<svg xmlns="http://www.w3.org/2000/svg" viewBox="0 0 24 24">
    <path d="M12 2.0996094L1 12L4 12L4 21L9 21L9 14L15 14L15 21L20 21L20 12L23 12L19 8.4003906L19 4L17 4L17 6.5996094L12 2.0996094 z"
          fill="#E6E6E6"/>
</svg>