<svg width="18" height="22" viewBox="0 0 18 22" fill="none" xmlns="http://www.w3.org/2000/svg">
<path d="M16.438 4.86101L12.338 0.76101C12.0971 0.518973 11.8107 0.327093 11.4952 0.19647C11.1797 0.0658471 10.8415 -0.000927211 10.5 9.72472e-06H3.6C2.64522 9.72472e-06 1.72955 0.379294 1.05442 1.05443C0.379285 1.72956 0 2.64523 0 3.60001V17.6C0 18.0728 0.0931166 18.5409 0.274034 18.9777C0.45495 19.4144 0.720125 19.8113 1.05442 20.1456C1.38871 20.4799 1.78557 20.7451 2.22234 20.926C2.65911 21.1069 3.12724 21.2 3.6 21.2H13.6C14.0728 21.2 14.5409 21.1069 14.9777 20.926C15.4144 20.7451 15.8113 20.4799 16.1456 20.1456C16.4799 19.8113 16.745 19.4144 16.926 18.9777C17.1069 18.5409 17.2 18.0728 17.2 17.6V6.70001C17.201 6.35831 17.1342 6.0198 17.0033 5.70412C16.8725 5.38845 16.6804 5.10187 16.438 4.86101ZM16 17.6C16 18.2365 15.7471 18.847 15.2971 19.2971C14.847 19.7472 14.2365 20 13.6 20H3.6C2.96348 20 2.35303 19.7472 1.90294 19.2971C1.45286 18.847 1.2 18.2365 1.2 17.6V3.60001C1.2 2.96349 1.45286 2.35304 1.90294 1.90295C2.35303 1.45287 2.96348 1.20001 3.6 1.20001H10.5C10.6839 1.2 10.8659 1.2362 11.0358 1.30655C11.2056 1.37689 11.36 1.48001 11.49 1.61001L15.59 5.71001C15.8515 5.97326 15.9988 6.32894 16 6.70001V17.6ZM14.1 10.619C14.0941 10.5962 14.0867 10.5739 14.078 10.552C14.066 10.53 14.05 10.512 14.037 10.491V10.485C13.4756 9.532 12.6751 8.74203 11.7148 8.1932C10.7545 7.64436 9.66758 7.35568 8.5615 7.35568C7.45542 7.35568 6.36849 7.64436 5.40817 8.1932C4.44786 8.74203 3.64742 9.532 3.086 10.485L3.081 10.493C3.069 10.514 3.053 10.532 3.041 10.553C3.03232 10.5745 3.02498 10.5966 3.019 10.619C3.00132 10.6574 2.98791 10.6977 2.979 10.739C2.96812 10.8133 2.96812 10.8887 2.979 10.963C2.98797 11.0043 3.00138 11.0446 3.019 11.083C3.02498 11.1054 3.03232 11.1275 3.041 11.149C3.053 11.17 3.069 11.188 3.081 11.209V11.216C3.64242 12.169 4.44286 12.959 5.40317 13.5078C6.36349 14.0567 7.45042 14.3453 8.5565 14.3453C9.66258 14.3453 10.7495 14.0567 11.7098 13.5078C12.6701 12.959 13.4706 12.169 14.032 11.216V11.21C14.045 11.189 14.061 11.17 14.073 11.149C14.0817 11.1272 14.0891 11.1048 14.095 11.082C14.1122 11.0442 14.1252 11.0046 14.134 10.964C14.145 10.8894 14.145 10.8136 14.134 10.739C14.127 10.6979 14.1156 10.6577 14.1 10.619V10.619ZM8.557 13.146C7.70953 13.1431 6.87578 12.9318 6.12922 12.5307C5.38267 12.1296 4.74623 11.5511 4.276 10.846C4.74505 10.1402 5.38135 9.56123 6.12826 9.16078C6.87517 8.76032 7.70951 8.55077 8.557 8.55077C9.40449 8.55077 10.2388 8.76032 10.9857 9.16078C11.7326 9.56123 12.369 10.1402 12.838 10.846C12.3678 11.5509 11.7315 12.1293 10.9852 12.5304C10.2388 12.9314 9.40529 13.1429 8.558 13.146H8.557ZM8.557 8.95901C8.18308 8.95941 7.81767 9.07065 7.50696 9.27867C7.19625 9.4867 6.95419 9.78217 6.81137 10.1277C6.66855 10.4733 6.63139 10.8535 6.70458 11.2201C6.77777 11.5868 6.95803 11.9236 7.22257 12.1879C7.48711 12.4521 7.82406 12.632 8.19082 12.7048C8.55758 12.7776 8.9377 12.7401 9.28312 12.5969C9.62853 12.4537 9.92375 12.2113 10.1314 11.9004C10.3391 11.5895 10.45 11.2239 10.45 10.85C10.4495 10.3485 10.2499 9.86765 9.8952 9.5131C9.54047 9.15856 9.05954 8.95927 8.558 8.95901H8.557ZM8.557 11.541C8.42033 11.541 8.28674 11.5005 8.1731 11.4246C8.05947 11.3486 7.9709 11.2407 7.9186 11.1144C7.8663 10.9882 7.85262 10.8492 7.87928 10.7152C7.90594 10.5812 7.97175 10.458 8.06839 10.3614C8.16503 10.2648 8.28815 10.1989 8.42219 10.1723C8.55623 10.1456 8.69517 10.1593 8.82143 10.2116C8.9477 10.2639 9.05562 10.3525 9.13155 10.4661C9.20747 10.5797 9.248 10.7133 9.248 10.85C9.24774 11.033 9.17499 11.2085 9.04567 11.338C8.91636 11.4675 8.74101 11.5405 8.558 11.541H8.557Z" fill="#808080"/>
</svg>
