<svg width="111" height="111" viewBox="0 0 111 111" fill="none" xmlns="http://www.w3.org/2000/svg">
<path d="M55.5 0.083374C24.91 0.083374 0.0833435 24.91 0.0833435 55.5C0.0833435 86.09 24.91 110.917 55.5 110.917C86.09 110.917 110.917 86.09 110.917 55.5C110.917 24.91 86.09 0.083374 55.5 0.083374ZM55.5 16.7084C64.6992 16.7084 72.125 24.1342 72.125 33.3334C72.125 42.5325 64.6992 49.9584 55.5 49.9584C46.3008 49.9584 38.875 42.5325 38.875 33.3334C38.875 24.1342 46.3008 16.7084 55.5 16.7084ZM55.5 95.4C48.9157 95.4001 42.4338 93.7707 36.6322 90.6572C30.8306 87.5436 25.8897 83.0427 22.25 77.5559C22.4163 66.528 44.4167 60.4875 55.5 60.4875C66.5279 60.4875 88.5838 66.528 88.75 77.5559C85.1104 83.0427 80.1694 87.5436 74.3678 90.6572C68.5662 93.7707 62.0843 95.4001 55.5 95.4Z" fill="url(#paint0_linear)"/>
<defs>
<linearGradient id="paint0_linear" x1="126.042" y1="80.2719" x2="-23.195" y2="78.6063" gradientUnits="userSpaceOnUse">
<stop stop-color="#2BB673"/>
<stop offset="1" stop-color="#00A79D"/>
</linearGradient>
</defs>
</svg>
