<svg width="34" height="38" viewBox="0 0 34 38" fill="none" xmlns="http://www.w3.org/2000/svg">
<rect width="33.2" height="37.2" rx="4" fill="#808080"/>
<path d="M24.438 12.861L20.338 8.76101C20.0972 8.51893 19.8107 8.32702 19.4952 8.19639C19.1797 8.06577 18.8415 7.99902 18.5 8.00001H11.6C10.6452 8.00001 9.72955 8.3793 9.05442 9.05443C8.37928 9.72956 8 10.6452 8 11.6V25.6C8 26.0728 8.09312 26.5409 8.27403 26.9777C8.45495 27.4144 8.72012 27.8113 9.05442 28.1456C9.38871 28.4799 9.78557 28.7451 10.2223 28.926C10.6591 29.1069 11.1272 29.2 11.6 29.2H21.6C22.0728 29.2 22.5409 29.1069 22.9777 28.926C23.4144 28.7451 23.8113 28.4799 24.1456 28.1456C24.4799 27.8113 24.745 27.4144 24.926 26.9777C25.1069 26.5409 25.2 26.0728 25.2 25.6V14.7C25.201 14.3583 25.1342 14.0198 25.0033 13.7041C24.8725 13.3884 24.6804 13.1019 24.438 12.861ZM24 25.6C24 26.2365 23.7471 26.847 23.2971 27.2971C22.847 27.7472 22.2365 28 21.6 28H11.6C10.9635 28 10.353 27.7472 9.90294 27.2971C9.45286 26.847 9.2 26.2365 9.2 25.6V11.6C9.2 10.9635 9.45286 10.353 9.90294 9.90295C10.353 9.45287 10.9635 9.20001 11.6 9.20001H18.5C18.8711 9.20118 19.2268 9.34848 19.49 9.61001L23.59 13.71C23.8515 13.9733 23.9988 14.3289 24 14.7V25.6ZM19.24 16.913C19.2958 16.9687 19.34 17.0349 19.3702 17.1077C19.4004 17.1806 19.416 17.2587 19.416 17.3375C19.416 17.4164 19.4004 17.4944 19.3702 17.5673C19.34 17.6401 19.2958 17.7063 19.24 17.762L17.035 19.944C16.9226 20.0558 16.7705 20.1185 16.612 20.1185C16.4535 20.1185 16.3014 20.0558 16.189 19.944L14 17.759C13.9436 17.7034 13.8987 17.6372 13.868 17.5642C13.8373 17.4912 13.8213 17.4128 13.8211 17.3336C13.8208 17.2544 13.8362 17.176 13.8664 17.1028C13.8966 17.0295 13.941 16.963 13.997 16.907C14.0531 16.8511 14.1196 16.8068 14.1929 16.7766C14.2662 16.7465 14.3446 16.7312 14.4238 16.7316C14.503 16.7319 14.5814 16.748 14.6544 16.7788C14.7273 16.8096 14.7935 16.8545 14.849 16.911L16.018 18.08V15.517C16.018 15.3579 16.0812 15.2053 16.1937 15.0927C16.3063 14.9802 16.4589 14.917 16.618 14.917C16.7771 14.917 16.9297 14.9802 17.0423 15.0927C17.1548 15.2053 17.218 15.3579 17.218 15.517V18.067L18.389 16.909C18.445 16.853 18.5116 16.8087 18.5849 16.7786C18.6581 16.7485 18.7366 16.7332 18.8158 16.7335C18.895 16.7339 18.9734 16.75 19.0464 16.7808C19.1193 16.8116 19.1855 16.8565 19.241 16.913H19.24ZM19.157 21.745C19.157 21.9041 19.0938 22.0568 18.9813 22.1693C18.8687 22.2818 18.7161 22.345 18.557 22.345H14.557C14.3979 22.345 14.2453 22.2818 14.1327 22.1693C14.0202 22.0568 13.957 21.9041 13.957 21.745C13.957 21.5859 14.0202 21.4333 14.1327 21.3207C14.2453 21.2082 14.3979 21.145 14.557 21.145H18.557C18.636 21.1449 18.7142 21.1603 18.7871 21.1905C18.8601 21.2206 18.9264 21.2649 18.9823 21.3207C19.0381 21.3766 19.0824 21.4429 19.1125 21.5159C19.1427 21.5888 19.1581 21.667 19.158 21.746L19.157 21.745Z" fill="white"/>
</svg>
