== Problem Description ==
Spline 19 Knots: [0.60932702 0.6237721  0.6316313  0.63999194 0.64888616 0.65844048
 0.66872609 0.679823   0.69192213 0.7051638  0.71981863 0.73620343
 0.75475436 0.77606225 0.80116074 0.83151462 0.86990274 0.92167013
 1.        ]
Spline Number of Coeffs: 21
Coeffs lower bound: [87.174      81.77348115 74.27365664 65.29976477 58.71392981 52.39130577
 46.41360143 40.74797951 35.37383991 30.3529459  25.63050879 21.25966944
 17.22535908 13.5450969  10.21180153  7.26440363  4.69253467  2.53650971
  0.8069245   0.2600494  -0.1       ]
Coeffs upper bound: [1.06546000e+02 9.99453658e+01 9.07789137e+01 7.98108236e+01
 7.17614698e+01 6.40338182e+01 5.67277351e+01 4.98030861e+01
 4.32346932e+01 3.70980450e+01 3.13261774e+01 2.59840404e+01
 2.10532166e+01 1.65551184e+01 1.24810908e+01 8.87871555e+00
 5.73532016e+00 3.10017854e+00 9.86241057e-01 3.17838156e-01
 1.00000000e-01]
=====================================================================================
n_gen |  n_eval |   cv (min)   |   cv (avg)   |  n_nds  |     eps      |  indicator
=====================================================================================
    1 |   10000 |  1.25352E+04 |  2.78466E+06 |       1 |            - |            -
    2 |   20000 |  1.25352E+04 |  1.15450E+05 |       1 |  0.00000E+00 |            f
    3 |   30000 |  1.25352E+04 |  7.95136E+04 |       1 |  0.00000E+00 |            f
    4 |   40000 |  5.15582E+03 |  6.15461E+04 |       1 |  0.533682828 |        ideal
    5 |   50000 |  3.55935E+03 |  4.99317E+04 |       1 |  0.942659686 |        ideal
    6 |   60000 |  3.55935E+03 |  4.16235E+04 |       1 |  0.00000E+00 |            f
    7 |   70000 |  3.55935E+03 |  3.54191E+04 |       1 |  0.00000E+00 |            f
    8 |   80000 |  1.98183E+03 |  3.05875E+04 |       1 |  0.940816137 |        ideal
    9 |   90000 |  1.98183E+03 |  2.66088E+04 |       1 |  0.00000E+00 |            f
   10 |  100000 |  1.98183E+03 |  2.35017E+04 |       1 |  0.00000E+00 |            f
   11 |  110000 |  1.97599E+03 |  2.09037E+04 |       1 |  0.561024380 |        ideal
   12 |  120000 |  1.63193E+02 |  1.86503E+04 |       1 |  0.635561161 |        ideal
   13 |  130000 |  1.63193E+02 |  1.66957E+04 |       1 |  0.00000E+00 |            f
   14 |  140000 |  1.63193E+02 |  1.49495E+04 |       1 |  0.00000E+00 |            f
   15 |  150000 |  0.007989992 |  1.35032E+04 |       1 |  0.108484674 |        ideal
   16 |  160000 |  0.007989992 |  1.22153E+04 |       1 |  0.00000E+00 |            f
   17 |  170000 |  0.007989992 |  1.10795E+04 |       1 |  0.00000E+00 |            f
   18 |  180000 |  0.007989992 |  1.00405E+04 |       1 |  0.00000E+00 |            f
   19 |  190000 |  0.007989992 |  9.10705E+03 |       1 |  0.00000E+00 |            f
   20 |  200000 |  0.007989992 |  8.23430E+03 |       1 |  0.00000E+00 |            f
   21 |  210000 |  0.007989992 |  7.44793E+03 |       1 |  0.00000E+00 |            f
   22 |  220000 |  0.007989992 |  6.73875E+03 |       1 |  0.00000E+00 |            f
   23 |  230000 |  0.007989992 |  6.10196E+03 |       1 |  0.00000E+00 |            f
   24 |  240000 |  0.007989992 |  5.56279E+03 |       1 |  0.00000E+00 |            f
   25 |  250000 |  0.007989992 |  5.02056E+03 |       1 |  0.00000E+00 |            f
   26 |  260000 |  0.007989992 |  4.54740E+03 |       1 |  0.00000E+00 |            f
   27 |  270000 |  0.007989992 |  4.08729E+03 |       1 |  0.00000E+00 |            f
   28 |  280000 |  0.003957460 |  3.67393E+03 |       1 |  1.105756932 |        ideal
   29 |  290000 |  0.003957460 |  3.27095E+03 |       1 |  0.00000E+00 |            f
   30 |  300000 |  0.000732318 |  2.90068E+03 |       1 |  0.793688041 |        ideal
   31 |  310000 |  0.000732318 |  2.56878E+03 |       1 |  0.00000E+00 |            f
   32 |  320000 |  0.000732318 |  2.25355E+03 |       1 |  0.00000E+00 |            f
   33 |  330000 |  0.000732318 |  1.96487E+03 |       1 |  0.00000E+00 |            f
   34 |  340000 |  0.000732318 |  1.70449E+03 |       1 |  0.00000E+00 |            f
   35 |  350000 |  0.000732318 |  1.46217E+03 |       1 |  0.00000E+00 |            f
   36 |  360000 |  0.000732318 |  1.25412E+03 |       1 |  0.00000E+00 |            f
   37 |  370000 |  0.000570744 |  1.06070E+03 |       1 |  0.087367140 |        ideal
   38 |  380000 |  0.000047876 |  8.83906E+02 |       1 |  0.125622934 |        ideal
   39 |  390000 |  0.000047876 |  7.15957E+02 |       1 |  0.00000E+00 |            f
   40 |  400000 |  0.000047876 |  5.71598E+02 |       1 |  0.00000E+00 |            f
   41 |  410000 |  0.000047876 |  4.35651E+02 |       1 |  0.00000E+00 |            f
   42 |  420000 |  0.000047876 |  3.16758E+02 |       1 |  0.00000E+00 |            f
   43 |  430000 |  0.000047876 |  2.19039E+02 |       1 |  0.00000E+00 |            f
   44 |  440000 |  0.000047876 |  1.41940E+02 |       1 |  0.00000E+00 |            f
   45 |  450000 |  0.000034995 |  8.30634E+01 |       1 |  0.348443950 |        ideal
   46 |  460000 |  0.000034995 |  3.95805E+01 |       1 |  0.00000E+00 |            f
   47 |  470000 |  0.000034995 |  1.55758E+01 |       1 |  0.00000E+00 |            f
   48 |  480000 |  0.000027512 |  5.023764888 |       1 |  0.223912803 |        ideal
   49 |  490000 |  0.000027512 |  0.581110233 |       1 |  0.00000E+00 |            f
   50 |  500000 |  0.000027512 |  0.035475787 |       1 |  0.00000E+00 |            f
   51 |  510000 |  0.000015805 |  0.026324899 |       1 |  0.401170894 |        ideal
   52 |  520000 |  5.64184E-06 |  0.019956532 |       1 |  0.113632312 |        ideal
   53 |  530000 |  5.64184E-06 |  0.015116023 |       1 |  0.00000E+00 |            f
   54 |  540000 |  5.64184E-06 |  0.011289661 |       1 |  0.00000E+00 |            f
   55 |  550000 |  2.59370E-06 |  0.008283526 |       1 |  0.701757711 |        ideal
   56 |  560000 |  3.10456E-07 |  0.006064816 |       1 |  0.767413527 |        ideal
   57 |  570000 |  3.10456E-07 |  0.004309468 |       1 |  0.00000E+00 |            f
   58 |  580000 |  3.10456E-07 |  0.002929563 |       1 |  0.00000E+00 |            f
   59 |  590000 |  3.10456E-07 |  0.001955208 |       1 |  0.00000E+00 |            f
   60 |  600000 |  3.10456E-07 |  0.001371243 |       1 |  0.00000E+00 |            f
   61 |  610000 |  0.00000E+00 |  0.000915463 |       1 |  0.026767598 |        ideal
   62 |  620000 |  0.00000E+00 |  0.000541924 |       1 |  1.122518307 |        ideal
   63 |  630000 |  0.00000E+00 |  0.000315390 |       1 |  0.00000E+00 |            f
   64 |  640000 |  0.00000E+00 |  0.000186230 |       1 |  0.00000E+00 |            f
   65 |  650000 |  0.00000E+00 |  0.000101567 |       1 |  0.00000E+00 |            f
   66 |  660000 |  0.00000E+00 |  0.000058358 |       1 |  0.00000E+00 |            f
   67 |  670000 |  0.00000E+00 |  0.000040429 |       1 |  0.00000E+00 |            f
   68 |  680000 |  0.00000E+00 |  0.000026479 |       1 |  0.00000E+00 |            f
   69 |  690000 |  0.00000E+00 |  0.000016442 |       1 |  0.00000E+00 |            f
   70 |  700000 |  0.00000E+00 |  8.68067E-06 |       1 |  0.00000E+00 |            f
   71 |  710000 |  0.00000E+00 |  3.68374E-06 |       1 |  0.074707786 |        ideal
   72 |  720000 |  0.00000E+00 |  1.39254E-06 |       1 |  0.00000E+00 |            f
   73 |  730000 |  0.00000E+00 |  3.64513E-07 |       1 |  0.113597967 |        ideal
   74 |  740000 |  0.00000E+00 |  5.69643E-08 |       1 |  0.00000E+00 |            f
   75 |  750000 |  0.00000E+00 |  0.00000E+00 |       1 |  0.098551804 |        ideal
   76 |  760000 |  0.00000E+00 |  0.00000E+00 |       1 |  0.003286054 |        ideal
   77 |  770000 |  0.00000E+00 |  0.00000E+00 |       1 |  0.126341045 |        ideal
   78 |  780000 |  0.00000E+00 |  0.00000E+00 |       1 |  0.081048963 |        ideal
   79 |  790000 |  0.00000E+00 |  0.00000E+00 |       1 |  0.00000E+00 |            f
   80 |  800000 |  0.00000E+00 |  0.00000E+00 |       1 |  0.027451952 |        ideal
   81 |  810000 |  0.00000E+00 |  0.00000E+00 |       1 |  0.030785720 |        ideal
   82 |  820000 |  0.00000E+00 |  0.00000E+00 |       1 |  0.00000E+00 |            f
   83 |  830000 |  0.00000E+00 |  0.00000E+00 |       1 |  0.035998458 |        ideal
   84 |  840000 |  0.00000E+00 |  0.00000E+00 |       1 |  0.00000E+00 |            f
   85 |  850000 |  0.00000E+00 |  0.00000E+00 |       1 |  0.032430526 |        ideal
   86 |  860000 |  0.00000E+00 |  0.00000E+00 |       1 |  0.012803547 |        ideal
   87 |  870000 |  0.00000E+00 |  0.00000E+00 |       1 |  0.00000E+00 |            f
   88 |  880000 |  0.00000E+00 |  0.00000E+00 |       1 |  0.00000E+00 |            f
   89 |  890000 |  0.00000E+00 |  0.00000E+00 |       1 |  0.017144828 |        ideal
   90 |  900000 |  0.00000E+00 |  0.00000E+00 |       1 |  0.003656762 |        ideal
   91 |  910000 |  0.00000E+00 |  0.00000E+00 |       1 |  0.019010573 |        ideal
   92 |  920000 |  0.00000E+00 |  0.00000E+00 |       1 |  0.026595332 |        ideal
   93 |  930000 |  0.00000E+00 |  0.00000E+00 |       1 |  0.00000E+00 |            f
   94 |  940000 |  0.00000E+00 |  0.00000E+00 |       1 |  0.023585221 |        ideal
   95 |  950000 |  0.00000E+00 |  0.00000E+00 |       1 |  0.034217932 |        ideal
   96 |  960000 |  0.00000E+00 |  0.00000E+00 |       1 |  0.00000E+00 |            f
   97 |  970000 |  0.00000E+00 |  0.00000E+00 |       1 |  0.027443948 |        ideal
   98 |  980000 |  0.00000E+00 |  0.00000E+00 |       1 |  0.011488617 |        ideal
   99 |  990000 |  0.00000E+00 |  0.00000E+00 |       1 |  1.50510E+27 |            f
  100 | 1000000 |  0.00000E+00 |  0.00000E+00 |       1 |  0.033860382 |        ideal
  101 | 1010000 |  0.00000E+00 |  0.00000E+00 |       1 |  0.020782971 |        ideal
  102 | 1020000 |  0.00000E+00 |  0.00000E+00 |       1 |  0.005372730 |        ideal
  103 | 1030000 |  0.00000E+00 |  0.00000E+00 |       1 |  0.009272121 |        ideal
  104 | 1040000 |  0.00000E+00 |  0.00000E+00 |       1 |  0.017595482 |        ideal
  105 | 1050000 |  0.00000E+00 |  0.00000E+00 |       1 |  0.009697545 |        ideal
  106 | 1060000 |  0.00000E+00 |  0.00000E+00 |       1 |  0.021002230 |        ideal
  107 | 1070000 |  0.00000E+00 |  0.00000E+00 |       1 |  0.017946091 |        ideal
  108 | 1080000 |  0.00000E+00 |  0.00000E+00 |       1 |  0.031512910 |        ideal
  109 | 1090000 |  0.00000E+00 |  0.00000E+00 |       1 |  0.00000E+00 |            f
  110 | 1100000 |  0.00000E+00 |  0.00000E+00 |       1 |  2.33038E+27 |            f
  111 | 1110000 |  0.00000E+00 |  0.00000E+00 |       1 |  0.023047548 |        ideal
  112 | 1120000 |  0.00000E+00 |  0.00000E+00 |       1 |  2.32319E+27 |            f
  113 | 1130000 |  0.00000E+00 |  0.00000E+00 |       1 |  0.007209990 |        ideal
  114 | 1140000 |  0.00000E+00 |  0.00000E+00 |       1 |  0.012863072 |        ideal
  115 | 1150000 |  0.00000E+00 |  0.00000E+00 |       1 |  0.014778183 |        ideal
  116 | 1160000 |  0.00000E+00 |  0.00000E+00 |       1 |  0.005730655 |        ideal
  117 | 1170000 |  0.00000E+00 |  0.00000E+00 |       1 |  0.00000E+00 |            f
  118 | 1180000 |  0.00000E+00 |  0.00000E+00 |       1 |  0.011594859 |        ideal
  119 | 1190000 |  0.00000E+00 |  0.00000E+00 |       1 |  1.66747E+27 |            f
  120 | 1200000 |  0.00000E+00 |  0.00000E+00 |       1 |  0.006245187 |        ideal
  121 | 1210000 |  0.00000E+00 |  0.00000E+00 |       1 |  0.002955028 |        ideal
  122 | 1220000 |  0.00000E+00 |  0.00000E+00 |       1 |  0.00000E+00 |            f
  123 | 1230000 |  0.00000E+00 |  0.00000E+00 |       1 |  0.007053246 |        ideal
  124 | 1240000 |  0.00000E+00 |  0.00000E+00 |       1 |  0.005906725 |        ideal
  125 | 1250000 |  0.00000E+00 |  0.00000E+00 |       1 |  0.00000E+00 |            f
  126 | 1260000 |  0.00000E+00 |  0.00000E+00 |       1 |  0.00000E+00 |            f
  127 | 1270000 |  0.00000E+00 |  0.00000E+00 |       1 |  0.00000E+00 |            f
  128 | 1280000 |  0.00000E+00 |  0.00000E+00 |       1 |  0.003430178 |        ideal
  129 | 1290000 |  0.00000E+00 |  0.00000E+00 |       1 |  0.002900801 |        ideal
  130 | 1300000 |  0.00000E+00 |  0.00000E+00 |       1 |  0.003888573 |        ideal
  131 | 1310000 |  0.00000E+00 |  0.00000E+00 |       1 |  2.01295E+27 |            f
  132 | 1320000 |  0.00000E+00 |  0.00000E+00 |       1 |  1.02828E+27 |            f
  133 | 1330000 |  0.00000E+00 |  0.00000E+00 |       1 |  0.00000E+00 |            f
  134 | 1340000 |  0.00000E+00 |  0.00000E+00 |       1 |  1.56997E+27 |            f
  135 | 1350000 |  0.00000E+00 |  0.00000E+00 |       1 |  2.39014E+27 |            f
  136 | 1360000 |  0.00000E+00 |  0.00000E+00 |       1 |  0.00000E+00 |            f
  137 | 1370000 |  0.00000E+00 |  0.00000E+00 |       1 |  0.00000E+00 |            f
  138 | 1380000 |  0.00000E+00 |  0.00000E+00 |       1 |  8.78750E+26 |            f
  139 | 1390000 |  0.00000E+00 |  0.00000E+00 |       1 |  3.43806E+26 |            f
  140 | 1400000 |  0.00000E+00 |  0.00000E+00 |       1 |  1.81510E+26 |            f
  141 | 1410000 |  0.00000E+00 |  0.00000E+00 |       1 |  6.90108E+26 |            f
  142 | 1420000 |  0.00000E+00 |  0.00000E+00 |       1 |  1.16038E+27 |            f
  143 | 1430000 |  0.00000E+00 |  0.00000E+00 |       1 |  1.68773E+27 |            f
  144 | 1440000 |  0.00000E+00 |  0.00000E+00 |       1 |  0.00000E+00 |            f
  145 | 1450000 |  0.00000E+00 |  0.00000E+00 |       1 |  0.00000E+00 |            f
  146 | 1460000 |  0.00000E+00 |  0.00000E+00 |       1 |  2.51703E+26 |            f
  147 | 1470000 |  0.00000E+00 |  0.00000E+00 |       1 |  0.003308001 |        ideal
  148 | 1480000 |  0.00000E+00 |  0.00000E+00 |       1 |  0.00000E+00 |            f
  149 | 1490000 |  0.00000E+00 |  0.00000E+00 |       1 |  0.00000E+00 |            f
  150 | 1500000 |  0.00000E+00 |  0.00000E+00 |       1 |  0.00000E+00 |            f
  151 | 1510000 |  0.00000E+00 |  0.00000E+00 |       1 |  0.00000E+00 |            f
  152 | 1520000 |  0.00000E+00 |  0.00000E+00 |       1 |  0.00000E+00 |            f
  153 | 1530000 |  0.00000E+00 |  0.00000E+00 |       1 |  0.00000E+00 |            f
  154 | 1540000 |  0.00000E+00 |  0.00000E+00 |       1 |  2.35746E+26 |            f
  155 | 1550000 |  0.00000E+00 |  0.00000E+00 |       1 |  2.00859E+26 |            f
  156 | 1560000 |  0.00000E+00 |  0.00000E+00 |       1 |  0.00000E+00 |            f
  157 | 1570000 |  0.00000E+00 |  0.00000E+00 |       1 |  9.46924E+26 |            f
  158 | 1580000 |  0.00000E+00 |  0.00000E+00 |       1 |  3.25975E+26 |            f
  159 | 1590000 |  0.00000E+00 |  0.00000E+00 |       1 |  4.97326E+25 |            f
  160 | 1600000 |  0.00000E+00 |  0.00000E+00 |       1 |  0.00000E+00 |            f
  161 | 1610000 |  0.00000E+00 |  0.00000E+00 |       1 |  8.58284E+26 |            f
  162 | 1620000 |  0.00000E+00 |  0.00000E+00 |       1 |  0.00000E+00 |            f
  163 | 1630000 |  0.00000E+00 |  0.00000E+00 |       1 |  0.00000E+00 |            f
  164 | 1640000 |  0.00000E+00 |  0.00000E+00 |       1 |  0.00000E+00 |            f
  165 | 1650000 |  0.00000E+00 |  0.00000E+00 |       1 |  2.38728E+26 |            f
  166 | 1660000 |  0.00000E+00 |  0.00000E+00 |       1 |  2.39143E+26 |            f
  167 | 1670000 |  0.00000E+00 |  0.00000E+00 |       1 |  1.72233E+26 |            f
  168 | 1680000 |  0.00000E+00 |  0.00000E+00 |       1 |  0.00000E+00 |            f
  169 | 1690000 |  0.00000E+00 |  0.00000E+00 |       1 |  3.80645E+26 |            f
  170 | 1700000 |  0.00000E+00 |  0.00000E+00 |       1 |  2.43210E+26 |            f
  171 | 1710000 |  0.00000E+00 |  0.00000E+00 |       1 |  0.00000E+00 |            f
  172 | 1720000 |  0.00000E+00 |  0.00000E+00 |       1 |  0.00000E+00 |            f
  173 | 1730000 |  0.00000E+00 |  0.00000E+00 |       1 |  0.00000E+00 |            f
  174 | 1740000 |  0.00000E+00 |  0.00000E+00 |       1 |  2.94347E+26 |            f
  175 | 1750000 |  0.00000E+00 |  0.00000E+00 |       1 |  0.00000E+00 |            f
  176 | 1760000 |  0.00000E+00 |  0.00000E+00 |       1 |  1.73227E+26 |            f
  177 | 1770000 |  0.00000E+00 |  0.00000E+00 |       1 |  0.00000E+00 |            f
  178 | 1780000 |  0.00000E+00 |  0.00000E+00 |       1 |  2.68794E+26 |            f
  179 | 1790000 |  0.00000E+00 |  0.00000E+00 |       1 |  0.00000E+00 |            f
  180 | 1800000 |  0.00000E+00 |  0.00000E+00 |       1 |  2.17167E+26 |            f
  181 | 1810000 |  0.00000E+00 |  0.00000E+00 |       1 |  0.00000E+00 |            f
  182 | 1820000 |  0.00000E+00 |  0.00000E+00 |       1 |  0.00000E+00 |            f
  183 | 1830000 |  0.00000E+00 |  0.00000E+00 |       1 |  4.76291E+25 |            f
  184 | 1840000 |  0.00000E+00 |  0.00000E+00 |       1 |  0.00000E+00 |            f
  185 | 1850000 |  0.00000E+00 |  0.00000E+00 |       1 |  0.00000E+00 |            f
  186 | 1860000 |  0.00000E+00 |  0.00000E+00 |       1 |  1.04676E+26 |            f
  187 | 1870000 |  0.00000E+00 |  0.00000E+00 |       1 |  1.23660E+26 |            f
  188 | 1880000 |  0.00000E+00 |  0.00000E+00 |       1 |  0.00000E+00 |            f
  189 | 1890000 |  0.00000E+00 |  0.00000E+00 |       1 |  2.93594E+25 |            f
  190 | 1900000 |  0.00000E+00 |  0.00000E+00 |       1 |  4.50764E+25 |            f
  191 | 1910000 |  0.00000E+00 |  0.00000E+00 |       1 |  1.93119E+25 |            f
  192 | 1920000 |  0.00000E+00 |  0.00000E+00 |       1 |  7.74730E+25 |            f
  193 | 1930000 |  0.00000E+00 |  0.00000E+00 |       1 |  5.15300E+25 |            f
  194 | 1940000 |  0.00000E+00 |  0.00000E+00 |       1 |  1.10685E+26 |            f
  195 | 1950000 |  0.00000E+00 |  0.00000E+00 |       1 |  1.22871E+26 |            f
  196 | 1960000 |  0.00000E+00 |  0.00000E+00 |       1 |  8.14052E+24 |            f
  197 | 1970000 |  0.00000E+00 |  0.00000E+00 |       1 |  0.00000E+00 |            f
  198 | 1980000 |  0.00000E+00 |  0.00000E+00 |       1 |  0.00000E+00 |            f
  199 | 1990000 |  0.00000E+00 |  0.00000E+00 |       1 |  0.00000E+00 |            f
  200 | 2000000 |  0.00000E+00 |  0.00000E+00 |       1 |  0.00000E+00 |            f
  201 | 2010000 |  0.00000E+00 |  0.00000E+00 |       1 |  4.33004E+25 |            f
  202 | 2020000 |  0.00000E+00 |  0.00000E+00 |       1 |  6.10808E+25 |            f
  203 | 2030000 |  0.00000E+00 |  0.00000E+00 |       1 |  1.51390E+25 |            f
  204 | 2040000 |  0.00000E+00 |  0.00000E+00 |       1 |  0.00000E+00 |            f
  205 | 2050000 |  0.00000E+00 |  0.00000E+00 |       1 |  6.90256E+24 |            f
  206 | 2060000 |  0.00000E+00 |  0.00000E+00 |       1 |  2.92742E+25 |            f
  207 | 2070000 |  0.00000E+00 |  0.00000E+00 |       1 |  3.52358E+25 |            f
  208 | 2080000 |  0.00000E+00 |  0.00000E+00 |       1 |  1.28413E+26 |            f
  209 | 2090000 |  0.00000E+00 |  0.00000E+00 |       1 |  0.00000E+00 |            f
  210 | 2100000 |  0.00000E+00 |  0.00000E+00 |       1 |  0.00000E+00 |            f
  211 | 2110000 |  0.00000E+00 |  0.00000E+00 |       1 |  4.20907E+25 |            f
  212 | 2120000 |  0.00000E+00 |  0.00000E+00 |       1 |  4.00561E+25 |            f
  213 | 2130000 |  0.00000E+00 |  0.00000E+00 |       1 |  0.00000E+00 |            f
  214 | 2140000 |  0.00000E+00 |  0.00000E+00 |       1 |  0.00000E+00 |            f
  215 | 2150000 |  0.00000E+00 |  0.00000E+00 |       1 |  3.10752E+25 |            f
  216 | 2160000 |  0.00000E+00 |  0.00000E+00 |       1 |  5.13942E+25 |            f
  217 | 2170000 |  0.00000E+00 |  0.00000E+00 |       1 |  0.00000E+00 |            f
  218 | 2180000 |  0.00000E+00 |  0.00000E+00 |       1 |  0.00000E+00 |            f
  219 | 2190000 |  0.00000E+00 |  0.00000E+00 |       1 |  2.97964E+25 |            f
  220 | 2200000 |  0.00000E+00 |  0.00000E+00 |       1 |  0.00000E+00 |            f
  221 | 2210000 |  0.00000E+00 |  0.00000E+00 |       1 |  0.00000E+00 |            f
  222 | 2220000 |  0.00000E+00 |  0.00000E+00 |       1 |  4.69672E+25 |            f
  223 | 2230000 |  0.00000E+00 |  0.00000E+00 |       1 |  0.00000E+00 |            f
  224 | 2240000 |  0.00000E+00 |  0.00000E+00 |       1 |  0.00000E+00 |            f
  225 | 2250000 |  0.00000E+00 |  0.00000E+00 |       1 |  6.62193E+24 |            f
  226 | 2260000 |  0.00000E+00 |  0.00000E+00 |       1 |  5.63178E+24 |            f
  227 | 2270000 |  0.00000E+00 |  0.00000E+00 |       1 |  4.37560E+25 |            f
  228 | 2280000 |  0.00000E+00 |  0.00000E+00 |       1 |  4.17259E+24 |            f
  229 | 2290000 |  0.00000E+00 |  0.00000E+00 |       1 |  6.45003E+24 |            f
  230 | 2300000 |  0.00000E+00 |  0.00000E+00 |       1 |  9.61167E+24 |            f
  231 | 2310000 |  0.00000E+00 |  0.00000E+00 |       1 |  1.61530E+25 |            f
  232 | 2320000 |  0.00000E+00 |  0.00000E+00 |       1 |  0.00000E+00 |            f
  233 | 2330000 |  0.00000E+00 |  0.00000E+00 |       1 |  2.57681E+25 |            f
  234 | 2340000 |  0.00000E+00 |  0.00000E+00 |       1 |  2.64755E+25 |            f
  235 | 2350000 |  0.00000E+00 |  0.00000E+00 |       1 |  0.00000E+00 |            f
  236 | 2360000 |  0.00000E+00 |  0.00000E+00 |       1 |  0.00000E+00 |            f
  237 | 2370000 |  0.00000E+00 |  0.00000E+00 |       1 |  1.38071E+25 |            f
  238 | 2380000 |  0.00000E+00 |  0.00000E+00 |       1 |  0.00000E+00 |            f
  239 | 2390000 |  0.00000E+00 |  0.00000E+00 |       1 |  0.00000E+00 |            f
  240 | 2400000 |  0.00000E+00 |  0.00000E+00 |       1 |  0.00000E+00 |            f
  241 | 2410000 |  0.00000E+00 |  0.00000E+00 |       1 |  0.00000E+00 |            f
  242 | 2420000 |  0.00000E+00 |  0.00000E+00 |       1 |  1.00325E+25 |            f
  243 | 2430000 |  0.00000E+00 |  0.00000E+00 |       1 |  1.84890E+24 |            f
  244 | 2440000 |  0.00000E+00 |  0.00000E+00 |       1 |  2.67256E+25 |            f
  245 | 2450000 |  0.00000E+00 |  0.00000E+00 |       1 |  1.07061E+25 |            f
  246 | 2460000 |  0.00000E+00 |  0.00000E+00 |       1 |  0.00000E+00 |            f
  247 | 2470000 |  0.00000E+00 |  0.00000E+00 |       1 |  5.63839E+24 |            f
  248 | 2480000 |  0.00000E+00 |  0.00000E+00 |       1 |  9.35780E+24 |            f
  249 | 2490000 |  0.00000E+00 |  0.00000E+00 |       1 |  0.00000E+00 |            f
  250 | 2500000 |  0.00000E+00 |  0.00000E+00 |       1 |  0.00000E+00 |            f
  251 | 2510000 |  0.00000E+00 |  0.00000E+00 |       1 |  1.19749E+25 |            f
  252 | 2520000 |  0.00000E+00 |  0.00000E+00 |       1 |  0.00000E+00 |            f
  253 | 2530000 |  0.00000E+00 |  0.00000E+00 |       1 |  6.97045E+24 |            f
  254 | 2540000 |  0.00000E+00 |  0.00000E+00 |       1 |  0.00000E+00 |            f
  255 | 2550000 |  0.00000E+00 |  0.00000E+00 |       1 |  0.00000E+00 |            f
  256 | 2560000 |  0.00000E+00 |  0.00000E+00 |       1 |  9.01089E+23 |            f
  257 | 2570000 |  0.00000E+00 |  0.00000E+00 |       1 |  7.64827E+24 |            f
  258 | 2580000 |  0.00000E+00 |  0.00000E+00 |       1 |  0.00000E+00 |            f
  259 | 2590000 |  0.00000E+00 |  0.00000E+00 |       1 |  1.37891E+25 |            f
  260 | 2600000 |  0.00000E+00 |  0.00000E+00 |       1 |  0.00000E+00 |            f
  261 | 2610000 |  0.00000E+00 |  0.00000E+00 |       1 |  0.00000E+00 |            f
  262 | 2620000 |  0.00000E+00 |  0.00000E+00 |       1 |  1.38291E+25 |            f
  263 | 2630000 |  0.00000E+00 |  0.00000E+00 |       1 |  0.00000E+00 |            f
  264 | 2640000 |  0.00000E+00 |  0.00000E+00 |       1 |  2.93427E+25 |            f
  265 | 2650000 |  0.00000E+00 |  0.00000E+00 |       1 |  4.39777E+24 |            f
  266 | 2660000 |  0.00000E+00 |  0.00000E+00 |       1 |  0.00000E+00 |            f
  267 | 2670000 |  0.00000E+00 |  0.00000E+00 |       1 |  0.00000E+00 |            f
  268 | 2680000 |  0.00000E+00 |  0.00000E+00 |       1 |  0.00000E+00 |            f
  269 | 2690000 |  0.00000E+00 |  0.00000E+00 |       1 |  0.00000E+00 |            f
  270 | 2700000 |  0.00000E+00 |  0.00000E+00 |       1 |  8.66206E+24 |            f
  271 | 2710000 |  0.00000E+00 |  0.00000E+00 |       1 |  1.84476E+25 |            f
  272 | 2720000 |  0.00000E+00 |  0.00000E+00 |       1 |  0.00000E+00 |            f
  273 | 2730000 |  0.00000E+00 |  0.00000E+00 |       1 |  5.23786E+24 |            f
  274 | 2740000 |  0.00000E+00 |  0.00000E+00 |       1 |  5.74550E+24 |            f
  275 | 2750000 |  0.00000E+00 |  0.00000E+00 |       1 |  0.00000E+00 |            f
  276 | 2760000 |  0.00000E+00 |  0.00000E+00 |       1 |  2.85752E+24 |            f
  277 | 2770000 |  0.00000E+00 |  0.00000E+00 |       1 |  5.91536E+24 |            f
  278 | 2780000 |  0.00000E+00 |  0.00000E+00 |       1 |  0.00000E+00 |            f
  279 | 2790000 |  0.00000E+00 |  0.00000E+00 |       1 |  2.37508E+24 |            f
  280 | 2800000 |  0.00000E+00 |  0.00000E+00 |       1 |  1.93920E+25 |            f
  281 | 2810000 |  0.00000E+00 |  0.00000E+00 |       1 |  4.78634E+24 |            f
  282 | 2820000 |  0.00000E+00 |  0.00000E+00 |       1 |  0.00000E+00 |            f
  283 | 2830000 |  0.00000E+00 |  0.00000E+00 |       1 |  0.00000E+00 |            f
  284 | 2840000 |  0.00000E+00 |  0.00000E+00 |       1 |  0.00000E+00 |            f
  285 | 2850000 |  0.00000E+00 |  0.00000E+00 |       1 |  0.00000E+00 |            f
  286 | 2860000 |  0.00000E+00 |  0.00000E+00 |       1 |  4.02892E+24 |            f
  287 | 2870000 |  0.00000E+00 |  0.00000E+00 |       1 |  0.00000E+00 |            f
  288 | 2880000 |  0.00000E+00 |  0.00000E+00 |       1 |  2.51875E+24 |            f
  289 | 2890000 |  0.00000E+00 |  0.00000E+00 |       1 |  4.73425E+24 |            f
  290 | 2900000 |  0.00000E+00 |  0.00000E+00 |       1 |  5.01890E+24 |            f
  291 | 2910000 |  0.00000E+00 |  0.00000E+00 |       1 |  0.00000E+00 |            f
  292 | 2920000 |  0.00000E+00 |  0.00000E+00 |       1 |  0.00000E+00 |            f
  293 | 2930000 |  0.00000E+00 |  0.00000E+00 |       1 |  1.01738E+24 |            f
  294 | 2940000 |  0.00000E+00 |  0.00000E+00 |       1 |  1.69650E+25 |            f
  295 | 2950000 |  0.00000E+00 |  0.00000E+00 |       1 |  0.00000E+00 |            f
  296 | 2960000 |  0.00000E+00 |  0.00000E+00 |       1 |  0.00000E+00 |            f
  297 | 2970000 |  0.00000E+00 |  0.00000E+00 |       1 |  0.00000E+00 |            f
  298 | 2980000 |  0.00000E+00 |  0.00000E+00 |       1 |  0.00000E+00 |            f
  299 | 2990000 |  0.00000E+00 |  0.00000E+00 |       1 |  5.97801E+24 |            f
  300 | 3000000 |  0.00000E+00 |  0.00000E+00 |       1 |  0.00000E+00 |            f
  301 | 3010000 |  0.00000E+00 |  0.00000E+00 |       1 |  6.14181E+24 |            f
  302 | 3020000 |  0.00000E+00 |  0.00000E+00 |       1 |  0.00000E+00 |            f
  303 | 3030000 |  0.00000E+00 |  0.00000E+00 |       1 |  0.00000E+00 |            f
  304 | 3040000 |  0.00000E+00 |  0.00000E+00 |       1 |  1.19801E+24 |            f
  305 | 3050000 |  0.00000E+00 |  0.00000E+00 |       1 |  2.03615E+24 |            f
  306 | 3060000 |  0.00000E+00 |  0.00000E+00 |       1 |  8.60536E+24 |            f
  307 | 3070000 |  0.00000E+00 |  0.00000E+00 |       1 |  0.00000E+00 |            f
  308 | 3080000 |  0.00000E+00 |  0.00000E+00 |       1 |  0.00000E+00 |            f
  309 | 3090000 |  0.00000E+00 |  0.00000E+00 |       1 |  3.28162E+24 |            f
  310 | 3100000 |  0.00000E+00 |  0.00000E+00 |       1 |  3.52272E+24 |            f
  311 | 3110000 |  0.00000E+00 |  0.00000E+00 |       1 |  0.00000E+00 |            f
  312 | 3120000 |  0.00000E+00 |  0.00000E+00 |       1 |  0.00000E+00 |            f
  313 | 3130000 |  0.00000E+00 |  0.00000E+00 |       1 |  1.47650E+24 |            f
  314 | 3140000 |  0.00000E+00 |  0.00000E+00 |       1 |  0.00000E+00 |            f
  315 | 3150000 |  0.00000E+00 |  0.00000E+00 |       1 |  4.62741E+23 |            f
  316 | 3160000 |  0.00000E+00 |  0.00000E+00 |       1 |  6.17427E+24 |            f
  317 | 3170000 |  0.00000E+00 |  0.00000E+00 |       1 |  0.00000E+00 |            f
  318 | 3180000 |  0.00000E+00 |  0.00000E+00 |       1 |  0.00000E+00 |            f
  319 | 3190000 |  0.00000E+00 |  0.00000E+00 |       1 |  0.00000E+00 |            f
  320 | 3200000 |  0.00000E+00 |  0.00000E+00 |       1 |  0.00000E+00 |            f
  321 | 3210000 |  0.00000E+00 |  0.00000E+00 |       1 |  2.09718E+24 |            f
  322 | 3220000 |  0.00000E+00 |  0.00000E+00 |       1 |  0.00000E+00 |            f
  323 | 3230000 |  0.00000E+00 |  0.00000E+00 |       1 |  1.00151E+24 |            f
  324 | 3240000 |  0.00000E+00 |  0.00000E+00 |       1 |  5.95458E+24 |            f
  325 | 3250000 |  0.00000E+00 |  0.00000E+00 |       1 |  2.74993E+24 |            f
  326 | 3260000 |  0.00000E+00 |  0.00000E+00 |       1 |  6.08938E+23 |            f
  327 | 3270000 |  0.00000E+00 |  0.00000E+00 |       1 |  5.93323E+24 |            f
  328 | 3280000 |  0.00000E+00 |  0.00000E+00 |       1 |  0.00000E+00 |            f
  329 | 3290000 |  0.00000E+00 |  0.00000E+00 |       1 |  2.63514E+24 |            f
  330 | 3300000 |  0.00000E+00 |  0.00000E+00 |       1 |  0.00000E+00 |            f
  331 | 3310000 |  0.00000E+00 |  0.00000E+00 |       1 |  1.63674E+24 |            f
  332 | 3320000 |  0.00000E+00 |  0.00000E+00 |       1 |  3.46424E+23 |            f
  333 | 3330000 |  0.00000E+00 |  0.00000E+00 |       1 |  2.32104E+24 |            f
  334 | 3340000 |  0.00000E+00 |  0.00000E+00 |       1 |  1.05944E+24 |            f
  335 | 3350000 |  0.00000E+00 |  0.00000E+00 |       1 |  5.60675E+24 |            f
  336 | 3360000 |  0.00000E+00 |  0.00000E+00 |       1 |  0.00000E+00 |            f
  337 | 3370000 |  0.00000E+00 |  0.00000E+00 |       1 |  4.25404E+22 |            f
  338 | 3380000 |  0.00000E+00 |  0.00000E+00 |       1 |  0.00000E+00 |            f
  339 | 3390000 |  0.00000E+00 |  0.00000E+00 |       1 |  0.00000E+00 |            f
  340 | 3400000 |  0.00000E+00 |  0.00000E+00 |       1 |  1.34640E+24 |            f
  341 | 3410000 |  0.00000E+00 |  0.00000E+00 |       1 |  1.45218E+24 |            f
  342 | 3420000 |  0.00000E+00 |  0.00000E+00 |       1 |  1.97365E+23 |            f
  343 | 3430000 |  0.00000E+00 |  0.00000E+00 |       1 |  5.34900E+24 |            f
  344 | 3440000 |  0.00000E+00 |  0.00000E+00 |       1 |  3.10744E+24 |            f
  345 | 3450000 |  0.00000E+00 |  0.00000E+00 |       1 |  0.00000E+00 |            f
  346 | 3460000 |  0.00000E+00 |  0.00000E+00 |       1 |  0.00000E+00 |            f
  347 | 3470000 |  0.00000E+00 |  0.00000E+00 |       1 |  1.11111E+23 |            f
  348 | 3480000 |  0.00000E+00 |  0.00000E+00 |       1 |  1.01742E+23 |            f
  349 | 3490000 |  0.00000E+00 |  0.00000E+00 |       1 |  2.91864E+24 |            f
  350 | 3500000 |  0.00000E+00 |  0.00000E+00 |       1 |  0.00000E+00 |            f
  351 | 3510000 |  0.00000E+00 |  0.00000E+00 |       1 |  1.05886E+24 |            f
  352 | 3520000 |  0.00000E+00 |  0.00000E+00 |       1 |  5.94883E+23 |            f
  353 | 3530000 |  0.00000E+00 |  0.00000E+00 |       1 |  5.69510E+23 |            f
  354 | 3540000 |  0.00000E+00 |  0.00000E+00 |       1 |  1.57412E+23 |            f
  355 | 3550000 |  0.00000E+00 |  0.00000E+00 |       1 |  0.00000E+00 |            f
  356 | 3560000 |  0.00000E+00 |  0.00000E+00 |       1 |  3.63334E+24 |            f
  357 | 3570000 |  0.00000E+00 |  0.00000E+00 |       1 |  7.27892E+23 |            f
  358 | 3580000 |  0.00000E+00 |  0.00000E+00 |       1 |  0.00000E+00 |            f
  359 | 3590000 |  0.00000E+00 |  0.00000E+00 |       1 |  2.49399E+24 |            f
  360 | 3600000 |  0.00000E+00 |  0.00000E+00 |       1 |  0.00000E+00 |            f
  361 | 3610000 |  0.00000E+00 |  0.00000E+00 |       1 |  0.00000E+00 |            f
  362 | 3620000 |  0.00000E+00 |  0.00000E+00 |       1 |  2.59464E+24 |            f
  363 | 3630000 |  0.00000E+00 |  0.00000E+00 |       1 |  0.00000E+00 |            f
  364 | 3640000 |  0.00000E+00 |  0.00000E+00 |       1 |  0.00000E+00 |            f
  365 | 3650000 |  0.00000E+00 |  0.00000E+00 |       1 |  2.19668E+23 |            f
  366 | 3660000 |  0.00000E+00 |  0.00000E+00 |       1 |  0.00000E+00 |            f
  367 | 3670000 |  0.00000E+00 |  0.00000E+00 |       1 |  1.42070E+24 |            f
  368 | 3680000 |  0.00000E+00 |  0.00000E+00 |       1 |  1.55496E+24 |            f
  369 | 3690000 |  0.00000E+00 |  0.00000E+00 |       1 |  2.32953E+24 |            f
  370 | 3700000 |  0.00000E+00 |  0.00000E+00 |       1 |  1.31780E+24 |            f
  371 | 3710000 |  0.00000E+00 |  0.00000E+00 |       1 |  0.00000E+00 |            f
  372 | 3720000 |  0.00000E+00 |  0.00000E+00 |       1 |  0.00000E+00 |            f
  373 | 3730000 |  0.00000E+00 |  0.00000E+00 |       1 |  1.99776E+23 |            f
  374 | 3740000 |  0.00000E+00 |  0.00000E+00 |       1 |  0.00000E+00 |            f
  375 | 3750000 |  0.00000E+00 |  0.00000E+00 |       1 |  5.31312E+23 |            f
  376 | 3760000 |  0.00000E+00 |  0.00000E+00 |       1 |  8.70046E+23 |            f
  377 | 3770000 |  0.00000E+00 |  0.00000E+00 |       1 |  3.51994E+24 |            f
  378 | 3780000 |  0.00000E+00 |  0.00000E+00 |       1 |  4.34134E+24 |            f
  379 | 3790000 |  0.00000E+00 |  0.00000E+00 |       1 |  0.00000E+00 |            f
  380 | 3800000 |  0.00000E+00 |  0.00000E+00 |       1 |  0.00000E+00 |            f
  381 | 3810000 |  0.00000E+00 |  0.00000E+00 |       1 |  3.38910E+24 |            f
  382 | 3820000 |  0.00000E+00 |  0.00000E+00 |       1 |  1.64528E+24 |            f
  383 | 3830000 |  0.00000E+00 |  0.00000E+00 |       1 |  1.69690E+24 |            f
  384 | 3840000 |  0.00000E+00 |  0.00000E+00 |       1 |  0.00000E+00 |            f
  385 | 3850000 |  0.00000E+00 |  0.00000E+00 |       1 |  1.88987E+24 |            f
  386 | 3860000 |  0.00000E+00 |  0.00000E+00 |       1 |  0.00000E+00 |            f
  387 | 3870000 |  0.00000E+00 |  0.00000E+00 |       1 |  6.58056E+23 |            f
  388 | 3880000 |  0.00000E+00 |  0.00000E+00 |       1 |  1.95397E+24 |            f
  389 | 3890000 |  0.00000E+00 |  0.00000E+00 |       1 |  3.21830E+23 |            f
  390 | 3900000 |  0.00000E+00 |  0.00000E+00 |       1 |  0.00000E+00 |            f
  391 | 3910000 |  0.00000E+00 |  0.00000E+00 |       1 |  6.25632E+23 |            f
  392 | 3920000 |  0.00000E+00 |  0.00000E+00 |       1 |  2.43200E+24 |            f
  393 | 3930000 |  0.00000E+00 |  0.00000E+00 |       1 |  0.00000E+00 |            f
  394 | 3940000 |  0.00000E+00 |  0.00000E+00 |       1 |  0.00000E+00 |            f
  395 | 3950000 |  0.00000E+00 |  0.00000E+00 |       1 |  2.95368E+20 |            f
  396 | 3960000 |  0.00000E+00 |  0.00000E+00 |       1 |  0.00000E+00 |            f
  397 | 3970000 |  0.00000E+00 |  0.00000E+00 |       1 |  1.45746E+24 |            f
  398 | 3980000 |  0.00000E+00 |  0.00000E+00 |       1 |  1.05943E+25 |            f
  399 | 3990000 |  0.00000E+00 |  0.00000E+00 |       1 |  3.13016E+24 |            f
  400 | 4000000 |  0.00000E+00 |  0.00000E+00 |       1 |  1.40460E+24 |            f
  401 | 4010000 |  0.00000E+00 |  0.00000E+00 |       1 |  0.00000E+00 |            f
  402 | 4020000 |  0.00000E+00 |  0.00000E+00 |       1 |  0.00000E+00 |            f
  403 | 4030000 |  0.00000E+00 |  0.00000E+00 |       1 |  1.68907E+24 |            f
  404 | 4040000 |  0.00000E+00 |  0.00000E+00 |       1 |  1.39157E+24 |            f
  405 | 4050000 |  0.00000E+00 |  0.00000E+00 |       1 |  4.93367E+23 |            f
  406 | 4060000 |  0.00000E+00 |  0.00000E+00 |       1 |  1.23071E+24 |            f
  407 | 4070000 |  0.00000E+00 |  0.00000E+00 |       1 |  0.00000E+00 |            f
  408 | 4080000 |  0.00000E+00 |  0.00000E+00 |       1 |  3.84325E+23 |            f
  409 | 4090000 |  0.00000E+00 |  0.00000E+00 |       1 |  0.00000E+00 |            f
  410 | 4100000 |  0.00000E+00 |  0.00000E+00 |       1 |  2.83512E+23 |            f
  411 | 4110000 |  0.00000E+00 |  0.00000E+00 |       1 |  8.46301E+23 |            f
  412 | 4120000 |  0.00000E+00 |  0.00000E+00 |       1 |  4.37590E+23 |            f
  413 | 4130000 |  0.00000E+00 |  0.00000E+00 |       1 |  7.09612E+23 |            f
  414 | 4140000 |  0.00000E+00 |  0.00000E+00 |       1 |  1.73834E+24 |            f
  415 | 4150000 |  0.00000E+00 |  0.00000E+00 |       1 |  0.00000E+00 |            f
  416 | 4160000 |  0.00000E+00 |  0.00000E+00 |       1 |  0.00000E+00 |            f
  417 | 4170000 |  0.00000E+00 |  0.00000E+00 |       1 |  0.00000E+00 |            f
  418 | 4180000 |  0.00000E+00 |  0.00000E+00 |       1 |  5.12304E+23 |            f
  419 | 4190000 |  0.00000E+00 |  0.00000E+00 |       1 |  4.54367E+23 |            f
  420 | 4200000 |  0.00000E+00 |  0.00000E+00 |       1 |  1.23766E+23 |            f
  421 | 4210000 |  0.00000E+00 |  0.00000E+00 |       1 |  2.41457E+23 |            f
  422 | 4220000 |  0.00000E+00 |  0.00000E+00 |       1 |  2.05248E+24 |            f
  423 | 4230000 |  0.00000E+00 |  0.00000E+00 |       1 |  5.44319E+23 |            f
  424 | 4240000 |  0.00000E+00 |  0.00000E+00 |       1 |  0.00000E+00 |            f
  425 | 4250000 |  0.00000E+00 |  0.00000E+00 |       1 |  2.85254E+23 |            f
  426 | 4260000 |  0.00000E+00 |  0.00000E+00 |       1 |  2.13130E+24 |            f
  427 | 4270000 |  0.00000E+00 |  0.00000E+00 |       1 |  0.00000E+00 |            f
  428 | 4280000 |  0.00000E+00 |  0.00000E+00 |       1 |  3.77708E+23 |            f
  429 | 4290000 |  0.00000E+00 |  0.00000E+00 |       1 |  1.81044E+24 |            f
  430 | 4300000 |  0.00000E+00 |  0.00000E+00 |       1 |  0.00000E+00 |            f
  431 | 4310000 |  0.00000E+00 |  0.00000E+00 |       1 |  2.44227E+24 |            f
  432 | 4320000 |  0.00000E+00 |  0.00000E+00 |       1 |  1.35183E+24 |            f
  433 | 4330000 |  0.00000E+00 |  0.00000E+00 |       1 |  0.00000E+00 |            f
  434 | 4340000 |  0.00000E+00 |  0.00000E+00 |       1 |  0.00000E+00 |            f
  435 | 4350000 |  0.00000E+00 |  0.00000E+00 |       1 |  0.00000E+00 |            f
  436 | 4360000 |  0.00000E+00 |  0.00000E+00 |       1 |  3.16837E+24 |            f
  437 | 4370000 |  0.00000E+00 |  0.00000E+00 |       1 |  0.00000E+00 |            f
  438 | 4380000 |  0.00000E+00 |  0.00000E+00 |       1 |  1.69654E+24 |            f
  439 | 4390000 |  0.00000E+00 |  0.00000E+00 |       1 |  0.00000E+00 |            f
  440 | 4400000 |  0.00000E+00 |  0.00000E+00 |       1 |  0.00000E+00 |            f
  441 | 4410000 |  0.00000E+00 |  0.00000E+00 |       1 |  3.37441E+22 |            f
  442 | 4420000 |  0.00000E+00 |  0.00000E+00 |       1 |  4.41213E+23 |            f
  443 | 4430000 |  0.00000E+00 |  0.00000E+00 |       1 |  1.70264E+24 |            f
  444 | 4440000 |  0.00000E+00 |  0.00000E+00 |       1 |  0.00000E+00 |            f
  445 | 4450000 |  0.00000E+00 |  0.00000E+00 |       1 |  6.95614E+23 |            f
  446 | 4460000 |  0.00000E+00 |  0.00000E+00 |       1 |  7.05591E+23 |            f
  447 | 4470000 |  0.00000E+00 |  0.00000E+00 |       1 |  6.11860E+23 |            f
  448 | 4480000 |  0.00000E+00 |  0.00000E+00 |       1 |  3.85713E+23 |            f
  449 | 4490000 |  0.00000E+00 |  0.00000E+00 |       1 |  0.00000E+00 |            f
  450 | 4500000 |  0.00000E+00 |  0.00000E+00 |       1 |  0.00000E+00 |            f
  451 | 4510000 |  0.00000E+00 |  0.00000E+00 |       1 |  0.00000E+00 |            f
  452 | 4520000 |  0.00000E+00 |  0.00000E+00 |       1 |  1.20617E+23 |            f
  453 | 4530000 |  0.00000E+00 |  0.00000E+00 |       1 |  7.51441E+23 |            f
  454 | 4540000 |  0.00000E+00 |  0.00000E+00 |       1 |  2.39646E+24 |            f
  455 | 4550000 |  0.00000E+00 |  0.00000E+00 |       1 |  0.00000E+00 |            f
  456 | 4560000 |  0.00000E+00 |  0.00000E+00 |       1 |  0.00000E+00 |            f
  457 | 4570000 |  0.00000E+00 |  0.00000E+00 |       1 |  3.65576E+23 |            f
  458 | 4580000 |  0.00000E+00 |  0.00000E+00 |       1 |  4.20296E+23 |            f
  459 | 4590000 |  0.00000E+00 |  0.00000E+00 |       1 |  0.00000E+00 |            f
  460 | 4600000 |  0.00000E+00 |  0.00000E+00 |       1 |  2.37862E+23 |            f
  461 | 4610000 |  0.00000E+00 |  0.00000E+00 |       1 |  9.42661E+23 |            f
  462 | 4620000 |  0.00000E+00 |  0.00000E+00 |       1 |  5.05701E+23 |            f
  463 | 4630000 |  0.00000E+00 |  0.00000E+00 |       1 |  0.00000E+00 |            f
  464 | 4640000 |  0.00000E+00 |  0.00000E+00 |       1 |  0.00000E+00 |            f
  465 | 4650000 |  0.00000E+00 |  0.00000E+00 |       1 |  5.15749E+21 |            f
  466 | 4660000 |  0.00000E+00 |  0.00000E+00 |       1 |  6.53661E+23 |            f
  467 | 4670000 |  0.00000E+00 |  0.00000E+00 |       1 |  4.44218E+23 |            f
  468 | 4680000 |  0.00000E+00 |  0.00000E+00 |       1 |  1.23543E+22 |            f
  469 | 4690000 |  0.00000E+00 |  0.00000E+00 |       1 |  4.88220E+23 |            f
  470 | 4700000 |  0.00000E+00 |  0.00000E+00 |       1 |  0.00000E+00 |            f
  471 | 4710000 |  0.00000E+00 |  0.00000E+00 |       1 |  1.38092E+24 |            f
  472 | 4720000 |  0.00000E+00 |  0.00000E+00 |       1 |  0.00000E+00 |            f
  473 | 4730000 |  0.00000E+00 |  0.00000E+00 |       1 |  1.04352E+24 |            f
  474 | 4740000 |  0.00000E+00 |  0.00000E+00 |       1 |  1.96649E+23 |            f
  475 | 4750000 |  0.00000E+00 |  0.00000E+00 |       1 |  0.00000E+00 |            f
  476 | 4760000 |  0.00000E+00 |  0.00000E+00 |       1 |  4.34128E+23 |            f
  477 | 4770000 |  0.00000E+00 |  0.00000E+00 |       1 |  4.20991E+23 |            f
  478 | 4780000 |  0.00000E+00 |  0.00000E+00 |       1 |  0.00000E+00 |            f
  479 | 4790000 |  0.00000E+00 |  0.00000E+00 |       1 |  4.64261E+23 |            f
  480 | 4800000 |  0.00000E+00 |  0.00000E+00 |       1 |  0.00000E+00 |            f
  481 | 4810000 |  0.00000E+00 |  0.00000E+00 |       1 |  8.29286E+22 |            f
  482 | 4820000 |  0.00000E+00 |  0.00000E+00 |       1 |  5.37676E+23 |            f
  483 | 4830000 |  0.00000E+00 |  0.00000E+00 |       1 |  1.00960E+23 |            f
  484 | 4840000 |  0.00000E+00 |  0.00000E+00 |       1 |  1.23984E+24 |            f
  485 | 4850000 |  0.00000E+00 |  0.00000E+00 |       1 |  0.00000E+00 |            f
  486 | 4860000 |  0.00000E+00 |  0.00000E+00 |       1 |  0.00000E+00 |            f
  487 | 4870000 |  0.00000E+00 |  0.00000E+00 |       1 |  2.60978E+23 |            f
  488 | 4880000 |  0.00000E+00 |  0.00000E+00 |       1 |  4.59046E+23 |            f
  489 | 4890000 |  0.00000E+00 |  0.00000E+00 |       1 |  0.00000E+00 |            f
  490 | 4900000 |  0.00000E+00 |  0.00000E+00 |       1 |  4.14519E+23 |            f
  491 | 4910000 |  0.00000E+00 |  0.00000E+00 |       1 |  1.06225E+24 |            f
  492 | 4920000 |  0.00000E+00 |  0.00000E+00 |       1 |  6.43786E+23 |            f
  493 | 4930000 |  0.00000E+00 |  0.00000E+00 |       1 |  2.18584E+23 |            f
  494 | 4940000 |  0.00000E+00 |  0.00000E+00 |       1 |  1.73782E+23 |            f
  495 | 4950000 |  0.00000E+00 |  0.00000E+00 |       1 |  6.93262E+23 |            f
  496 | 4960000 |  0.00000E+00 |  0.00000E+00 |       1 |  1.14278E+24 |            f
  497 | 4970000 |  0.00000E+00 |  0.00000E+00 |       1 |  0.00000E+00 |            f
  498 | 4980000 |  0.00000E+00 |  0.00000E+00 |       1 |  1.39016E+24 |            f
  499 | 4990000 |  0.00000E+00 |  0.00000E+00 |       1 |  0.00000E+00 |            f
  500 | 5000000 |  0.00000E+00 |  0.00000E+00 |       1 |  2.83195E+23 |            f
  501 | 5010000 |  0.00000E+00 |  0.00000E+00 |       1 |  1.14405E+23 |            f
  502 | 5020000 |  0.00000E+00 |  0.00000E+00 |       1 |  4.13913E+23 |            f
  503 | 5030000 |  0.00000E+00 |  0.00000E+00 |       1 |  2.83914E+23 |            f
  504 | 5040000 |  0.00000E+00 |  0.00000E+00 |       1 |  4.06025E+23 |            f
  505 | 5050000 |  0.00000E+00 |  0.00000E+00 |       1 |  6.94195E+23 |            f
  506 | 5060000 |  0.00000E+00 |  0.00000E+00 |       1 |  1.03179E+24 |            f
  507 | 5070000 |  0.00000E+00 |  0.00000E+00 |       1 |  4.16688E+23 |            f
  508 | 5080000 |  0.00000E+00 |  0.00000E+00 |       1 |  0.00000E+00 |            f
  509 | 5090000 |  0.00000E+00 |  0.00000E+00 |       1 |  0.00000E+00 |            f
  510 | 5100000 |  0.00000E+00 |  0.00000E+00 |       1 |  0.00000E+00 |            f
  511 | 5110000 |  0.00000E+00 |  0.00000E+00 |       1 |  7.80102E+22 |            f
  512 | 5120000 |  0.00000E+00 |  0.00000E+00 |       1 |  8.74024E+23 |            f
  513 | 5130000 |  0.00000E+00 |  0.00000E+00 |       1 |  4.30785E+23 |            f
  514 | 5140000 |  0.00000E+00 |  0.00000E+00 |       1 |  0.00000E+00 |            f
  515 | 5150000 |  0.00000E+00 |  0.00000E+00 |       1 |  0.00000E+00 |            f
  516 | 5160000 |  0.00000E+00 |  0.00000E+00 |       1 |  4.25209E+23 |            f
  517 | 5170000 |  0.00000E+00 |  0.00000E+00 |       1 |  0.00000E+00 |            f
  518 | 5180000 |  0.00000E+00 |  0.00000E+00 |       1 |  3.41129E+22 |            f
  519 | 5190000 |  0.00000E+00 |  0.00000E+00 |       1 |  3.49825E+23 |            f
  520 | 5200000 |  0.00000E+00 |  0.00000E+00 |       1 |  9.53809E+23 |            f
  521 | 5210000 |  0.00000E+00 |  0.00000E+00 |       1 |  0.00000E+00 |            f
  522 | 5220000 |  0.00000E+00 |  0.00000E+00 |       1 |  4.46256E+23 |            f
  523 | 5230000 |  0.00000E+00 |  0.00000E+00 |       1 |  8.43463E+22 |            f
  524 | 5240000 |  0.00000E+00 |  0.00000E+00 |       1 |  0.00000E+00 |            f
  525 | 5250000 |  0.00000E+00 |  0.00000E+00 |       1 |  2.57115E+23 |            f
  526 | 5260000 |  0.00000E+00 |  0.00000E+00 |       1 |  3.26531E+23 |            f
  527 | 5270000 |  0.00000E+00 |  0.00000E+00 |       1 |  2.86915E+23 |            f
  528 | 5280000 |  0.00000E+00 |  0.00000E+00 |       1 |  1.20098E+24 |            f
  529 | 5290000 |  0.00000E+00 |  0.00000E+00 |       1 |  0.00000E+00 |            f
  530 | 5300000 |  0.00000E+00 |  0.00000E+00 |       1 |  0.00000E+00 |            f
  531 | 5310000 |  0.00000E+00 |  0.00000E+00 |       1 |  1.92620E+24 |            f
  532 | 5320000 |  0.00000E+00 |  0.00000E+00 |       1 |  0.00000E+00 |            f
  533 | 5330000 |  0.00000E+00 |  0.00000E+00 |       1 |  1.86526E+23 |            f
  534 | 5340000 |  0.00000E+00 |  0.00000E+00 |       1 |  1.27812E+24 |            f
  535 | 5350000 |  0.00000E+00 |  0.00000E+00 |       1 |  0.00000E+00 |            f
  536 | 5360000 |  0.00000E+00 |  0.00000E+00 |       1 |  0.00000E+00 |            f
  537 | 5370000 |  0.00000E+00 |  0.00000E+00 |       1 |  2.62790E+23 |            f
  538 | 5380000 |  0.00000E+00 |  0.00000E+00 |       1 |  2.36957E+23 |            f
  539 | 5390000 |  0.00000E+00 |  0.00000E+00 |       1 |  1.07717E+24 |            f
  540 | 5400000 |  0.00000E+00 |  0.00000E+00 |       1 |  2.16656E+22 |            f
  541 | 5410000 |  0.00000E+00 |  0.00000E+00 |       1 |  0.00000E+00 |            f
  542 | 5420000 |  0.00000E+00 |  0.00000E+00 |       1 |  0.00000E+00 |            f
  543 | 5430000 |  0.00000E+00 |  0.00000E+00 |       1 |  2.17083E+24 |            f
  544 | 5440000 |  0.00000E+00 |  0.00000E+00 |       1 |  0.00000E+00 |            f
  545 | 5450000 |  0.00000E+00 |  0.00000E+00 |       1 |  5.00742E+22 |            f
  546 | 5460000 |  0.00000E+00 |  0.00000E+00 |       1 |  0.00000E+00 |            f
  547 | 5470000 |  0.00000E+00 |  0.00000E+00 |       1 |  3.25967E+23 |            f
  548 | 5480000 |  0.00000E+00 |  0.00000E+00 |       1 |  5.53417E+23 |            f
  549 | 5490000 |  0.00000E+00 |  0.00000E+00 |       1 |  0.00000E+00 |            f
  550 | 5500000 |  0.00000E+00 |  0.00000E+00 |       1 |  1.05869E+23 |            f
  551 | 5510000 |  0.00000E+00 |  0.00000E+00 |       1 |  7.06597E+21 |            f
  552 | 5520000 |  0.00000E+00 |  0.00000E+00 |       1 |  6.54584E+22 |            f
  553 | 5530000 |  0.00000E+00 |  0.00000E+00 |       1 |  2.13740E+24 |            f
  554 | 5540000 |  0.00000E+00 |  0.00000E+00 |       1 |  0.00000E+00 |            f
  555 | 5550000 |  0.00000E+00 |  0.00000E+00 |       1 |  0.00000E+00 |            f
  556 | 5560000 |  0.00000E+00 |  0.00000E+00 |       1 |  0.00000E+00 |            f
  557 | 5570000 |  0.00000E+00 |  0.00000E+00 |       1 |  0.00000E+00 |            f
  558 | 5580000 |  0.00000E+00 |  0.00000E+00 |       1 |  0.00000E+00 |            f
  559 | 5590000 |  0.00000E+00 |  0.00000E+00 |       1 |  3.86682E+22 |            f
  560 | 5600000 |  0.00000E+00 |  0.00000E+00 |       1 |  0.00000E+00 |            f
  561 | 5610000 |  0.00000E+00 |  0.00000E+00 |       1 |  3.85235E+23 |            f
  562 | 5620000 |  0.00000E+00 |  0.00000E+00 |       1 |  9.33843E+22 |            f
  563 | 5630000 |  0.00000E+00 |  0.00000E+00 |       1 |  2.43019E+23 |            f
  564 | 5640000 |  0.00000E+00 |  0.00000E+00 |       1 |  1.16749E+22 |            f
  565 | 5650000 |  0.00000E+00 |  0.00000E+00 |       1 |  7.22268E+23 |            f
  566 | 5660000 |  0.00000E+00 |  0.00000E+00 |       1 |  0.00000E+00 |            f
  567 | 5670000 |  0.00000E+00 |  0.00000E+00 |       1 |  0.00000E+00 |            f
  568 | 5680000 |  0.00000E+00 |  0.00000E+00 |       1 |  2.37552E+23 |            f
  569 | 5690000 |  0.00000E+00 |  0.00000E+00 |       1 |  2.31932E+23 |            f
  570 | 5700000 |  0.00000E+00 |  0.00000E+00 |       1 |  0.00000E+00 |            f
  571 | 5710000 |  0.00000E+00 |  0.00000E+00 |       1 |  9.84463E+22 |            f
  572 | 5720000 |  0.00000E+00 |  0.00000E+00 |       1 |  3.74073E+23 |            f
  573 | 5730000 |  0.00000E+00 |  0.00000E+00 |       1 |  1.76836E+23 |            f
  574 | 5740000 |  0.00000E+00 |  0.00000E+00 |       1 |  8.66373E+23 |            f
  575 | 5750000 |  0.00000E+00 |  0.00000E+00 |       1 |  8.86488E+23 |            f
2:41:42.857953
res.X:
[9.68600118e+01 9.08589027e+01 8.25268583e+01 7.25549454e+01
 6.52379611e+01 5.82122982e+01 5.15708771e+01 4.52754127e+01
 3.93043312e+01 3.37254417e+01 2.84783689e+01 2.36218014e+01
 1.91393709e+01 1.50500100e+01 1.13465818e+01 8.07138351e+00
 5.21417979e+00 2.81770408e+00 8.99375351e-01 2.80008369e-01
 3.69253614e-07]
res.F:
[7.70260173e-05]
Traceback (most recent call last):
  File "<input>", line 1, in <module>
  File "C:\Users\rginoza\AppData\Local\JetBrains\PyCharm Community Edition 2020.2.1\plugins\python-ce\helpers\pydev\_pydev_bundle\pydev_umd.py", line 197, in runfile
    pydev_imports.execfile(filename, global_vars, local_vars)  # execute the script
  File "C:\Users\rginoza\AppData\Local\JetBrains\PyCharm Community Edition 2020.2.1\plugins\python-ce\helpers\pydev\_pydev_imps\_pydev_execfile.py", line 18, in execfile
    exec(compile(contents+"\n", file, 'exec'), glob, loc)
  File "C:/Users/rginoza/Documents/CODE/spline-eos/runs/2021-03-01_artificial_data/problem_1_match_orig.py", line 202, in <module>
    print(f"res.F:\n{res.F}")
NotImplementedError: Post-processing plots not completed
result_spline = base_spline.new_spline_from_coeffs(res.X)
...
...     # TODO(RG): delete this import after most recent run
...     from seos.optimizer.opt_plots import plot_spline_against_data
...     res_sp_fig, res_sp_ax = plot_spline_against_data(
...         result_spline, data["V(--)"], data["P(GPA)"]
...     )
...     res_sp_fig.savefig(out_dir / "result_spline_plot.eps")
...     truth_fig, truth_ax = plot_against_known_truth(
...         initial_spline(), result_spline, data["V(--)"], data["P(GPA)"]
...     )
...     truth_fig.savefig(out_dir / "result_against_truth.eps")
...
...     with (out_dir / "prob_1_opt_problem.pickle").open("wb") as f:
...         pickle.dump(problem, f)
...
...     with (out_dir / "prob_1_opt_result.pickle").open("wb") as f:
...         pickle.dump(res, f)
...
...     with (out_dir / "prob_1_result_spline.pickle").open("wb") as f:
...         pickle.dump(result_spline, f)
...
  File "<input>", line 4
    from seos.optimizer.opt_plots import plot_spline_against_data
    ^
IndentationError: unexpected indent
from seos.optimizer.opt_plots import plot_spline_against_data
...
... res_sp_fig, res_sp_ax = plot_spline_against_data(
...     result_spline, data["V(--)"], data["P(GPA)"]
... )
... res_sp_fig.savefig(out_dir / "result_spline_plot.eps")
... truth_fig, truth_ax = plot_against_known_truth(
...     initial_spline(), result_spline, data["V(--)"], data["P(GPA)"]
... )
... truth_fig.savefig(out_dir / "result_against_truth.eps")
...
... with (out_dir / "prob_1_opt_problem.pickle").open("wb") as f:
...     pickle.dump(problem, f)
...
... with (out_dir / "prob_1_opt_result.pickle").open("wb") as f:
...     pickle.dump(res, f)
...
... with (out_dir / "prob_1_result_spline.pickle").open("wb") as f:
...     pickle.dump(result_spline, f)
...
Traceback (most recent call last):
  File "<input>", line 4, in <module>
NameError: name 'result_spline' is not defined
result_spline = base_spline.new_spline_from_coeffs(res.X)
...
... # TODO(RG): delete this import after most recent run
... from seos.optimizer.opt_plots import plot_spline_against_data
...
... res_sp_fig, res_sp_ax = plot_spline_against_data(
...     result_spline, data["V(--)"], data["P(GPA)"]
... )
... res_sp_fig.savefig(out_dir / "result_spline_plot.eps")
... truth_fig, truth_ax = plot_against_known_truth(
...     initial_spline(), result_spline, data["V(--)"], data["P(GPA)"]
... )
... truth_fig.savefig(out_dir / "result_against_truth.eps")
...
... with (out_dir / "prob_1_opt_problem.pickle").open("wb") as f:
...     pickle.dump(problem, f)
...
... with (out_dir / "prob_1_opt_result.pickle").open("wb") as f:
...     pickle.dump(res, f)
...
... with (out_dir / "prob_1_result_spline.pickle").open("wb") as f:
...     pickle.dump(result_spline, f)
...
The PostScript backend does not support transparency; partially transparent artists will be rendered opaque.
The PostScript backend does not support transparency; partially transparent artists will be rendered opaque.
Traceback (most recent call last):
  File "<input>", line 10, in <module>
NameError: name 'plot_against_known_truth' is not defined
def plot_against_known_truth(initial_spline, result_spline, data_v, data_P):
...     fig: plt.Figure
...     ax: plt.Axes
...     fig, ax = plt.subplots()
...
...     v = np.linspace(min(data_v) - 0.005, max(data_v) + 0.05, 10000)
...
...     _err = result_spline(v) - initial_spline(v)
...     _sq = _err**2
...     _mean = _sq.mean()
...     rmse = np.sqrt(_mean)
...
...     ax.plot(v, initial_spline(v), color=ARA_BLUE, label="Known Truth")
...     ax.scatter(data_v, data_P, color=ARA_BLUE, label="Data")
...     ax.plot(v, result_spline(v), color=ARA_ORANGE, alpha=0.7, label="Result")
...     ax.legend()
...     ax.set_xlabel(r"Relative Volume $\nu$")
...     ax.set_ylabel(r"Pressure $P$ (GPa)")
...     ax.set_title(f"GA Spline Fit Against Known Truth\nRMSE: {round(rmse, 4)} GPa")
...     return fig, ax
...
result_spline = base_spline.new_spline_from_coeffs(res.X)
...
... # TODO(RG): delete this import after most recent run
... from seos.optimizer.opt_plots import plot_spline_against_data
...
... res_sp_fig, res_sp_ax = plot_spline_against_data(
...     result_spline, data["V(--)"], data["P(GPA)"]
... )
... res_sp_fig.savefig(out_dir / "result_spline_plot.eps")
... truth_fig, truth_ax = plot_against_known_truth(
...     initial_spline(), result_spline, data["V(--)"], data["P(GPA)"]
... )
... truth_fig.savefig(out_dir / "result_against_truth.eps")
...
... with (out_dir / "prob_1_opt_problem.pickle").open("wb") as f:
...     pickle.dump(problem, f)
...
... with (out_dir / "prob_1_opt_result.pickle").open("wb") as f:
...     pickle.dump(res, f)
...
... with (out_dir / "prob_1_result_spline.pickle").open("wb") as f:
...     pickle.dump(result_spline, f)
...
The PostScript backend does not support transparency; partially transparent artists will be rendered opaque.
The PostScript backend does not support transparency; partially transparent artists will be rendered opaque.
The PostScript backend does not support transparency; partially transparent artists will be rendered opaque.
The PostScript backend does not support transparency; partially transparent artists will be rendered opaque.
The PostScript backend does not support transparency; partially transparent artists will be rendered opaque.
The PostScript backend does not support transparency; partially transparent artists will be rendered opaque.
coeffs = [9.68600118e+01, 9.08589027e+01, 8.25268583e+01, 7.25549454e+01,
...  6.52379611e+01, 5.82122982e+01, 5.15708771e+01, 4.52754127e+01,
...  3.93043312e+01, 3.37254417e+01, 2.84783689e+01, 2.36218014e+01,
...  1.91393709e+01, 1.50500100e+01, 1.13465818e+01, 8.07138351e+00,
...  5.21417979e+00, 2.81770408e+00, 8.99375351e-01, 2.80008369e-01,
...  3.69253614e-07,]
print(coeffs)
[96.8600118, 90.8589027, 82.5268583, 72.5549454, 65.2379611, 58.2122982, 51.5708771, 45.2754127, 39.3043312, 33.7254417, 28.4783689, 23.6218014, 19.1393709, 15.05001, 11.3465818, 8.07138351, 5.21417979, 2.81770408, 0.899375351, 0.280008369, 3.69253614e-07]
for c in coeffs:
...     print(c)
...
96.8600118
90.8589027
82.5268583
72.5549454
65.2379611
58.2122982
51.5708771
45.2754127
39.3043312
33.7254417
28.4783689
23.6218014
19.1393709
15.05001
11.3465818
8.07138351
5.21417979
2.81770408
0.899375351
0.280008369
3.69253614e-07
len(res.X)
21
base_spline.get_coeffs()
array([96.86      , 90.85942349, 82.52628515, 72.55529419, 65.23769979,
       58.21256197, 51.57066825, 45.27553279, 39.30426657, 33.72549545,
       28.4783431 , 23.62185493, 19.13928786, 15.05010767, 11.34644615,
        8.07155959,  5.21392742,  2.81834413,  0.89658278,  0.28894378,
        0.        ])
len(base_spline.get_coeffs())
21
for c in base_spline.get_coeffs():
...     print(c)
...
96.86000000000001
90.85942349492585
82.5262851544149
72.55529419142842
65.23769978787472
58.21256196712225
51.57066825493778
45.27553279393329
39.30426656785794
33.725495447262276
28.478343099871626
23.62185492866599
19.1392878613843
15.05010766854102
11.346446147942249
8.071559588153741
5.213927415193053
2.818344126786154
0.896582778904702
0.2889437784011535
0.0
residual = base_spline.get_coeffs() - res.X
for c in residual:
...     print(c)
...
-1.1789282581275984e-05
0.0005208116093768922
-0.0005731388908145618
0.00034876426138907846
-0.00026130038004623657
0.0002637368640563409
-0.0002088055524183119
0.00012008026357790413
-6.46198789198138e-05
5.371423103639472e-05
-2.5829733466764537e-05
5.35717391620949e-05
-8.305040733347369e-05
9.76193999431274e-05
-0.0001356934625320605
0.00017607663192009682
-0.000252375576767605
0.0006400490232261191
-0.002792571653237763
0.008935409674278971
-3.692536138678186e-07
residual.max()
0.008935409674278971
np.abs(residual).max()
0.008935409674278971
len(base_spline.get_coeffs())
21
len(base_spline.get_knots())
19
