== Problem Description ==
Spline 19 Knots: [0.60932702 0.6237721  0.6316313  0.63999194 0.64888616 0.65844048
 0.66872609 0.679823   0.69192213 0.7051638  0.71981863 0.73620343
 0.75475436 0.77606225 0.80116074 0.83151462 0.86990274 0.92167013
 1.        ]
Spline Number of Coeffs: 21
Coeffs lower bound: [87.174      81.77348115 74.27365664 65.29976477 58.71392981 52.39130577
 46.41360143 40.74797951 35.37383991 30.3529459  25.63050879 21.25966944
 17.22535908 13.5450969  10.21180153  7.26440363  4.69253467  2.53650971
  0.8069245   0.2600494  -0.1       ]
Coeffs upper bound: [1.06546000e+02 9.99453658e+01 9.07789137e+01 7.98108236e+01
 7.17614698e+01 6.40338182e+01 5.67277351e+01 4.98030861e+01
 4.32346932e+01 3.70980450e+01 3.13261774e+01 2.59840404e+01
 2.10532166e+01 1.65551184e+01 1.24810908e+01 8.87871555e+00
 5.73532016e+00 3.10017854e+00 9.86241057e-01 3.17838156e-01
 1.00000000e-01]
=====================================================================================
n_gen |  n_eval |   cv (min)   |   cv (avg)   |  n_nds  |     eps      |  indicator
=====================================================================================
    1 |   10000 |  1.25352E+04 |  2.78466E+06 |       1 |            - |            -
    2 |   20000 |  1.25352E+04 |  1.15450E+05 |       1 |  0.00000E+00 |            f
    3 |   30000 |  1.25352E+04 |  7.95136E+04 |       1 |  0.00000E+00 |            f
    4 |   40000 |  5.15582E+03 |  6.15461E+04 |       1 |  0.071836566 |        ideal
    5 |   50000 |  3.55935E+03 |  4.99317E+04 |       1 |  0.562990388 |        ideal
    6 |   60000 |  3.55935E+03 |  4.16235E+04 |       1 |  0.00000E+00 |            f
    7 |   70000 |  3.55935E+03 |  3.54191E+04 |       1 |  0.00000E+00 |            f
    8 |   80000 |  1.98183E+03 |  3.05875E+04 |       1 |  0.625320358 |        ideal
    9 |   90000 |  1.98183E+03 |  2.66088E+04 |       1 |  0.00000E+00 |            f
   10 |  100000 |  1.98183E+03 |  2.35017E+04 |       1 |  0.00000E+00 |            f
   11 |  110000 |  1.97599E+03 |  2.09037E+04 |       1 |  0.552842332 |        ideal
   12 |  120000 |  1.63193E+02 |  1.86503E+04 |       1 |  0.491553225 |        ideal
   13 |  130000 |  1.63193E+02 |  1.66957E+04 |       1 |  0.00000E+00 |            f
   14 |  140000 |  1.63193E+02 |  1.49495E+04 |       1 |  0.00000E+00 |            f
   15 |  150000 |  0.007989992 |  1.35032E+04 |       1 |  0.234180169 |        ideal
   16 |  160000 |  0.007989992 |  1.22153E+04 |       1 |  0.00000E+00 |            f
   17 |  170000 |  0.007989992 |  1.10795E+04 |       1 |  0.00000E+00 |            f
   18 |  180000 |  0.007989992 |  1.00405E+04 |       1 |  0.00000E+00 |            f
   19 |  190000 |  0.007989992 |  9.10705E+03 |       1 |  0.00000E+00 |            f
   20 |  200000 |  0.007989992 |  8.23430E+03 |       1 |  0.00000E+00 |            f
   21 |  210000 |  0.007989992 |  7.44793E+03 |       1 |  0.00000E+00 |            f
   22 |  220000 |  0.007989992 |  6.73875E+03 |       1 |  0.00000E+00 |            f
   23 |  230000 |  0.007989992 |  6.10196E+03 |       1 |  0.00000E+00 |            f
   24 |  240000 |  0.007989992 |  5.56279E+03 |       1 |  0.00000E+00 |            f
   25 |  250000 |  0.007989992 |  5.02056E+03 |       1 |  0.00000E+00 |            f
   26 |  260000 |  0.007989992 |  4.54740E+03 |       1 |  0.00000E+00 |            f
   27 |  270000 |  0.007989992 |  4.08729E+03 |       1 |  0.00000E+00 |            f
   28 |  280000 |  0.003957460 |  3.67393E+03 |       1 |  0.297035330 |        ideal
   29 |  290000 |  0.003957460 |  3.27095E+03 |       1 |  0.00000E+00 |            f
   30 |  300000 |  0.000732318 |  2.90068E+03 |       1 |  0.284407997 |        ideal
   31 |  310000 |  0.000732318 |  2.56878E+03 |       1 |  0.00000E+00 |            f
   32 |  320000 |  0.000732318 |  2.25355E+03 |       1 |  0.00000E+00 |            f
   33 |  330000 |  0.000732318 |  1.96487E+03 |       1 |  0.00000E+00 |            f
   34 |  340000 |  0.000732318 |  1.70449E+03 |       1 |  0.00000E+00 |            f
   35 |  350000 |  0.000732318 |  1.46217E+03 |       1 |  0.00000E+00 |            f
   36 |  360000 |  0.000732318 |  1.25412E+03 |       1 |  0.00000E+00 |            f
   37 |  370000 |  0.000570744 |  1.06070E+03 |       1 |  0.011133660 |        ideal
   38 |  380000 |  0.000047876 |  8.83906E+02 |       1 |  0.069942635 |        ideal
   39 |  390000 |  0.000047876 |  7.15957E+02 |       1 |  0.00000E+00 |            f
   40 |  400000 |  0.000047876 |  5.71598E+02 |       1 |  0.00000E+00 |            f
   41 |  410000 |  0.000047876 |  4.35651E+02 |       1 |  0.00000E+00 |            f
   42 |  420000 |  0.000047876 |  3.16758E+02 |       1 |  0.00000E+00 |            f
   43 |  430000 |  0.000047876 |  2.19039E+02 |       1 |  0.00000E+00 |            f
   44 |  440000 |  0.000047876 |  1.41940E+02 |       1 |  0.00000E+00 |            f
   45 |  450000 |  0.000034995 |  8.30634E+01 |       1 |  0.334394295 |        ideal
   46 |  460000 |  0.000034995 |  3.95805E+01 |       1 |  0.00000E+00 |            f
   47 |  470000 |  0.000034995 |  1.55758E+01 |       1 |  0.00000E+00 |            f
   48 |  480000 |  0.000027512 |  5.023764888 |       1 |  0.192535050 |        ideal
   49 |  490000 |  0.000027512 |  0.581110233 |       1 |  0.00000E+00 |            f
   50 |  500000 |  0.000027512 |  0.035475787 |       1 |  0.00000E+00 |            f
   51 |  510000 |  0.000015805 |  0.026324899 |       1 |  0.202687702 |        ideal
   52 |  520000 |  5.64184E-06 |  0.019956532 |       1 |  0.076557877 |        ideal
   53 |  530000 |  5.64184E-06 |  0.015116023 |       1 |  0.00000E+00 |            f
   54 |  540000 |  5.64184E-06 |  0.011289661 |       1 |  0.00000E+00 |            f
   55 |  550000 |  2.59370E-06 |  0.008283526 |       1 |  0.535906455 |        ideal
   56 |  560000 |  3.10456E-07 |  0.006064816 |       1 |  0.538576982 |        ideal
   57 |  570000 |  3.10456E-07 |  0.004309468 |       1 |  0.00000E+00 |            f
   58 |  580000 |  3.10456E-07 |  0.002929563 |       1 |  0.00000E+00 |            f
   59 |  590000 |  3.10456E-07 |  0.001955208 |       1 |  0.00000E+00 |            f
   60 |  600000 |  3.10456E-07 |  0.001371243 |       1 |  0.00000E+00 |            f
   61 |  610000 |  0.00000E+00 |  0.000915463 |       1 |  0.088500557 |        ideal
   62 |  620000 |  0.00000E+00 |  0.000542080 |       1 |  0.584962227 |        ideal
   63 |  630000 |  0.00000E+00 |  0.000320784 |       1 |  0.00000E+00 |            f
   64 |  640000 |  0.00000E+00 |  0.000186813 |       1 |  0.00000E+00 |            f
   65 |  650000 |  0.00000E+00 |  0.000101997 |       1 |  0.00000E+00 |            f
   66 |  660000 |  0.00000E+00 |  0.000057392 |       1 |  0.00000E+00 |            f
   67 |  670000 |  0.00000E+00 |  0.000039068 |       1 |  0.00000E+00 |            f
   68 |  680000 |  0.00000E+00 |  0.000025415 |       1 |  0.003781708 |        ideal
   69 |  690000 |  0.00000E+00 |  0.000015693 |       1 |  0.00000E+00 |            f
   70 |  700000 |  0.00000E+00 |  8.80404E-06 |       1 |  0.011615129 |        ideal
   71 |  710000 |  0.00000E+00 |  3.91425E-06 |       1 |  0.013449881 |        ideal
   72 |  720000 |  0.00000E+00 |  1.61364E-06 |       1 |  0.00000E+00 |            f
   73 |  730000 |  0.00000E+00 |  3.83507E-07 |       1 |  0.00000E+00 |            f
   74 |  740000 |  0.00000E+00 |  6.14041E-08 |       1 |  0.025000693 |        ideal
   75 |  750000 |  0.00000E+00 |  0.00000E+00 |       1 |  0.00000E+00 |            f
   76 |  760000 |  0.00000E+00 |  0.00000E+00 |       1 |  2.45240E+27 |            f
   77 |  770000 |  0.00000E+00 |  0.00000E+00 |       1 |  0.039022718 |        ideal
   78 |  780000 |  0.00000E+00 |  0.00000E+00 |       1 |  0.003815762 |        ideal
   79 |  790000 |  0.00000E+00 |  0.00000E+00 |       1 |  1.39113E+27 |            f
   80 |  800000 |  0.00000E+00 |  0.00000E+00 |       1 |  0.014251117 |        ideal
   81 |  810000 |  0.00000E+00 |  0.00000E+00 |       1 |  0.007226709 |        ideal
   82 |  820000 |  0.00000E+00 |  0.00000E+00 |       1 |  0.055921915 |        ideal
   83 |  830000 |  0.00000E+00 |  0.00000E+00 |       1 |  0.00000E+00 |            f
   84 |  840000 |  0.00000E+00 |  0.00000E+00 |       1 |  0.021576732 |        ideal
   85 |  850000 |  0.00000E+00 |  0.00000E+00 |       1 |  0.00000E+00 |            f
   86 |  860000 |  0.00000E+00 |  0.00000E+00 |       1 |  0.004276352 |        ideal
   87 |  870000 |  0.00000E+00 |  0.00000E+00 |       1 |  0.004089611 |        ideal
   88 |  880000 |  0.00000E+00 |  0.00000E+00 |       1 |  0.047531792 |        ideal
   89 |  890000 |  0.00000E+00 |  0.00000E+00 |       2 |  0.00000E+00 |            f
   90 |  900000 |  0.00000E+00 |  0.00000E+00 |       1 |  0.015620797 |        ideal
   91 |  910000 |  0.00000E+00 |  0.00000E+00 |       1 |  0.006218805 |        ideal
   92 |  920000 |  0.00000E+00 |  0.00000E+00 |       1 |  0.007732546 |        ideal
   93 |  930000 |  0.00000E+00 |  0.00000E+00 |       1 |  0.026958148 |        ideal
   94 |  940000 |  0.00000E+00 |  0.00000E+00 |       1 |  0.00000E+00 |            f
   95 |  950000 |  0.00000E+00 |  0.00000E+00 |       1 |  0.014016232 |        ideal
   96 |  960000 |  0.00000E+00 |  0.00000E+00 |       1 |  0.012937506 |        ideal
   97 |  970000 |  0.00000E+00 |  0.00000E+00 |       1 |  6.75610E+26 |            f
   98 |  980000 |  0.00000E+00 |  0.00000E+00 |       1 |  0.016511518 |        ideal
   99 |  990000 |  0.00000E+00 |  0.00000E+00 |       1 |  0.023929605 |        ideal
  100 | 1000000 |  0.00000E+00 |  0.00000E+00 |       1 |  0.00000E+00 |            f
  101 | 1010000 |  0.00000E+00 |  0.00000E+00 |       1 |  0.024855058 |        ideal
  102 | 1020000 |  0.00000E+00 |  0.00000E+00 |       1 |  3.11844E+25 |            f
  103 | 1030000 |  0.00000E+00 |  0.00000E+00 |       1 |  0.007747164 |        ideal
  104 | 1040000 |  0.00000E+00 |  0.00000E+00 |       1 |  8.97535E+26 |            f
  105 | 1050000 |  0.00000E+00 |  0.00000E+00 |       1 |  1.59857E+27 |            f
  106 | 1060000 |  0.00000E+00 |  0.00000E+00 |       1 |  0.014327446 |        ideal
  107 | 1070000 |  0.00000E+00 |  0.00000E+00 |       1 |  0.014524642 |        ideal
  108 | 1080000 |  0.00000E+00 |  0.00000E+00 |       1 |  0.011114040 |        ideal
  109 | 1090000 |  0.00000E+00 |  0.00000E+00 |       1 |  0.006452376 |        ideal
  110 | 1100000 |  0.00000E+00 |  0.00000E+00 |       1 |  1.00176E+27 |            f
  111 | 1110000 |  0.00000E+00 |  0.00000E+00 |       1 |  0.004559622 |        ideal
  112 | 1120000 |  0.00000E+00 |  0.00000E+00 |       1 |  0.005441486 |        ideal
  113 | 1130000 |  0.00000E+00 |  0.00000E+00 |       1 |  0.00000E+00 |            f
  114 | 1140000 |  0.00000E+00 |  0.00000E+00 |       1 |  0.009505357 |        ideal
  115 | 1150000 |  0.00000E+00 |  0.00000E+00 |       1 |  0.007744077 |        ideal
  116 | 1160000 |  0.00000E+00 |  0.00000E+00 |       1 |  0.007184079 |        ideal
  117 | 1170000 |  0.00000E+00 |  0.00000E+00 |       1 |  0.00000E+00 |            f
  118 | 1180000 |  0.00000E+00 |  0.00000E+00 |       1 |  0.007688872 |        ideal
  119 | 1190000 |  0.00000E+00 |  0.00000E+00 |       1 |  0.003029526 |        ideal
  120 | 1200000 |  0.00000E+00 |  0.00000E+00 |       1 |  0.003568728 |        ideal
  121 | 1210000 |  0.00000E+00 |  0.00000E+00 |       1 |  0.004979544 |        ideal
  122 | 1220000 |  0.00000E+00 |  0.00000E+00 |       1 |  0.002558166 |        ideal
  123 | 1230000 |  0.00000E+00 |  0.00000E+00 |       1 |  0.00000E+00 |            f
  124 | 1240000 |  0.00000E+00 |  0.00000E+00 |       1 |  2.46462E+27 |            f
  125 | 1250000 |  0.00000E+00 |  0.00000E+00 |       1 |  0.002693230 |        ideal
  126 | 1260000 |  0.00000E+00 |  0.00000E+00 |       1 |  0.009910893 |        ideal
  127 | 1270000 |  0.00000E+00 |  0.00000E+00 |       1 |  0.00000E+00 |            f
  128 | 1280000 |  0.00000E+00 |  0.00000E+00 |       1 |  0.00000E+00 |            f
  129 | 1290000 |  0.00000E+00 |  0.00000E+00 |       1 |  1.58072E+27 |            f
  130 | 1300000 |  0.00000E+00 |  0.00000E+00 |       1 |  1.42452E+27 |            f
  131 | 1310000 |  0.00000E+00 |  0.00000E+00 |       1 |  0.005273676 |        ideal
  132 | 1320000 |  0.00000E+00 |  0.00000E+00 |       1 |  0.005094353 |        ideal
  133 | 1330000 |  0.00000E+00 |  0.00000E+00 |       1 |  6.71506E+26 |            f
  134 | 1340000 |  0.00000E+00 |  0.00000E+00 |       1 |  0.010059134 |        ideal
  135 | 1350000 |  0.00000E+00 |  0.00000E+00 |       1 |  0.00000E+00 |            f
  136 | 1360000 |  0.00000E+00 |  0.00000E+00 |       1 |  0.00000E+00 |            f
  137 | 1370000 |  0.00000E+00 |  0.00000E+00 |       1 |  8.64034E+26 |            f
  138 | 1380000 |  0.00000E+00 |  0.00000E+00 |       1 |  0.00000E+00 |            f
  139 | 1390000 |  0.00000E+00 |  0.00000E+00 |       1 |  0.004260356 |        ideal
  140 | 1400000 |  0.00000E+00 |  0.00000E+00 |       1 |  1.67516E+27 |            f
  141 | 1410000 |  0.00000E+00 |  0.00000E+00 |       1 |  0.003133112 |        ideal
  142 | 1420000 |  0.00000E+00 |  0.00000E+00 |       1 |  1.65054E+27 |            f
  143 | 1430000 |  0.00000E+00 |  0.00000E+00 |       1 |  1.91370E+27 |            f
  144 | 1440000 |  0.00000E+00 |  0.00000E+00 |       1 |  0.012991019 |        ideal
  145 | 1450000 |  0.00000E+00 |  0.00000E+00 |       1 |  9.06079E+26 |            f
  146 | 1460000 |  0.00000E+00 |  0.00000E+00 |       1 |  0.00000E+00 |            f
  147 | 1470000 |  0.00000E+00 |  0.00000E+00 |       1 |  0.00000E+00 |            f
  148 | 1480000 |  0.00000E+00 |  0.00000E+00 |       1 |  2.28082E+27 |            f
  149 | 1490000 |  0.00000E+00 |  0.00000E+00 |       1 |  0.00000E+00 |            f
  150 | 1500000 |  0.00000E+00 |  0.00000E+00 |       1 |  8.59699E+26 |            f
  151 | 1510000 |  0.00000E+00 |  0.00000E+00 |       1 |  1.79536E+27 |            f
  152 | 1520000 |  0.00000E+00 |  0.00000E+00 |       1 |  9.37997E+26 |            f
  153 | 1530000 |  0.00000E+00 |  0.00000E+00 |       1 |  1.34234E+27 |            f
  154 | 1540000 |  0.00000E+00 |  0.00000E+00 |       1 |  0.004590279 |        ideal
  155 | 1550000 |  0.00000E+00 |  0.00000E+00 |       1 |  0.00000E+00 |            f
  156 | 1560000 |  0.00000E+00 |  0.00000E+00 |       1 |  0.00000E+00 |            f
  157 | 1570000 |  0.00000E+00 |  0.00000E+00 |       1 |  1.52808E+27 |            f
  158 | 1580000 |  0.00000E+00 |  0.00000E+00 |       1 |  0.007348002 |        ideal
  159 | 1590000 |  0.00000E+00 |  0.00000E+00 |       1 |  0.00000E+00 |            f
  160 | 1600000 |  0.00000E+00 |  0.00000E+00 |       1 |  2.08484E+27 |            f
  161 | 1610000 |  0.00000E+00 |  0.00000E+00 |       1 |  1.96303E+27 |            f
  162 | 1620000 |  0.00000E+00 |  0.00000E+00 |       1 |  0.00000E+00 |            f
  163 | 1630000 |  0.00000E+00 |  0.00000E+00 |       1 |  2.46564E+27 |            f
  164 | 1640000 |  0.00000E+00 |  0.00000E+00 |       1 |  0.00000E+00 |            f
  165 | 1650000 |  0.00000E+00 |  0.00000E+00 |       1 |  0.00000E+00 |            f
  166 | 1660000 |  0.00000E+00 |  0.00000E+00 |       1 |  0.00000E+00 |            f
  167 | 1670000 |  0.00000E+00 |  0.00000E+00 |       1 |  1.98459E+27 |            f
  168 | 1680000 |  0.00000E+00 |  0.00000E+00 |       1 |  1.53734E+27 |            f
  169 | 1690000 |  0.00000E+00 |  0.00000E+00 |       1 |  0.00000E+00 |            f
  170 | 1700000 |  0.00000E+00 |  0.00000E+00 |       1 |  1.75043E+27 |            f
  171 | 1710000 |  0.00000E+00 |  0.00000E+00 |       1 |  6.94715E+26 |            f
  172 | 1720000 |  0.00000E+00 |  0.00000E+00 |       1 |  0.006500212 |        ideal
  173 | 1730000 |  0.00000E+00 |  0.00000E+00 |       1 |  0.00000E+00 |            f
  174 | 1740000 |  0.00000E+00 |  0.00000E+00 |       1 |  0.00000E+00 |            f
  175 | 1750000 |  0.00000E+00 |  0.00000E+00 |       1 |  5.92957E+26 |            f
  176 | 1760000 |  0.00000E+00 |  0.00000E+00 |       1 |  0.00000E+00 |            f
  177 | 1770000 |  0.00000E+00 |  0.00000E+00 |       1 |  0.00000E+00 |            f
  178 | 1780000 |  0.00000E+00 |  0.00000E+00 |       1 |  0.007422569 |        ideal
  179 | 1790000 |  0.00000E+00 |  0.00000E+00 |       1 |  0.00000E+00 |            f
  180 | 1800000 |  0.00000E+00 |  0.00000E+00 |       1 |  0.00000E+00 |            f
  181 | 1810000 |  0.00000E+00 |  0.00000E+00 |       1 |  0.00000E+00 |            f
  182 | 1820000 |  0.00000E+00 |  0.00000E+00 |       1 |  2.47602E+26 |            f
  183 | 1830000 |  0.00000E+00 |  0.00000E+00 |       1 |  5.43280E+26 |            f
  184 | 1840000 |  0.00000E+00 |  0.00000E+00 |       1 |  1.59899E+27 |            f
  185 | 1850000 |  0.00000E+00 |  0.00000E+00 |       1 |  0.00000E+00 |            f
  186 | 1860000 |  0.00000E+00 |  0.00000E+00 |       1 |  1.95645E+27 |            f
  187 | 1870000 |  0.00000E+00 |  0.00000E+00 |       1 |  0.00000E+00 |            f
  188 | 1880000 |  0.00000E+00 |  0.00000E+00 |       1 |  8.37972E+25 |            f
  189 | 1890000 |  0.00000E+00 |  0.00000E+00 |       1 |  1.79406E+27 |            f
  190 | 1900000 |  0.00000E+00 |  0.00000E+00 |       1 |  0.00000E+00 |            f
  191 | 1910000 |  0.00000E+00 |  0.00000E+00 |       1 |  0.00000E+00 |            f
  192 | 1920000 |  0.00000E+00 |  0.00000E+00 |       1 |  0.00000E+00 |            f
  193 | 1930000 |  0.00000E+00 |  0.00000E+00 |       1 |  7.15317E+26 |            f
  194 | 1940000 |  0.00000E+00 |  0.00000E+00 |       1 |  5.30076E+26 |            f
  195 | 1950000 |  0.00000E+00 |  0.00000E+00 |       1 |  1.58607E+26 |            f
  196 | 1960000 |  0.00000E+00 |  0.00000E+00 |       1 |  1.72577E+27 |            f
  197 | 1970000 |  0.00000E+00 |  0.00000E+00 |       1 |  9.14742E+26 |            f
  198 | 1980000 |  0.00000E+00 |  0.00000E+00 |       1 |  0.00000E+00 |            f
  199 | 1990000 |  0.00000E+00 |  0.00000E+00 |       1 |  6.19363E+26 |            f
  200 | 2000000 |  0.00000E+00 |  0.00000E+00 |       1 |  2.20262E+26 |            f
  201 | 2010000 |  0.00000E+00 |  0.00000E+00 |       1 |  1.00541E+27 |            f
  202 | 2020000 |  0.00000E+00 |  0.00000E+00 |       1 |  6.69297E+26 |            f
  203 | 2030000 |  0.00000E+00 |  0.00000E+00 |       1 |  2.46302E+26 |            f
  204 | 2040000 |  0.00000E+00 |  0.00000E+00 |       1 |  1.97117E+27 |            f
  205 | 2050000 |  0.00000E+00 |  0.00000E+00 |       1 |  0.00000E+00 |            f
  206 | 2060000 |  0.00000E+00 |  0.00000E+00 |       1 |  1.07931E+27 |            f
  207 | 2070000 |  0.00000E+00 |  0.00000E+00 |       1 |  0.00000E+00 |            f
  208 | 2080000 |  0.00000E+00 |  0.00000E+00 |       1 |  0.00000E+00 |            f
  209 | 2090000 |  0.00000E+00 |  0.00000E+00 |       1 |  2.94688E+26 |            f
  210 | 2100000 |  0.00000E+00 |  0.00000E+00 |       1 |  5.35041E+26 |            f
  211 | 2110000 |  0.00000E+00 |  0.00000E+00 |       1 |  6.03550E+26 |            f
  212 | 2120000 |  0.00000E+00 |  0.00000E+00 |       1 |  0.00000E+00 |            f
  213 | 2130000 |  0.00000E+00 |  0.00000E+00 |       1 |  6.45203E+26 |            f
  214 | 2140000 |  0.00000E+00 |  0.00000E+00 |       1 |  0.00000E+00 |            f
  215 | 2150000 |  0.00000E+00 |  0.00000E+00 |       1 |  0.00000E+00 |            f
  216 | 2160000 |  0.00000E+00 |  0.00000E+00 |       1 |  0.00000E+00 |            f
  217 | 2170000 |  0.00000E+00 |  0.00000E+00 |       1 |  2.55110E+26 |            f
  218 | 2180000 |  0.00000E+00 |  0.00000E+00 |       1 |  2.95087E+25 |            f
  219 | 2190000 |  0.00000E+00 |  0.00000E+00 |       1 |  5.65445E+26 |            f
  220 | 2200000 |  0.00000E+00 |  0.00000E+00 |       1 |  3.60678E+26 |            f
  221 | 2210000 |  0.00000E+00 |  0.00000E+00 |       1 |  8.13278E+25 |            f
  222 | 2220000 |  0.00000E+00 |  0.00000E+00 |       1 |  3.26790E+26 |            f
  223 | 2230000 |  0.00000E+00 |  0.00000E+00 |       1 |  0.00000E+00 |            f
  224 | 2240000 |  0.00000E+00 |  0.00000E+00 |       1 |  0.00000E+00 |            f
  225 | 2250000 |  0.00000E+00 |  0.00000E+00 |       1 |  4.85169E+26 |            f
  226 | 2260000 |  0.00000E+00 |  0.00000E+00 |       1 |  3.78383E+26 |            f
  227 | 2270000 |  0.00000E+00 |  0.00000E+00 |       1 |  0.00000E+00 |            f
  228 | 2280000 |  0.00000E+00 |  0.00000E+00 |       1 |  1.86537E+26 |            f
  229 | 2290000 |  0.00000E+00 |  0.00000E+00 |       1 |  2.10765E+26 |            f
  230 | 2300000 |  0.00000E+00 |  0.00000E+00 |       1 |  1.23194E+26 |            f
  231 | 2310000 |  0.00000E+00 |  0.00000E+00 |       1 |  1.73125E+26 |            f
  232 | 2320000 |  0.00000E+00 |  0.00000E+00 |       1 |  2.21664E+26 |            f
  233 | 2330000 |  0.00000E+00 |  0.00000E+00 |       1 |  1.42709E+25 |            f
  234 | 2340000 |  0.00000E+00 |  0.00000E+00 |       1 |  0.00000E+00 |            f
  235 | 2350000 |  0.00000E+00 |  0.00000E+00 |       1 |  3.65744E+26 |            f
  236 | 2360000 |  0.00000E+00 |  0.00000E+00 |       1 |  2.19690E+26 |            f
  237 | 2370000 |  0.00000E+00 |  0.00000E+00 |       1 |  4.95776E+25 |            f
  238 | 2380000 |  0.00000E+00 |  0.00000E+00 |       1 |  3.89091E+26 |            f
  239 | 2390000 |  0.00000E+00 |  0.00000E+00 |       1 |  0.00000E+00 |            f
  240 | 2400000 |  0.00000E+00 |  0.00000E+00 |       1 |  0.00000E+00 |            f
  241 | 2410000 |  0.00000E+00 |  0.00000E+00 |       1 |  0.00000E+00 |            f
  242 | 2420000 |  0.00000E+00 |  0.00000E+00 |       1 |  0.00000E+00 |            f
  243 | 2430000 |  0.00000E+00 |  0.00000E+00 |       1 |  2.66635E+26 |            f
  244 | 2440000 |  0.00000E+00 |  0.00000E+00 |       1 |  0.00000E+00 |            f
  245 | 2450000 |  0.00000E+00 |  0.00000E+00 |       1 |  3.92452E+25 |            f
  246 | 2460000 |  0.00000E+00 |  0.00000E+00 |       1 |  0.00000E+00 |            f
  247 | 2470000 |  0.00000E+00 |  0.00000E+00 |       1 |  0.00000E+00 |            f
  248 | 2480000 |  0.00000E+00 |  0.00000E+00 |       1 |  9.13724E+25 |            f
  249 | 2490000 |  0.00000E+00 |  0.00000E+00 |       1 |  0.00000E+00 |            f
  250 | 2500000 |  0.00000E+00 |  0.00000E+00 |       1 |  4.70643E+25 |            f
  251 | 2510000 |  0.00000E+00 |  0.00000E+00 |       1 |  1.78587E+25 |            f
  252 | 2520000 |  0.00000E+00 |  0.00000E+00 |       1 |  1.93296E+25 |            f
  253 | 2530000 |  0.00000E+00 |  0.00000E+00 |       1 |  3.68967E+25 |            f
  254 | 2540000 |  0.00000E+00 |  0.00000E+00 |       1 |  5.38982E+25 |            f
  255 | 2550000 |  0.00000E+00 |  0.00000E+00 |       1 |  7.64557E+24 |            f
  256 | 2560000 |  0.00000E+00 |  0.00000E+00 |       1 |  0.00000E+00 |            f
  257 | 2570000 |  0.00000E+00 |  0.00000E+00 |       1 |  2.36112E+26 |            f
  258 | 2580000 |  0.00000E+00 |  0.00000E+00 |       1 |  8.11168E+25 |            f
  259 | 2590000 |  0.00000E+00 |  0.00000E+00 |       1 |  8.18726E+26 |            f
  260 | 2600000 |  0.00000E+00 |  0.00000E+00 |       1 |  0.00000E+00 |            f
  261 | 2610000 |  0.00000E+00 |  0.00000E+00 |       1 |  0.00000E+00 |            f
  262 | 2620000 |  0.00000E+00 |  0.00000E+00 |       1 |  0.00000E+00 |            f
  263 | 2630000 |  0.00000E+00 |  0.00000E+00 |       1 |  0.00000E+00 |            f
  264 | 2640000 |  0.00000E+00 |  0.00000E+00 |       1 |  0.00000E+00 |            f
  265 | 2650000 |  0.00000E+00 |  0.00000E+00 |       1 |  2.22589E+25 |            f
  266 | 2660000 |  0.00000E+00 |  0.00000E+00 |       1 |  0.00000E+00 |            f
  267 | 2670000 |  0.00000E+00 |  0.00000E+00 |       1 |  2.21802E+24 |            f
  268 | 2680000 |  0.00000E+00 |  0.00000E+00 |       1 |  3.31052E+25 |            f
  269 | 2690000 |  0.00000E+00 |  0.00000E+00 |       1 |  0.00000E+00 |            f
  270 | 2700000 |  0.00000E+00 |  0.00000E+00 |       1 |  3.97497E+24 |            f
  271 | 2710000 |  0.00000E+00 |  0.00000E+00 |       1 |  1.87610E+25 |            f
  272 | 2720000 |  0.00000E+00 |  0.00000E+00 |       1 |  0.00000E+00 |            f
  273 | 2730000 |  0.00000E+00 |  0.00000E+00 |       1 |  0.00000E+00 |            f
  274 | 2740000 |  0.00000E+00 |  0.00000E+00 |       1 |  1.37316E+25 |            f
  275 | 2750000 |  0.00000E+00 |  0.00000E+00 |       1 |  2.13732E+25 |            f
  276 | 2760000 |  0.00000E+00 |  0.00000E+00 |       1 |  0.00000E+00 |            f
  277 | 2770000 |  0.00000E+00 |  0.00000E+00 |       1 |  0.00000E+00 |            f
  278 | 2780000 |  0.00000E+00 |  0.00000E+00 |       1 |  2.04911E+25 |            f
  279 | 2790000 |  0.00000E+00 |  0.00000E+00 |       1 |  0.00000E+00 |            f
  280 | 2800000 |  0.00000E+00 |  0.00000E+00 |       1 |  1.54034E+24 |            f
  281 | 2810000 |  0.00000E+00 |  0.00000E+00 |       1 |  0.00000E+00 |            f
  282 | 2820000 |  0.00000E+00 |  0.00000E+00 |       1 |  2.41037E+25 |            f
  283 | 2830000 |  0.00000E+00 |  0.00000E+00 |       1 |  0.00000E+00 |            f
  284 | 2840000 |  0.00000E+00 |  0.00000E+00 |       1 |  0.00000E+00 |            f
  285 | 2850000 |  0.00000E+00 |  0.00000E+00 |       1 |  6.28329E+24 |            f
  286 | 2860000 |  0.00000E+00 |  0.00000E+00 |       1 |  0.00000E+00 |            f
  287 | 2870000 |  0.00000E+00 |  0.00000E+00 |       1 |  2.23815E+24 |            f
  288 | 2880000 |  0.00000E+00 |  0.00000E+00 |       1 |  1.51891E+24 |            f
  289 | 2890000 |  0.00000E+00 |  0.00000E+00 |       1 |  3.33676E+24 |            f
  290 | 2900000 |  0.00000E+00 |  0.00000E+00 |       1 |  5.13366E+24 |            f
  291 | 2910000 |  0.00000E+00 |  0.00000E+00 |       1 |  0.00000E+00 |            f
  292 | 2920000 |  0.00000E+00 |  0.00000E+00 |       1 |  7.34370E+24 |            f
  293 | 2930000 |  0.00000E+00 |  0.00000E+00 |       1 |  3.23503E+23 |            f
  294 | 2940000 |  0.00000E+00 |  0.00000E+00 |       1 |  0.00000E+00 |            f
  295 | 2950000 |  0.00000E+00 |  0.00000E+00 |       1 |  2.73524E+24 |            f
  296 | 2960000 |  0.00000E+00 |  0.00000E+00 |       1 |  6.88888E+24 |            f
  297 | 2970000 |  0.00000E+00 |  0.00000E+00 |       1 |  0.00000E+00 |            f
  298 | 2980000 |  0.00000E+00 |  0.00000E+00 |       1 |  4.62562E+23 |            f
  299 | 2990000 |  0.00000E+00 |  0.00000E+00 |       1 |  3.96347E+23 |            f
  300 | 3000000 |  0.00000E+00 |  0.00000E+00 |       1 |  5.03317E+24 |            f
  301 | 3010000 |  0.00000E+00 |  0.00000E+00 |       1 |  5.37386E+24 |            f
  302 | 3020000 |  0.00000E+00 |  0.00000E+00 |       1 |  0.00000E+00 |            f
  303 | 3030000 |  0.00000E+00 |  0.00000E+00 |       1 |  0.00000E+00 |            f
  304 | 3040000 |  0.00000E+00 |  0.00000E+00 |       1 |  0.00000E+00 |            f
  305 | 3050000 |  0.00000E+00 |  0.00000E+00 |       1 |  1.78103E+24 |            f
  306 | 3060000 |  0.00000E+00 |  0.00000E+00 |       1 |  0.00000E+00 |            f
  307 | 3070000 |  0.00000E+00 |  0.00000E+00 |       1 |  2.31184E+24 |            f
  308 | 3080000 |  0.00000E+00 |  0.00000E+00 |       1 |  3.36294E+23 |            f
  309 | 3090000 |  0.00000E+00 |  0.00000E+00 |       1 |  1.74822E+24 |            f
  310 | 3100000 |  0.00000E+00 |  0.00000E+00 |       1 |  0.00000E+00 |            f
  311 | 3110000 |  0.00000E+00 |  0.00000E+00 |       1 |  0.00000E+00 |            f
  312 | 3120000 |  0.00000E+00 |  0.00000E+00 |       1 |  0.00000E+00 |            f
  313 | 3130000 |  0.00000E+00 |  0.00000E+00 |       1 |  0.00000E+00 |            f
  314 | 3140000 |  0.00000E+00 |  0.00000E+00 |       1 |  6.24558E+22 |            f
  315 | 3150000 |  0.00000E+00 |  0.00000E+00 |       1 |  0.00000E+00 |            f
  316 | 3160000 |  0.00000E+00 |  0.00000E+00 |       1 |  0.00000E+00 |            f
  317 | 3170000 |  0.00000E+00 |  0.00000E+00 |       1 |  2.39896E+22 |            f
  318 | 3180000 |  0.00000E+00 |  0.00000E+00 |       1 |  6.54285E+23 |            f
  319 | 3190000 |  0.00000E+00 |  0.00000E+00 |       1 |  5.66577E+23 |            f
  320 | 3200000 |  0.00000E+00 |  0.00000E+00 |       1 |  0.00000E+00 |            f
  321 | 3210000 |  0.00000E+00 |  0.00000E+00 |       1 |  0.00000E+00 |            f
  322 | 3220000 |  0.00000E+00 |  0.00000E+00 |       1 |  0.00000E+00 |            f
  323 | 3230000 |  0.00000E+00 |  0.00000E+00 |       1 |  0.00000E+00 |            f
  324 | 3240000 |  0.00000E+00 |  0.00000E+00 |       1 |  4.05427E+23 |            f
  325 | 3250000 |  0.00000E+00 |  0.00000E+00 |       1 |  0.00000E+00 |            f
  326 | 3260000 |  0.00000E+00 |  0.00000E+00 |       1 |  3.41484E+23 |            f
  327 | 3270000 |  0.00000E+00 |  0.00000E+00 |       2 |  0.00000E+00 |            f
  328 | 3280000 |  0.00000E+00 |  0.00000E+00 |       1 |  4.04886E+23 |            f
  329 | 3290000 |  0.00000E+00 |  0.00000E+00 |       1 |  0.00000E+00 |            f
  330 | 3300000 |  0.00000E+00 |  0.00000E+00 |       1 |  4.22507E+23 |            f
1:18:35.072897
res.X:
[ 1.00358864e+02  9.23234388e+01  8.33459854e+01  7.46501321e+01
  6.78961322e+01  6.13920223e+01  5.46198127e+01  4.75603709e+01
  4.10728825e+01  3.47766679e+01  2.81788302e+01  2.12596700e+01
  1.72253597e+01  1.36416894e+01  1.14585458e+01  8.87871539e+00
  5.73531910e+00  3.10017841e+00  9.86239806e-01  3.17835655e-01
 -7.84298915e-07]
res.F:
[2.73426026]
The PostScript backend does not support transparency; partially transparent artists will be rendered opaque.
The PostScript backend does not support transparency; partially transparent artists will be rendered opaque.
The PostScript backend does not support transparency; partially transparent artists will be rendered opaque.
The PostScript backend does not support transparency; partially transparent artists will be rendered opaque.
The PostScript backend does not support transparency; partially transparent artists will be rendered opaque.
The PostScript backend does not support transparency; partially transparent artists will be rendered opaque.
