RHO(G/CC),T(K),P(GPA),E(MJ/KG),UP(KM/S),US(KM/S)
1.9086,298.6500,0.0199,0.0679,0.0044,2.3383
1.9509,304.6300,0.2808,0.0696,0.0589,2.5002
1.9928,310.8700,0.5984,0.0748,0.1176,2.6698
2.0313,317.2600,0.9527,0.0834,0.1763,2.8351
2.0672,324.0700,1.3424,0.0955,0.2351,2.9964
2.1007,331.5300,1.7662,0.1111,0.2939,3.1541
2.1323,339.8400,2.2231,0.1301,0.3527,3.3086
2.1621,349.1200,2.7123,0.1526,0.4114,3.4600
2.1904,359.5100,3.2330,0.1785,0.4702,3.6088
2.2174,371.1000,3.7848,0.2078,0.5290,3.7552
2.2432,383.9900,4.3665,0.2407,0.5878,3.8992
2.2679,398.2500,4.9778,0.2769,0.6466,4.0411
2.2916,413.9400,5.6183,0.3167,0.7054,4.1810
2.3145,431.1400,6.2875,0.3599,0.7641,4.3191
2.3365,449.8700,6.9850,0.4065,0.8229,4.4555
2.3579,470.2000,7.7104,0.4566,0.8817,4.5903
2.3786,492.1600,8.4632,0.5102,0.9405,4.7237
2.3986,515.7900,9.2433,0.5672,0.9993,4.8556
2.4181,541.1200,10.0500,0.6276,1.0580,4.9862
2.4371,568.1900,10.8840,0.6916,1.1168,5.1155
2.4555,597.0200,11.7440,0.7589,1.1756,5.2437
2.4735,627.6400,12.6290,0.8298,1.2344,5.3707
2.4911,660.0700,13.5410,0.9041,1.2932,5.4966
2.5082,694.3400,14.4780,0.9818,1.3519,5.6216
2.5250,730.4600,15.4410,1.0630,1.4107,5.7455
2.5414,768.4600,16.4290,1.1476,1.4695,5.8686
2.5574,808.3500,17.4410,1.2358,1.5283,5.9907
2.5732,850.1500,18.4790,1.3273,1.5871,6.1120
2.5886,893.8800,19.5410,1.4223,1.6458,6.2325
2.6037,939.5500,20.6280,1.5208,1.7046,6.3521
2.6186,987.1800,21.7380,1.6227,1.7634,6.4711
2.6332,1036.8000,22.8730,1.7281,1.8222,6.5893
2.6475,1088.4000,24.0320,1.8370,1.8810,6.7068
2.6616,1142.0000,25.2150,1.9492,1.9397,6.8236
2.6755,1197.5000,26.4220,2.0650,1.9985,6.9398
2.6891,1255.2000,27.6520,2.1842,2.0573,7.0554
2.7026,1314.8000,28.9050,2.3069,2.1161,7.1704
2.7158,1376.5000,30.1820,2.4330,2.1749,7.2847
2.7289,1440.2000,31.4820,2.5625,2.2336,7.3985
2.7417,1506.0000,32.8050,2.6956,2.2924,7.5118
2.7544,1573.9000,34.1510,2.8320,2.3512,7.6245
2.7669,1643.8000,35.5200,2.9720,2.4100,7.7368
2.7792,1715.9000,36.9120,3.1154,2.4688,7.8485
2.7914,1790.0000,38.3260,3.2622,2.5276,7.9597
2.8034,1866.3000,39.7630,3.4125,2.5863,8.0705
2.8153,1944.6000,41.2230,3.5663,2.6451,8.1808
2.8270,2025.1000,42.7050,3.7235,2.7039,8.2907
2.8386,2107.7000,44.2090,3.8841,2.7627,8.4001
2.8500,2192.4000,45.7360,4.0483,2.8215,8.5091
2.8613,2279.3000,47.2850,4.2158,2.8802,8.6177
2.8725,2368.3000,48.8550,4.3869,2.9390,8.7259
2.8836,2459.5000,50.4480,4.5614,2.9978,8.8337
2.8945,2552.9000,52.0630,4.7393,3.0566,8.9412
2.9053,2648.4000,53.7000,4.9207,3.1154,9.0483
2.9160,2746.1000,55.3580,5.1055,3.1741,9.1550
2.9266,2846.0000,57.0380,5.2939,3.2329,9.2613
2.9371,2948.1000,58.7400,5.4856,3.2917,9.3673
2.9475,3052.3000,60.4640,5.6808,3.3505,9.4730
2.9578,3158.8000,62.2090,5.8795,3.4093,9.5784
2.9680,3267.4000,63.9750,6.0816,3.4681,9.6834
2.9780,3378.3000,65.7630,6.2872,3.5268,9.7881
2.9880,3491.4000,67.5720,6.4963,3.5856,9.8925
2.9979,3606.7000,69.4030,6.7088,3.6444,9.9966
3.0077,3724.2000,71.2540,6.9247,3.7032,10.1000
3.0175,3844.0000,73.1270,7.1441,3.7620,10.2040
3.0271,3966.0000,75.0210,7.3670,3.8207,10.3070
3.0367,4090.2000,76.9370,7.5933,3.8795,10.4100
3.0461,4216.7000,78.8730,7.8230,3.9383,10.5130
3.0555,4345.5000,80.8300,8.0563,3.9971,10.6150
3.0648,4476.4000,82.8080,8.2930,4.0559,10.7180
3.0741,4609.7000,84.8070,8.5331,4.1146,10.8190
3.0832,4745.2000,86.8270,8.7767,4.1734,10.9210
3.0923,4883.0000,88.8680,9.0237,4.2322,11.0230
3.1013,5023.0000,90.9290,9.2742,4.2910,11.1240
3.1103,5165.3000,93.0110,9.5282,4.3498,11.2250
3.1192,5309.9000,95.1140,9.7856,4.4085,11.3250
3.1280,5456.8000,97.2380,10.0460,4.4673,11.4260
3.1367,5606.0000,99.3820,10.3110,4.5261,11.5260
3.1454,5757.4000,101.5500,10.5790,4.5849,11.6260
3.1540,5911.2000,103.7300,10.8500,4.6437,11.7260
3.1626,6067.2000,105.9400,11.1240,4.7024,11.8260
3.1711,6225.6000,108.1600,11.4030,4.7612,11.9250
3.1795,6386.3000,110.4100,11.6840,4.8200,12.0240
3.1879,6549.2000,112.6800,11.9690,4.8788,12.1230
3.1962,6714.5000,114.9600,12.2580,4.9376,12.2220
3.2045,6882.1000,117.2700,12.5500,4.9964,12.3210
3.2127,7052.0000,119.6000,12.8450,5.0551,12.4190
3.2209,7224.3000,121.9500,13.1440,5.1139,12.5170
3.2290,7398.8000,124.3100,13.4460,5.1727,12.6160
3.2370,7575.7000,126.7000,13.7520,5.2315,12.7130
3.2450,7755.0000,129.1100,14.0610,5.2903,12.8110
3.2529,7936.6000,131.5400,14.3740,5.3490,12.9090
3.2608,8120.5000,133.9900,14.6900,5.4078,13.0060
3.2687,8306.7000,136.4600,15.0100,5.4666,13.1030
3.2765,8495.3000,138.9400,15.3330,5.5254,13.2000
3.2842,8686.3000,141.4500,15.6590,5.5842,13.2970
3.2919,8879.6000,143.9800,15.9890,5.6429,13.3940
3.2996,9075.2000,146.5300,16.3230,5.7017,13.4900
3.3072,9273.3000,149.1000,16.6600,5.7605,13.5870
3.3148,9473.6000,151.6900,17.0000,5.8193,13.6830
