RHO(G/CC),T(K),P(GPA),E(MJ/KG),UP(KM/S),US(KM/S),V(--)
3.1264,5430.6,96.86,10.0,4.4569,11.408,0.6093270214943706
3.0908,4859.7,88.524,8.982,4.2224,11.005999999999998,0.6163452827746861
3.054,4324.9,80.51899999999999,8.0191,3.9878,10.599,0.6237721021611002
3.016,3826.0,72.847,7.1112,3.7532,10.189,0.631631299734748
2.9766,3362.7,65.512,6.2583,3.5186,9.7735,0.6399919371094538
2.9358,2934.6,58.518,5.4604,3.2841,9.3536,0.6488861639076231
2.8932,2541.5,51.867,4.7175,3.0495,8.9283,0.6584404811281626
2.8487,2182.8,45.565,4.0297,2.8149,8.497,0.6687260855828975
2.8022,1858.3,39.617,3.3969,2.5804,8.0593,0.6798229962172578
2.7532,1567.5,34.027,2.8192,2.3458,7.6142,0.6919221269795147
2.7015,1309.7,28.799,2.2964,2.1112,7.1607,0.7051637978900611
2.6465,1084.5,23.945,1.8287,1.8766,6.698,0.7198186283771019
2.5876,890.97,19.471,1.416,1.642,6.2246,0.7362034317514299
2.524,728.39,15.386,1.0584,1.4074,5.7386,0.7547543581616482
2.4547,595.63,11.703,0.75571,1.1728,5.2377,0.7760622479325376
2.3778,491.31,8.4345,0.5080899999999999,0.93827,4.7187,0.8011607368155438
2.291,413.48,5.6003,0.31551,0.7037399999999999,4.1772,0.8315146224356177
2.1899,359.3,3.2228,0.17794000000000001,0.46911,3.606,0.8699027352847162
2.0669,324.0,1.3383,0.095403,0.23451999999999998,2.9948,0.9216701340171272
1.9059,298.28,0.0052342,0.06789099999999999,0.0011056,2.3283,0.9995277821501654
