RHO(G/CC),T(K),P(GPA),E(MJ/KG),UP(KM/S),US(KM/S)
1.9207,299.3500,0.0091,0.3892,0.0043,1.0653
1.9857,309.3300,0.1032,0.3902,0.0444,1.2119
2.0448,318.5100,0.2330,0.3931,0.0885,1.3732
2.0942,326.6800,0.3903,0.3980,0.1328,1.5348
2.1360,334.4200,0.5750,0.4049,0.1771,1.6964
2.1717,342.1800,0.7872,0.4137,0.2214,1.8580
2.2027,350.2600,1.0268,0.4245,0.2657,2.0197
2.2298,358.8900,1.2937,0.4372,0.3099,2.1813
2.2537,368.2300,1.5880,0.4519,0.3542,2.3429
2.2750,378.4300,1.9098,0.4686,0.3985,2.5046
2.2940,389.5800,2.2592,0.4872,0.4429,2.6664
2.3111,401.7600,2.6357,0.5078,0.4871,2.8280
2.3265,415.0400,3.0395,0.5304,0.5314,2.9896
2.3406,429.4700,3.4707,0.5549,0.5757,3.1512
2.3534,445.1100,3.9293,0.5814,0.6200,3.3128
2.3652,461.9800,4.4153,0.6098,0.6642,3.4745
2.3760,480.1100,4.9287,0.6402,0.7085,3.6361
2.3860,499.5400,5.4695,0.6726,0.7528,3.7977
2.3952,520.2900,6.0377,0.7069,0.7971,3.9594
2.4038,542.3700,6.6333,0.7432,0.8414,4.1210
2.4118,565.8100,7.2562,0.7814,0.8857,4.2826
2.4192,590.6100,7.9066,0.8216,0.9299,4.4443
2.4262,616.7900,8.5843,0.8638,0.9742,4.6059
2.4327,644.3600,9.2894,0.9079,1.0185,4.7675
2.4388,673.3300,10.0220,0.9540,1.0628,4.9292
2.4446,703.7000,10.7820,1.0020,1.1071,5.0908
2.4501,735.5000,11.5690,1.0521,1.1514,5.2524
2.4552,768.7200,12.3840,1.1040,1.1956,5.4141
2.4601,803.3600,13.2260,1.1580,1.2399,5.5757
2.4647,839.4400,14.0950,1.2139,1.2842,5.7373
2.4690,876.9600,14.9920,1.2717,1.3285,5.8990
2.4732,915.9300,15.9160,1.3315,1.3728,6.0606
2.4771,956.3400,16.8680,1.3933,1.4171,6.2222
2.4809,998.2000,17.8470,1.4570,1.4613,6.3839
2.4845,1041.5000,18.8530,1.5227,1.5056,6.5455
2.4879,1086.3000,19.8870,1.5904,1.5499,6.7071
2.4912,1132.5000,20.9480,1.6600,1.5942,6.8688
2.4943,1180.2000,22.0360,1.7316,1.6385,7.0304
2.4973,1229.4000,23.1520,1.8052,1.6827,7.1920
2.5002,1280.0000,24.2950,1.8807,1.7270,7.3536
2.5029,1332.1000,25.4660,1.9581,1.7713,7.5153
2.5056,1385.7000,26.6640,2.0376,1.8156,7.6769
2.5081,1440.7000,27.8890,2.1189,1.8599,7.8385
2.5105,1497.3000,29.1420,2.2023,1.9041,8.0001
2.5129,1555.2000,30.4220,2.2876,1.9484,8.1617
2.5152,1614.7000,31.7290,2.3749,1.9927,8.3234
2.5173,1675.7000,33.0640,2.4641,2.0370,8.4850
2.5194,1738.1000,34.4260,2.5553,2.0813,8.6466
2.5215,1802.0000,35.8160,2.6485,2.1255,8.8082
2.5234,1867.4000,37.2330,2.7436,2.1698,8.9698
2.5253,1934.3000,38.6770,2.8407,2.2141,9.1314
2.5271,2002.6000,40.1490,2.9397,2.2584,9.2930
2.5289,2072.5000,41.6480,3.0407,2.3026,9.4547
2.5306,2143.8000,43.1740,3.1437,2.3469,9.6163
2.5323,2216.6000,44.7280,3.2486,2.3912,9.7779
2.5339,2290.9000,46.3090,3.3555,2.4355,9.9395
2.5354,2366.7000,47.9170,3.4643,2.4797,10.1010
2.5369,2443.9000,49.5530,3.5751,2.5240,10.2630
2.5384,2522.7000,51.2160,3.6879,2.5683,10.4240
2.5398,2602.9000,52.9070,3.8026,2.6126,10.5860
2.5412,2684.7000,54.6240,3.9193,2.6568,10.7470
2.5425,2767.9000,56.3700,4.0380,2.7011,10.9090
2.5438,2852.6000,58.1420,4.1586,2.7454,11.0710
2.5451,2938.8000,59.9420,4.2812,2.7896,11.2320
2.5463,3026.5000,61.7690,4.4057,2.8339,11.3940
2.5475,3115.6000,63.6400,4.5322,2.8786,11.5570
2.5487,3206.3000,65.5230,4.6607,2.9229,11.7180
2.5498,3298.5000,67.4330,4.7911,2.9671,11.8800
2.5509,3392.1000,69.3710,4.9234,3.0114,12.0420
2.5520,3487.3000,71.3360,5.0578,3.0557,12.2030
2.5531,3583.9000,73.3290,5.1941,3.1000,12.3650
2.5541,3682.0000,75.3490,5.3324,3.1443,12.5270
2.5551,3781.7000,77.3960,5.4726,3.1886,12.6880
2.5561,3882.8000,79.4710,5.6148,3.2329,12.8500
2.5570,3985.4000,81.5730,5.7589,3.2772,13.0120
2.5579,4089.5000,83.7020,5.9050,3.3214,13.1730
2.5589,4195.1000,85.8600,6.0531,3.3657,13.3350
2.5597,4302.2000,88.0440,6.2031,3.4100,13.4970
2.5606,4410.8000,90.2560,6.3551,3.4543,13.6580
2.5614,4520.8000,92.4960,6.5091,3.4986,13.8200
2.5623,4632.4000,94.7620,6.6650,3.5429,13.9820
2.5631,4745.5000,97.0560,6.8229,3.5872,14.1430
2.5639,4860.0000,99.3770,6.9827,3.6315,14.3050
2.5646,4976.1000,101.7300,7.1445,3.6758,14.4670
2.5654,5093.7000,104.1000,7.3083,3.7201,14.6280
2.5661,5212.7000,106.5100,7.4740,3.7644,14.7900
2.5669,5333.2000,108.9400,7.6417,3.8087,14.9520
2.5676,5455.3000,111.4000,7.8113,3.8530,15.1130
2.5683,5578.8000,113.8800,7.9829,3.8972,15.2750
2.5689,5703.8000,116.4000,8.1565,3.9415,15.4370
2.5696,5830.4000,118.9400,8.3320,3.9858,15.5980
2.5703,5958.4000,121.5000,8.5095,4.0301,15.7600
2.5709,6087.9000,124.1000,8.6889,4.0744,15.9220
2.5715,6218.9000,126.7200,8.8704,4.1187,16.0830
2.5722,6351.4000,129.3700,9.0537,4.1630,16.2450
2.5728,6485.4000,132.0500,9.2391,4.2073,16.4070
2.5733,6620.9000,134.7600,9.4264,4.2516,16.5680
2.5739,6757.9000,137.4900,9.6156,4.2959,16.7300
2.5745,6896.4000,140.2500,9.8068,4.3403,16.8920
2.5751,7036.4000,143.0400,10.0000,4.3846,17.0540
