V(--),UP(KM/S),US(KM/S),v_spec,P(GPA)
0.743022443,4.3498,16.92677,0.388406923,140.8504867
0.743240696,4.291,16.71215,0.388521012,137.1847416
0.743464628,4.2322,16.49753,0.38863807,133.5672793
0.743694462,4.1734,16.28291,0.388758214,129.9980998
0.743930437,4.1146,16.06829,0.388881567,126.4772031
0.744172383,4.0559,15.854035,0.389008041,123.010454
0.744421387,3.9971,15.639415,0.389138205,119.5860408
0.74467732,3.9383,15.424795,0.389271992,116.2099104
0.744940476,3.8795,15.210175,0.389409553,112.8820628
0.745211164,3.8207,14.995555,0.389551053,109.602498
0.745489233,3.762,14.7813,0.38969641,106.3766704
0.745775976,3.7032,14.56668,0.389846302,103.1935891
0.746071296,3.6444,14.35206,0.390000677,100.0587906
0.746375581,3.5856,14.13744,0.390159739,96.9722749
0.746689248,3.5268,13.92282,0.390323705,93.93404201
0.747012178,3.4681,13.708565,0.390492513,90.94913589
0.747345939,3.4093,13.493945,0.390666983,88.0073865
0.747690489,3.3505,13.279325,0.390847093,85.1139199
0.748046358,3.2917,13.064705,0.39103312,82.26873611
0.748414116,3.2329,12.850085,0.391225361,79.47183513
0.748794366,3.1741,12.635465,0.391424133,76.72321695
0.749187076,3.1154,12.42121,0.391629418,74.02743299
0.749594277,3.0566,12.20659,0.391842277,71.37529831
0.750016052,2.9978,11.99197,0.392062756,68.77144643
0.7504532,2.939,11.77735,0.39229127,66.21587735
0.750906577,2.8802,11.56273,0.392528268,63.70859107
0.751376286,2.8215,11.348475,0.392773804,61.25372859
0.75186492,2.7627,11.133855,0.393029232,58.84292581
0.752372762,2.7039,10.919235,0.393294701,56.48040584
0.752900968,2.6451,10.704615,0.393570815,54.16616866
0.753450788,2.5863,10.489995,0.393858227,51.90021429
0.754022581,2.5276,10.27574,0.394157126,49.68627329
0.754619764,2.4688,10.06112,0.394469296,47.51680242
0.75524298,2.41,9.8465,0.394795076,45.39561435
0.755893969,2.3512,9.63188,0.395135373,43.32270908
0.75657463,2.2924,9.41726,0.395491181,41.29808661
0.757287039,2.2336,9.20264,0.395863586,39.32174695
0.758032172,2.1749,8.988385,0.396253095,37.39692812
0.758815058,2.1161,8.773765,0.396662341,35.51707195
0.759637207,2.0573,8.559145,0.39709211,33.68549859
0.760501646,1.9985,8.344525,0.397543987,31.90220804
0.761411726,1.9397,8.129905,0.398019721,30.16720028
0.762369483,1.881,7.91565,0.398520378,28.48330292
0.763382301,1.8222,7.70103,0.399049817,26.84477866
0.764453189,1.7634,7.48641,0.399609613,25.25453721
0.76558729,1.7046,7.27179,0.400202452,23.71257856
0.766790371,1.6458,7.05717,0.400831349,22.21890271
0.768066679,1.5871,6.842915,0.401498525,20.77592683
0.769427885,1.5283,6.628295,0.402210081,19.37873447
0.77088019,1.4695,6.413675,0.402969257,18.02982492
0.772433056,1.4107,6.199055,0.403781002,16.72919818
0.774097304,1.3519,5.984435,0.404650969,15.47685424
0.775882208,1.2932,5.77018,0.405584008,14.27479983
0.777808178,1.2344,5.55556,0.406590788,13.11893938
0.779888933,1.1756,5.34094,0.407678481,12.01136174
0.782143916,1.1168,5.12632,0.408857248,10.9520669
0.784595965,1.058,4.9117,0.41013903,9.941054862
0.787267334,0.9993,4.697445,0.411535459,8.979921936
0.790199261,0.9405,4.482825,0.413068092,8.065393394
0.793426042,0.8817,4.268205,0.414754857,7.199147655
0.796994512,0.8229,4.053585,0.416620236,6.38118472
0.800961978,0.7641,3.838965,0.418694186,5.611504588
0.805391328,0.7054,3.62471,0.421009581,4.89129314
0.810386236,0.6466,3.41009,0.423620615,4.218096503
0.816052099,0.5878,3.19547,0.426582383,3.59318267
0.822533841,0.529,2.98085,0.429970644,3.01655164
0.830021365,0.4702,2.76623,0.433884665,2.488203415
0.838768464,0.4114,2.55161,0.438457116,2.008137993
0.849102939,0.3527,2.337355,0.443859351,1.577048713
0.861546543,0.2939,2.122735,0.45036411,1.193466785
0.876789397,0.2351,1.908115,0.458332147,0.858167661
0.895895766,0.1763,1.693495,0.468319794,0.571151341
0.920499716,0.1176,1.47924,0.481181242,0.332782848
0.953438183,0.0589,1.264985,0.498399468,0.14253307
0.995872653,0.0044,1.06606,0.520581627,0.00897324
