V(--),UP(KM/S),US(KM/S),v_spec,P(GPA)
0.5610842785,5.8193,13.258354,0.295307515,146.5932449
0.5620620527,5.7605,13.15369,0.295822133,143.9664794
0.5630555114,5.7017,13.049026,0.296345006,141.3630999
0.5640650346,5.6429,12.944362,0.296876334,138.7831066
0.5650892581,5.5842,12.839876,0.297415399,136.2308276
0.566132075,5.5254,12.735212,0.29796425,133.6975667
0.5671921762,5.4666,12.630548,0.298522198,131.187692
0.5682699911,5.4078,12.525884,0.299089469,128.7012034
0.5693659719,5.349,12.42122,0.299666301,126.238101
0.5704786669999999,5.2903,12.316734,0.30025193,123.802514
0.5716123476,5.2315,12.21207,0.300848604,121.386144
0.5727656285999999,5.1727,12.107406,0.301455594,118.9931601
0.5739390211,5.1139,12.002742,0.302073169,116.6235624
0.575133059,5.0551,11.898078,0.30270161,114.2773508
0.5763462052,4.9964,11.793592,0.303340108,111.9584558
0.5775831621999999,4.9376,11.688928,0.303991138,109.6589767
0.5788424708,4.8788,11.584264,0.304653932,107.3828837
0.5801247428,4.82,11.4796,0.305328812,105.1301768
0.5814306128,4.7612,11.374936,0.306016112,102.900856
0.5827607362999999,4.7024,11.270272,0.306716177,100.6949214
0.5841134698,4.6437,11.165786,0.307428142,98.51606485
0.5854941294999999,4.5849,11.061122,0.308154805,96.35686269
0.5869011688,4.5261,10.956458,0.308895352,94.22104665
0.5883353477000001,4.4673,10.851794,0.309650183,92.10861674
0.5897974623,4.4085,10.74713,0.310419717,90.01957295
0.5912857741,4.3498,10.642644,0.311203039,87.95740846
0.5928062111,4.291,10.53798,0.312003269,85.91509714
0.5943571545,4.2322,10.433316,0.312819555,83.89617195
0.5959395276999999,4.1734,10.328652,0.313652383,81.90063289
0.5975543015999999,4.1146,10.223988,0.314502264,79.92847995
0.5991996446,4.0559,10.119502,0.315368234,77.98300751
0.6008822105,3.9971,10.014838,0.316253795,76.05758704
0.6026003178,3.9383,9.910174,0.317158062,74.1555527
0.6043551026999999,3.8795,9.80551,0.318081633,72.27690449
0.6061477527,3.8207,9.700846,0.319025133,70.42164239
0.6079763583,3.762,9.59636,0.319987557,68.59286201
0.6098484396999999,3.7032,9.491696,0.320972863,66.78433239
0.6117622698,3.6444,9.387032,0.321980142,64.9991889
0.6137192584,3.5856,9.282368,0.323010136,63.23743153
0.6157208818,3.5268,9.177704,0.324063622,61.49906029
0.6177651639999999,3.4681,9.073218,0.32513956,59.78697196
0.6198606816,3.4093,8.968554,0.326242464,58.09533319
0.6220056884999999,3.3505,8.86389,0.327371415,56.42708055
0.6242019555,3.2917,8.759226,0.328527345,54.78221403
0.6264513446,3.2329,8.654562,0.329711234,53.16073363
0.6287558052,3.1741,8.549898,0.330924108,51.56263936
0.6311133194999999,3.1154,8.445412,0.332164905,49.99058944
0.6335340657999999,3.0566,8.340748,0.333438982,48.43922764
0.6360163397999999,2.9978,8.236084,0.334745442,46.91125197
0.6385625146,2.939,8.13142,0.336085534,45.40666242
0.6411750906,2.8802,8.026756,0.337460574,43.925459
0.6438520785,2.8215,7.92227,0.338869515,42.47010113
0.6466053666,2.7627,7.817606,0.340318614,41.03563018
0.6494333817,2.7039,7.712942,0.341807043,39.62454536
0.6523392017999999,2.6451,7.608278,0.343336422,38.23684666
0.6553260873,2.5863,7.503614,0.344908467,36.87253409
0.6583921781,2.5276,7.399128,0.346522199,35.53386827
0.6615515551,2.4688,7.294464,0.348185029,34.21628817
0.6648029149,2.41,7.1898,0.349896271,32.9220942
0.6681503367999999,2.3512,7.085136,0.351658072,31.65128635
0.6715981376,2.2924,6.980472,0.353472704,30.40386462
0.6751509058,2.2336,6.875808,0.355342582,29.17982902
0.6788071803,2.1749,6.771322,0.357266937,27.98120161
0.6825845874,2.1161,6.666658,0.359255046,26.80389849
0.6864824925,2.0573,6.561994,0.361306575,25.64998149
0.6905067571,1.9985,6.45733,0.363424609,24.51945061
0.6946636265,1.9397,6.352666,0.365612435,23.41230586
0.698952335,1.881,6.24818,0.36786965,22.3303705
0.7033946033999999,1.8222,6.143516,0.370207686,21.26995822
0.7079908573,1.7634,6.038852,0.372626767,20.23293207
0.712749242,1.7046,5.934188,0.37513118,19.21929204
0.7176784937,1.6458,5.829524,0.377725523,18.22903814
0.722779133,1.5871,5.725038,0.38041007,17.26379484
0.728078594,1.5283,5.620374,0.38319926,16.32027341
0.7335791757,1.4695,5.51571,0.386094303,15.40013811
0.7392925517,1.4107,5.411046,0.389101343,14.50338893
0.7452313075999999,1.3519,5.306382,0.392227004,13.63002587
0.7513983370999999,1.2932,5.201896,0.395472809,12.78147462
0.7578293468999999,1.2344,5.097232,0.398857551,11.95484404
0.7645299970999999,1.1756,4.992568,0.402384209,11.15159959
0.7715176080999999,1.1168,4.887904,0.406061899,10.37174126
0.7788110145999999,1.058,4.78324,0.409900534,9.615269048
0.7864174955,0.9993,4.678754,0.413903945,8.883409857
0.7943853317,0.9405,4.57409,0.418097543,8.173670126
0.802726345,0.8817,4.469426,0.42248755,7.487316518
0.8114673843,0.8229,4.364762,0.427088097,6.824349035
0.8177372798,0.7641,4.1923,0.430388042,6.086339217
0.8243613371999999,0.7054,4.0162,0.433874388,5.382752212
0.831605813,0.6466,3.8398,0.43768727,4.717347892
0.8395479612,0.5878,3.6634,0.441867348,4.091358388
0.8482936631,0.529,3.487,0.446470349,3.5047837
0.8579713643999999,0.4702,3.3106,0.451563876,2.957623828
0.8687384345,0.4114,3.1342,0.457230755,2.449878772
0.8807680602999999,0.3527,2.9581,0.463562137,1.982311553
0.8943451848,0.2939,2.7817,0.470707992,1.553329097
0.9097608728,0.2351,2.6053,0.478821512,1.163761457
0.9274157032,0.1763,2.4289,0.488113528,0.813608633
0.9477982951999999,0.1176,2.2528,0.498841208,0.503365632
0.971637694,0.0589,2.0767,0.51138826,0.232403497
0.9977001878,0.0044,1.9132,0.525105362,0.015994352
