rho_0,v_spec,P,Label,V(--),UP,US
# g/cc,cc/g,GPa,--,--,mm/us,mm/us
1.9,0.259813084,135.1862001,Holmes,0.49364485960000004,6.002290235348241,11.853913896493035
1.9,0.278334001,87.41304651,Holmes,0.5288346019,4.655839731936994,9.881540008480927
1.9,0.334295334,51.46340886,Holmes,0.6351611346,3.1435691831937844,8.616322111810252
