RHO(G/CC),T(K),P(GPA),E(MJ/KG),UP(KM/S),US(KM/S)
1.9003,298.1900,0.0019,0.3892,0.0003,2.3247
1.9818,311.0000,0.5213,0.3948,0.1064,2.5769
2.0549,323.6500,1.1426,0.4118,0.2129,2.8239
2.1205,337.6800,1.8639,0.4402,0.3194,3.0710
2.1798,354.3500,2.6851,0.4799,0.4259,3.3180
2.2335,374.6400,3.6062,0.5309,0.5323,3.5650
2.2825,399.3100,4.6273,0.5932,0.6388,3.8121
2.3273,428.9900,5.7484,0.6669,0.7453,4.0591
2.3685,464.1900,6.9694,0.7520,0.8518,4.3061
2.4065,505.3200,8.2903,0.8483,0.9583,4.5532
2.4416,552.7300,9.7113,0.9560,1.0647,4.8002
2.4741,606.7000,11.2330,1.0751,1.1713,5.0474
2.5044,667.4900,12.8540,1.2055,1.2778,5.2944
2.5326,735.2900,14.5740,1.3472,1.3842,5.5414
2.5590,810.2800,16.3950,1.5002,1.4907,5.7884
2.5837,892.6100,18.3160,1.6646,1.5972,6.0354
2.6069,982.4200,20.3360,1.8404,1.7036,6.2825
2.6287,1079.8000,22.4570,2.0274,1.8101,6.5295
2.6493,1184.9000,24.6770,2.2259,1.9166,6.7765
2.6687,1297.8000,26.9980,2.4356,2.0231,7.0235
2.6870,1418.5000,29.4180,2.6567,2.1295,7.2706
2.7044,1547.1000,31.9380,2.8891,2.2360,7.5176
2.7209,1683.8000,34.5590,3.1329,2.3425,7.7646
2.7365,1828.5000,37.2790,3.3880,2.4490,8.0116
2.7513,1981.2000,40.0990,3.6544,2.5555,8.2587
2.7655,2142.1000,43.0190,3.9322,2.6619,8.5057
2.7790,2311.2000,46.0400,4.2213,2.7684,8.7527
2.7918,2488.5000,49.1600,4.5217,2.8749,8.9998
2.8041,2674.1000,52.3800,4.8335,2.9814,9.2468
2.8159,2867.9000,55.7000,5.1566,3.0878,9.4938
2.8271,3070.0000,59.1200,5.4911,3.1943,9.7408
2.8379,3280.4000,62.6400,5.8369,3.3008,9.9879
2.8482,3499.2000,66.2590,6.1940,3.4073,10.2350
2.8581,3726.4000,69.9790,6.5625,3.5138,10.4820
2.8676,3961.9000,73.7990,6.9423,3.6202,10.7290
2.8768,4205.9000,77.7190,7.3335,3.7267,10.9760
2.8856,4458.2000,81.7380,7.7360,3.8332,11.2230
2.8940,4719.1000,85.8580,8.1498,3.9397,11.4700
2.9022,4988.3000,90.0780,8.5749,4.0462,11.7170
2.9101,5266.0000,94.3970,9.0114,4.1526,11.9640
2.9176,5552.2000,98.8170,9.4593,4.2591,12.2110
2.9250,5846.9000,103.3400,9.9184,4.3656,12.4580
2.9320,6150.1000,107.9600,10.3890,4.4721,12.7050
2.9389,6461.8000,112.6700,10.8710,4.5785,12.9520
2.9455,6781.9000,117.4900,11.3640,4.6850,13.1990
2.9519,7110.7000,122.4100,11.8690,4.7915,13.4460
2.9581,7447.9000,127.4300,12.3840,4.8980,13.6930
2.9641,7793.7000,132.5500,12.9120,5.0045,13.9400
2.9699,8148.0000,137.7700,13.4500,5.1109,14.1870
2.9755,8510.9000,143.0900,14.0000,5.2174,14.4340
