RHO(G/CC),T(K),P(GPA),E(MJ/KG),UP(KM/S),US(KM/S),v_spec
2.5575,7033.2,142.01,9.9955,4.3836,17.05,0.39100684261974583
2.557,6891.8,139.21,9.8005,4.3388,16.887,0.3910833007430583
2.5564,6752.0,136.44,9.6075,4.294,16.723,0.3911750899702707
2.5558,6613.7,133.7,9.4164,4.2493,16.56,0.3912669222943892
2.5552,6477.0,130.99,9.2274,4.2045,16.397,0.3913587977457733
2.5546,6341.7,128.3,9.0403,4.1598,16.233,0.3914507163548109
2.554,6208.0,125.64,8.8553,4.1151,16.07,0.39154267815191857
2.5534,6075.8,123.02,8.6722,4.0703,15.907,0.39163468316754135
2.5527,5945.2,120.42,8.4912,4.0256,15.743,0.39174207701649233
2.5521,5816.0,117.84,8.3121,3.9809,15.58,0.3918341757768113
2.5514,5688.4,115.3,8.1351,3.9361,15.417,0.39194167907815314
2.5507,5562.4,112.78,7.96,3.8914,15.254,0.3920492413847179
2.55,5437.8,110.29,7.787,3.8466,15.09,0.3921568627450981
2.5493,5314.8,107.83,7.616,3.8019,14.927,0.3922645432079394
2.5486,5193.3,105.39,7.4469,3.7572,14.764,0.3923722828219415
2.5478,5073.3,102.99,7.2799,3.7124,14.6,0.3924954863019075
2.5471,4954.8,100.61,7.1148,3.6677,14.437,0.3926033528326332
2.5463,4837.9,98.257,6.9518,3.623,14.274,0.3927267014884342
2.5455,4722.5,95.933,6.7908,3.5782,14.111,0.39285012767629146
2.5447,4608.6,93.638,6.6317,3.5335,13.947,0.3929736314693284
2.5439,4496.2,91.37,6.4747,3.4888,13.784,0.3930972129407603
2.543,4385.4,89.13,6.3196,3.444,13.621,0.39323633503735744
2.5421,4276.1,86.918,6.1666,3.3993,13.457,0.39337555564297233
2.5412,4168.3,84.733,6.0156,3.3546,13.294,0.3935148748622698
2.5403,4062.0,82.576,5.8665,3.3098,13.131,0.39365429280006303
2.5394,3957.3,80.448,5.7195,3.2651,12.968,0.39379380956131366
2.5384,3854.1,78.347,5.5744,3.2204,12.804,0.39394894421682947
2.5374,3752.4,76.273,5.4314,3.1756,12.641,0.39410420115078426
2.5364,3652.2,74.228,5.2904,3.1309,12.478,0.39425958050780635
2.5354,3553.6,72.21,5.1513,3.0862,12.315,0.3944150824327522
2.5343,3456.5,70.22,5.0143,3.0415,12.151,0.39458627628931064
2.5333,3360.9,68.258,4.8793,2.9967,11.988,0.3947420360794221
2.5321,3266.8,66.323,4.7462,2.952,11.825,0.3949291102247147
2.531,3174.2,64.416,4.6152,2.9073,11.662,0.3951007506914263
2.5298,3083.2,62.537,4.4862,2.8625,11.498,0.39528816507233777
2.5286,2993.7,60.671,4.3591,2.8174,11.334,0.3954757573360753
2.5273,2905.7,58.849,4.2341,2.7727,11.171,0.39567918331816565
2.5261,2819.2,57.054,4.1111,2.728,11.007,0.39586714698547165
2.5247,2734.3,55.287,3.9901,2.6833,10.844,0.3960866637620311
2.5234,2650.8,53.547,3.871,2.6386,10.681,0.396290718871364
2.522,2568.9,51.836,3.754,2.5939,10.518,0.39651070578905634
2.5205,2488.5,50.151,3.639,2.5492,10.354,0.39674667724657803
2.519,2409.6,48.495,3.5259,2.5045,10.191,0.39698292973402144
2.5175,2332.2,46.867,3.4149,2.4597,10.028,0.3972194637537239
2.5159,2256.4,45.266,3.3059,2.415,9.8649,0.39747207758654957
2.5143,2182.1,43.693,3.1989,2.3703,9.7016,0.39772501292606294
2.5126,2109.2,42.147,3.0938,2.3256,9.5384,0.39799410968717663
2.5109,2037.9,40.629,2.9908,2.2809,9.3752,0.3982635708311761
2.5091,1968.1,39.139,2.8898,2.2362,9.212,0.39854928061854844
2.5072,1899.9,37.677,2.7908,2.1914,9.0488,0.398851308232291
2.5053,1833.1,36.242,2.6937,2.1467,8.8855,0.39915379395681155
2.5033,1767.9,34.835,2.5987,2.102,8.7223,0.3994726960412256
2.5012,1704.1,33.456,2.5057,2.0573,8.5591,0.39980809211578444
2.499,1641.9,32.105,2.4147,2.0126,8.3959,0.4001600640256102
2.4968,1581.1,30.781,2.3256,1.9678,8.2326,0.4005126561999359
2.4945,1521.9,29.485,2.2386,1.9231,8.0694,0.4008819402685909
2.4921,1464.2,28.217,2.1536,1.8784,7.9062,0.4012680069018097
2.4896,1408.0,26.977,2.0706,1.8337,7.7429,0.4016709511568124
2.487,1353.3,25.764,1.9896,1.789,7.5797,0.4020908725371934
2.4843,1300.1,24.579,1.9105,1.7442,7.4165,0.40252787505534754
2.4814,1248.4,23.421,1.8335,1.6995,7.2532,0.4029983074071089
2.4785,1198.2,22.292,1.7585,1.6548,7.09,0.403469840629413
2.4754,1149.5,21.19,1.6855,1.6101,6.9268,0.4039751151329078
2.4722,1102.3,20.116,1.6145,1.5653,6.7635,0.404498017959712
2.4688,1056.5,19.07,1.5454,1.5206,6.6003,0.4050550874918989
2.4652,1012.3,18.051,1.4784,1.4759,6.437,0.40564660068148634
2.4615,969.53,17.06,1.4134,1.4312,6.2738,0.4062563477554337
2.4576,928.25,16.097,1.3504,1.3864,6.1105,0.4069010416666667
2.4535,888.46,15.162,1.2894,1.3417,5.9473,0.4075810067250866
2.4492,850.14,14.254,1.2304,1.297,5.7841,0.4082965866405357
2.4446,813.28,13.374,1.1734,1.2523,5.6208,0.4090648776896016
2.4398,777.9,12.522,1.1183,1.2075,5.4576,0.40986966144765963
2.4348,743.97,11.697,1.0653,1.1628,5.2943,0.41071135206177095
2.4294,711.49,10.901,1.0143,1.1181,5.1311,0.4116242693669219
2.4237,680.46,10.132,0.9653,1.0734,4.9678,0.4125923175310475
2.4176,650.87,9.3906,0.9183,1.0286,4.8046,0.41363335539377893
2.4111,622.71,8.6771,0.8733,0.9839,4.6413,0.4147484550620049
2.4042,595.97,7.9914,0.8303,0.9392,4.4781,0.41593877381249483
2.3969,570.64,7.3334,0.7893,0.8945,4.3148,0.4172055571780216
2.389,546.7,6.7032,0.7503,0.8498,4.1516,0.41858518208455425
2.3805,524.15,6.1007,0.7132,0.805,3.9883,0.4200798151648813
2.3713,502.96,5.5259,0.6782,0.7603,3.8251,0.42170961076202923
2.3615,483.12,4.979,0.6452,0.7156,3.6618,0.4234596654668643
2.3507,464.6,4.4597,0.6142,0.6709,3.4986,0.42540519845152514
2.3391,447.38,3.9682,0.5852,0.6261,3.3354,0.4275148561412509
2.3264,431.42,3.5045,0.5582,0.5814,3.1721,0.4298486932599725
2.3125,416.7,3.0685,0.5332,0.5367,3.0089,0.43243243243243246
2.2971,403.15,2.6602,0.5102,0.492,2.8457,0.4353315049410126
2.2802,390.74,2.2798,0.4892,0.4472,2.6824,0.4385580212262083
2.2613,379.38,1.9266,0.4702,0.4025,2.519,0.4422234997567771
2.2402,369.01,1.6015,0.4532,0.3577,2.3557,0.44638871529327734
2.2164,359.51,1.3042,0.4382,0.313,2.1925,0.4511820970943873
2.1895,350.75,1.0347,0.4252,0.2683,2.0292,0.4567252797442339
2.1586,342.57,0.7928,0.4142,0.2235,1.8659,0.46326322616510707
2.1229,334.72,0.5788,0.4052,0.1788,1.7026,0.4710537472325592
2.0813,326.9,0.3925,0.3982,0.1341,1.5394,0.4804689376831787
2.0319,318.66,0.2339,0.3932,0.0893,1.376,0.4921502042423348
1.9725,309.38,0.1031,0.3902,0.0446,1.2127,0.5069708491761724
1.9005,298.23,0.0009,0.3892,0.0003,1.0439,0.5261773217574323
