rho_0,v_spec,P,US,UP,Uf,Label,Shot Name
# g/cc,cc/g,GPa,mm/us,mm/us,mm/us,--,--
1.9,0.405284211,10.9,4.99471261,1.14858302,,Jackson Gun,
1.9,0.392925263,15.4,5.65514872,1.43325376,,Jackson Gun,
1.9,0.388560526,17.5,5.93214234,1.55264756,,Jackson Gun,
1.9,0.397543158,13.5,5.38891235,1.3184967,,Jackson Wedge,
1.9,0.388947895,17.3,5.90645922,1.54157725,,Jackson Wedge,
1.9,0.382705789,20.9,6.34932493,1.73246764,,Jackson Wedge,
1.914,0.397321113,9.93,4.655,1.115,,Dallman,
1.911,0.396921525,11.55,4.99,1.205,,Dallman,
1.917,0.39241829,11.7,4.965,1.23,,Dallman,
1.913,0.393597419,14.45,5.505,1.36,,Dallman,
1.912,0.395448515,16.5,5.945,1.45,,Dallman,
1.9,0.38708213,14.975,5.449,1.4415,2.951,Gustavsen,2s-47
1.9,0.397255161,12.336,5.1465,1.262,2.589,Gustavsen,2s-54
1.9,0.3967862,12.5155,5.1685,1.272,2.617,Gustavsen,2s-50
1.9,0.382994484,16.385,5.6274,1.5324,3.131,Gustavsen,2s-64
