('/Users/mac/PycharmProjects/djangoApp/build/manage/manage',
 True,
 False,
 True,
 None,
 None,
 False,
 False,
 None,
 True,
 'x86_64',
 None,
 None,
 'manage.pkg',
 [('PYZ-00.pyz',
   '/Users/mac/PycharmProjects/djangoApp/build/manage/PYZ-00.pyz',
   'PYZ'),
  ('lib-dynload/_struct',
   '/usr/local/Cellar/python@3.9/3.9.6/Frameworks/Python.framework/Versions/3.9/lib/python3.9/lib-dynload/_struct.cpython-39-darwin.so',
   'EXTENSION'),
  ('lib-dynload/zlib',
   '/usr/local/Cellar/python@3.9/3.9.6/Frameworks/Python.framework/Versions/3.9/lib/python3.9/lib-dynload/zlib.cpython-39-darwin.so',
   'EXTENSION'),
  ('struct',
   '/usr/local/Cellar/python@3.9/3.9.6/Frameworks/Python.framework/Versions/3.9/lib/python3.9/struct.pyo',
   'PYMODULE'),
  ('pyimod01_os_path',
   '/Users/mac/PycharmProjects/djangoApp/venv/lib/python3.9/site-packages/PyInstaller/loader/pyimod01_os_path.pyc',
   'PYMODULE'),
  ('pyimod02_archive',
   '/Users/mac/PycharmProjects/djangoApp/venv/lib/python3.9/site-packages/PyInstaller/loader/pyimod02_archive.pyc',
   'PYMODULE'),
  ('pyimod03_importers',
   '/Users/mac/PycharmProjects/djangoApp/venv/lib/python3.9/site-packages/PyInstaller/loader/pyimod03_importers.pyc',
   'PYMODULE'),
  ('pyimod04_ctypes',
   '/Users/mac/PycharmProjects/djangoApp/venv/lib/python3.9/site-packages/PyInstaller/loader/pyimod04_ctypes.pyc',
   'PYMODULE'),
  ('pyiboot01_bootstrap',
   '/Users/mac/PycharmProjects/djangoApp/venv/lib/python3.9/site-packages/PyInstaller/loader/pyiboot01_bootstrap.py',
   'PYSOURCE'),
  ('pyi_rth_pkgutil',
   '/Users/mac/PycharmProjects/djangoApp/venv/lib/python3.9/site-packages/PyInstaller/hooks/rthooks/pyi_rth_pkgutil.py',
   'PYSOURCE'),
  ('pyi_rth_multiprocessing',
   '/Users/mac/PycharmProjects/djangoApp/venv/lib/python3.9/site-packages/PyInstaller/hooks/rthooks/pyi_rth_multiprocessing.py',
   'PYSOURCE'),
  ('pyi_rth_inspect',
   '/Users/mac/PycharmProjects/djangoApp/venv/lib/python3.9/site-packages/PyInstaller/hooks/rthooks/pyi_rth_inspect.py',
   'PYSOURCE'),
  ('pyi_rth_pkgres',
   '/Users/mac/PycharmProjects/djangoApp/venv/lib/python3.9/site-packages/PyInstaller/hooks/rthooks/pyi_rth_pkgres.py',
   'PYSOURCE'),
  ('pyi_rth_django',
   '/Users/mac/PycharmProjects/djangoApp/venv/lib/python3.9/site-packages/PyInstaller/hooks/rthooks/pyi_rth_django.py',
   'PYSOURCE'),
  ('manage', '/Users/mac/PycharmProjects/djangoApp/manage.py', 'PYSOURCE')],
 [],
 False,
 False,
 1632747823,
 [('run',
   '/Users/mac/PycharmProjects/djangoApp/venv/lib/python3.9/site-packages/PyInstaller/bootloader/Darwin-64bit/run',
   'EXECUTABLE')])
