___       _________________________________________________________
__ |     / ___  _______  __ __  __ ___  __ ___  ______  ______  __ \
__ | /| / /__  __/  __  / / _  / / __  / / __  __/  _  /    _  / / /
__ |/ |/ / _  /___  _  /_/ // /_/ /_  /_/ /_  /___  / /___  / /_/ /
____/|__/  /_____/  /_____/ \____/ /_____/ /_____/  \____/  \____/

                            |  _`\                       ( )_
                            | (_) )  __    __  _   _  ___| ,_)  _    ___    __
                            | ,  / /'__`\/'_ `( ) ( /',__| |  /'_`\/' _ `\/'__`\
                            | |\ \(  ___( (_) | (_) \__, | |_( (_) | ( ) (  ___/
                            (_) (_`\____`\__  `\__, (____`\__`\___/(_) (_`\____)
                                        ( )_) ( )_| |
                                         \___/`\___/'

 ______  ___   ___                          __      __                                                                __
/\  _  \/\_ \ /\_ \              __        /\ \    /\ \__                                                            /\ \
\ \ \L\ \//\ \\//\ \       _ __ /\_\     __\ \ \___\ \ ,_\   ____      _ __   __    ____    __  _ __  __  __    __   \_\ \
 \ \  __ \\ \ \ \ \ \     /\`'__\/\ \  /'_ `\ \  _ `\ \ \/  /',__\    /\`'__/'__`\ /',__\ /'__`/\`'__/\ \/\ \ /'__`\ /'_` \
  \ \ \/\ \\_\ \_\_\ \_   \ \ \/ \ \ \/\ \L\ \ \ \ \ \ \ \_/\__, `\   \ \ \/\  __//\__, `/\  __\ \ \/\ \ \_/ /\  __//\ \L\ \
   \ \_\ \_/\____/\____\   \ \_\  \ \_\ \____ \ \_\ \_\ \__\/\____/    \ \_\ \____\/\____\ \____\ \_\ \ \___/\ \____\ \___,_\
    \/_/\/_\/____\/____/    \/_/   \/_/\/___L\ \/_/\/_/\/__/\/___/      \/_/\/____/\/___/ \/____/\/_/  \/__/  \/____/\/__,_ /
                                         /\____/
                                         \_/__/