{
  "nombreApp": "Componemtes",
  "rutas": [
    {
      "ruta": "alert",
      "icon": "add_alert",
      "text": "Alertas"
    },
    {
      "ruta": "avatar",
      "icon": "accessibility",
      "text": "Avatars"
    },
    {
      "ruta": "card",
      "icon": "folder_open",
      "text": "Card - Tarjetas"
    },
    {
      "ruta": "animatedContainer",
      "icon": "donut_large",
      "text": "Animated Container"
    },
    {
      "ruta": "inputs",
      "icon": "input",
      "text": "Inputs"
    },
    {
      "ruta": "sliderAndChecks",
      "icon": "tune",
      "text": "Slider - Checks"
    },
    {
      "ruta": "listAndScroll",
      "icon": "list",
      "text": "Lista y Scroll"
    }
  ]
}
