C:\Users\Surabhi\eclipse-workspace\pcs\src\main\java\com\pcs\dao\StudentDao.java
C:\Users\Surabhi\eclipse-workspace\pcs\src\main\java\com\pcs\controller\StudentController.java
C:\Users\Surabhi\eclipse-workspace\pcs\src\main\java\com\pcs\dao\StudentDaoImpl.java
C:\Users\Surabhi\eclipse-workspace\pcs\src\main\java\com\pcs\services\StudentService.java
C:\Users\Surabhi\eclipse-workspace\pcs\src\main\java\com\pcs\model\Student.java
C:\Users\Surabhi\eclipse-workspace\pcs\src\main\java\com\pcs\services\StudentServiceImpl.java
