{
  "type": "minecraft:block",
  "pools": [
    {
      "conditions": [
        {
          "condition": "minecraft:survives_explosion"
        }
      ],
      "entries": [
        {
          "type": "minecraft:item",
          "name": "minecraft:bamboo_mosaic_stairs"
        }
      ],
      "rolls": 1
    }
  ]
}