{
  "parent": "regedt32:block/cntrafficsymbols/circle_rotation23_up",
  "textures": {
    "front": "regedt32:block/cntrafficsymbols/heightlimit_2d2",
    "side": "regedt32:block/cntrafficsymbols/circle_backboard"
  }
}
