{
  "parent": "regedt32:block/cntrafficsymbols/circle_rotation16_up",
  "textures": {
    "front": "regedt32:block/cntrafficsymbols/speedlimit_low_90",
    "side": "regedt32:block/cntrafficsymbols/circle_backboard"
  }
}
