{
  "parent": "regedt32:block/cntrafficsymbols/circle_rotation18_down",
  "textures": {
    "front": "regedt32:block/cntrafficsymbols/lift_speedlimit_high_100",
    "side": "regedt32:block/cntrafficsymbols/circle_backboard"
  }
}
