{
  "parent": "regedt32:block/cntrafficsymbols/wideboard_standing",
  "textures": {
    "front": "regedt32:block/cntrafficsymbols/keep_space_variant1_left",
    "back": "regedt32:block/cntrafficsymbols/full_square_backboard",
    "side": "regedt32:block/cntrafficsymbols/full_square_backboard"
  }
}
