{
  "values": [
    "regedt32:cntrafficsymbbols/white_rod_with_lamp",
    "regedt32:cntrafficsymbbols/orange_rod_with_lamp",
    "regedt32:cntrafficsymbbols/magenta_rod_with_lamp",
    "regedt32:cntrafficsymbbols/light_blue_rod_with_lamp",
    "regedt32:cntrafficsymbbols/yellow_rod_with_lamp",
    "regedt32:cntrafficsymbbols/lime_rod_with_lamp",
    "regedt32:cntrafficsymbbols/pink_rod_with_lamp",
    "regedt32:cntrafficsymbbols/gray_rod_with_lamp",
    "regedt32:cntrafficsymbbols/light_gray_rod_with_lamp",
    "regedt32:cntrafficsymbbols/cyan_rod_with_lamp",
    "regedt32:cntrafficsymbbols/purple_rod_with_lamp",
    "regedt32:cntrafficsymbbols/blue_rod_with_lamp",
    "regedt32:cntrafficsymbbols/brown_rod_with_lamp",
    "regedt32:cntrafficsymbbols/green_rod_with_lamp",
    "regedt32:cntrafficsymbbols/red_rod_with_lamp",
    "regedt32:cntrafficsymbbols/black_rod_with_lamp"
  ]
}
