{
  "parent": "regedt32:block/cntrafficsymbols/circle_rotation26_down",
  "textures": {
    "front": "regedt32:block/cntrafficsymbols/heightlimit_4d1",
    "back": "regedt32:block/cntrafficsymbols/circle_backboard",
    "side": "regedt32:block/cntrafficsymbols/circle_backboard"
  }
}
