{
  "parent": "regedt32:block/cntrafficsymbols/circle_rotation16_down",
  "textures": {
    "front": "regedt32:block/cntrafficsymbols/lift_speedlimit_high_70",
    "side": "regedt32:block/cntrafficsymbols/circle_backboard"
  }
}
