{
  "parent": "regedt32:block/cntrafficsymbols/circle_rotation23_up",
  "textures": {
    "front": "regedt32:block/cntrafficsymbols/speedlimit_low_75",
    "side": "regedt32:block/cntrafficsymbols/circle_backboard"
  }
}
