{
  "parent": "regedt32:block/cntrafficsymbols/circle_rotation18_up",
  "textures": {
    "front": "regedt32:block/cntrafficsymbols/heightlimit_7d1",
    "side": "regedt32:block/cntrafficsymbols/circle_backboard"
  }
}
