{
  "parent": "regedt32:block/cntrafficsymbols/highway_hm_rotation18",
  "textures": {
    "front": "regedt32:block/cntrafficsymbols/highway_4hm",
    "side": "regedt32:block/cntrafficsymbols/highway_hm_backboard"
  }
}
