{
  "parent": "regedt32:block/cntrafficsymbols/circle_rotation16_down",
  "textures": {
    "front": "regedt32:block/cntrafficsymbols/heightlimit_6",
    "side": "regedt32:block/cntrafficsymbols/circle_backboard"
  }
}
