{
  "type": "minecraft:block",
  "pools": [
    {
      "bonus_rolls": 0.0,
      "entries": [
        {
          "type": "minecraft:item",
          "functions": [{"function": "minecraft:explosion_decay"}],
          "name": "regedt32:cntrafficsymbols/light_blue_half1_cylindrical_rod"
        }
      ],
      "rolls": 1.0
    }
  ],
  "random_sequence": "regedt32:cntrafficsymbols/light_blue_half1_cylindrical_rod"
}
