{
  "parent": "regedt32:block/cntrafficsymbols/circle_rotation18",
  "textures": {
    "front": "regedt32:block/cntrafficsymbols/lift_speedlimit_high_3",
    "side": "regedt32:block/cntrafficsymbols/circle_backboard"
  }
}
