{
  "parent": "regedt32:block/cntrafficsymbols/circle_rotation1_down",
  "textures": {
    "front": "regedt32:block/cntrafficsymbols/heightlimit_8d2",
    "back": "regedt32:block/cntrafficsymbols/circle_backboard",
    "side": "regedt32:block/cntrafficsymbols/circle_backboard"
  }
}
