{
  "variants": {
    "axis=x,bottom=true": {"model": "regedt32:block/cntrafficsymbols/pink_lined7_tp_x_bottom"},
    "axis=x,bottom=false": {"model": "regedt32:block/cntrafficsymbols/pink_lined7_tp_x_up"},
    "axis=z,bottom=true": {
      "model": "regedt32:block/cntrafficsymbols/pink_lined7_tp_x_bottom",
      "y": 90,
      "uvlock": true
    },
    "axis=z,bottom=false": {
      "model": "regedt32:block/cntrafficsymbols/pink_lined7_tp_x_up",
      "y": 90,
      "uvlock": true
    }
  }
}
