{
  "parent": "regedt32:block/cntrafficsymbols/circle_rotation18_up",
  "textures": {
    "front": "regedt32:block/cntrafficsymbols/lift_speedlimit_high_140",
    "side": "regedt32:block/cntrafficsymbols/circle_backboard"
  }
}
