{
  "parent": "regedt32:block/cntrafficsymbols/highway_hm_rotation23_up",
  "textures": {
    "front": "regedt32:block/cntrafficsymbols/highway_5hm",
    "side": "regedt32:block/cntrafficsymbols/highway_hm_backboard"
  }
}
