{
  "parent": "minecraft:block/block",
  "textures": {
    "particle": "#this"
  },
  "elements": [
    {
      "from": [
        0,
        8,
        0
      ],
      "to": [
        16,
        9,
        16
      ],
      "faces": {
        "down": {
          "uv": [
            0,
            0,
            16,
            16
          ],
          "texture": "#this"
        },
        "up": {
          "uv": [
            0,
            0,
            16,
            16
          ],
          "texture": "#this"
        },
        "north": {
          "uv": [
            0,
            7,
            16,
            8
          ],
          "texture": "#this",
          "cullface": "north"
        },
        "south": {
          "uv": [
            0,
            7,
            16,
            8
          ],
          "texture": "#this",
          "cullface": "south"
        },
        "west": {
          "uv": [
            0,
            7,
            16,
            8
          ],
          "texture": "#this",
          "cullface": "west"
        },
        "east": {
          "uv": [
            0,
            7,
            16,
            8
          ],
          "texture": "#this",
          "cullface": "east"
        }
      }
    },
    {
      "from": [
        1.5,
        9,
        1.5
      ],
      "to": [
        2.5,
        9.5,
        2.5
      ],
      "faces": {
        "up": {
          "uv": [
            1.5,
            1.5,
            2.5,
            2.5
          ],
          "texture": "#this"
        },
        "north": {
          "uv": [
            13.5,
            6.5,
            14.5,
            7
          ],
          "texture": "#this"
        },
        "south": {
          "uv": [
            1.5,
            6.5,
            2.5,
            7
          ],
          "texture": "#this"
        },
        "west": {
          "uv": [
            1.5,
            6.5,
            2.5,
            7
          ],
          "texture": "#this"
        },
        "east": {
          "uv": [
            13.5,
            6.5,
            14.5,
            7
          ],
          "texture": "#this"
        }
      }
    },
    {
      "from": [
        1.5,
        9,
        3.5
      ],
      "to": [
        2.5,
        9.5,
        4.5
      ],
      "faces": {
        "up": {
          "uv": [
            1.5,
            3.5,
            2.5,
            4.5
          ],
          "texture": "#this"
        },
        "north": {
          "uv": [
            13.5,
            6.5,
            14.5,
            7
          ],
          "texture": "#this"
        },
        "south": {
          "uv": [
            1.5,
            6.5,
            2.5,
            7
          ],
          "texture": "#this"
        },
        "west": {
          "uv": [
            3.5,
            6.5,
            4.5,
            7
          ],
          "texture": "#this"
        },
        "east": {
          "uv": [
            11.5,
            6.5,
            12.5,
            7
          ],
          "texture": "#this"
        }
      }
    },
    {
      "from": [
        1.5,
        9,
        5.5
      ],
      "to": [
        2.5,
        9.5,
        6.5
      ],
      "faces": {
        "up": {
          "uv": [
            1.5,
            5.5,
            2.5,
            6.5
          ],
          "texture": "#this"
        },
        "north": {
          "uv": [
            13.5,
            6.5,
            14.5,
            7
          ],
          "texture": "#this"
        },
        "south": {
          "uv": [
            1.5,
            6.5,
            2.5,
            7
          ],
          "texture": "#this"
        },
        "west": {
          "uv": [
            5.5,
            6.5,
            6.5,
            7
          ],
          "texture": "#this"
        },
        "east": {
          "uv": [
            9.5,
            6.5,
            10.5,
            7
          ],
          "texture": "#this"
        }
      }
    },
    {
      "from": [
        1.5,
        9,
        7.5
      ],
      "to": [
        2.5,
        9.5,
        8.5
      ],
      "faces": {
        "up": {
          "uv": [
            1.5,
            7.5,
            2.5,
            8.5
          ],
          "texture": "#this"
        },
        "north": {
          "uv": [
            13.5,
            6.5,
            14.5,
            7
          ],
          "texture": "#this"
        },
        "south": {
          "uv": [
            1.5,
            6.5,
            2.5,
            7
          ],
          "texture": "#this"
        },
        "west": {
          "uv": [
            7.5,
            6.5,
            8.5,
            7
          ],
          "texture": "#this"
        },
        "east": {
          "uv": [
            7.5,
            6.5,
            8.5,
            7
          ],
          "texture": "#this"
        }
      }
    },
    {
      "from": [
        1.5,
        9,
        9.5
      ],
      "to": [
        2.5,
        9.5,
        10.5
      ],
      "faces": {
        "up": {
          "uv": [
            1.5,
            9.5,
            2.5,
            10.5
          ],
          "texture": "#this"
        },
        "north": {
          "uv": [
            13.5,
            6.5,
            14.5,
            7
          ],
          "texture": "#this"
        },
        "south": {
          "uv": [
            1.5,
            6.5,
            2.5,
            7
          ],
          "texture": "#this"
        },
        "west": {
          "uv": [
            9.5,
            6.5,
            10.5,
            7
          ],
          "texture": "#this"
        },
        "east": {
          "uv": [
            5.5,
            6.5,
            6.5,
            7
          ],
          "texture": "#this"
        }
      }
    },
    {
      "from": [
        1.5,
        9,
        11.5
      ],
      "to": [
        2.5,
        9.5,
        12.5
      ],
      "faces": {
        "up": {
          "uv": [
            1.5,
            11.5,
            2.5,
            12.5
          ],
          "texture": "#this"
        },
        "north": {
          "uv": [
            13.5,
            6.5,
            14.5,
            7
          ],
          "texture": "#this"
        },
        "south": {
          "uv": [
            1.5,
            6.5,
            2.5,
            7
          ],
          "texture": "#this"
        },
        "west": {
          "uv": [
            11.5,
            6.5,
            12.5,
            7
          ],
          "texture": "#this"
        },
        "east": {
          "uv": [
            3.5,
            6.5,
            4.5,
            7
          ],
          "texture": "#this"
        }
      }
    },
    {
      "from": [
        1.5,
        9,
        13.5
      ],
      "to": [
        2.5,
        9.5,
        14.5
      ],
      "faces": {
        "up": {
          "uv": [
            1.5,
            13.5,
            2.5,
            14.5
          ],
          "texture": "#this"
        },
        "north": {
          "uv": [
            13.5,
            6.5,
            14.5,
            7
          ],
          "texture": "#this"
        },
        "south": {
          "uv": [
            1.5,
            6.5,
            2.5,
            7
          ],
          "texture": "#this"
        },
        "west": {
          "uv": [
            13.5,
            6.5,
            14.5,
            7
          ],
          "texture": "#this"
        },
        "east": {
          "uv": [
            1.5,
            6.5,
            2.5,
            7
          ],
          "texture": "#this"
        }
      }
    },
    {
      "from": [
        3.5,
        9,
        1.5
      ],
      "to": [
        4.5,
        9.5,
        2.5
      ],
      "faces": {
        "up": {
          "uv": [
            3.5,
            1.5,
            4.5,
            2.5
          ],
          "texture": "#this"
        },
        "north": {
          "uv": [
            11.5,
            6.5,
            12.5,
            7
          ],
          "texture": "#this"
        },
        "south": {
          "uv": [
            3.5,
            6.5,
            4.5,
            7
          ],
          "texture": "#this"
        },
        "west": {
          "uv": [
            1.5,
            6.5,
            2.5,
            7
          ],
          "texture": "#this"
        },
        "east": {
          "uv": [
            13.5,
            6.5,
            14.5,
            7
          ],
          "texture": "#this"
        }
      }
    },
    {
      "from": [
        3.5,
        9,
        3.5
      ],
      "to": [
        4.5,
        9.5,
        4.5
      ],
      "faces": {
        "up": {
          "uv": [
            3.5,
            3.5,
            4.5,
            4.5
          ],
          "texture": "#this"
        },
        "north": {
          "uv": [
            11.5,
            6.5,
            12.5,
            7
          ],
          "texture": "#this"
        },
        "south": {
          "uv": [
            3.5,
            6.5,
            4.5,
            7
          ],
          "texture": "#this"
        },
        "west": {
          "uv": [
            3.5,
            6.5,
            4.5,
            7
          ],
          "texture": "#this"
        },
        "east": {
          "uv": [
            11.5,
            6.5,
            12.5,
            7
          ],
          "texture": "#this"
        }
      }
    },
    {
      "from": [
        3.5,
        9,
        5.5
      ],
      "to": [
        4.5,
        9.5,
        6.5
      ],
      "faces": {
        "up": {
          "uv": [
            3.5,
            5.5,
            4.5,
            6.5
          ],
          "texture": "#this"
        },
        "north": {
          "uv": [
            11.5,
            6.5,
            12.5,
            7
          ],
          "texture": "#this"
        },
        "south": {
          "uv": [
            3.5,
            6.5,
            4.5,
            7
          ],
          "texture": "#this"
        },
        "west": {
          "uv": [
            5.5,
            6.5,
            6.5,
            7
          ],
          "texture": "#this"
        },
        "east": {
          "uv": [
            9.5,
            6.5,
            10.5,
            7
          ],
          "texture": "#this"
        }
      }
    },
    {
      "from": [
        3.5,
        9,
        7.5
      ],
      "to": [
        4.5,
        9.5,
        8.5
      ],
      "faces": {
        "up": {
          "uv": [
            3.5,
            7.5,
            4.5,
            8.5
          ],
          "texture": "#this"
        },
        "north": {
          "uv": [
            11.5,
            6.5,
            12.5,
            7
          ],
          "texture": "#this"
        },
        "south": {
          "uv": [
            3.5,
            6.5,
            4.5,
            7
          ],
          "texture": "#this"
        },
        "west": {
          "uv": [
            7.5,
            6.5,
            8.5,
            7
          ],
          "texture": "#this"
        },
        "east": {
          "uv": [
            7.5,
            6.5,
            8.5,
            7
          ],
          "texture": "#this"
        }
      }
    },
    {
      "from": [
        3.5,
        9,
        9.5
      ],
      "to": [
        4.5,
        9.5,
        10.5
      ],
      "faces": {
        "up": {
          "uv": [
            3.5,
            9.5,
            4.5,
            10.5
          ],
          "texture": "#this"
        },
        "north": {
          "uv": [
            11.5,
            6.5,
            12.5,
            7
          ],
          "texture": "#this"
        },
        "south": {
          "uv": [
            3.5,
            6.5,
            4.5,
            7
          ],
          "texture": "#this"
        },
        "west": {
          "uv": [
            9.5,
            6.5,
            10.5,
            7
          ],
          "texture": "#this"
        },
        "east": {
          "uv": [
            5.5,
            6.5,
            6.5,
            7
          ],
          "texture": "#this"
        }
      }
    },
    {
      "from": [
        3.5,
        9,
        11.5
      ],
      "to": [
        4.5,
        9.5,
        12.5
      ],
      "faces": {
        "up": {
          "uv": [
            3.5,
            11.5,
            4.5,
            12.5
          ],
          "texture": "#this"
        },
        "north": {
          "uv": [
            11.5,
            6.5,
            12.5,
            7
          ],
          "texture": "#this"
        },
        "south": {
          "uv": [
            3.5,
            6.5,
            4.5,
            7
          ],
          "texture": "#this"
        },
        "west": {
          "uv": [
            11.5,
            6.5,
            12.5,
            7
          ],
          "texture": "#this"
        },
        "east": {
          "uv": [
            3.5,
            6.5,
            4.5,
            7
          ],
          "texture": "#this"
        }
      }
    },
    {
      "from": [
        3.5,
        9,
        13.5
      ],
      "to": [
        4.5,
        9.5,
        14.5
      ],
      "faces": {
        "up": {
          "uv": [
            3.5,
            13.5,
            4.5,
            14.5
          ],
          "texture": "#this"
        },
        "north": {
          "uv": [
            11.5,
            6.5,
            12.5,
            7
          ],
          "texture": "#this"
        },
        "south": {
          "uv": [
            3.5,
            6.5,
            4.5,
            7
          ],
          "texture": "#this"
        },
        "west": {
          "uv": [
            13.5,
            6.5,
            14.5,
            7
          ],
          "texture": "#this"
        },
        "east": {
          "uv": [
            1.5,
            6.5,
            2.5,
            7
          ],
          "texture": "#this"
        }
      }
    },
    {
      "from": [
        5.5,
        9,
        1.5
      ],
      "to": [
        6.5,
        9.5,
        2.5
      ],
      "faces": {
        "up": {
          "uv": [
            5.5,
            1.5,
            6.5,
            2.5
          ],
          "texture": "#this"
        },
        "north": {
          "uv": [
            9.5,
            6.5,
            10.5,
            7
          ],
          "texture": "#this"
        },
        "south": {
          "uv": [
            5.5,
            6.5,
            6.5,
            7
          ],
          "texture": "#this"
        },
        "west": {
          "uv": [
            1.5,
            6.5,
            2.5,
            7
          ],
          "texture": "#this"
        },
        "east": {
          "uv": [
            13.5,
            6.5,
            14.5,
            7
          ],
          "texture": "#this"
        }
      }
    },
    {
      "from": [
        5.5,
        9,
        3.5
      ],
      "to": [
        6.5,
        9.5,
        4.5
      ],
      "faces": {
        "up": {
          "uv": [
            5.5,
            3.5,
            6.5,
            4.5
          ],
          "texture": "#this"
        },
        "north": {
          "uv": [
            9.5,
            6.5,
            10.5,
            7
          ],
          "texture": "#this"
        },
        "south": {
          "uv": [
            5.5,
            6.5,
            6.5,
            7
          ],
          "texture": "#this"
        },
        "west": {
          "uv": [
            3.5,
            6.5,
            4.5,
            7
          ],
          "texture": "#this"
        },
        "east": {
          "uv": [
            11.5,
            6.5,
            12.5,
            7
          ],
          "texture": "#this"
        }
      }
    },
    {
      "from": [
        5.5,
        9,
        5.5
      ],
      "to": [
        6.5,
        9.5,
        6.5
      ],
      "faces": {
        "up": {
          "uv": [
            5.5,
            5.5,
            6.5,
            6.5
          ],
          "texture": "#this"
        },
        "north": {
          "uv": [
            9.5,
            6.5,
            10.5,
            7
          ],
          "texture": "#this"
        },
        "south": {
          "uv": [
            5.5,
            6.5,
            6.5,
            7
          ],
          "texture": "#this"
        },
        "west": {
          "uv": [
            5.5,
            6.5,
            6.5,
            7
          ],
          "texture": "#this"
        },
        "east": {
          "uv": [
            9.5,
            6.5,
            10.5,
            7
          ],
          "texture": "#this"
        }
      }
    },
    {
      "from": [
        5.5,
        9,
        7.5
      ],
      "to": [
        6.5,
        9.5,
        8.5
      ],
      "faces": {
        "up": {
          "uv": [
            5.5,
            7.5,
            6.5,
            8.5
          ],
          "texture": "#this"
        },
        "north": {
          "uv": [
            9.5,
            6.5,
            10.5,
            7
          ],
          "texture": "#this"
        },
        "south": {
          "uv": [
            5.5,
            6.5,
            6.5,
            7
          ],
          "texture": "#this"
        },
        "west": {
          "uv": [
            7.5,
            6.5,
            8.5,
            7
          ],
          "texture": "#this"
        },
        "east": {
          "uv": [
            7.5,
            6.5,
            8.5,
            7
          ],
          "texture": "#this"
        }
      }
    },
    {
      "from": [
        5.5,
        9,
        9.5
      ],
      "to": [
        6.5,
        9.5,
        10.5
      ],
      "faces": {
        "up": {
          "uv": [
            5.5,
            9.5,
            6.5,
            10.5
          ],
          "texture": "#this"
        },
        "north": {
          "uv": [
            9.5,
            6.5,
            10.5,
            7
          ],
          "texture": "#this"
        },
        "south": {
          "uv": [
            5.5,
            6.5,
            6.5,
            7
          ],
          "texture": "#this"
        },
        "west": {
          "uv": [
            9.5,
            6.5,
            10.5,
            7
          ],
          "texture": "#this"
        },
        "east": {
          "uv": [
            5.5,
            6.5,
            6.5,
            7
          ],
          "texture": "#this"
        }
      }
    },
    {
      "from": [
        5.5,
        9,
        11.5
      ],
      "to": [
        6.5,
        9.5,
        12.5
      ],
      "faces": {
        "up": {
          "uv": [
            5.5,
            11.5,
            6.5,
            12.5
          ],
          "texture": "#this"
        },
        "north": {
          "uv": [
            9.5,
            6.5,
            10.5,
            7
          ],
          "texture": "#this"
        },
        "south": {
          "uv": [
            5.5,
            6.5,
            6.5,
            7
          ],
          "texture": "#this"
        },
        "west": {
          "uv": [
            11.5,
            6.5,
            12.5,
            7
          ],
          "texture": "#this"
        },
        "east": {
          "uv": [
            3.5,
            6.5,
            4.5,
            7
          ],
          "texture": "#this"
        }
      }
    },
    {
      "from": [
        5.5,
        9,
        13.5
      ],
      "to": [
        6.5,
        9.5,
        14.5
      ],
      "faces": {
        "up": {
          "uv": [
            5.5,
            13.5,
            6.5,
            14.5
          ],
          "texture": "#this"
        },
        "north": {
          "uv": [
            9.5,
            6.5,
            10.5,
            7
          ],
          "texture": "#this"
        },
        "south": {
          "uv": [
            5.5,
            6.5,
            6.5,
            7
          ],
          "texture": "#this"
        },
        "west": {
          "uv": [
            13.5,
            6.5,
            14.5,
            7
          ],
          "texture": "#this"
        },
        "east": {
          "uv": [
            1.5,
            6.5,
            2.5,
            7
          ],
          "texture": "#this"
        }
      }
    },
    {
      "from": [
        7.5,
        9,
        1.5
      ],
      "to": [
        8.5,
        9.5,
        2.5
      ],
      "faces": {
        "up": {
          "uv": [
            7.5,
            1.5,
            8.5,
            2.5
          ],
          "texture": "#this"
        },
        "north": {
          "uv": [
            7.5,
            6.5,
            8.5,
            7
          ],
          "texture": "#this"
        },
        "south": {
          "uv": [
            7.5,
            6.5,
            8.5,
            7
          ],
          "texture": "#this"
        },
        "west": {
          "uv": [
            1.5,
            6.5,
            2.5,
            7
          ],
          "texture": "#this"
        },
        "east": {
          "uv": [
            13.5,
            6.5,
            14.5,
            7
          ],
          "texture": "#this"
        }
      }
    },
    {
      "from": [
        7.5,
        9,
        3.5
      ],
      "to": [
        8.5,
        9.5,
        4.5
      ],
      "faces": {
        "up": {
          "uv": [
            7.5,
            3.5,
            8.5,
            4.5
          ],
          "texture": "#this"
        },
        "north": {
          "uv": [
            7.5,
            6.5,
            8.5,
            7
          ],
          "texture": "#this"
        },
        "south": {
          "uv": [
            7.5,
            6.5,
            8.5,
            7
          ],
          "texture": "#this"
        },
        "west": {
          "uv": [
            3.5,
            6.5,
            4.5,
            7
          ],
          "texture": "#this"
        },
        "east": {
          "uv": [
            11.5,
            6.5,
            12.5,
            7
          ],
          "texture": "#this"
        }
      }
    },
    {
      "from": [
        7.5,
        9,
        5.5
      ],
      "to": [
        8.5,
        9.5,
        6.5
      ],
      "faces": {
        "up": {
          "uv": [
            7.5,
            5.5,
            8.5,
            6.5
          ],
          "texture": "#this"
        },
        "north": {
          "uv": [
            7.5,
            6.5,
            8.5,
            7
          ],
          "texture": "#this"
        },
        "south": {
          "uv": [
            7.5,
            6.5,
            8.5,
            7
          ],
          "texture": "#this"
        },
        "west": {
          "uv": [
            5.5,
            6.5,
            6.5,
            7
          ],
          "texture": "#this"
        },
        "east": {
          "uv": [
            9.5,
            6.5,
            10.5,
            7
          ],
          "texture": "#this"
        }
      }
    },
    {
      "from": [
        7.5,
        9,
        7.5
      ],
      "to": [
        8.5,
        9.5,
        8.5
      ],
      "faces": {
        "up": {
          "uv": [
            7.5,
            7.5,
            8.5,
            8.5
          ],
          "texture": "#this"
        },
        "north": {
          "uv": [
            7.5,
            6.5,
            8.5,
            7
          ],
          "texture": "#this"
        },
        "south": {
          "uv": [
            7.5,
            6.5,
            8.5,
            7
          ],
          "texture": "#this"
        },
        "west": {
          "uv": [
            7.5,
            6.5,
            8.5,
            7
          ],
          "texture": "#this"
        },
        "east": {
          "uv": [
            7.5,
            6.5,
            8.5,
            7
          ],
          "texture": "#this"
        }
      }
    },
    {
      "from": [
        7.5,
        9,
        9.5
      ],
      "to": [
        8.5,
        9.5,
        10.5
      ],
      "faces": {
        "up": {
          "uv": [
            7.5,
            9.5,
            8.5,
            10.5
          ],
          "texture": "#this"
        },
        "north": {
          "uv": [
            7.5,
            6.5,
            8.5,
            7
          ],
          "texture": "#this"
        },
        "south": {
          "uv": [
            7.5,
            6.5,
            8.5,
            7
          ],
          "texture": "#this"
        },
        "west": {
          "uv": [
            9.5,
            6.5,
            10.5,
            7
          ],
          "texture": "#this"
        },
        "east": {
          "uv": [
            5.5,
            6.5,
            6.5,
            7
          ],
          "texture": "#this"
        }
      }
    },
    {
      "from": [
        7.5,
        9,
        11.5
      ],
      "to": [
        8.5,
        9.5,
        12.5
      ],
      "faces": {
        "up": {
          "uv": [
            7.5,
            11.5,
            8.5,
            12.5
          ],
          "texture": "#this"
        },
        "north": {
          "uv": [
            7.5,
            6.5,
            8.5,
            7
          ],
          "texture": "#this"
        },
        "south": {
          "uv": [
            7.5,
            6.5,
            8.5,
            7
          ],
          "texture": "#this"
        },
        "west": {
          "uv": [
            11.5,
            6.5,
            12.5,
            7
          ],
          "texture": "#this"
        },
        "east": {
          "uv": [
            3.5,
            6.5,
            4.5,
            7
          ],
          "texture": "#this"
        }
      }
    },
    {
      "from": [
        7.5,
        9,
        13.5
      ],
      "to": [
        8.5,
        9.5,
        14.5
      ],
      "faces": {
        "up": {
          "uv": [
            7.5,
            13.5,
            8.5,
            14.5
          ],
          "texture": "#this"
        },
        "north": {
          "uv": [
            7.5,
            6.5,
            8.5,
            7
          ],
          "texture": "#this"
        },
        "south": {
          "uv": [
            7.5,
            6.5,
            8.5,
            7
          ],
          "texture": "#this"
        },
        "west": {
          "uv": [
            13.5,
            6.5,
            14.5,
            7
          ],
          "texture": "#this"
        },
        "east": {
          "uv": [
            1.5,
            6.5,
            2.5,
            7
          ],
          "texture": "#this"
        }
      }
    },
    {
      "from": [
        9.5,
        9,
        1.5
      ],
      "to": [
        10.5,
        9.5,
        2.5
      ],
      "faces": {
        "up": {
          "uv": [
            9.5,
            1.5,
            10.5,
            2.5
          ],
          "texture": "#this"
        },
        "north": {
          "uv": [
            5.5,
            6.5,
            6.5,
            7
          ],
          "texture": "#this"
        },
        "south": {
          "uv": [
            9.5,
            6.5,
            10.5,
            7
          ],
          "texture": "#this"
        },
        "west": {
          "uv": [
            1.5,
            6.5,
            2.5,
            7
          ],
          "texture": "#this"
        },
        "east": {
          "uv": [
            13.5,
            6.5,
            14.5,
            7
          ],
          "texture": "#this"
        }
      }
    },
    {
      "from": [
        9.5,
        9,
        3.5
      ],
      "to": [
        10.5,
        9.5,
        4.5
      ],
      "faces": {
        "up": {
          "uv": [
            9.5,
            3.5,
            10.5,
            4.5
          ],
          "texture": "#this"
        },
        "north": {
          "uv": [
            5.5,
            6.5,
            6.5,
            7
          ],
          "texture": "#this"
        },
        "south": {
          "uv": [
            9.5,
            6.5,
            10.5,
            7
          ],
          "texture": "#this"
        },
        "west": {
          "uv": [
            3.5,
            6.5,
            4.5,
            7
          ],
          "texture": "#this"
        },
        "east": {
          "uv": [
            11.5,
            6.5,
            12.5,
            7
          ],
          "texture": "#this"
        }
      }
    },
    {
      "from": [
        9.5,
        9,
        5.5
      ],
      "to": [
        10.5,
        9.5,
        6.5
      ],
      "faces": {
        "up": {
          "uv": [
            9.5,
            5.5,
            10.5,
            6.5
          ],
          "texture": "#this"
        },
        "north": {
          "uv": [
            5.5,
            6.5,
            6.5,
            7
          ],
          "texture": "#this"
        },
        "south": {
          "uv": [
            9.5,
            6.5,
            10.5,
            7
          ],
          "texture": "#this"
        },
        "west": {
          "uv": [
            5.5,
            6.5,
            6.5,
            7
          ],
          "texture": "#this"
        },
        "east": {
          "uv": [
            9.5,
            6.5,
            10.5,
            7
          ],
          "texture": "#this"
        }
      }
    },
    {
      "from": [
        9.5,
        9,
        7.5
      ],
      "to": [
        10.5,
        9.5,
        8.5
      ],
      "faces": {
        "up": {
          "uv": [
            9.5,
            7.5,
            10.5,
            8.5
          ],
          "texture": "#this"
        },
        "north": {
          "uv": [
            5.5,
            6.5,
            6.5,
            7
          ],
          "texture": "#this"
        },
        "south": {
          "uv": [
            9.5,
            6.5,
            10.5,
            7
          ],
          "texture": "#this"
        },
        "west": {
          "uv": [
            7.5,
            6.5,
            8.5,
            7
          ],
          "texture": "#this"
        },
        "east": {
          "uv": [
            7.5,
            6.5,
            8.5,
            7
          ],
          "texture": "#this"
        }
      }
    },
    {
      "from": [
        9.5,
        9,
        9.5
      ],
      "to": [
        10.5,
        9.5,
        10.5
      ],
      "faces": {
        "up": {
          "uv": [
            9.5,
            9.5,
            10.5,
            10.5
          ],
          "texture": "#this"
        },
        "north": {
          "uv": [
            5.5,
            6.5,
            6.5,
            7
          ],
          "texture": "#this"
        },
        "south": {
          "uv": [
            9.5,
            6.5,
            10.5,
            7
          ],
          "texture": "#this"
        },
        "west": {
          "uv": [
            9.5,
            6.5,
            10.5,
            7
          ],
          "texture": "#this"
        },
        "east": {
          "uv": [
            5.5,
            6.5,
            6.5,
            7
          ],
          "texture": "#this"
        }
      }
    },
    {
      "from": [
        9.5,
        9,
        11.5
      ],
      "to": [
        10.5,
        9.5,
        12.5
      ],
      "faces": {
        "up": {
          "uv": [
            9.5,
            11.5,
            10.5,
            12.5
          ],
          "texture": "#this"
        },
        "north": {
          "uv": [
            5.5,
            6.5,
            6.5,
            7
          ],
          "texture": "#this"
        },
        "south": {
          "uv": [
            9.5,
            6.5,
            10.5,
            7
          ],
          "texture": "#this"
        },
        "west": {
          "uv": [
            11.5,
            6.5,
            12.5,
            7
          ],
          "texture": "#this"
        },
        "east": {
          "uv": [
            3.5,
            6.5,
            4.5,
            7
          ],
          "texture": "#this"
        }
      }
    },
    {
      "from": [
        9.5,
        9,
        13.5
      ],
      "to": [
        10.5,
        9.5,
        14.5
      ],
      "faces": {
        "up": {
          "uv": [
            9.5,
            13.5,
            10.5,
            14.5
          ],
          "texture": "#this"
        },
        "north": {
          "uv": [
            5.5,
            6.5,
            6.5,
            7
          ],
          "texture": "#this"
        },
        "south": {
          "uv": [
            9.5,
            6.5,
            10.5,
            7
          ],
          "texture": "#this"
        },
        "west": {
          "uv": [
            13.5,
            6.5,
            14.5,
            7
          ],
          "texture": "#this"
        },
        "east": {
          "uv": [
            1.5,
            6.5,
            2.5,
            7
          ],
          "texture": "#this"
        }
      }
    },
    {
      "from": [
        11.5,
        9,
        1.5
      ],
      "to": [
        12.5,
        9.5,
        2.5
      ],
      "faces": {
        "up": {
          "uv": [
            11.5,
            1.5,
            12.5,
            2.5
          ],
          "texture": "#this"
        },
        "north": {
          "uv": [
            3.5,
            6.5,
            4.5,
            7
          ],
          "texture": "#this"
        },
        "south": {
          "uv": [
            11.5,
            6.5,
            12.5,
            7
          ],
          "texture": "#this"
        },
        "west": {
          "uv": [
            1.5,
            6.5,
            2.5,
            7
          ],
          "texture": "#this"
        },
        "east": {
          "uv": [
            13.5,
            6.5,
            14.5,
            7
          ],
          "texture": "#this"
        }
      }
    },
    {
      "from": [
        11.5,
        9,
        3.5
      ],
      "to": [
        12.5,
        9.5,
        4.5
      ],
      "faces": {
        "up": {
          "uv": [
            11.5,
            3.5,
            12.5,
            4.5
          ],
          "texture": "#this"
        },
        "north": {
          "uv": [
            3.5,
            6.5,
            4.5,
            7
          ],
          "texture": "#this"
        },
        "south": {
          "uv": [
            11.5,
            6.5,
            12.5,
            7
          ],
          "texture": "#this"
        },
        "west": {
          "uv": [
            3.5,
            6.5,
            4.5,
            7
          ],
          "texture": "#this"
        },
        "east": {
          "uv": [
            11.5,
            6.5,
            12.5,
            7
          ],
          "texture": "#this"
        }
      }
    },
    {
      "from": [
        11.5,
        9,
        5.5
      ],
      "to": [
        12.5,
        9.5,
        6.5
      ],
      "faces": {
        "up": {
          "uv": [
            11.5,
            5.5,
            12.5,
            6.5
          ],
          "texture": "#this"
        },
        "north": {
          "uv": [
            3.5,
            6.5,
            4.5,
            7
          ],
          "texture": "#this"
        },
        "south": {
          "uv": [
            11.5,
            6.5,
            12.5,
            7
          ],
          "texture": "#this"
        },
        "west": {
          "uv": [
            5.5,
            6.5,
            6.5,
            7
          ],
          "texture": "#this"
        },
        "east": {
          "uv": [
            9.5,
            6.5,
            10.5,
            7
          ],
          "texture": "#this"
        }
      }
    },
    {
      "from": [
        11.5,
        9,
        7.5
      ],
      "to": [
        12.5,
        9.5,
        8.5
      ],
      "faces": {
        "up": {
          "uv": [
            11.5,
            7.5,
            12.5,
            8.5
          ],
          "texture": "#this"
        },
        "north": {
          "uv": [
            3.5,
            6.5,
            4.5,
            7
          ],
          "texture": "#this"
        },
        "south": {
          "uv": [
            11.5,
            6.5,
            12.5,
            7
          ],
          "texture": "#this"
        },
        "west": {
          "uv": [
            7.5,
            6.5,
            8.5,
            7
          ],
          "texture": "#this"
        },
        "east": {
          "uv": [
            7.5,
            6.5,
            8.5,
            7
          ],
          "texture": "#this"
        }
      }
    },
    {
      "from": [
        11.5,
        9,
        9.5
      ],
      "to": [
        12.5,
        9.5,
        10.5
      ],
      "faces": {
        "up": {
          "uv": [
            11.5,
            9.5,
            12.5,
            10.5
          ],
          "texture": "#this"
        },
        "north": {
          "uv": [
            3.5,
            6.5,
            4.5,
            7
          ],
          "texture": "#this"
        },
        "south": {
          "uv": [
            11.5,
            6.5,
            12.5,
            7
          ],
          "texture": "#this"
        },
        "west": {
          "uv": [
            9.5,
            6.5,
            10.5,
            7
          ],
          "texture": "#this"
        },
        "east": {
          "uv": [
            5.5,
            6.5,
            6.5,
            7
          ],
          "texture": "#this"
        }
      }
    },
    {
      "from": [
        11.5,
        9,
        11.5
      ],
      "to": [
        12.5,
        9.5,
        12.5
      ],
      "faces": {
        "up": {
          "uv": [
            11.5,
            11.5,
            12.5,
            12.5
          ],
          "texture": "#this"
        },
        "north": {
          "uv": [
            3.5,
            6.5,
            4.5,
            7
          ],
          "texture": "#this"
        },
        "south": {
          "uv": [
            11.5,
            6.5,
            12.5,
            7
          ],
          "texture": "#this"
        },
        "west": {
          "uv": [
            11.5,
            6.5,
            12.5,
            7
          ],
          "texture": "#this"
        },
        "east": {
          "uv": [
            3.5,
            6.5,
            4.5,
            7
          ],
          "texture": "#this"
        }
      }
    },
    {
      "from": [
        11.5,
        9,
        13.5
      ],
      "to": [
        12.5,
        9.5,
        14.5
      ],
      "faces": {
        "up": {
          "uv": [
            11.5,
            13.5,
            12.5,
            14.5
          ],
          "texture": "#this"
        },
        "north": {
          "uv": [
            3.5,
            6.5,
            4.5,
            7
          ],
          "texture": "#this"
        },
        "south": {
          "uv": [
            11.5,
            6.5,
            12.5,
            7
          ],
          "texture": "#this"
        },
        "west": {
          "uv": [
            13.5,
            6.5,
            14.5,
            7
          ],
          "texture": "#this"
        },
        "east": {
          "uv": [
            1.5,
            6.5,
            2.5,
            7
          ],
          "texture": "#this"
        }
      }
    },
    {
      "from": [
        13.5,
        9,
        1.5
      ],
      "to": [
        14.5,
        9.5,
        2.5
      ],
      "faces": {
        "up": {
          "uv": [
            13.5,
            1.5,
            14.5,
            2.5
          ],
          "texture": "#this"
        },
        "north": {
          "uv": [
            1.5,
            6.5,
            2.5,
            7
          ],
          "texture": "#this"
        },
        "south": {
          "uv": [
            13.5,
            6.5,
            14.5,
            7
          ],
          "texture": "#this"
        },
        "west": {
          "uv": [
            1.5,
            6.5,
            2.5,
            7
          ],
          "texture": "#this"
        },
        "east": {
          "uv": [
            13.5,
            6.5,
            14.5,
            7
          ],
          "texture": "#this"
        }
      }
    },
    {
      "from": [
        13.5,
        9,
        3.5
      ],
      "to": [
        14.5,
        9.5,
        4.5
      ],
      "faces": {
        "up": {
          "uv": [
            13.5,
            3.5,
            14.5,
            4.5
          ],
          "texture": "#this"
        },
        "north": {
          "uv": [
            1.5,
            6.5,
            2.5,
            7
          ],
          "texture": "#this"
        },
        "south": {
          "uv": [
            13.5,
            6.5,
            14.5,
            7
          ],
          "texture": "#this"
        },
        "west": {
          "uv": [
            3.5,
            6.5,
            4.5,
            7
          ],
          "texture": "#this"
        },
        "east": {
          "uv": [
            11.5,
            6.5,
            12.5,
            7
          ],
          "texture": "#this"
        }
      }
    },
    {
      "from": [
        13.5,
        9,
        5.5
      ],
      "to": [
        14.5,
        9.5,
        6.5
      ],
      "faces": {
        "up": {
          "uv": [
            13.5,
            5.5,
            14.5,
            6.5
          ],
          "texture": "#this"
        },
        "north": {
          "uv": [
            1.5,
            6.5,
            2.5,
            7
          ],
          "texture": "#this"
        },
        "south": {
          "uv": [
            13.5,
            6.5,
            14.5,
            7
          ],
          "texture": "#this"
        },
        "west": {
          "uv": [
            5.5,
            6.5,
            6.5,
            7
          ],
          "texture": "#this"
        },
        "east": {
          "uv": [
            9.5,
            6.5,
            10.5,
            7
          ],
          "texture": "#this"
        }
      }
    },
    {
      "from": [
        13.5,
        9,
        7.5
      ],
      "to": [
        14.5,
        9.5,
        8.5
      ],
      "faces": {
        "up": {
          "uv": [
            13.5,
            7.5,
            14.5,
            8.5
          ],
          "texture": "#this"
        },
        "north": {
          "uv": [
            1.5,
            6.5,
            2.5,
            7
          ],
          "texture": "#this"
        },
        "south": {
          "uv": [
            13.5,
            6.5,
            14.5,
            7
          ],
          "texture": "#this"
        },
        "west": {
          "uv": [
            7.5,
            6.5,
            8.5,
            7
          ],
          "texture": "#this"
        },
        "east": {
          "uv": [
            7.5,
            6.5,
            8.5,
            7
          ],
          "texture": "#this"
        }
      }
    },
    {
      "from": [
        13.5,
        9,
        9.5
      ],
      "to": [
        14.5,
        9.5,
        10.5
      ],
      "faces": {
        "up": {
          "uv": [
            13.5,
            9.5,
            14.5,
            10.5
          ],
          "texture": "#this"
        },
        "north": {
          "uv": [
            1.5,
            6.5,
            2.5,
            7
          ],
          "texture": "#this"
        },
        "south": {
          "uv": [
            13.5,
            6.5,
            14.5,
            7
          ],
          "texture": "#this"
        },
        "west": {
          "uv": [
            9.5,
            6.5,
            10.5,
            7
          ],
          "texture": "#this"
        },
        "east": {
          "uv": [
            5.5,
            6.5,
            6.5,
            7
          ],
          "texture": "#this"
        }
      }
    },
    {
      "from": [
        13.5,
        9,
        11.5
      ],
      "to": [
        14.5,
        9.5,
        12.5
      ],
      "faces": {
        "up": {
          "uv": [
            13.5,
            11.5,
            14.5,
            12.5
          ],
          "texture": "#this"
        },
        "north": {
          "uv": [
            1.5,
            6.5,
            2.5,
            7
          ],
          "texture": "#this"
        },
        "south": {
          "uv": [
            13.5,
            6.5,
            14.5,
            7
          ],
          "texture": "#this"
        },
        "west": {
          "uv": [
            11.5,
            6.5,
            12.5,
            7
          ],
          "texture": "#this"
        },
        "east": {
          "uv": [
            3.5,
            6.5,
            4.5,
            7
          ],
          "texture": "#this"
        }
      }
    },
    {
      "from": [
        13.5,
        9,
        13.5
      ],
      "to": [
        14.5,
        9.5,
        14.5
      ],
      "faces": {
        "up": {
          "uv": [
            13.5,
            13.5,
            14.5,
            14.5
          ],
          "texture": "#this"
        },
        "north": {
          "uv": [
            1.5,
            6.5,
            2.5,
            7
          ],
          "texture": "#this"
        },
        "south": {
          "uv": [
            13.5,
            6.5,
            14.5,
            7
          ],
          "texture": "#this"
        },
        "west": {
          "uv": [
            13.5,
            6.5,
            14.5,
            7
          ],
          "texture": "#this"
        },
        "east": {
          "uv": [
            1.5,
            6.5,
            2.5,
            7
          ],
          "texture": "#this"
        }
      }
    }
  ]
}