{
  "parent": "regedt32:block/cntrafficsymbols/circle_rotation23_down",
  "textures": {
    "front": "regedt32:block/cntrafficsymbols/speedlimit_low_140",
    "side": "regedt32:block/cntrafficsymbols/circle_backboard"
  }
}
