{
  "parent": "minecraft:recipes/root",
  "criteria": {
    "has_lime_concrete": {
      "conditions": {"items": [{"items": ["minecraft:lime_concrete"]}]},
      "trigger": "minecraft:inventory_changed"
    },
    "has_the_recipe": {
      "conditions": {"recipe": "regedt32:cntrafficsymbols/lime_lined8_tp"},
      "trigger": "minecraft:recipe_unlocked"
    }
  },
  "requirements": [
    [
      "has_the_recipe",
      "has_lime_concrete"
    ]
  ],
  "rewards": {"recipes": ["regedt32:cntrafficsymbols/lime_lined8_tp"]},
  "sends_telemetry_event": false
}
