{
  "parent": "minecraft:recipes/root",
  "criteria": {
    "has_green_concrete": {
      "conditions": {"items": [{"items": ["minecraft:green_concrete"]}]},
      "trigger": "minecraft:inventory_changed"
    },
    "has_the_recipe": {
      "conditions": {"recipe": "regedt32:cntrafficsymbols/green_lined5_tp"},
      "trigger": "minecraft:recipe_unlocked"
    }
  },
  "requirements": [
    [
      "has_the_recipe",
      "has_green_concrete"
    ]
  ],
  "rewards": {"recipes": ["regedt32:cntrafficsymbols/green_lined5_tp"]},
  "sends_telemetry_event": false
}
