{
  "parent": "regedt32:block/cntrafficsymbols/circle_rotation23_down",
  "textures": {
    "front": "regedt32:block/cntrafficsymbols/lift_speedlimit_high_90",
    "side": "regedt32:block/cntrafficsymbols/circle_backboard"
  }
}
