{
  "parent": "regedt32:block/cntrafficsymbols/circle_rotation17_down",
  "textures": {
    "front": "regedt32:block/cntrafficsymbols/heightlimit_9d7",
    "side": "regedt32:block/cntrafficsymbols/circle_backboard"
  }
}
