{
  "parent": "minecraft:recipes/root",
  "criteria": {
    "has_iron_block": {
      "conditions": {"items": [{"items": ["minecraft:iron_block"]}]},
      "trigger": "minecraft:inventory_changed"
    },
    "has_the_recipe": {
      "conditions": {"recipe": "regedt32:cntrafficsymbols/iron_plate"},
      "trigger": "minecraft:recipe_unlocked"
    }
  },
  "requirements": [
    [
      "has_the_recipe",
      "has_iron_block"
    ]
  ],
  "rewards": {"recipes": ["regedt32:cntrafficsymbols/iron_plate"]},
  "sends_telemetry_event": false
}
