{
  "parent": "regedt32:block/cntrafficsymbols/circle_rotation26_up",
  "textures": {
    "front": "regedt32:block/cntrafficsymbols/heightlimit_9",
    "back": "regedt32:block/cntrafficsymbols/circle_backboard",
    "side": "regedt32:block/cntrafficsymbols/circle_backboard"
  }
}
