{
  "parent": "regedt32:block/cntrafficsymbols/circle_rotation17_down",
  "textures": {
    "front": "regedt32:block/cntrafficsymbols/speedlimit_high_3",
    "side": "regedt32:block/cntrafficsymbols/circle_backboard"
  }
}
