{
  "parent": "regedt32:block/cntrafficsymbols/wideboard_wall",
  "textures": {
    "front": "regedt32:block/cntrafficsymbols/distance_detection_50m_left",
    "back": "regedt32:block/cntrafficsymbols/full_square_backboard",
    "side": "regedt32:block/cntrafficsymbols/full_square_backboard"
  }
}
