{
  "parent": "regedt32:block/cntrafficsymbols/circle_rotation0_down",
  "textures": {
    "front": "regedt32:block/cntrafficsymbols/heightlimit_5d4",
    "back": "regedt32:block/cntrafficsymbols/circle_backboard",
    "side": "regedt32:block/cntrafficsymbols/circle_backboard"
  }
}
