{
  "parent": "regedt32:block/cntrafficsymbols/highway_hm_rotation26_up",
  "textures": {
    "front": "regedt32:block/cntrafficsymbols/highway_2hm",
    "back": "regedt32:block/cntrafficsymbols/highway_hm_backboard",
    "side": "regedt32:block/cntrafficsymbols/highway_hm_backboard"
  }
}
