{
  "parent": "regedt32:block/cntrafficsymbols/circle_rotation26",
  "textures": {
    "front": "regedt32:block/cntrafficsymbols/speedlimit_low_30",
    "back": "regedt32:block/cntrafficsymbols/circle_backboard",
    "side": "regedt32:block/cntrafficsymbols/circle_backboard"
  }
}
