{
  "parent": "regedt32:block/cntrafficsymbols/circle_rotation23",
  "textures": {
    "front": "regedt32:block/cntrafficsymbols/heightlimit_8d6",
    "side": "regedt32:block/cntrafficsymbols/circle_backboard"
  }
}
