{
  "parent": "regedt32:block/cntrafficsymbols/circle_rotation15_up",
  "textures": {
    "front": "regedt32:block/cntrafficsymbols/speedlimit_low_10",
    "back": "regedt32:block/cntrafficsymbols/circle_backboard",
    "side": "regedt32:block/cntrafficsymbols/circle_backboard"
  }
}
