{
  "parent": "regedt32:block/cntrafficsymbols/highway_hm_rotation16_down",
  "textures": {
    "front": "regedt32:block/cntrafficsymbols/highway_7hm",
    "side": "regedt32:block/cntrafficsymbols/highway_hm_backboard"
  }
}
