{
  "parent": "regedt32:block/cntrafficsymbols/circle_rotation17_up",
  "textures": {
    "front": "regedt32:block/cntrafficsymbols/heightlimit_6d6",
    "side": "regedt32:block/cntrafficsymbols/circle_backboard"
  }
}
