{
  "variants": {
    "bottom=true": {"model": "regedt32:block/cntrafficsymbols/black_dotted8_tp_bottom"},
    "bottom=false": {"model": "regedt32:block/cntrafficsymbols/black_dotted8_tp_up"}
  }
}
