{
  "parent": "regedt32:block/cntrafficsymbols/circle_rotation23",
  "textures": {
    "front": "regedt32:block/cntrafficsymbols/speedlimit_low_150",
    "side": "regedt32:block/cntrafficsymbols/circle_backboard"
  }
}
