{
  "parent": "regedt32:block/cntrafficsymbols/circle_rotation18",
  "textures": {
    "front": "regedt32:block/cntrafficsymbols/speedlimit_high_90",
    "side": "regedt32:block/cntrafficsymbols/circle_backboard"
  }
}
