{
  "parent": "regedt32:block/cntrafficsymbols/circle_rotation16",
  "textures": {
    "front": "regedt32:block/cntrafficsymbols/lift_speedlimit_high_10",
    "side": "regedt32:block/cntrafficsymbols/circle_backboard"
  }
}
