{
  "parent": "regedt32:block/cntrafficsymbols/circle_rotation17",
  "textures": {
    "front": "regedt32:block/cntrafficsymbols/heightlimit_3d3",
    "side": "regedt32:block/cntrafficsymbols/circle_backboard"
  }
}
