{
  "parent": "regedt32:block/cntrafficsymbols/circle_rotation16_up",
  "textures": {
    "front": "regedt32:block/cntrafficsymbols/heightlimit_1d8",
    "side": "regedt32:block/cntrafficsymbols/circle_backboard"
  }
}
