{
  "parent": "minecraft:block/block",
  "textures": {"particle": "#side"},
  "elements": [
    {
      "from": [1, 0, 6],
      "to": [3, 16, 7],
      "faces": {
        "north": {"uv": [1, 0, 3, 16], "texture": "#side"},
        "west": {"uv": [0, 0, 1, 16], "texture": "#side"},
        "east": {"uv": [3, 0, 4, 16], "texture": "#side"}
      }
    },
    {
      "from": [1, 0, 9],
      "to": [3, 16, 10],
      "faces": {
        "south": {"uv": [1, 0, 3, 16], "texture": "#side"},
        "west": {"uv": [3, 0, 4, 16], "texture": "#side"},
        "east": {"uv": [0, 0, 1, 16], "texture": "#side"}
      }
    },
    {
      "from": [0, 0, 7],
      "to": [1, 16, 9],
      "faces": {
        "west": {"uv": [1, 0, 3, 16], "texture": "#side"},
        "north": {"uv": [3, 0, 4, 16], "texture": "#side"},
        "south": {"uv": [0, 0, 1, 16], "texture": "#side"}
      }
    },
    {
      "from": [3, 0, 7],
      "to": [4, 16, 9],
      "faces": {
        "east": {"uv": [1, 0, 3, 16], "texture": "#side"},
        "north": {"uv": [0, 0, 1, 16], "texture": "#side"},
        "south": {"uv": [3, 0, 4, 16], "texture": "#side"}
      }
    },
    {
      "from": [0, 0, 6],
      "to": [4, 16, 10],
      "faces": {
        "down": {"uv": [4, 0, 8, 4], "texture": "#side", "cullface": "down"},
        "up": {"uv": [4, 0, 8, 4], "texture": "#side", "cullface": "up"}
      }
    }
  ]
}
