{
  "parent": "regedt32:block/cntrafficsymbols/circle_rotation2",
  "textures": {
    "front": "regedt32:block/cntrafficsymbols/heightlimit_6d6",
    "back": "regedt32:block/cntrafficsymbols/circle_backboard",
    "side": "regedt32:block/cntrafficsymbols/circle_backboard"
  }
}
