{
  "variants": {
    "bottom=true": {"model": "regedt32:block/cntrafficsymbols/light_gray_dotted10_tp_bottom"},
    "bottom=false": {"model": "regedt32:block/cntrafficsymbols/light_gray_dotted10_tp_up"}
  }
}
