{
  "parent": "regedt32:block/cntrafficsymbols/circle_rotation17",
  "textures": {
    "front": "regedt32:block/cntrafficsymbols/lift_speedlimit_high_125",
    "side": "regedt32:block/cntrafficsymbols/circle_backboard"
  }
}
