{
  "parent": "regedt32:block/cntrafficsymbols/wideboard_standing",
  "textures": {
    "front": "regedt32:block/cntrafficsymbols/highway_exit_distance_info_middle_bottom",
    "back": "regedt32:block/cntrafficsymbols/full_square_backboard",
    "side": "regedt32:block/cntrafficsymbols/full_square_backboard"
  }
}
