{
  "parent": "regedt32:block/cntrafficsymbols/highway_hm_rotation1",
  "textures": {
    "front": "regedt32:block/cntrafficsymbols/highway_1hm",
    "back": "regedt32:block/cntrafficsymbols/highway_hm_backboard",
    "side": "regedt32:block/cntrafficsymbols/highway_hm_backboard"
  }
}
