{
  "parent": "regedt32:block/cntrafficsymbols/circle_rotation2_down",
  "textures": {
    "front": "regedt32:block/cntrafficsymbols/speedlimit_high_35",
    "back": "regedt32:block/cntrafficsymbols/circle_backboard",
    "side": "regedt32:block/cntrafficsymbols/circle_backboard"
  }
}
