{
  "elements": [
    {
      "from": [
        0,
        0,
        2
      ],
      "to": [
        16,
        0.5,
        4
      ],
      "faces": {
        "down": {
          "uv": [
            0,
            2,
            16,
            4
          ],
          "texture": "#a2",
          "cullface": "down"
        },
        "up": {
          "uv": [
            0,
            2,
            16,
            4
          ],
          "texture": "#a2"
        },
        "north": {
          "uv": [
            0,
            15.5,
            16,
            16
          ],
          "texture": "#a2"
        },
        "south": {
          "uv": [
            0,
            15.5,
            16,
            16
          ],
          "texture": "#a2"
        },
        "west": {
          "uv": [
            2,
            15.5,
            4,
            6
          ],
          "texture": "#a2",
          "cullface": "west"
        },
        "east": {
          "uv": [
            12,
            15.5,
            14,
            6
          ],
          "texture": "#a2",
          "cullface": "east"
        }
      }
    },
    {
      "from": [
        0,
        0,
        6
      ],
      "to": [
        16,
        0.5,
        10
      ],
      "faces": {
        "down": {
          "uv": [
            0,
            6,
            16,
            10
          ],
          "texture": "#a1",
          "cullface": "down"
        },
        "up": {
          "uv": [
            0,
            6,
            16,
            10
          ],
          "texture": "#a1"
        },
        "north": {
          "uv": [
            0,
            15.5,
            16,
            16
          ],
          "texture": "#a1"
        },
        "south": {
          "uv": [
            0,
            15.5,
            16,
            16
          ],
          "texture": "#a1"
        },
        "west": {
          "uv": [
            6,
            15.5,
            10,
            6
          ],
          "texture": "#a1",
          "cullface": "west"
        },
        "east": {
          "uv": [
            6,
            15.5,
            10,
            6
          ],
          "texture": "#a1",
          "cullface": "east"
        }
      }
    },
    {
      "from": [
        0,
        0,
        14
      ],
      "to": [
        16,
        0.5,
        16
      ],
      "faces": {
        "down": {
          "uv": [
            0,
            14,
            16,
            16
          ],
          "texture": "#a1",
          "cullface": "down"
        },
        "up": {
          "uv": [
            0,
            14,
            16,
            16
          ],
          "texture": "#a1"
        },
        "north": {
          "uv": [
            0,
            15.5,
            16,
            16
          ],
          "texture": "#a1"
        },
        "south": {
          "uv": [
            0,
            15.5,
            16,
            16
          ],
          "texture": "#a1",
          "cullface": "south"
        },
        "west": {
          "uv": [
            14,
            15.5,
            16,
            6
          ],
          "texture": "#a1",
          "cullface": "west"
        },
        "east": {
          "uv": [
            0,
            15.5,
            2,
            6
          ],
          "texture": "#a1",
          "cullface": "east"
        }
      }
    }
  ],
  "textures": {
    "a2": "regedt32:block/cntrafficsymbols/yellow_floor_line_eighths",
    "a1": "regedt32:block/cntrafficsymbols/white_floor_line_eighths"
  }
}