{
  "parent": "regedt32:block/cntrafficsymbols/wideboard_wall",
  "textures": {
    "front": "regedt32:block/cntrafficsymbols/keep_space_variant2_upperleft",
    "back": "regedt32:block/cntrafficsymbols/full_square_backboard",
    "side": "regedt32:block/cntrafficsymbols/full_square_backboard"
  }
}
