{
  "parent": "regedt32:block/cntrafficsymbols/circle_rotation16",
  "textures": {
    "front": "regedt32:block/cntrafficsymbols/speedlimit_high_125",
    "side": "regedt32:block/cntrafficsymbols/circle_backboard"
  }
}
