{
  "parent": "regedt32:block/cntrafficsymbols/circle_rotation23",
  "textures": {
    "front": "regedt32:block/cntrafficsymbols/lift_speedlimit_high_80",
    "side": "regedt32:block/cntrafficsymbols/circle_backboard"
  }
}
