{
  "parent": "regedt32:block/cntrafficsymbols/wideboard_double",
  "textures": {
    "front": "regedt32:block/cntrafficsymbols/keep_space_variant2_lowerleft",
    "side": "regedt32:block/cntrafficsymbols/full_square_backboard"
  }
}
