{
  "variants": {
    "bottom=true": {"model": "regedt32:block/cntrafficsymbols/brown_dotted6_tp_bottom"},
    "bottom=false": {"model": "regedt32:block/cntrafficsymbols/brown_dotted6_tp_up"}
  }
}
