{
  "parent": "regedt32:block/cntrafficsymbols/circle_rotation17",
  "textures": {
    "front": "regedt32:block/cntrafficsymbols/speedlimit_low_100",
    "side": "regedt32:block/cntrafficsymbols/circle_backboard"
  }
}
