{
  "parent": "minecraft:recipes/root",
  "criteria": {
    "has_blue_concrete": {
      "conditions": {"items": [{"items": ["minecraft:blue_concrete"]}]},
      "trigger": "minecraft:inventory_changed"
    },
    "has_the_recipe": {
      "conditions": {"recipe": "regedt32:cntrafficsymbols/blue_dotted5_tp"},
      "trigger": "minecraft:recipe_unlocked"
    }
  },
  "requirements": [
    [
      "has_the_recipe",
      "has_blue_concrete"
    ]
  ],
  "rewards": {"recipes": ["regedt32:cntrafficsymbols/blue_dotted5_tp"]},
  "sends_telemetry_event": false
}
