{
  "parent": "regedt32:block/cntrafficsymbols/circle_rotation18",
  "textures": {
    "front": "regedt32:block/cntrafficsymbols/speedlimit_low_130",
    "side": "regedt32:block/cntrafficsymbols/circle_backboard"
  }
}
