{
  "parent": "regedt32:block/cntrafficsymbols/circle_rotation18_down",
  "textures": {
    "front": "regedt32:block/cntrafficsymbols/no_u_turn",
    "side": "regedt32:block/cntrafficsymbols/circle_backboard"
  }
}
