{
  "parent": "regedt32:block/cntrafficsymbols/circle_rotation2_up",
  "textures": {
    "front": "regedt32:block/cntrafficsymbols/speedlimit_high_65",
    "back": "regedt32:block/cntrafficsymbols/circle_backboard",
    "side": "regedt32:block/cntrafficsymbols/circle_backboard"
  }
}
