{
  "parent": "minecraft:block/block",
  "textures": {
    "particle": "#this"
  },
  "elements": [
    {
      "from": [
        0,
        0,
        0
      ],
      "to": [
        16,
        1,
        16
      ],
      "faces": {
        "down": {
          "uv": [
            0,
            0,
            16,
            16
          ],
          "texture": "#this",
          "cullface": "down"
        },
        "up": {
          "uv": [
            0,
            0,
            16,
            16
          ],
          "texture": "#this"
        },
        "north": {
          "uv": [
            0,
            15,
            16,
            16
          ],
          "texture": "#this",
          "cullface": "north"
        },
        "south": {
          "uv": [
            0,
            15,
            16,
            16
          ],
          "texture": "#this",
          "cullface": "south"
        },
        "west": {
          "uv": [
            0,
            15,
            16,
            16
          ],
          "texture": "#this",
          "cullface": "west"
        },
        "east": {
          "uv": [
            0,
            15,
            16,
            16
          ],
          "texture": "#this",
          "cullface": "east"
        }
      }
    },
    {
      "from": [
        0.75,
        1,
        0.75
      ],
      "to": [
        1.75,
        1.5,
        1.75
      ],
      "faces": {
        "up": {
          "uv": [
            0.75,
            0.75,
            1.75,
            1.75
          ],
          "texture": "#this"
        },
        "north": {
          "uv": [
            14.25,
            14.5,
            15.25,
            15
          ],
          "texture": "#this"
        },
        "south": {
          "uv": [
            0.75,
            14.5,
            1.75,
            15
          ],
          "texture": "#this"
        },
        "west": {
          "uv": [
            0.75,
            14.5,
            1.75,
            15
          ],
          "texture": "#this"
        },
        "east": {
          "uv": [
            14.25,
            14.5,
            15.25,
            15
          ],
          "texture": "#this"
        }
      }
    },
    {
      "from": [
        0.75,
        1,
        2.25
      ],
      "to": [
        1.75,
        1.5,
        3.25
      ],
      "faces": {
        "up": {
          "uv": [
            0.75,
            2.25,
            1.75,
            3.25
          ],
          "texture": "#this"
        },
        "north": {
          "uv": [
            14.25,
            14.5,
            15.25,
            15
          ],
          "texture": "#this"
        },
        "south": {
          "uv": [
            0.75,
            14.5,
            1.75,
            15
          ],
          "texture": "#this"
        },
        "west": {
          "uv": [
            2.25,
            14.5,
            3.25,
            15
          ],
          "texture": "#this"
        },
        "east": {
          "uv": [
            12.75,
            14.5,
            13.75,
            15
          ],
          "texture": "#this"
        }
      }
    },
    {
      "from": [
        0.75,
        1,
        3.75
      ],
      "to": [
        1.75,
        1.5,
        4.75
      ],
      "faces": {
        "up": {
          "uv": [
            0.75,
            3.75,
            1.75,
            4.75
          ],
          "texture": "#this"
        },
        "north": {
          "uv": [
            14.25,
            14.5,
            15.25,
            15
          ],
          "texture": "#this"
        },
        "south": {
          "uv": [
            0.75,
            14.5,
            1.75,
            15
          ],
          "texture": "#this"
        },
        "west": {
          "uv": [
            3.75,
            14.5,
            4.75,
            15
          ],
          "texture": "#this"
        },
        "east": {
          "uv": [
            11.25,
            14.5,
            12.25,
            15
          ],
          "texture": "#this"
        }
      }
    },
    {
      "from": [
        0.75,
        1,
        5.25
      ],
      "to": [
        1.75,
        1.5,
        6.25
      ],
      "faces": {
        "up": {
          "uv": [
            0.75,
            5.25,
            1.75,
            6.25
          ],
          "texture": "#this"
        },
        "north": {
          "uv": [
            14.25,
            14.5,
            15.25,
            15
          ],
          "texture": "#this"
        },
        "south": {
          "uv": [
            0.75,
            14.5,
            1.75,
            15
          ],
          "texture": "#this"
        },
        "west": {
          "uv": [
            5.25,
            14.5,
            6.25,
            15
          ],
          "texture": "#this"
        },
        "east": {
          "uv": [
            9.75,
            14.5,
            10.75,
            15
          ],
          "texture": "#this"
        }
      }
    },
    {
      "from": [
        0.75,
        1,
        6.75
      ],
      "to": [
        1.75,
        1.5,
        7.75
      ],
      "faces": {
        "up": {
          "uv": [
            0.75,
            6.75,
            1.75,
            7.75
          ],
          "texture": "#this"
        },
        "north": {
          "uv": [
            14.25,
            14.5,
            15.25,
            15
          ],
          "texture": "#this"
        },
        "south": {
          "uv": [
            0.75,
            14.5,
            1.75,
            15
          ],
          "texture": "#this"
        },
        "west": {
          "uv": [
            6.75,
            14.5,
            7.75,
            15
          ],
          "texture": "#this"
        },
        "east": {
          "uv": [
            8.25,
            14.5,
            9.25,
            15
          ],
          "texture": "#this"
        }
      }
    },
    {
      "from": [
        0.75,
        1,
        8.25
      ],
      "to": [
        1.75,
        1.5,
        9.25
      ],
      "faces": {
        "up": {
          "uv": [
            0.75,
            8.25,
            1.75,
            9.25
          ],
          "texture": "#this"
        },
        "north": {
          "uv": [
            14.25,
            14.5,
            15.25,
            15
          ],
          "texture": "#this"
        },
        "south": {
          "uv": [
            0.75,
            14.5,
            1.75,
            15
          ],
          "texture": "#this"
        },
        "west": {
          "uv": [
            8.25,
            14.5,
            9.25,
            15
          ],
          "texture": "#this"
        },
        "east": {
          "uv": [
            6.75,
            14.5,
            7.75,
            15
          ],
          "texture": "#this"
        }
      }
    },
    {
      "from": [
        0.75,
        1,
        9.75
      ],
      "to": [
        1.75,
        1.5,
        10.75
      ],
      "faces": {
        "up": {
          "uv": [
            0.75,
            9.75,
            1.75,
            10.75
          ],
          "texture": "#this"
        },
        "north": {
          "uv": [
            14.25,
            14.5,
            15.25,
            15
          ],
          "texture": "#this"
        },
        "south": {
          "uv": [
            0.75,
            14.5,
            1.75,
            15
          ],
          "texture": "#this"
        },
        "west": {
          "uv": [
            9.75,
            14.5,
            10.75,
            15
          ],
          "texture": "#this"
        },
        "east": {
          "uv": [
            5.25,
            14.5,
            6.25,
            15
          ],
          "texture": "#this"
        }
      }
    },
    {
      "from": [
        0.75,
        1,
        11.25
      ],
      "to": [
        1.75,
        1.5,
        12.25
      ],
      "faces": {
        "up": {
          "uv": [
            0.75,
            11.25,
            1.75,
            12.25
          ],
          "texture": "#this"
        },
        "north": {
          "uv": [
            14.25,
            14.5,
            15.25,
            15
          ],
          "texture": "#this"
        },
        "south": {
          "uv": [
            0.75,
            14.5,
            1.75,
            15
          ],
          "texture": "#this"
        },
        "west": {
          "uv": [
            11.25,
            14.5,
            12.25,
            15
          ],
          "texture": "#this"
        },
        "east": {
          "uv": [
            3.75,
            14.5,
            4.75,
            15
          ],
          "texture": "#this"
        }
      }
    },
    {
      "from": [
        0.75,
        1,
        12.75
      ],
      "to": [
        1.75,
        1.5,
        13.75
      ],
      "faces": {
        "up": {
          "uv": [
            0.75,
            12.75,
            1.75,
            13.75
          ],
          "texture": "#this"
        },
        "north": {
          "uv": [
            14.25,
            14.5,
            15.25,
            15
          ],
          "texture": "#this"
        },
        "south": {
          "uv": [
            0.75,
            14.5,
            1.75,
            15
          ],
          "texture": "#this"
        },
        "west": {
          "uv": [
            12.75,
            14.5,
            13.75,
            15
          ],
          "texture": "#this"
        },
        "east": {
          "uv": [
            2.25,
            14.5,
            3.25,
            15
          ],
          "texture": "#this"
        }
      }
    },
    {
      "from": [
        0.75,
        1,
        14.25
      ],
      "to": [
        1.75,
        1.5,
        15.25
      ],
      "faces": {
        "up": {
          "uv": [
            0.75,
            14.25,
            1.75,
            15.25
          ],
          "texture": "#this"
        },
        "north": {
          "uv": [
            14.25,
            14.5,
            15.25,
            15
          ],
          "texture": "#this"
        },
        "south": {
          "uv": [
            0.75,
            14.5,
            1.75,
            15
          ],
          "texture": "#this"
        },
        "west": {
          "uv": [
            14.25,
            14.5,
            15.25,
            15
          ],
          "texture": "#this"
        },
        "east": {
          "uv": [
            0.75,
            14.5,
            1.75,
            15
          ],
          "texture": "#this"
        }
      }
    },
    {
      "from": [
        2.25,
        1,
        0.75
      ],
      "to": [
        3.25,
        1.5,
        1.75
      ],
      "faces": {
        "up": {
          "uv": [
            2.25,
            0.75,
            3.25,
            1.75
          ],
          "texture": "#this"
        },
        "north": {
          "uv": [
            12.75,
            14.5,
            13.75,
            15
          ],
          "texture": "#this"
        },
        "south": {
          "uv": [
            2.25,
            14.5,
            3.25,
            15
          ],
          "texture": "#this"
        },
        "west": {
          "uv": [
            0.75,
            14.5,
            1.75,
            15
          ],
          "texture": "#this"
        },
        "east": {
          "uv": [
            14.25,
            14.5,
            15.25,
            15
          ],
          "texture": "#this"
        }
      }
    },
    {
      "from": [
        2.25,
        1,
        2.25
      ],
      "to": [
        3.25,
        1.5,
        3.25
      ],
      "faces": {
        "up": {
          "uv": [
            2.25,
            2.25,
            3.25,
            3.25
          ],
          "texture": "#this"
        },
        "north": {
          "uv": [
            12.75,
            14.5,
            13.75,
            15
          ],
          "texture": "#this"
        },
        "south": {
          "uv": [
            2.25,
            14.5,
            3.25,
            15
          ],
          "texture": "#this"
        },
        "west": {
          "uv": [
            2.25,
            14.5,
            3.25,
            15
          ],
          "texture": "#this"
        },
        "east": {
          "uv": [
            12.75,
            14.5,
            13.75,
            15
          ],
          "texture": "#this"
        }
      }
    },
    {
      "from": [
        2.25,
        1,
        3.75
      ],
      "to": [
        3.25,
        1.5,
        4.75
      ],
      "faces": {
        "up": {
          "uv": [
            2.25,
            3.75,
            3.25,
            4.75
          ],
          "texture": "#this"
        },
        "north": {
          "uv": [
            12.75,
            14.5,
            13.75,
            15
          ],
          "texture": "#this"
        },
        "south": {
          "uv": [
            2.25,
            14.5,
            3.25,
            15
          ],
          "texture": "#this"
        },
        "west": {
          "uv": [
            3.75,
            14.5,
            4.75,
            15
          ],
          "texture": "#this"
        },
        "east": {
          "uv": [
            11.25,
            14.5,
            12.25,
            15
          ],
          "texture": "#this"
        }
      }
    },
    {
      "from": [
        2.25,
        1,
        5.25
      ],
      "to": [
        3.25,
        1.5,
        6.25
      ],
      "faces": {
        "up": {
          "uv": [
            2.25,
            5.25,
            3.25,
            6.25
          ],
          "texture": "#this"
        },
        "north": {
          "uv": [
            12.75,
            14.5,
            13.75,
            15
          ],
          "texture": "#this"
        },
        "south": {
          "uv": [
            2.25,
            14.5,
            3.25,
            15
          ],
          "texture": "#this"
        },
        "west": {
          "uv": [
            5.25,
            14.5,
            6.25,
            15
          ],
          "texture": "#this"
        },
        "east": {
          "uv": [
            9.75,
            14.5,
            10.75,
            15
          ],
          "texture": "#this"
        }
      }
    },
    {
      "from": [
        2.25,
        1,
        6.75
      ],
      "to": [
        3.25,
        1.5,
        7.75
      ],
      "faces": {
        "up": {
          "uv": [
            2.25,
            6.75,
            3.25,
            7.75
          ],
          "texture": "#this"
        },
        "north": {
          "uv": [
            12.75,
            14.5,
            13.75,
            15
          ],
          "texture": "#this"
        },
        "south": {
          "uv": [
            2.25,
            14.5,
            3.25,
            15
          ],
          "texture": "#this"
        },
        "west": {
          "uv": [
            6.75,
            14.5,
            7.75,
            15
          ],
          "texture": "#this"
        },
        "east": {
          "uv": [
            8.25,
            14.5,
            9.25,
            15
          ],
          "texture": "#this"
        }
      }
    },
    {
      "from": [
        2.25,
        1,
        8.25
      ],
      "to": [
        3.25,
        1.5,
        9.25
      ],
      "faces": {
        "up": {
          "uv": [
            2.25,
            8.25,
            3.25,
            9.25
          ],
          "texture": "#this"
        },
        "north": {
          "uv": [
            12.75,
            14.5,
            13.75,
            15
          ],
          "texture": "#this"
        },
        "south": {
          "uv": [
            2.25,
            14.5,
            3.25,
            15
          ],
          "texture": "#this"
        },
        "west": {
          "uv": [
            8.25,
            14.5,
            9.25,
            15
          ],
          "texture": "#this"
        },
        "east": {
          "uv": [
            6.75,
            14.5,
            7.75,
            15
          ],
          "texture": "#this"
        }
      }
    },
    {
      "from": [
        2.25,
        1,
        9.75
      ],
      "to": [
        3.25,
        1.5,
        10.75
      ],
      "faces": {
        "up": {
          "uv": [
            2.25,
            9.75,
            3.25,
            10.75
          ],
          "texture": "#this"
        },
        "north": {
          "uv": [
            12.75,
            14.5,
            13.75,
            15
          ],
          "texture": "#this"
        },
        "south": {
          "uv": [
            2.25,
            14.5,
            3.25,
            15
          ],
          "texture": "#this"
        },
        "west": {
          "uv": [
            9.75,
            14.5,
            10.75,
            15
          ],
          "texture": "#this"
        },
        "east": {
          "uv": [
            5.25,
            14.5,
            6.25,
            15
          ],
          "texture": "#this"
        }
      }
    },
    {
      "from": [
        2.25,
        1,
        11.25
      ],
      "to": [
        3.25,
        1.5,
        12.25
      ],
      "faces": {
        "up": {
          "uv": [
            2.25,
            11.25,
            3.25,
            12.25
          ],
          "texture": "#this"
        },
        "north": {
          "uv": [
            12.75,
            14.5,
            13.75,
            15
          ],
          "texture": "#this"
        },
        "south": {
          "uv": [
            2.25,
            14.5,
            3.25,
            15
          ],
          "texture": "#this"
        },
        "west": {
          "uv": [
            11.25,
            14.5,
            12.25,
            15
          ],
          "texture": "#this"
        },
        "east": {
          "uv": [
            3.75,
            14.5,
            4.75,
            15
          ],
          "texture": "#this"
        }
      }
    },
    {
      "from": [
        2.25,
        1,
        12.75
      ],
      "to": [
        3.25,
        1.5,
        13.75
      ],
      "faces": {
        "up": {
          "uv": [
            2.25,
            12.75,
            3.25,
            13.75
          ],
          "texture": "#this"
        },
        "north": {
          "uv": [
            12.75,
            14.5,
            13.75,
            15
          ],
          "texture": "#this"
        },
        "south": {
          "uv": [
            2.25,
            14.5,
            3.25,
            15
          ],
          "texture": "#this"
        },
        "west": {
          "uv": [
            12.75,
            14.5,
            13.75,
            15
          ],
          "texture": "#this"
        },
        "east": {
          "uv": [
            2.25,
            14.5,
            3.25,
            15
          ],
          "texture": "#this"
        }
      }
    },
    {
      "from": [
        2.25,
        1,
        14.25
      ],
      "to": [
        3.25,
        1.5,
        15.25
      ],
      "faces": {
        "up": {
          "uv": [
            2.25,
            14.25,
            3.25,
            15.25
          ],
          "texture": "#this"
        },
        "north": {
          "uv": [
            12.75,
            14.5,
            13.75,
            15
          ],
          "texture": "#this"
        },
        "south": {
          "uv": [
            2.25,
            14.5,
            3.25,
            15
          ],
          "texture": "#this"
        },
        "west": {
          "uv": [
            14.25,
            14.5,
            15.25,
            15
          ],
          "texture": "#this"
        },
        "east": {
          "uv": [
            0.75,
            14.5,
            1.75,
            15
          ],
          "texture": "#this"
        }
      }
    },
    {
      "from": [
        3.75,
        1,
        0.75
      ],
      "to": [
        4.75,
        1.5,
        1.75
      ],
      "faces": {
        "up": {
          "uv": [
            3.75,
            0.75,
            4.75,
            1.75
          ],
          "texture": "#this"
        },
        "north": {
          "uv": [
            11.25,
            14.5,
            12.25,
            15
          ],
          "texture": "#this"
        },
        "south": {
          "uv": [
            3.75,
            14.5,
            4.75,
            15
          ],
          "texture": "#this"
        },
        "west": {
          "uv": [
            0.75,
            14.5,
            1.75,
            15
          ],
          "texture": "#this"
        },
        "east": {
          "uv": [
            14.25,
            14.5,
            15.25,
            15
          ],
          "texture": "#this"
        }
      }
    },
    {
      "from": [
        3.75,
        1,
        2.25
      ],
      "to": [
        4.75,
        1.5,
        3.25
      ],
      "faces": {
        "up": {
          "uv": [
            3.75,
            2.25,
            4.75,
            3.25
          ],
          "texture": "#this"
        },
        "north": {
          "uv": [
            11.25,
            14.5,
            12.25,
            15
          ],
          "texture": "#this"
        },
        "south": {
          "uv": [
            3.75,
            14.5,
            4.75,
            15
          ],
          "texture": "#this"
        },
        "west": {
          "uv": [
            2.25,
            14.5,
            3.25,
            15
          ],
          "texture": "#this"
        },
        "east": {
          "uv": [
            12.75,
            14.5,
            13.75,
            15
          ],
          "texture": "#this"
        }
      }
    },
    {
      "from": [
        3.75,
        1,
        3.75
      ],
      "to": [
        4.75,
        1.5,
        4.75
      ],
      "faces": {
        "up": {
          "uv": [
            3.75,
            3.75,
            4.75,
            4.75
          ],
          "texture": "#this"
        },
        "north": {
          "uv": [
            11.25,
            14.5,
            12.25,
            15
          ],
          "texture": "#this"
        },
        "south": {
          "uv": [
            3.75,
            14.5,
            4.75,
            15
          ],
          "texture": "#this"
        },
        "west": {
          "uv": [
            3.75,
            14.5,
            4.75,
            15
          ],
          "texture": "#this"
        },
        "east": {
          "uv": [
            11.25,
            14.5,
            12.25,
            15
          ],
          "texture": "#this"
        }
      }
    },
    {
      "from": [
        3.75,
        1,
        5.25
      ],
      "to": [
        4.75,
        1.5,
        6.25
      ],
      "faces": {
        "up": {
          "uv": [
            3.75,
            5.25,
            4.75,
            6.25
          ],
          "texture": "#this"
        },
        "north": {
          "uv": [
            11.25,
            14.5,
            12.25,
            15
          ],
          "texture": "#this"
        },
        "south": {
          "uv": [
            3.75,
            14.5,
            4.75,
            15
          ],
          "texture": "#this"
        },
        "west": {
          "uv": [
            5.25,
            14.5,
            6.25,
            15
          ],
          "texture": "#this"
        },
        "east": {
          "uv": [
            9.75,
            14.5,
            10.75,
            15
          ],
          "texture": "#this"
        }
      }
    },
    {
      "from": [
        3.75,
        1,
        6.75
      ],
      "to": [
        4.75,
        1.5,
        7.75
      ],
      "faces": {
        "up": {
          "uv": [
            3.75,
            6.75,
            4.75,
            7.75
          ],
          "texture": "#this"
        },
        "north": {
          "uv": [
            11.25,
            14.5,
            12.25,
            15
          ],
          "texture": "#this"
        },
        "south": {
          "uv": [
            3.75,
            14.5,
            4.75,
            15
          ],
          "texture": "#this"
        },
        "west": {
          "uv": [
            6.75,
            14.5,
            7.75,
            15
          ],
          "texture": "#this"
        },
        "east": {
          "uv": [
            8.25,
            14.5,
            9.25,
            15
          ],
          "texture": "#this"
        }
      }
    },
    {
      "from": [
        3.75,
        1,
        8.25
      ],
      "to": [
        4.75,
        1.5,
        9.25
      ],
      "faces": {
        "up": {
          "uv": [
            3.75,
            8.25,
            4.75,
            9.25
          ],
          "texture": "#this"
        },
        "north": {
          "uv": [
            11.25,
            14.5,
            12.25,
            15
          ],
          "texture": "#this"
        },
        "south": {
          "uv": [
            3.75,
            14.5,
            4.75,
            15
          ],
          "texture": "#this"
        },
        "west": {
          "uv": [
            8.25,
            14.5,
            9.25,
            15
          ],
          "texture": "#this"
        },
        "east": {
          "uv": [
            6.75,
            14.5,
            7.75,
            15
          ],
          "texture": "#this"
        }
      }
    },
    {
      "from": [
        3.75,
        1,
        9.75
      ],
      "to": [
        4.75,
        1.5,
        10.75
      ],
      "faces": {
        "up": {
          "uv": [
            3.75,
            9.75,
            4.75,
            10.75
          ],
          "texture": "#this"
        },
        "north": {
          "uv": [
            11.25,
            14.5,
            12.25,
            15
          ],
          "texture": "#this"
        },
        "south": {
          "uv": [
            3.75,
            14.5,
            4.75,
            15
          ],
          "texture": "#this"
        },
        "west": {
          "uv": [
            9.75,
            14.5,
            10.75,
            15
          ],
          "texture": "#this"
        },
        "east": {
          "uv": [
            5.25,
            14.5,
            6.25,
            15
          ],
          "texture": "#this"
        }
      }
    },
    {
      "from": [
        3.75,
        1,
        11.25
      ],
      "to": [
        4.75,
        1.5,
        12.25
      ],
      "faces": {
        "up": {
          "uv": [
            3.75,
            11.25,
            4.75,
            12.25
          ],
          "texture": "#this"
        },
        "north": {
          "uv": [
            11.25,
            14.5,
            12.25,
            15
          ],
          "texture": "#this"
        },
        "south": {
          "uv": [
            3.75,
            14.5,
            4.75,
            15
          ],
          "texture": "#this"
        },
        "west": {
          "uv": [
            11.25,
            14.5,
            12.25,
            15
          ],
          "texture": "#this"
        },
        "east": {
          "uv": [
            3.75,
            14.5,
            4.75,
            15
          ],
          "texture": "#this"
        }
      }
    },
    {
      "from": [
        3.75,
        1,
        12.75
      ],
      "to": [
        4.75,
        1.5,
        13.75
      ],
      "faces": {
        "up": {
          "uv": [
            3.75,
            12.75,
            4.75,
            13.75
          ],
          "texture": "#this"
        },
        "north": {
          "uv": [
            11.25,
            14.5,
            12.25,
            15
          ],
          "texture": "#this"
        },
        "south": {
          "uv": [
            3.75,
            14.5,
            4.75,
            15
          ],
          "texture": "#this"
        },
        "west": {
          "uv": [
            12.75,
            14.5,
            13.75,
            15
          ],
          "texture": "#this"
        },
        "east": {
          "uv": [
            2.25,
            14.5,
            3.25,
            15
          ],
          "texture": "#this"
        }
      }
    },
    {
      "from": [
        3.75,
        1,
        14.25
      ],
      "to": [
        4.75,
        1.5,
        15.25
      ],
      "faces": {
        "up": {
          "uv": [
            3.75,
            14.25,
            4.75,
            15.25
          ],
          "texture": "#this"
        },
        "north": {
          "uv": [
            11.25,
            14.5,
            12.25,
            15
          ],
          "texture": "#this"
        },
        "south": {
          "uv": [
            3.75,
            14.5,
            4.75,
            15
          ],
          "texture": "#this"
        },
        "west": {
          "uv": [
            14.25,
            14.5,
            15.25,
            15
          ],
          "texture": "#this"
        },
        "east": {
          "uv": [
            0.75,
            14.5,
            1.75,
            15
          ],
          "texture": "#this"
        }
      }
    },
    {
      "from": [
        5.25,
        1,
        0.75
      ],
      "to": [
        6.25,
        1.5,
        1.75
      ],
      "faces": {
        "up": {
          "uv": [
            5.25,
            0.75,
            6.25,
            1.75
          ],
          "texture": "#this"
        },
        "north": {
          "uv": [
            9.75,
            14.5,
            10.75,
            15
          ],
          "texture": "#this"
        },
        "south": {
          "uv": [
            5.25,
            14.5,
            6.25,
            15
          ],
          "texture": "#this"
        },
        "west": {
          "uv": [
            0.75,
            14.5,
            1.75,
            15
          ],
          "texture": "#this"
        },
        "east": {
          "uv": [
            14.25,
            14.5,
            15.25,
            15
          ],
          "texture": "#this"
        }
      }
    },
    {
      "from": [
        5.25,
        1,
        2.25
      ],
      "to": [
        6.25,
        1.5,
        3.25
      ],
      "faces": {
        "up": {
          "uv": [
            5.25,
            2.25,
            6.25,
            3.25
          ],
          "texture": "#this"
        },
        "north": {
          "uv": [
            9.75,
            14.5,
            10.75,
            15
          ],
          "texture": "#this"
        },
        "south": {
          "uv": [
            5.25,
            14.5,
            6.25,
            15
          ],
          "texture": "#this"
        },
        "west": {
          "uv": [
            2.25,
            14.5,
            3.25,
            15
          ],
          "texture": "#this"
        },
        "east": {
          "uv": [
            12.75,
            14.5,
            13.75,
            15
          ],
          "texture": "#this"
        }
      }
    },
    {
      "from": [
        5.25,
        1,
        3.75
      ],
      "to": [
        6.25,
        1.5,
        4.75
      ],
      "faces": {
        "up": {
          "uv": [
            5.25,
            3.75,
            6.25,
            4.75
          ],
          "texture": "#this"
        },
        "north": {
          "uv": [
            9.75,
            14.5,
            10.75,
            15
          ],
          "texture": "#this"
        },
        "south": {
          "uv": [
            5.25,
            14.5,
            6.25,
            15
          ],
          "texture": "#this"
        },
        "west": {
          "uv": [
            3.75,
            14.5,
            4.75,
            15
          ],
          "texture": "#this"
        },
        "east": {
          "uv": [
            11.25,
            14.5,
            12.25,
            15
          ],
          "texture": "#this"
        }
      }
    },
    {
      "from": [
        5.25,
        1,
        5.25
      ],
      "to": [
        6.25,
        1.5,
        6.25
      ],
      "faces": {
        "up": {
          "uv": [
            5.25,
            5.25,
            6.25,
            6.25
          ],
          "texture": "#this"
        },
        "north": {
          "uv": [
            9.75,
            14.5,
            10.75,
            15
          ],
          "texture": "#this"
        },
        "south": {
          "uv": [
            5.25,
            14.5,
            6.25,
            15
          ],
          "texture": "#this"
        },
        "west": {
          "uv": [
            5.25,
            14.5,
            6.25,
            15
          ],
          "texture": "#this"
        },
        "east": {
          "uv": [
            9.75,
            14.5,
            10.75,
            15
          ],
          "texture": "#this"
        }
      }
    },
    {
      "from": [
        5.25,
        1,
        6.75
      ],
      "to": [
        6.25,
        1.5,
        7.75
      ],
      "faces": {
        "up": {
          "uv": [
            5.25,
            6.75,
            6.25,
            7.75
          ],
          "texture": "#this"
        },
        "north": {
          "uv": [
            9.75,
            14.5,
            10.75,
            15
          ],
          "texture": "#this"
        },
        "south": {
          "uv": [
            5.25,
            14.5,
            6.25,
            15
          ],
          "texture": "#this"
        },
        "west": {
          "uv": [
            6.75,
            14.5,
            7.75,
            15
          ],
          "texture": "#this"
        },
        "east": {
          "uv": [
            8.25,
            14.5,
            9.25,
            15
          ],
          "texture": "#this"
        }
      }
    },
    {
      "from": [
        5.25,
        1,
        8.25
      ],
      "to": [
        6.25,
        1.5,
        9.25
      ],
      "faces": {
        "up": {
          "uv": [
            5.25,
            8.25,
            6.25,
            9.25
          ],
          "texture": "#this"
        },
        "north": {
          "uv": [
            9.75,
            14.5,
            10.75,
            15
          ],
          "texture": "#this"
        },
        "south": {
          "uv": [
            5.25,
            14.5,
            6.25,
            15
          ],
          "texture": "#this"
        },
        "west": {
          "uv": [
            8.25,
            14.5,
            9.25,
            15
          ],
          "texture": "#this"
        },
        "east": {
          "uv": [
            6.75,
            14.5,
            7.75,
            15
          ],
          "texture": "#this"
        }
      }
    },
    {
      "from": [
        5.25,
        1,
        9.75
      ],
      "to": [
        6.25,
        1.5,
        10.75
      ],
      "faces": {
        "up": {
          "uv": [
            5.25,
            9.75,
            6.25,
            10.75
          ],
          "texture": "#this"
        },
        "north": {
          "uv": [
            9.75,
            14.5,
            10.75,
            15
          ],
          "texture": "#this"
        },
        "south": {
          "uv": [
            5.25,
            14.5,
            6.25,
            15
          ],
          "texture": "#this"
        },
        "west": {
          "uv": [
            9.75,
            14.5,
            10.75,
            15
          ],
          "texture": "#this"
        },
        "east": {
          "uv": [
            5.25,
            14.5,
            6.25,
            15
          ],
          "texture": "#this"
        }
      }
    },
    {
      "from": [
        5.25,
        1,
        11.25
      ],
      "to": [
        6.25,
        1.5,
        12.25
      ],
      "faces": {
        "up": {
          "uv": [
            5.25,
            11.25,
            6.25,
            12.25
          ],
          "texture": "#this"
        },
        "north": {
          "uv": [
            9.75,
            14.5,
            10.75,
            15
          ],
          "texture": "#this"
        },
        "south": {
          "uv": [
            5.25,
            14.5,
            6.25,
            15
          ],
          "texture": "#this"
        },
        "west": {
          "uv": [
            11.25,
            14.5,
            12.25,
            15
          ],
          "texture": "#this"
        },
        "east": {
          "uv": [
            3.75,
            14.5,
            4.75,
            15
          ],
          "texture": "#this"
        }
      }
    },
    {
      "from": [
        5.25,
        1,
        12.75
      ],
      "to": [
        6.25,
        1.5,
        13.75
      ],
      "faces": {
        "up": {
          "uv": [
            5.25,
            12.75,
            6.25,
            13.75
          ],
          "texture": "#this"
        },
        "north": {
          "uv": [
            9.75,
            14.5,
            10.75,
            15
          ],
          "texture": "#this"
        },
        "south": {
          "uv": [
            5.25,
            14.5,
            6.25,
            15
          ],
          "texture": "#this"
        },
        "west": {
          "uv": [
            12.75,
            14.5,
            13.75,
            15
          ],
          "texture": "#this"
        },
        "east": {
          "uv": [
            2.25,
            14.5,
            3.25,
            15
          ],
          "texture": "#this"
        }
      }
    },
    {
      "from": [
        5.25,
        1,
        14.25
      ],
      "to": [
        6.25,
        1.5,
        15.25
      ],
      "faces": {
        "up": {
          "uv": [
            5.25,
            14.25,
            6.25,
            15.25
          ],
          "texture": "#this"
        },
        "north": {
          "uv": [
            9.75,
            14.5,
            10.75,
            15
          ],
          "texture": "#this"
        },
        "south": {
          "uv": [
            5.25,
            14.5,
            6.25,
            15
          ],
          "texture": "#this"
        },
        "west": {
          "uv": [
            14.25,
            14.5,
            15.25,
            15
          ],
          "texture": "#this"
        },
        "east": {
          "uv": [
            0.75,
            14.5,
            1.75,
            15
          ],
          "texture": "#this"
        }
      }
    },
    {
      "from": [
        6.75,
        1,
        0.75
      ],
      "to": [
        7.75,
        1.5,
        1.75
      ],
      "faces": {
        "up": {
          "uv": [
            6.75,
            0.75,
            7.75,
            1.75
          ],
          "texture": "#this"
        },
        "north": {
          "uv": [
            8.25,
            14.5,
            9.25,
            15
          ],
          "texture": "#this"
        },
        "south": {
          "uv": [
            6.75,
            14.5,
            7.75,
            15
          ],
          "texture": "#this"
        },
        "west": {
          "uv": [
            0.75,
            14.5,
            1.75,
            15
          ],
          "texture": "#this"
        },
        "east": {
          "uv": [
            14.25,
            14.5,
            15.25,
            15
          ],
          "texture": "#this"
        }
      }
    },
    {
      "from": [
        6.75,
        1,
        2.25
      ],
      "to": [
        7.75,
        1.5,
        3.25
      ],
      "faces": {
        "up": {
          "uv": [
            6.75,
            2.25,
            7.75,
            3.25
          ],
          "texture": "#this"
        },
        "north": {
          "uv": [
            8.25,
            14.5,
            9.25,
            15
          ],
          "texture": "#this"
        },
        "south": {
          "uv": [
            6.75,
            14.5,
            7.75,
            15
          ],
          "texture": "#this"
        },
        "west": {
          "uv": [
            2.25,
            14.5,
            3.25,
            15
          ],
          "texture": "#this"
        },
        "east": {
          "uv": [
            12.75,
            14.5,
            13.75,
            15
          ],
          "texture": "#this"
        }
      }
    },
    {
      "from": [
        6.75,
        1,
        3.75
      ],
      "to": [
        7.75,
        1.5,
        4.75
      ],
      "faces": {
        "up": {
          "uv": [
            6.75,
            3.75,
            7.75,
            4.75
          ],
          "texture": "#this"
        },
        "north": {
          "uv": [
            8.25,
            14.5,
            9.25,
            15
          ],
          "texture": "#this"
        },
        "south": {
          "uv": [
            6.75,
            14.5,
            7.75,
            15
          ],
          "texture": "#this"
        },
        "west": {
          "uv": [
            3.75,
            14.5,
            4.75,
            15
          ],
          "texture": "#this"
        },
        "east": {
          "uv": [
            11.25,
            14.5,
            12.25,
            15
          ],
          "texture": "#this"
        }
      }
    },
    {
      "from": [
        6.75,
        1,
        5.25
      ],
      "to": [
        7.75,
        1.5,
        6.25
      ],
      "faces": {
        "up": {
          "uv": [
            6.75,
            5.25,
            7.75,
            6.25
          ],
          "texture": "#this"
        },
        "north": {
          "uv": [
            8.25,
            14.5,
            9.25,
            15
          ],
          "texture": "#this"
        },
        "south": {
          "uv": [
            6.75,
            14.5,
            7.75,
            15
          ],
          "texture": "#this"
        },
        "west": {
          "uv": [
            5.25,
            14.5,
            6.25,
            15
          ],
          "texture": "#this"
        },
        "east": {
          "uv": [
            9.75,
            14.5,
            10.75,
            15
          ],
          "texture": "#this"
        }
      }
    },
    {
      "from": [
        6.75,
        1,
        6.75
      ],
      "to": [
        7.75,
        1.5,
        7.75
      ],
      "faces": {
        "up": {
          "uv": [
            6.75,
            6.75,
            7.75,
            7.75
          ],
          "texture": "#this"
        },
        "north": {
          "uv": [
            8.25,
            14.5,
            9.25,
            15
          ],
          "texture": "#this"
        },
        "south": {
          "uv": [
            6.75,
            14.5,
            7.75,
            15
          ],
          "texture": "#this"
        },
        "west": {
          "uv": [
            6.75,
            14.5,
            7.75,
            15
          ],
          "texture": "#this"
        },
        "east": {
          "uv": [
            8.25,
            14.5,
            9.25,
            15
          ],
          "texture": "#this"
        }
      }
    },
    {
      "from": [
        6.75,
        1,
        8.25
      ],
      "to": [
        7.75,
        1.5,
        9.25
      ],
      "faces": {
        "up": {
          "uv": [
            6.75,
            8.25,
            7.75,
            9.25
          ],
          "texture": "#this"
        },
        "north": {
          "uv": [
            8.25,
            14.5,
            9.25,
            15
          ],
          "texture": "#this"
        },
        "south": {
          "uv": [
            6.75,
            14.5,
            7.75,
            15
          ],
          "texture": "#this"
        },
        "west": {
          "uv": [
            8.25,
            14.5,
            9.25,
            15
          ],
          "texture": "#this"
        },
        "east": {
          "uv": [
            6.75,
            14.5,
            7.75,
            15
          ],
          "texture": "#this"
        }
      }
    },
    {
      "from": [
        6.75,
        1,
        9.75
      ],
      "to": [
        7.75,
        1.5,
        10.75
      ],
      "faces": {
        "up": {
          "uv": [
            6.75,
            9.75,
            7.75,
            10.75
          ],
          "texture": "#this"
        },
        "north": {
          "uv": [
            8.25,
            14.5,
            9.25,
            15
          ],
          "texture": "#this"
        },
        "south": {
          "uv": [
            6.75,
            14.5,
            7.75,
            15
          ],
          "texture": "#this"
        },
        "west": {
          "uv": [
            9.75,
            14.5,
            10.75,
            15
          ],
          "texture": "#this"
        },
        "east": {
          "uv": [
            5.25,
            14.5,
            6.25,
            15
          ],
          "texture": "#this"
        }
      }
    },
    {
      "from": [
        6.75,
        1,
        11.25
      ],
      "to": [
        7.75,
        1.5,
        12.25
      ],
      "faces": {
        "up": {
          "uv": [
            6.75,
            11.25,
            7.75,
            12.25
          ],
          "texture": "#this"
        },
        "north": {
          "uv": [
            8.25,
            14.5,
            9.25,
            15
          ],
          "texture": "#this"
        },
        "south": {
          "uv": [
            6.75,
            14.5,
            7.75,
            15
          ],
          "texture": "#this"
        },
        "west": {
          "uv": [
            11.25,
            14.5,
            12.25,
            15
          ],
          "texture": "#this"
        },
        "east": {
          "uv": [
            3.75,
            14.5,
            4.75,
            15
          ],
          "texture": "#this"
        }
      }
    },
    {
      "from": [
        6.75,
        1,
        12.75
      ],
      "to": [
        7.75,
        1.5,
        13.75
      ],
      "faces": {
        "up": {
          "uv": [
            6.75,
            12.75,
            7.75,
            13.75
          ],
          "texture": "#this"
        },
        "north": {
          "uv": [
            8.25,
            14.5,
            9.25,
            15
          ],
          "texture": "#this"
        },
        "south": {
          "uv": [
            6.75,
            14.5,
            7.75,
            15
          ],
          "texture": "#this"
        },
        "west": {
          "uv": [
            12.75,
            14.5,
            13.75,
            15
          ],
          "texture": "#this"
        },
        "east": {
          "uv": [
            2.25,
            14.5,
            3.25,
            15
          ],
          "texture": "#this"
        }
      }
    },
    {
      "from": [
        6.75,
        1,
        14.25
      ],
      "to": [
        7.75,
        1.5,
        15.25
      ],
      "faces": {
        "up": {
          "uv": [
            6.75,
            14.25,
            7.75,
            15.25
          ],
          "texture": "#this"
        },
        "north": {
          "uv": [
            8.25,
            14.5,
            9.25,
            15
          ],
          "texture": "#this"
        },
        "south": {
          "uv": [
            6.75,
            14.5,
            7.75,
            15
          ],
          "texture": "#this"
        },
        "west": {
          "uv": [
            14.25,
            14.5,
            15.25,
            15
          ],
          "texture": "#this"
        },
        "east": {
          "uv": [
            0.75,
            14.5,
            1.75,
            15
          ],
          "texture": "#this"
        }
      }
    },
    {
      "from": [
        8.25,
        1,
        0.75
      ],
      "to": [
        9.25,
        1.5,
        1.75
      ],
      "faces": {
        "up": {
          "uv": [
            8.25,
            0.75,
            9.25,
            1.75
          ],
          "texture": "#this"
        },
        "north": {
          "uv": [
            6.75,
            14.5,
            7.75,
            15
          ],
          "texture": "#this"
        },
        "south": {
          "uv": [
            8.25,
            14.5,
            9.25,
            15
          ],
          "texture": "#this"
        },
        "west": {
          "uv": [
            0.75,
            14.5,
            1.75,
            15
          ],
          "texture": "#this"
        },
        "east": {
          "uv": [
            14.25,
            14.5,
            15.25,
            15
          ],
          "texture": "#this"
        }
      }
    },
    {
      "from": [
        8.25,
        1,
        2.25
      ],
      "to": [
        9.25,
        1.5,
        3.25
      ],
      "faces": {
        "up": {
          "uv": [
            8.25,
            2.25,
            9.25,
            3.25
          ],
          "texture": "#this"
        },
        "north": {
          "uv": [
            6.75,
            14.5,
            7.75,
            15
          ],
          "texture": "#this"
        },
        "south": {
          "uv": [
            8.25,
            14.5,
            9.25,
            15
          ],
          "texture": "#this"
        },
        "west": {
          "uv": [
            2.25,
            14.5,
            3.25,
            15
          ],
          "texture": "#this"
        },
        "east": {
          "uv": [
            12.75,
            14.5,
            13.75,
            15
          ],
          "texture": "#this"
        }
      }
    },
    {
      "from": [
        8.25,
        1,
        3.75
      ],
      "to": [
        9.25,
        1.5,
        4.75
      ],
      "faces": {
        "up": {
          "uv": [
            8.25,
            3.75,
            9.25,
            4.75
          ],
          "texture": "#this"
        },
        "north": {
          "uv": [
            6.75,
            14.5,
            7.75,
            15
          ],
          "texture": "#this"
        },
        "south": {
          "uv": [
            8.25,
            14.5,
            9.25,
            15
          ],
          "texture": "#this"
        },
        "west": {
          "uv": [
            3.75,
            14.5,
            4.75,
            15
          ],
          "texture": "#this"
        },
        "east": {
          "uv": [
            11.25,
            14.5,
            12.25,
            15
          ],
          "texture": "#this"
        }
      }
    },
    {
      "from": [
        8.25,
        1,
        5.25
      ],
      "to": [
        9.25,
        1.5,
        6.25
      ],
      "faces": {
        "up": {
          "uv": [
            8.25,
            5.25,
            9.25,
            6.25
          ],
          "texture": "#this"
        },
        "north": {
          "uv": [
            6.75,
            14.5,
            7.75,
            15
          ],
          "texture": "#this"
        },
        "south": {
          "uv": [
            8.25,
            14.5,
            9.25,
            15
          ],
          "texture": "#this"
        },
        "west": {
          "uv": [
            5.25,
            14.5,
            6.25,
            15
          ],
          "texture": "#this"
        },
        "east": {
          "uv": [
            9.75,
            14.5,
            10.75,
            15
          ],
          "texture": "#this"
        }
      }
    },
    {
      "from": [
        8.25,
        1,
        6.75
      ],
      "to": [
        9.25,
        1.5,
        7.75
      ],
      "faces": {
        "up": {
          "uv": [
            8.25,
            6.75,
            9.25,
            7.75
          ],
          "texture": "#this"
        },
        "north": {
          "uv": [
            6.75,
            14.5,
            7.75,
            15
          ],
          "texture": "#this"
        },
        "south": {
          "uv": [
            8.25,
            14.5,
            9.25,
            15
          ],
          "texture": "#this"
        },
        "west": {
          "uv": [
            6.75,
            14.5,
            7.75,
            15
          ],
          "texture": "#this"
        },
        "east": {
          "uv": [
            8.25,
            14.5,
            9.25,
            15
          ],
          "texture": "#this"
        }
      }
    },
    {
      "from": [
        8.25,
        1,
        8.25
      ],
      "to": [
        9.25,
        1.5,
        9.25
      ],
      "faces": {
        "up": {
          "uv": [
            8.25,
            8.25,
            9.25,
            9.25
          ],
          "texture": "#this"
        },
        "north": {
          "uv": [
            6.75,
            14.5,
            7.75,
            15
          ],
          "texture": "#this"
        },
        "south": {
          "uv": [
            8.25,
            14.5,
            9.25,
            15
          ],
          "texture": "#this"
        },
        "west": {
          "uv": [
            8.25,
            14.5,
            9.25,
            15
          ],
          "texture": "#this"
        },
        "east": {
          "uv": [
            6.75,
            14.5,
            7.75,
            15
          ],
          "texture": "#this"
        }
      }
    },
    {
      "from": [
        8.25,
        1,
        9.75
      ],
      "to": [
        9.25,
        1.5,
        10.75
      ],
      "faces": {
        "up": {
          "uv": [
            8.25,
            9.75,
            9.25,
            10.75
          ],
          "texture": "#this"
        },
        "north": {
          "uv": [
            6.75,
            14.5,
            7.75,
            15
          ],
          "texture": "#this"
        },
        "south": {
          "uv": [
            8.25,
            14.5,
            9.25,
            15
          ],
          "texture": "#this"
        },
        "west": {
          "uv": [
            9.75,
            14.5,
            10.75,
            15
          ],
          "texture": "#this"
        },
        "east": {
          "uv": [
            5.25,
            14.5,
            6.25,
            15
          ],
          "texture": "#this"
        }
      }
    },
    {
      "from": [
        8.25,
        1,
        11.25
      ],
      "to": [
        9.25,
        1.5,
        12.25
      ],
      "faces": {
        "up": {
          "uv": [
            8.25,
            11.25,
            9.25,
            12.25
          ],
          "texture": "#this"
        },
        "north": {
          "uv": [
            6.75,
            14.5,
            7.75,
            15
          ],
          "texture": "#this"
        },
        "south": {
          "uv": [
            8.25,
            14.5,
            9.25,
            15
          ],
          "texture": "#this"
        },
        "west": {
          "uv": [
            11.25,
            14.5,
            12.25,
            15
          ],
          "texture": "#this"
        },
        "east": {
          "uv": [
            3.75,
            14.5,
            4.75,
            15
          ],
          "texture": "#this"
        }
      }
    },
    {
      "from": [
        8.25,
        1,
        12.75
      ],
      "to": [
        9.25,
        1.5,
        13.75
      ],
      "faces": {
        "up": {
          "uv": [
            8.25,
            12.75,
            9.25,
            13.75
          ],
          "texture": "#this"
        },
        "north": {
          "uv": [
            6.75,
            14.5,
            7.75,
            15
          ],
          "texture": "#this"
        },
        "south": {
          "uv": [
            8.25,
            14.5,
            9.25,
            15
          ],
          "texture": "#this"
        },
        "west": {
          "uv": [
            12.75,
            14.5,
            13.75,
            15
          ],
          "texture": "#this"
        },
        "east": {
          "uv": [
            2.25,
            14.5,
            3.25,
            15
          ],
          "texture": "#this"
        }
      }
    },
    {
      "from": [
        8.25,
        1,
        14.25
      ],
      "to": [
        9.25,
        1.5,
        15.25
      ],
      "faces": {
        "up": {
          "uv": [
            8.25,
            14.25,
            9.25,
            15.25
          ],
          "texture": "#this"
        },
        "north": {
          "uv": [
            6.75,
            14.5,
            7.75,
            15
          ],
          "texture": "#this"
        },
        "south": {
          "uv": [
            8.25,
            14.5,
            9.25,
            15
          ],
          "texture": "#this"
        },
        "west": {
          "uv": [
            14.25,
            14.5,
            15.25,
            15
          ],
          "texture": "#this"
        },
        "east": {
          "uv": [
            0.75,
            14.5,
            1.75,
            15
          ],
          "texture": "#this"
        }
      }
    },
    {
      "from": [
        9.75,
        1,
        0.75
      ],
      "to": [
        10.75,
        1.5,
        1.75
      ],
      "faces": {
        "up": {
          "uv": [
            9.75,
            0.75,
            10.75,
            1.75
          ],
          "texture": "#this"
        },
        "north": {
          "uv": [
            5.25,
            14.5,
            6.25,
            15
          ],
          "texture": "#this"
        },
        "south": {
          "uv": [
            9.75,
            14.5,
            10.75,
            15
          ],
          "texture": "#this"
        },
        "west": {
          "uv": [
            0.75,
            14.5,
            1.75,
            15
          ],
          "texture": "#this"
        },
        "east": {
          "uv": [
            14.25,
            14.5,
            15.25,
            15
          ],
          "texture": "#this"
        }
      }
    },
    {
      "from": [
        9.75,
        1,
        2.25
      ],
      "to": [
        10.75,
        1.5,
        3.25
      ],
      "faces": {
        "up": {
          "uv": [
            9.75,
            2.25,
            10.75,
            3.25
          ],
          "texture": "#this"
        },
        "north": {
          "uv": [
            5.25,
            14.5,
            6.25,
            15
          ],
          "texture": "#this"
        },
        "south": {
          "uv": [
            9.75,
            14.5,
            10.75,
            15
          ],
          "texture": "#this"
        },
        "west": {
          "uv": [
            2.25,
            14.5,
            3.25,
            15
          ],
          "texture": "#this"
        },
        "east": {
          "uv": [
            12.75,
            14.5,
            13.75,
            15
          ],
          "texture": "#this"
        }
      }
    },
    {
      "from": [
        9.75,
        1,
        3.75
      ],
      "to": [
        10.75,
        1.5,
        4.75
      ],
      "faces": {
        "up": {
          "uv": [
            9.75,
            3.75,
            10.75,
            4.75
          ],
          "texture": "#this"
        },
        "north": {
          "uv": [
            5.25,
            14.5,
            6.25,
            15
          ],
          "texture": "#this"
        },
        "south": {
          "uv": [
            9.75,
            14.5,
            10.75,
            15
          ],
          "texture": "#this"
        },
        "west": {
          "uv": [
            3.75,
            14.5,
            4.75,
            15
          ],
          "texture": "#this"
        },
        "east": {
          "uv": [
            11.25,
            14.5,
            12.25,
            15
          ],
          "texture": "#this"
        }
      }
    },
    {
      "from": [
        9.75,
        1,
        5.25
      ],
      "to": [
        10.75,
        1.5,
        6.25
      ],
      "faces": {
        "up": {
          "uv": [
            9.75,
            5.25,
            10.75,
            6.25
          ],
          "texture": "#this"
        },
        "north": {
          "uv": [
            5.25,
            14.5,
            6.25,
            15
          ],
          "texture": "#this"
        },
        "south": {
          "uv": [
            9.75,
            14.5,
            10.75,
            15
          ],
          "texture": "#this"
        },
        "west": {
          "uv": [
            5.25,
            14.5,
            6.25,
            15
          ],
          "texture": "#this"
        },
        "east": {
          "uv": [
            9.75,
            14.5,
            10.75,
            15
          ],
          "texture": "#this"
        }
      }
    },
    {
      "from": [
        9.75,
        1,
        6.75
      ],
      "to": [
        10.75,
        1.5,
        7.75
      ],
      "faces": {
        "up": {
          "uv": [
            9.75,
            6.75,
            10.75,
            7.75
          ],
          "texture": "#this"
        },
        "north": {
          "uv": [
            5.25,
            14.5,
            6.25,
            15
          ],
          "texture": "#this"
        },
        "south": {
          "uv": [
            9.75,
            14.5,
            10.75,
            15
          ],
          "texture": "#this"
        },
        "west": {
          "uv": [
            6.75,
            14.5,
            7.75,
            15
          ],
          "texture": "#this"
        },
        "east": {
          "uv": [
            8.25,
            14.5,
            9.25,
            15
          ],
          "texture": "#this"
        }
      }
    },
    {
      "from": [
        9.75,
        1,
        8.25
      ],
      "to": [
        10.75,
        1.5,
        9.25
      ],
      "faces": {
        "up": {
          "uv": [
            9.75,
            8.25,
            10.75,
            9.25
          ],
          "texture": "#this"
        },
        "north": {
          "uv": [
            5.25,
            14.5,
            6.25,
            15
          ],
          "texture": "#this"
        },
        "south": {
          "uv": [
            9.75,
            14.5,
            10.75,
            15
          ],
          "texture": "#this"
        },
        "west": {
          "uv": [
            8.25,
            14.5,
            9.25,
            15
          ],
          "texture": "#this"
        },
        "east": {
          "uv": [
            6.75,
            14.5,
            7.75,
            15
          ],
          "texture": "#this"
        }
      }
    },
    {
      "from": [
        9.75,
        1,
        9.75
      ],
      "to": [
        10.75,
        1.5,
        10.75
      ],
      "faces": {
        "up": {
          "uv": [
            9.75,
            9.75,
            10.75,
            10.75
          ],
          "texture": "#this"
        },
        "north": {
          "uv": [
            5.25,
            14.5,
            6.25,
            15
          ],
          "texture": "#this"
        },
        "south": {
          "uv": [
            9.75,
            14.5,
            10.75,
            15
          ],
          "texture": "#this"
        },
        "west": {
          "uv": [
            9.75,
            14.5,
            10.75,
            15
          ],
          "texture": "#this"
        },
        "east": {
          "uv": [
            5.25,
            14.5,
            6.25,
            15
          ],
          "texture": "#this"
        }
      }
    },
    {
      "from": [
        9.75,
        1,
        11.25
      ],
      "to": [
        10.75,
        1.5,
        12.25
      ],
      "faces": {
        "up": {
          "uv": [
            9.75,
            11.25,
            10.75,
            12.25
          ],
          "texture": "#this"
        },
        "north": {
          "uv": [
            5.25,
            14.5,
            6.25,
            15
          ],
          "texture": "#this"
        },
        "south": {
          "uv": [
            9.75,
            14.5,
            10.75,
            15
          ],
          "texture": "#this"
        },
        "west": {
          "uv": [
            11.25,
            14.5,
            12.25,
            15
          ],
          "texture": "#this"
        },
        "east": {
          "uv": [
            3.75,
            14.5,
            4.75,
            15
          ],
          "texture": "#this"
        }
      }
    },
    {
      "from": [
        9.75,
        1,
        12.75
      ],
      "to": [
        10.75,
        1.5,
        13.75
      ],
      "faces": {
        "up": {
          "uv": [
            9.75,
            12.75,
            10.75,
            13.75
          ],
          "texture": "#this"
        },
        "north": {
          "uv": [
            5.25,
            14.5,
            6.25,
            15
          ],
          "texture": "#this"
        },
        "south": {
          "uv": [
            9.75,
            14.5,
            10.75,
            15
          ],
          "texture": "#this"
        },
        "west": {
          "uv": [
            12.75,
            14.5,
            13.75,
            15
          ],
          "texture": "#this"
        },
        "east": {
          "uv": [
            2.25,
            14.5,
            3.25,
            15
          ],
          "texture": "#this"
        }
      }
    },
    {
      "from": [
        9.75,
        1,
        14.25
      ],
      "to": [
        10.75,
        1.5,
        15.25
      ],
      "faces": {
        "up": {
          "uv": [
            9.75,
            14.25,
            10.75,
            15.25
          ],
          "texture": "#this"
        },
        "north": {
          "uv": [
            5.25,
            14.5,
            6.25,
            15
          ],
          "texture": "#this"
        },
        "south": {
          "uv": [
            9.75,
            14.5,
            10.75,
            15
          ],
          "texture": "#this"
        },
        "west": {
          "uv": [
            14.25,
            14.5,
            15.25,
            15
          ],
          "texture": "#this"
        },
        "east": {
          "uv": [
            0.75,
            14.5,
            1.75,
            15
          ],
          "texture": "#this"
        }
      }
    },
    {
      "from": [
        11.25,
        1,
        0.75
      ],
      "to": [
        12.25,
        1.5,
        1.75
      ],
      "faces": {
        "up": {
          "uv": [
            11.25,
            0.75,
            12.25,
            1.75
          ],
          "texture": "#this"
        },
        "north": {
          "uv": [
            3.75,
            14.5,
            4.75,
            15
          ],
          "texture": "#this"
        },
        "south": {
          "uv": [
            11.25,
            14.5,
            12.25,
            15
          ],
          "texture": "#this"
        },
        "west": {
          "uv": [
            0.75,
            14.5,
            1.75,
            15
          ],
          "texture": "#this"
        },
        "east": {
          "uv": [
            14.25,
            14.5,
            15.25,
            15
          ],
          "texture": "#this"
        }
      }
    },
    {
      "from": [
        11.25,
        1,
        2.25
      ],
      "to": [
        12.25,
        1.5,
        3.25
      ],
      "faces": {
        "up": {
          "uv": [
            11.25,
            2.25,
            12.25,
            3.25
          ],
          "texture": "#this"
        },
        "north": {
          "uv": [
            3.75,
            14.5,
            4.75,
            15
          ],
          "texture": "#this"
        },
        "south": {
          "uv": [
            11.25,
            14.5,
            12.25,
            15
          ],
          "texture": "#this"
        },
        "west": {
          "uv": [
            2.25,
            14.5,
            3.25,
            15
          ],
          "texture": "#this"
        },
        "east": {
          "uv": [
            12.75,
            14.5,
            13.75,
            15
          ],
          "texture": "#this"
        }
      }
    },
    {
      "from": [
        11.25,
        1,
        3.75
      ],
      "to": [
        12.25,
        1.5,
        4.75
      ],
      "faces": {
        "up": {
          "uv": [
            11.25,
            3.75,
            12.25,
            4.75
          ],
          "texture": "#this"
        },
        "north": {
          "uv": [
            3.75,
            14.5,
            4.75,
            15
          ],
          "texture": "#this"
        },
        "south": {
          "uv": [
            11.25,
            14.5,
            12.25,
            15
          ],
          "texture": "#this"
        },
        "west": {
          "uv": [
            3.75,
            14.5,
            4.75,
            15
          ],
          "texture": "#this"
        },
        "east": {
          "uv": [
            11.25,
            14.5,
            12.25,
            15
          ],
          "texture": "#this"
        }
      }
    },
    {
      "from": [
        11.25,
        1,
        5.25
      ],
      "to": [
        12.25,
        1.5,
        6.25
      ],
      "faces": {
        "up": {
          "uv": [
            11.25,
            5.25,
            12.25,
            6.25
          ],
          "texture": "#this"
        },
        "north": {
          "uv": [
            3.75,
            14.5,
            4.75,
            15
          ],
          "texture": "#this"
        },
        "south": {
          "uv": [
            11.25,
            14.5,
            12.25,
            15
          ],
          "texture": "#this"
        },
        "west": {
          "uv": [
            5.25,
            14.5,
            6.25,
            15
          ],
          "texture": "#this"
        },
        "east": {
          "uv": [
            9.75,
            14.5,
            10.75,
            15
          ],
          "texture": "#this"
        }
      }
    },
    {
      "from": [
        11.25,
        1,
        6.75
      ],
      "to": [
        12.25,
        1.5,
        7.75
      ],
      "faces": {
        "up": {
          "uv": [
            11.25,
            6.75,
            12.25,
            7.75
          ],
          "texture": "#this"
        },
        "north": {
          "uv": [
            3.75,
            14.5,
            4.75,
            15
          ],
          "texture": "#this"
        },
        "south": {
          "uv": [
            11.25,
            14.5,
            12.25,
            15
          ],
          "texture": "#this"
        },
        "west": {
          "uv": [
            6.75,
            14.5,
            7.75,
            15
          ],
          "texture": "#this"
        },
        "east": {
          "uv": [
            8.25,
            14.5,
            9.25,
            15
          ],
          "texture": "#this"
        }
      }
    },
    {
      "from": [
        11.25,
        1,
        8.25
      ],
      "to": [
        12.25,
        1.5,
        9.25
      ],
      "faces": {
        "up": {
          "uv": [
            11.25,
            8.25,
            12.25,
            9.25
          ],
          "texture": "#this"
        },
        "north": {
          "uv": [
            3.75,
            14.5,
            4.75,
            15
          ],
          "texture": "#this"
        },
        "south": {
          "uv": [
            11.25,
            14.5,
            12.25,
            15
          ],
          "texture": "#this"
        },
        "west": {
          "uv": [
            8.25,
            14.5,
            9.25,
            15
          ],
          "texture": "#this"
        },
        "east": {
          "uv": [
            6.75,
            14.5,
            7.75,
            15
          ],
          "texture": "#this"
        }
      }
    },
    {
      "from": [
        11.25,
        1,
        9.75
      ],
      "to": [
        12.25,
        1.5,
        10.75
      ],
      "faces": {
        "up": {
          "uv": [
            11.25,
            9.75,
            12.25,
            10.75
          ],
          "texture": "#this"
        },
        "north": {
          "uv": [
            3.75,
            14.5,
            4.75,
            15
          ],
          "texture": "#this"
        },
        "south": {
          "uv": [
            11.25,
            14.5,
            12.25,
            15
          ],
          "texture": "#this"
        },
        "west": {
          "uv": [
            9.75,
            14.5,
            10.75,
            15
          ],
          "texture": "#this"
        },
        "east": {
          "uv": [
            5.25,
            14.5,
            6.25,
            15
          ],
          "texture": "#this"
        }
      }
    },
    {
      "from": [
        11.25,
        1,
        11.25
      ],
      "to": [
        12.25,
        1.5,
        12.25
      ],
      "faces": {
        "up": {
          "uv": [
            11.25,
            11.25,
            12.25,
            12.25
          ],
          "texture": "#this"
        },
        "north": {
          "uv": [
            3.75,
            14.5,
            4.75,
            15
          ],
          "texture": "#this"
        },
        "south": {
          "uv": [
            11.25,
            14.5,
            12.25,
            15
          ],
          "texture": "#this"
        },
        "west": {
          "uv": [
            11.25,
            14.5,
            12.25,
            15
          ],
          "texture": "#this"
        },
        "east": {
          "uv": [
            3.75,
            14.5,
            4.75,
            15
          ],
          "texture": "#this"
        }
      }
    },
    {
      "from": [
        11.25,
        1,
        12.75
      ],
      "to": [
        12.25,
        1.5,
        13.75
      ],
      "faces": {
        "up": {
          "uv": [
            11.25,
            12.75,
            12.25,
            13.75
          ],
          "texture": "#this"
        },
        "north": {
          "uv": [
            3.75,
            14.5,
            4.75,
            15
          ],
          "texture": "#this"
        },
        "south": {
          "uv": [
            11.25,
            14.5,
            12.25,
            15
          ],
          "texture": "#this"
        },
        "west": {
          "uv": [
            12.75,
            14.5,
            13.75,
            15
          ],
          "texture": "#this"
        },
        "east": {
          "uv": [
            2.25,
            14.5,
            3.25,
            15
          ],
          "texture": "#this"
        }
      }
    },
    {
      "from": [
        11.25,
        1,
        14.25
      ],
      "to": [
        12.25,
        1.5,
        15.25
      ],
      "faces": {
        "up": {
          "uv": [
            11.25,
            14.25,
            12.25,
            15.25
          ],
          "texture": "#this"
        },
        "north": {
          "uv": [
            3.75,
            14.5,
            4.75,
            15
          ],
          "texture": "#this"
        },
        "south": {
          "uv": [
            11.25,
            14.5,
            12.25,
            15
          ],
          "texture": "#this"
        },
        "west": {
          "uv": [
            14.25,
            14.5,
            15.25,
            15
          ],
          "texture": "#this"
        },
        "east": {
          "uv": [
            0.75,
            14.5,
            1.75,
            15
          ],
          "texture": "#this"
        }
      }
    },
    {
      "from": [
        12.75,
        1,
        0.75
      ],
      "to": [
        13.75,
        1.5,
        1.75
      ],
      "faces": {
        "up": {
          "uv": [
            12.75,
            0.75,
            13.75,
            1.75
          ],
          "texture": "#this"
        },
        "north": {
          "uv": [
            2.25,
            14.5,
            3.25,
            15
          ],
          "texture": "#this"
        },
        "south": {
          "uv": [
            12.75,
            14.5,
            13.75,
            15
          ],
          "texture": "#this"
        },
        "west": {
          "uv": [
            0.75,
            14.5,
            1.75,
            15
          ],
          "texture": "#this"
        },
        "east": {
          "uv": [
            14.25,
            14.5,
            15.25,
            15
          ],
          "texture": "#this"
        }
      }
    },
    {
      "from": [
        12.75,
        1,
        2.25
      ],
      "to": [
        13.75,
        1.5,
        3.25
      ],
      "faces": {
        "up": {
          "uv": [
            12.75,
            2.25,
            13.75,
            3.25
          ],
          "texture": "#this"
        },
        "north": {
          "uv": [
            2.25,
            14.5,
            3.25,
            15
          ],
          "texture": "#this"
        },
        "south": {
          "uv": [
            12.75,
            14.5,
            13.75,
            15
          ],
          "texture": "#this"
        },
        "west": {
          "uv": [
            2.25,
            14.5,
            3.25,
            15
          ],
          "texture": "#this"
        },
        "east": {
          "uv": [
            12.75,
            14.5,
            13.75,
            15
          ],
          "texture": "#this"
        }
      }
    },
    {
      "from": [
        12.75,
        1,
        3.75
      ],
      "to": [
        13.75,
        1.5,
        4.75
      ],
      "faces": {
        "up": {
          "uv": [
            12.75,
            3.75,
            13.75,
            4.75
          ],
          "texture": "#this"
        },
        "north": {
          "uv": [
            2.25,
            14.5,
            3.25,
            15
          ],
          "texture": "#this"
        },
        "south": {
          "uv": [
            12.75,
            14.5,
            13.75,
            15
          ],
          "texture": "#this"
        },
        "west": {
          "uv": [
            3.75,
            14.5,
            4.75,
            15
          ],
          "texture": "#this"
        },
        "east": {
          "uv": [
            11.25,
            14.5,
            12.25,
            15
          ],
          "texture": "#this"
        }
      }
    },
    {
      "from": [
        12.75,
        1,
        5.25
      ],
      "to": [
        13.75,
        1.5,
        6.25
      ],
      "faces": {
        "up": {
          "uv": [
            12.75,
            5.25,
            13.75,
            6.25
          ],
          "texture": "#this"
        },
        "north": {
          "uv": [
            2.25,
            14.5,
            3.25,
            15
          ],
          "texture": "#this"
        },
        "south": {
          "uv": [
            12.75,
            14.5,
            13.75,
            15
          ],
          "texture": "#this"
        },
        "west": {
          "uv": [
            5.25,
            14.5,
            6.25,
            15
          ],
          "texture": "#this"
        },
        "east": {
          "uv": [
            9.75,
            14.5,
            10.75,
            15
          ],
          "texture": "#this"
        }
      }
    },
    {
      "from": [
        12.75,
        1,
        6.75
      ],
      "to": [
        13.75,
        1.5,
        7.75
      ],
      "faces": {
        "up": {
          "uv": [
            12.75,
            6.75,
            13.75,
            7.75
          ],
          "texture": "#this"
        },
        "north": {
          "uv": [
            2.25,
            14.5,
            3.25,
            15
          ],
          "texture": "#this"
        },
        "south": {
          "uv": [
            12.75,
            14.5,
            13.75,
            15
          ],
          "texture": "#this"
        },
        "west": {
          "uv": [
            6.75,
            14.5,
            7.75,
            15
          ],
          "texture": "#this"
        },
        "east": {
          "uv": [
            8.25,
            14.5,
            9.25,
            15
          ],
          "texture": "#this"
        }
      }
    },
    {
      "from": [
        12.75,
        1,
        8.25
      ],
      "to": [
        13.75,
        1.5,
        9.25
      ],
      "faces": {
        "up": {
          "uv": [
            12.75,
            8.25,
            13.75,
            9.25
          ],
          "texture": "#this"
        },
        "north": {
          "uv": [
            2.25,
            14.5,
            3.25,
            15
          ],
          "texture": "#this"
        },
        "south": {
          "uv": [
            12.75,
            14.5,
            13.75,
            15
          ],
          "texture": "#this"
        },
        "west": {
          "uv": [
            8.25,
            14.5,
            9.25,
            15
          ],
          "texture": "#this"
        },
        "east": {
          "uv": [
            6.75,
            14.5,
            7.75,
            15
          ],
          "texture": "#this"
        }
      }
    },
    {
      "from": [
        12.75,
        1,
        9.75
      ],
      "to": [
        13.75,
        1.5,
        10.75
      ],
      "faces": {
        "up": {
          "uv": [
            12.75,
            9.75,
            13.75,
            10.75
          ],
          "texture": "#this"
        },
        "north": {
          "uv": [
            2.25,
            14.5,
            3.25,
            15
          ],
          "texture": "#this"
        },
        "south": {
          "uv": [
            12.75,
            14.5,
            13.75,
            15
          ],
          "texture": "#this"
        },
        "west": {
          "uv": [
            9.75,
            14.5,
            10.75,
            15
          ],
          "texture": "#this"
        },
        "east": {
          "uv": [
            5.25,
            14.5,
            6.25,
            15
          ],
          "texture": "#this"
        }
      }
    },
    {
      "from": [
        12.75,
        1,
        11.25
      ],
      "to": [
        13.75,
        1.5,
        12.25
      ],
      "faces": {
        "up": {
          "uv": [
            12.75,
            11.25,
            13.75,
            12.25
          ],
          "texture": "#this"
        },
        "north": {
          "uv": [
            2.25,
            14.5,
            3.25,
            15
          ],
          "texture": "#this"
        },
        "south": {
          "uv": [
            12.75,
            14.5,
            13.75,
            15
          ],
          "texture": "#this"
        },
        "west": {
          "uv": [
            11.25,
            14.5,
            12.25,
            15
          ],
          "texture": "#this"
        },
        "east": {
          "uv": [
            3.75,
            14.5,
            4.75,
            15
          ],
          "texture": "#this"
        }
      }
    },
    {
      "from": [
        12.75,
        1,
        12.75
      ],
      "to": [
        13.75,
        1.5,
        13.75
      ],
      "faces": {
        "up": {
          "uv": [
            12.75,
            12.75,
            13.75,
            13.75
          ],
          "texture": "#this"
        },
        "north": {
          "uv": [
            2.25,
            14.5,
            3.25,
            15
          ],
          "texture": "#this"
        },
        "south": {
          "uv": [
            12.75,
            14.5,
            13.75,
            15
          ],
          "texture": "#this"
        },
        "west": {
          "uv": [
            12.75,
            14.5,
            13.75,
            15
          ],
          "texture": "#this"
        },
        "east": {
          "uv": [
            2.25,
            14.5,
            3.25,
            15
          ],
          "texture": "#this"
        }
      }
    },
    {
      "from": [
        12.75,
        1,
        14.25
      ],
      "to": [
        13.75,
        1.5,
        15.25
      ],
      "faces": {
        "up": {
          "uv": [
            12.75,
            14.25,
            13.75,
            15.25
          ],
          "texture": "#this"
        },
        "north": {
          "uv": [
            2.25,
            14.5,
            3.25,
            15
          ],
          "texture": "#this"
        },
        "south": {
          "uv": [
            12.75,
            14.5,
            13.75,
            15
          ],
          "texture": "#this"
        },
        "west": {
          "uv": [
            14.25,
            14.5,
            15.25,
            15
          ],
          "texture": "#this"
        },
        "east": {
          "uv": [
            0.75,
            14.5,
            1.75,
            15
          ],
          "texture": "#this"
        }
      }
    },
    {
      "from": [
        14.25,
        1,
        0.75
      ],
      "to": [
        15.25,
        1.5,
        1.75
      ],
      "faces": {
        "up": {
          "uv": [
            14.25,
            0.75,
            15.25,
            1.75
          ],
          "texture": "#this"
        },
        "north": {
          "uv": [
            0.75,
            14.5,
            1.75,
            15
          ],
          "texture": "#this"
        },
        "south": {
          "uv": [
            14.25,
            14.5,
            15.25,
            15
          ],
          "texture": "#this"
        },
        "west": {
          "uv": [
            0.75,
            14.5,
            1.75,
            15
          ],
          "texture": "#this"
        },
        "east": {
          "uv": [
            14.25,
            14.5,
            15.25,
            15
          ],
          "texture": "#this"
        }
      }
    },
    {
      "from": [
        14.25,
        1,
        2.25
      ],
      "to": [
        15.25,
        1.5,
        3.25
      ],
      "faces": {
        "up": {
          "uv": [
            14.25,
            2.25,
            15.25,
            3.25
          ],
          "texture": "#this"
        },
        "north": {
          "uv": [
            0.75,
            14.5,
            1.75,
            15
          ],
          "texture": "#this"
        },
        "south": {
          "uv": [
            14.25,
            14.5,
            15.25,
            15
          ],
          "texture": "#this"
        },
        "west": {
          "uv": [
            2.25,
            14.5,
            3.25,
            15
          ],
          "texture": "#this"
        },
        "east": {
          "uv": [
            12.75,
            14.5,
            13.75,
            15
          ],
          "texture": "#this"
        }
      }
    },
    {
      "from": [
        14.25,
        1,
        3.75
      ],
      "to": [
        15.25,
        1.5,
        4.75
      ],
      "faces": {
        "up": {
          "uv": [
            14.25,
            3.75,
            15.25,
            4.75
          ],
          "texture": "#this"
        },
        "north": {
          "uv": [
            0.75,
            14.5,
            1.75,
            15
          ],
          "texture": "#this"
        },
        "south": {
          "uv": [
            14.25,
            14.5,
            15.25,
            15
          ],
          "texture": "#this"
        },
        "west": {
          "uv": [
            3.75,
            14.5,
            4.75,
            15
          ],
          "texture": "#this"
        },
        "east": {
          "uv": [
            11.25,
            14.5,
            12.25,
            15
          ],
          "texture": "#this"
        }
      }
    },
    {
      "from": [
        14.25,
        1,
        5.25
      ],
      "to": [
        15.25,
        1.5,
        6.25
      ],
      "faces": {
        "up": {
          "uv": [
            14.25,
            5.25,
            15.25,
            6.25
          ],
          "texture": "#this"
        },
        "north": {
          "uv": [
            0.75,
            14.5,
            1.75,
            15
          ],
          "texture": "#this"
        },
        "south": {
          "uv": [
            14.25,
            14.5,
            15.25,
            15
          ],
          "texture": "#this"
        },
        "west": {
          "uv": [
            5.25,
            14.5,
            6.25,
            15
          ],
          "texture": "#this"
        },
        "east": {
          "uv": [
            9.75,
            14.5,
            10.75,
            15
          ],
          "texture": "#this"
        }
      }
    },
    {
      "from": [
        14.25,
        1,
        6.75
      ],
      "to": [
        15.25,
        1.5,
        7.75
      ],
      "faces": {
        "up": {
          "uv": [
            14.25,
            6.75,
            15.25,
            7.75
          ],
          "texture": "#this"
        },
        "north": {
          "uv": [
            0.75,
            14.5,
            1.75,
            15
          ],
          "texture": "#this"
        },
        "south": {
          "uv": [
            14.25,
            14.5,
            15.25,
            15
          ],
          "texture": "#this"
        },
        "west": {
          "uv": [
            6.75,
            14.5,
            7.75,
            15
          ],
          "texture": "#this"
        },
        "east": {
          "uv": [
            8.25,
            14.5,
            9.25,
            15
          ],
          "texture": "#this"
        }
      }
    },
    {
      "from": [
        14.25,
        1,
        8.25
      ],
      "to": [
        15.25,
        1.5,
        9.25
      ],
      "faces": {
        "up": {
          "uv": [
            14.25,
            8.25,
            15.25,
            9.25
          ],
          "texture": "#this"
        },
        "north": {
          "uv": [
            0.75,
            14.5,
            1.75,
            15
          ],
          "texture": "#this"
        },
        "south": {
          "uv": [
            14.25,
            14.5,
            15.25,
            15
          ],
          "texture": "#this"
        },
        "west": {
          "uv": [
            8.25,
            14.5,
            9.25,
            15
          ],
          "texture": "#this"
        },
        "east": {
          "uv": [
            6.75,
            14.5,
            7.75,
            15
          ],
          "texture": "#this"
        }
      }
    },
    {
      "from": [
        14.25,
        1,
        9.75
      ],
      "to": [
        15.25,
        1.5,
        10.75
      ],
      "faces": {
        "up": {
          "uv": [
            14.25,
            9.75,
            15.25,
            10.75
          ],
          "texture": "#this"
        },
        "north": {
          "uv": [
            0.75,
            14.5,
            1.75,
            15
          ],
          "texture": "#this"
        },
        "south": {
          "uv": [
            14.25,
            14.5,
            15.25,
            15
          ],
          "texture": "#this"
        },
        "west": {
          "uv": [
            9.75,
            14.5,
            10.75,
            15
          ],
          "texture": "#this"
        },
        "east": {
          "uv": [
            5.25,
            14.5,
            6.25,
            15
          ],
          "texture": "#this"
        }
      }
    },
    {
      "from": [
        14.25,
        1,
        11.25
      ],
      "to": [
        15.25,
        1.5,
        12.25
      ],
      "faces": {
        "up": {
          "uv": [
            14.25,
            11.25,
            15.25,
            12.25
          ],
          "texture": "#this"
        },
        "north": {
          "uv": [
            0.75,
            14.5,
            1.75,
            15
          ],
          "texture": "#this"
        },
        "south": {
          "uv": [
            14.25,
            14.5,
            15.25,
            15
          ],
          "texture": "#this"
        },
        "west": {
          "uv": [
            11.25,
            14.5,
            12.25,
            15
          ],
          "texture": "#this"
        },
        "east": {
          "uv": [
            3.75,
            14.5,
            4.75,
            15
          ],
          "texture": "#this"
        }
      }
    },
    {
      "from": [
        14.25,
        1,
        12.75
      ],
      "to": [
        15.25,
        1.5,
        13.75
      ],
      "faces": {
        "up": {
          "uv": [
            14.25,
            12.75,
            15.25,
            13.75
          ],
          "texture": "#this"
        },
        "north": {
          "uv": [
            0.75,
            14.5,
            1.75,
            15
          ],
          "texture": "#this"
        },
        "south": {
          "uv": [
            14.25,
            14.5,
            15.25,
            15
          ],
          "texture": "#this"
        },
        "west": {
          "uv": [
            12.75,
            14.5,
            13.75,
            15
          ],
          "texture": "#this"
        },
        "east": {
          "uv": [
            2.25,
            14.5,
            3.25,
            15
          ],
          "texture": "#this"
        }
      }
    },
    {
      "from": [
        14.25,
        1,
        14.25
      ],
      "to": [
        15.25,
        1.5,
        15.25
      ],
      "faces": {
        "up": {
          "uv": [
            14.25,
            14.25,
            15.25,
            15.25
          ],
          "texture": "#this"
        },
        "north": {
          "uv": [
            0.75,
            14.5,
            1.75,
            15
          ],
          "texture": "#this"
        },
        "south": {
          "uv": [
            14.25,
            14.5,
            15.25,
            15
          ],
          "texture": "#this"
        },
        "west": {
          "uv": [
            14.25,
            14.5,
            15.25,
            15
          ],
          "texture": "#this"
        },
        "east": {
          "uv": [
            0.75,
            14.5,
            1.75,
            15
          ],
          "texture": "#this"
        }
      }
    }
  ]
}