{
  "parent": "minecraft:block/block",
  "textures": {"particle": "#side"},
  "elements": [
    {
      "from": [13, 12, 0],
      "to": [15, 13, 16],
      "faces": {
        "down": {"uv": [1, 0, 3, 16], "texture": "#side"},
        "west": {"uv": [0, 15, 16, 16], "texture": "#side"},
        "east": {"uv": [0, 15, 16, 16], "texture": "#side"}
      }
    },
    {
      "from": [13, 15, 0],
      "to": [15, 16, 16],
      "faces": {
        "up": {"uv": [1, 0, 3, 16], "texture": "#side"},
        "west": {"uv": [0, 12, 16, 13], "texture": "#side"},
        "east": {"uv": [0, 12, 16, 13], "texture": "#side"}
      }
    },
    {
      "from": [12, 13, 0],
      "to": [13, 15, 16],
      "faces": {
        "west": {"uv": [0, 13, 16, 15], "texture": "#side"},
        "down": {"uv": [0, 0, 1, 16], "texture": "#side"},
        "up": {"uv": [0, 0, 1, 16], "texture": "#side"}
      }
    },
    {
      "from": [15, 13, 0],
      "to": [16, 15, 16],
      "faces": {
        "east": {"uv": [0, 13, 16, 15], "texture": "#side"},
        "down": {"uv": [3, 0, 4, 16], "texture": "#side"},
        "up": {"uv": [3, 0, 4, 16], "texture": "#side"}
      }
    },
    {
      "from": [12, 12, 0],
      "to": [16, 16, 16],
      "faces": {
        "north": {"uv": [4, 0, 8, 4], "texture": "#side", "cullface": "north"},
        "south": {"uv": [4, 0, 8, 4], "texture": "#side"}
      }
    }
  ]
}
