{
  "ambientocclusion": false,
  "textures": {"particle": "#front"},
  "elements": [
    {
      "from": [0, 2, 8],
      "to": [16, 16, 9],
      "rotation": {"origin": [8, 8, 8], "axis": "y", "angle": -45},
      "faces": {
        "north": {"uv": [0, 2, 16, 16], "texture": "#back"},
        "south": {"uv": [0, 2, 16, 16], "texture": "#front"}
      }
    },
    {
      "from": [2, 8.5, 8],
      "to": [2.5, 11.5, 9],
      "rotation": {"origin": [8, 8, 8], "axis": "y", "angle": -45},
      "faces": {
        "down": {"uv": [2, 8, 2.5, 9], "texture": "#side"},
        "up": {"uv": [2, 8, 2.5, 9], "texture": "#side"}
      }
    },
    {
      "from": [2.5, 7.5, 8],
      "to": [3, 12.5, 9],
      "rotation": {"origin": [8, 8, 8], "axis": "y", "angle": -45},
      "faces": {
        "down": {"uv": [2.5, 8, 3, 9], "texture": "#side"},
        "up": {"uv": [2.5, 8, 3, 9], "texture": "#side"}
      }
    },
    {
      "from": [3, 6.5, 8],
      "to": [3.5, 13.5, 9],
      "rotation": {"origin": [8, 8, 8], "axis": "y", "angle": -45},
      "faces": {
        "down": {"uv": [3, 8, 3.5, 9], "texture": "#side"},
        "up": {"uv": [3, 8, 3.5, 9], "texture": "#side"}
      }
    },
    {
      "from": [3.5, 6, 8],
      "to": [4, 14, 9],
      "rotation": {"origin": [8, 8, 8], "axis": "y", "angle": -45},
      "faces": {
        "down": {"uv": [3.5, 8, 4, 9], "texture": "#side"},
        "up": {"uv": [3.5, 8, 4, 9], "texture": "#side"}
      }
    },
    {
      "from": [4, 5.5, 8],
      "to": [4.5, 14.5, 9],
      "rotation": {"origin": [8, 8, 8], "axis": "y", "angle": -45},
      "faces": {
        "down": {"uv": [4, 8, 4.5, 9], "texture": "#side"},
        "up": {"uv": [4, 8, 4.5, 9], "texture": "#side"}
      }
    },
    {
      "from": [4.5, 5, 8],
      "to": [5.5, 15, 9],
      "rotation": {"origin": [8, 8, 8], "axis": "y", "angle": -45},
      "faces": {
        "down": {"uv": [4.5, 8, 5.5, 9], "texture": "#side"},
        "up": {"uv": [4.5, 8, 5.5, 9], "texture": "#side"}
      }
    },
    {
      "from": [5.5, 4.5, 8],
      "to": [6.5, 15.5, 9],
      "rotation": {"origin": [8, 8, 8], "axis": "y", "angle": -45},
      "faces": {
        "down": {"uv": [5.5, 8, 6.5, 9], "texture": "#side"},
        "up": {"uv": [5.5, 8, 6.5, 9], "texture": "#side"}
      }
    },
    {
      "from": [6.5, 4, 8],
      "to": [9.5, 16, 9],
      "rotation": {"origin": [8, 8, 8], "axis": "y", "angle": -45},
      "faces": {
        "down": {"uv": [6.5, 8, 9.5, 9], "texture": "#side"},
        "up": {"uv": [6.5, 8, 9.5, 9], "texture": "#side", "cullface": "up"}
      }
    },
    {
      "from": [9.5, 4.5, 8],
      "to": [10.5, 15.5, 9],
      "rotation": {"origin": [8, 8, 8], "axis": "y", "angle": -45},
      "faces": {
        "down": {"uv": [9.5, 8, 10.5, 9], "texture": "#side"},
        "up": {"uv": [9.5, 8, 10.5, 9], "texture": "#side"}
      }
    },
    {
      "from": [10.5, 5, 8],
      "to": [11.5, 15, 9],
      "rotation": {"origin": [8, 8, 8], "axis": "y", "angle": -45},
      "faces": {
        "down": {"uv": [10.5, 8, 11.5, 9], "texture": "#side"},
        "up": {"uv": [10.5, 8, 11.5, 9], "texture": "#side"}
      }
    },
    {
      "from": [11.5, 5.5, 8],
      "to": [12, 14.5, 9],
      "rotation": {"origin": [8, 8, 8], "axis": "y", "angle": -45},
      "faces": {
        "down": {"uv": [11.5, 8, 12, 9], "texture": "#side"},
        "up": {"uv": [11.5, 8, 12, 9], "texture": "#side"}
      }
    },
    {
      "from": [12, 6, 8],
      "to": [12.5, 14, 9],
      "rotation": {"origin": [8, 8, 8], "axis": "y", "angle": -45},
      "faces": {
        "down": {"uv": [12, 8, 12.5, 9], "texture": "#side"},
        "up": {"uv": [12, 8, 12.5, 9], "texture": "#side"}
      }
    },
    {
      "from": [12.5, 6.5, 8],
      "to": [13, 13.5, 9],
      "rotation": {"origin": [8, 8, 8], "axis": "y", "angle": -45},
      "faces": {
        "down": {"uv": [12.5, 8, 13, 9], "texture": "#side"},
        "up": {"uv": [12.5, 8, 13, 9], "texture": "#side"}
      }
    },
    {
      "from": [13, 7.5, 8],
      "to": [13.5, 12.5, 9],
      "rotation": {"origin": [8, 8, 8], "axis": "y", "angle": -45},
      "faces": {
        "down": {"uv": [13, 8, 13.5, 9], "texture": "#side"},
        "up": {"uv": [13, 8, 13.5, 9], "texture": "#side"}
      }
    },
    {
      "from": [13.5, 8.5, 8],
      "to": [14, 11.5, 9],
      "rotation": {"origin": [8, 8, 8], "axis": "y", "angle": -45},
      "faces": {
        "down": {"uv": [13.5, 8, 14, 9], "texture": "#side"},
        "up": {"uv": [13.5, 8, 14, 9], "texture": "#side"}
      }
    },
    {
      "from": [6.5, 4, 8],
      "to": [9.5, 4.5, 9],
      "rotation": {"origin": [8, 8, 8], "axis": "y", "angle": -45},
      "faces": {
        "west": {"uv": [2, 8, 2.5, 9], "texture": "#side"},
        "east": {"uv": [2, 8, 2.5, 9], "texture": "#side"}
      }
    },
    {
      "from": [5.5, 4.5, 8],
      "to": [10.5, 5, 9],
      "rotation": {"origin": [8, 8, 8], "axis": "y", "angle": -45},
      "faces": {
        "west": {"uv": [2.5, 8, 3, 9], "texture": "#side"},
        "east": {"uv": [2.5, 8, 3, 9], "texture": "#side"}
      }
    },
    {
      "from": [4.5, 5, 8],
      "to": [11.5, 5.5, 9],
      "rotation": {"origin": [8, 8, 8], "axis": "y", "angle": -45},
      "faces": {
        "west": {"uv": [3, 8, 3.5, 9], "texture": "#side"},
        "east": {"uv": [3, 8, 3.5, 9], "texture": "#side"}
      }
    },
    {
      "from": [4, 5.5, 8],
      "to": [12, 6, 9],
      "rotation": {"origin": [8, 8, 8], "axis": "y", "angle": -45},
      "faces": {
        "west": {"uv": [3.5, 8, 4, 9], "texture": "#side"},
        "east": {"uv": [3.5, 8, 4, 9], "texture": "#side"}
      }
    },
    {
      "from": [3.5, 6, 8],
      "to": [12.5, 6.5, 9],
      "rotation": {"origin": [8, 8, 8], "axis": "y", "angle": -45},
      "faces": {
        "west": {"uv": [4, 8, 4.5, 9], "texture": "#side"},
        "east": {"uv": [4, 8, 4.5, 9], "texture": "#side"}
      }
    },
    {
      "from": [3, 6.5, 8],
      "to": [13, 7.5, 9],
      "rotation": {"origin": [8, 8, 8], "axis": "y", "angle": -45},
      "faces": {
        "west": {"uv": [4.5, 8, 5.5, 9], "texture": "#side"},
        "east": {"uv": [4.5, 8, 5.5, 9], "texture": "#side"}
      }
    },
    {
      "from": [2.5, 7.5, 8],
      "to": [13.5, 8.5, 9],
      "rotation": {"origin": [8, 8, 8], "axis": "y", "angle": -45},
      "faces": {
        "west": {"uv": [5.5, 8, 6.5, 9], "texture": "#side"},
        "east": {"uv": [5.5, 8, 6.5, 9], "texture": "#side"}
      }
    },
    {
      "from": [2, 8.5, 8],
      "to": [14, 11.5, 9],
      "rotation": {"origin": [8, 8, 8], "axis": "y", "angle": -45},
      "faces": {
        "west": {"uv": [6.5, 8, 9.5, 9], "texture": "#side"},
        "east": {"uv": [6.5, 8, 9.5, 9], "texture": "#side"}
      }
    },
    {
      "from": [2.5, 11.5, 8],
      "to": [13.5, 12.5, 9],
      "rotation": {"origin": [8, 8, 8], "axis": "y", "angle": -45},
      "faces": {
        "west": {"uv": [9.5, 8, 10.5, 9], "texture": "#side"},
        "east": {"uv": [9.5, 8, 10.5, 9], "texture": "#side"}
      }
    },
    {
      "from": [3, 12.5, 8],
      "to": [13, 13.5, 9],
      "rotation": {"origin": [8, 8, 8], "axis": "y", "angle": -45},
      "faces": {
        "west": {"uv": [10.5, 8, 11.5, 9], "texture": "#side"},
        "east": {"uv": [10.5, 8, 11.5, 9], "texture": "#side"}
      }
    },
    {
      "from": [3.5, 13.5, 8],
      "to": [12.5, 14, 9],
      "rotation": {"origin": [8, 8, 8], "axis": "y", "angle": -45},
      "faces": {
        "west": {"uv": [11.5, 8, 12, 9], "texture": "#side"},
        "east": {"uv": [11.5, 8, 12, 9], "texture": "#side"}
      }
    },
    {
      "from": [4, 14, 8],
      "to": [12, 14.5, 9],
      "rotation": {"origin": [8, 8, 8], "axis": "y", "angle": -45},
      "faces": {
        "west": {"uv": [12, 8, 12.5, 9], "texture": "#side"},
        "east": {"uv": [12, 8, 12.5, 9], "texture": "#side"}
      }
    },
    {
      "from": [4.5, 14.5, 8],
      "to": [11.5, 15, 9],
      "rotation": {"origin": [8, 8, 8], "axis": "y", "angle": -45},
      "faces": {
        "west": {"uv": [12.5, 8, 13, 9], "texture": "#side"},
        "east": {"uv": [12.5, 8, 13, 9], "texture": "#side"}
      }
    },
    {
      "from": [5.5, 15, 8],
      "to": [10.5, 15.5, 9],
      "rotation": {"origin": [8, 8, 8], "axis": "y", "angle": -45},
      "faces": {
        "west": {"uv": [13, 8, 13.5, 9], "texture": "#side"},
        "east": {"uv": [13, 8, 13.5, 9], "texture": "#side"}
      }
    },
    {
      "from": [6.5, 15.5, 8],
      "to": [9.5, 16, 9],
      "rotation": {"origin": [8, 8, 8], "axis": "y", "angle": -45},
      "faces": {
        "west": {"uv": [13.5, 8, 14, 9], "texture": "#side"},
        "east": {"uv": [13.5, 8, 14, 9], "texture": "#side"}
      }
    }
  ]
}
