{
  "parent": "regedt32:block/cntrafficsymbols/circle_rotation16",
  "textures": {
    "front": "regedt32:block/cntrafficsymbols/heightlimit_3d6",
    "side": "regedt32:block/cntrafficsymbols/circle_backboard"
  }
}
