{
  "variants": {
    "bottom=true": {"model": "regedt32:block/cntrafficsymbols/pink_dotted9_tp_bottom"},
    "bottom=false": {"model": "regedt32:block/cntrafficsymbols/pink_dotted9_tp_up"}
  }
}
