{
  "ambientocclusion": false,
  "textures": {
    "front": "regedt32:block/cntrafficsymbols/highway_km",
    "back": "regedt32:block/cntrafficsymbols/highway_km_backboard",
    "side": "regedt32:block/cntrafficsymbols/highway_km_backboard",
    "particle": "#front"
  },
  "elements": [
    {
      "from": [0, 0, 8],
      "to": [16, 16, 9],
      "rotation": {"origin": [8, 8, 8], "axis": "y", "angle": 22.5},
      "faces": {
        "north": {"uv": [0, 0, 16, 16], "texture": "#back"},
        "south": {"uv": [0, 0, 16, 16], "texture": "#front"}
      }
    },
    {
      "from": [2, 6, 8],
      "to": [2.5, 12, 9],
      "rotation": {"origin": [8, 8, 8], "axis": "y", "angle": 22.5},
      "faces": {
        "down": {"uv": [2, 8, 2.5, 9], "texture": "#side"},
        "up": {"uv": [2, 7, 2.5, 8], "texture": "#side"},
        "west": {"uv": [8, 4, 9, 10], "texture": "#side"}
      }
    },
    {
      "from": [2.5, 5.5, 8],
      "to": [3, 12, 9],
      "rotation": {"origin": [8, 8, 8], "axis": "y", "angle": 22.5},
      "faces": {
        "down": {"uv": [2.5, 8, 3, 9], "texture": "#side"},
        "up": {"uv": [2.5, 7, 3, 8], "texture": "#side"}
      }
    },
    {
      "from": [3, 5, 8],
      "to": [3.5, 12, 9],
      "rotation": {"origin": [8, 8, 8], "axis": "y", "angle": 22.5},
      "faces": {
        "down": {"uv": [3, 8, 3.5, 9], "texture": "#side"},
        "up": {"uv": [3, 7, 3.5, 8], "texture": "#side"}
      }
    },
    {
      "from": [3.5, 4.5, 8],
      "to": [4, 12, 9],
      "rotation": {"origin": [8, 8, 8], "axis": "y", "angle": 22.5},
      "faces": {
        "down": {"uv": [3.5, 8, 4, 9], "texture": "#side"},
        "up": {"uv": [3.5, 7, 4, 8], "texture": "#side"}
      }
    },
    {
      "from": [4, 4, 8],
      "to": [12, 12, 9],
      "rotation": {"origin": [8, 8, 8], "axis": "y", "angle": 22.5},
      "faces": {
        "down": {"uv": [4, 8, 12, 9], "texture": "#side"},
        "up": {"uv": [4, 7, 12, 8], "texture": "#side"}
      }
    },
    {
      "from": [12, 4.5, 8],
      "to": [12.5, 12, 9],
      "rotation": {"origin": [8, 8, 8], "axis": "y", "angle": 22.5},
      "faces": {
        "down": {"uv": [12, 8, 12.5, 9], "texture": "#side"},
        "up": {"uv": [12, 7, 12.5, 8], "texture": "#side"}
      }
    },
    {
      "from": [12.5, 5, 8],
      "to": [13, 12, 9],
      "rotation": {"origin": [8, 8, 8], "axis": "y", "angle": 22.5},
      "faces": {
        "down": {"uv": [12.5, 8, 13, 9], "texture": "#side"},
        "up": {"uv": [12.5, 7, 13, 8], "texture": "#side"}
      }
    },
    {
      "from": [13, 5.5, 8],
      "to": [13.5, 12, 9],
      "rotation": {"origin": [8, 8, 8], "axis": "y", "angle": 22.5},
      "faces": {
        "down": {"uv": [13, 8, 13.5, 9], "texture": "#side"},
        "up": {"uv": [13, 7, 13.5, 8], "texture": "#side"}
      }
    },
    {
      "from": [13.5, 6, 8],
      "to": [14, 12, 9],
      "rotation": {"origin": [8, 8, 8], "axis": "y", "angle": 22.5},
      "faces": {
        "down": {"uv": [13.5, 8, 14, 9], "texture": "#side"},
        "up": {"uv": [13.5, 7, 14, 8], "texture": "#side"},
        "east": {"uv": [7, 4, 8, 10], "texture": "#side"}
      }
    },
    {
      "from": [2.5, 5.5, 8],
      "to": [13.5, 6, 9],
      "rotation": {"origin": [8, 8, 8], "axis": "y", "angle": 22.5},
      "faces": {
        "west": {"uv": [8, 10, 9, 10.5], "texture": "#side"},
        "east": {"uv": [7, 10, 8, 10.5], "texture": "#side"}
      }
    },
    {
      "from": [3, 5, 8],
      "to": [13, 5.5, 9],
      "rotation": {"origin": [8, 8, 8], "axis": "y", "angle": 22.5},
      "faces": {
        "west": {"uv": [8, 10.5, 9, 11], "texture": "#side"},
        "east": {"uv": [7, 10.5, 8, 11], "texture": "#side"}
      }
    },
    {
      "from": [3.5, 4.5, 8],
      "to": [12.5, 5, 9],
      "rotation": {"origin": [8, 8, 8], "axis": "y", "angle": 22.5},
      "faces": {
        "west": {"uv": [8, 11, 9, 11.5], "texture": "#side"},
        "east": {"uv": [7, 11, 8, 11.5], "texture": "#side"}
      }
    },
    {
      "from": [4, 4, 8],
      "to": [12, 4.5, 9],
      "rotation": {"origin": [8, 8, 8], "axis": "y", "angle": 22.5},
      "faces": {
        "west": {"uv": [8, 11.5, 9, 12], "texture": "#side"},
        "east": {"uv": [7, 11.5, 8, 12], "texture": "#side"}
      }
    }
  ]
}
