{
  "variants": {
    "bottom=true": {"model": "regedt32:block/cntrafficsymbols/red_dotted7_tp_bottom"},
    "bottom=false": {"model": "regedt32:block/cntrafficsymbols/red_dotted7_tp_up"}
  }
}
