{
  "parent": "regedt32:block/cntrafficsymbols/circle_rotation15",
  "textures": {
    "front": "regedt32:block/cntrafficsymbols/heightlimit_9d2",
    "back": "regedt32:block/cntrafficsymbols/circle_backboard",
    "side": "regedt32:block/cntrafficsymbols/circle_backboard"
  }
}
