{
  "parent": "minecraft:block/block",
  "textures": {"particle": "#side"},
  "elements": [
    {
      "from": [13, 0, 12],
      "to": [15, 8, 13],
      "faces": {
        "north": {"uv": [1, 0, 3, 8], "texture": "#side"},
        "west": {"uv": [0, 0, 1, 8], "texture": "#side"},
        "east": {"uv": [3, 0, 4, 8], "texture": "#side"}
      }
    },
    {
      "from": [13, 0, 15],
      "to": [15, 8, 16],
      "faces": {
        "south": {"uv": [1, 0, 3, 8], "texture": "#side"},
        "west": {"uv": [3, 0, 4, 8], "texture": "#side"},
        "east": {"uv": [0, 0, 1, 8], "texture": "#side"}
      }
    },
    {
      "from": [12, 0, 13],
      "to": [13, 8, 15],
      "faces": {
        "west": {"uv": [1, 0, 3, 8], "texture": "#side"},
        "north": {"uv": [3, 0, 4, 8], "texture": "#side"},
        "south": {"uv": [0, 0, 1, 8], "texture": "#side"}
      }
    },
    {
      "from": [15, 0, 13],
      "to": [16, 8, 15],
      "faces": {
        "east": {"uv": [1, 0, 3, 8], "texture": "#side"},
        "north": {"uv": [0, 0, 1, 8], "texture": "#side"},
        "south": {"uv": [3, 0, 4, 8], "texture": "#side"}
      }
    },
    {
      "from": [12, 0, 12],
      "to": [16, 8, 16],
      "faces": {
        "down": {"uv": [4, 0, 8, 4], "texture": "#side", "cullface": "down"},
        "up": {"uv": [4, 0, 8, 4], "texture": "#side"}
      }
    }
  ]
}
