{
  "parent": "regedt32:block/cntrafficsymbols/circle_rotation1",
  "textures": {
    "front": "regedt32:block/cntrafficsymbols/lift_speedlimit_high_125",
    "back": "regedt32:block/cntrafficsymbols/circle_backboard",
    "side": "regedt32:block/cntrafficsymbols/circle_backboard"
  }
}
