{
  "parent": "regedt32:block/cntrafficsymbols/circle_rotation0",
  "textures": {
    "front": "regedt32:block/cntrafficsymbols/heightlimit_3d8",
    "back": "regedt32:block/cntrafficsymbols/circle_backboard",
    "side": "regedt32:block/cntrafficsymbols/circle_backboard"
  }
}
