{
  "parent": "minecraft:block/block",
  "textures": {"particle": "#side"},
  "elements": [
    {
      "from": [13, 6, 0],
      "to": [15, 7, 8],
      "faces": {
        "down": {"uv": [1, 0, 3, 8], "texture": "#side"},
        "west": {"uv": [0, 15, 8, 16], "texture": "#side"},
        "east": {"uv": [0, 15, 8, 16], "texture": "#side"}
      }
    },
    {
      "from": [13, 9, 0],
      "to": [15, 10, 8],
      "faces": {
        "up": {"uv": [1, 0, 3, 8], "texture": "#side"},
        "west": {"uv": [0, 12, 8, 13], "texture": "#side"},
        "east": {"uv": [0, 12, 8, 13], "texture": "#side"}
      }
    },
    {
      "from": [12, 7, 0],
      "to": [13, 9, 8],
      "faces": {
        "west": {"uv": [0, 13, 8, 15], "texture": "#side"},
        "down": {"uv": [0, 0, 1, 8], "texture": "#side"},
        "up": {"uv": [0, 0, 1, 8], "texture": "#side"}
      }
    },
    {
      "from": [15, 7, 0],
      "to": [16, 9, 8],
      "faces": {
        "east": {"uv": [0, 13, 8, 15], "texture": "#side"},
        "down": {"uv": [3, 0, 4, 8], "texture": "#side"},
        "up": {"uv": [3, 0, 4, 8], "texture": "#side"}
      }
    },
    {
      "from": [12, 6, 0],
      "to": [16, 10, 8],
      "faces": {
        "north": {"uv": [4, 0, 8, 4], "texture": "#side", "cullface": "north"},
        "south": {"uv": [4, 0, 8, 4], "texture": "#side"}
      }
    }
  ]
}
