{
  "parent": "minecraft:block/block",
  "textures": {
    "bottom": "regedt32:block/cntrafficsymbols/barricade_1m_edge_1m_height_bottom",
    "top": "regedt32:block/cntrafficsymbols/barricade_1m_edge_1m_height_top",
    "north": "regedt32:block/cntrafficsymbols/barricade_1m_edge_1m_height_north",
    "south": "regedt32:block/cntrafficsymbols/barricade_1m_edge_1m_height_south",
    "west": "regedt32:block/cntrafficsymbols/barricade_1m_edge_1m_height_west",
    "east": "regedt32:block/cntrafficsymbols/barricade_1m_edge_1m_height_east",
    "particle": "regedt32:block/cntrafficsymbols/barricade_1m_edge_1m_height_north"
  },
  "elements": [
    {
      "from": [0, 0, 0],
      "to": [16, 2, 16],
      "faces": {
        "down": {"uv": [0, 0, 16, 16], "texture": "#bottom", "cullface": "down"},
        "up": {"uv": [0, 0, 16, 16], "texture": "#bottom"},
        "north": {"uv": [0, 14, 16, 16], "texture": "#north", "cullface": "north"},
        "south": {"uv": [0, 14, 16, 16], "texture": "#south", "cullface": "south"},
        "west": {"uv": [0, 14, 16, 16], "texture": "#west", "cullface": "west"},
        "east": {"uv": [0, 14, 16, 16], "texture": "#east", "cullface": "east"}
      }
    },
    {
      "from": [2, 2, 2],
      "to": [14, 16, 14],
      "faces": {
        "up": {"uv": [0, 0, 12, 12], "texture": "#top", "cullface": "up"},
        "north": {"uv": [2, 0, 14, 14], "texture": "#north"},
        "south": {"uv": [2, 0, 14, 14], "texture": "#south"},
        "west": {"uv": [2, 0, 14, 14], "texture": "#west"},
        "east": {"uv": [2, 0, 14, 14], "texture": "#east"}
      }
    }
  ]
}
