{
  "type": "minecraft:block",
  "pools": [
    {
      "bonus_rolls": 0.0,
      "entries": [
        {
          "type": "minecraft:item",
          "functions": [
            {
              "function": "minecraft:explosion_decay"
            },
            {
              "function": "minecraft:copy_name",
              "source": "block_entity"
            }
          ],
          "name": "regedt32:cntrafficsymbols/blue_rod_with_lamp"
        }
      ],
      "rolls": 1.0
    }
  ],
  "random_sequence": "regedt32:cntrafficsymbols/blue_rod_with_lamp"
}
