{
  "values": [
    "regedt32:cntrafficsymbols/highway_exit_distance_info_right_single",
    "regedt32:cntrafficsymbols/highway_exit_distance_info_right_top",
    "regedt32:cntrafficsymbols/highway_exit_distance_info_right_middle",
    "regedt32:cntrafficsymbols/highway_exit_distance_info_right_bottom"
  ]
}
