{
  "parent": "regedt32:block/cntrafficsymbols/circle_rotation18",
  "textures": {
    "front": "regedt32:block/cntrafficsymbols/heightlimit_9d1",
    "side": "regedt32:block/cntrafficsymbols/circle_backboard"
  }
}
