{
  "textures": {"particle": "#front"},
  "elements": [
    {
      "from": [0, 0, 0],
      "to": [16, 16, 1],
      "faces": {
        "down": {"uv": [0, 8, 16, 9], "texture": "#side", "cullface": "down"},
        "up": {"uv": [0, 8, 16, 9], "texture": "#side", "cullface": "up"},
        "north": {"uv": [0, 0, 16, 16], "texture": "#back", "cullface": "north"},
        "south": {"uv": [0, 0, 16, 16], "texture": "#front"},
        "west": {"uv": [8, 0, 9, 16], "texture": "#side", "cullface": "west"},
        "east": {"uv": [8, 0, 9, 16], "texture": "#side", "cullface": "east"}
      }
    }
  ]
}
