{
  "ambientocclusion": false,
  "textures": {"particle": "#front"},
  "elements": [
    {
      "from": [6, 6, 7],
      "to": [10, 10, 9],
      "faces": {
        "north": {"uv": [0, 0, 16, 16], "texture": "#front"},
        "south": {"uv": [0, 0, 16, 16], "texture": "#front"}
      }
    },
    {
      "from": [6, 7.5, 7],
      "to": [6.25, 8.5, 9],
      "faces": {
        "down": {"uv": [0, 7, 1, 9], "texture": "#side"},
        "up": {"uv": [0, 7, 1, 9], "texture": "#side"}
      }
    },
    {
      "from": [6.25, 7, 7],
      "to": [6.5, 9, 9],
      "faces": {
        "down": {"uv": [1, 7, 2, 9], "texture": "#side"},
        "up": {"uv": [1, 7, 2, 9], "texture": "#side"}
      }
    },
    {
      "from": [6.5, 6.75, 7],
      "to": [6.75, 9.25, 9],
      "faces": {
        "down": {"uv": [2, 7, 3, 9], "texture": "#side"},
        "up": {"uv": [2, 7, 3, 9], "texture": "#side"}
      }
    },
    {
      "from": [6.75, 6.5, 7],
      "to": [7, 9.5, 9],
      "faces": {
        "down": {"uv": [3, 7, 4, 9], "texture": "#side"},
        "up": {"uv": [3, 7, 4, 9], "texture": "#side"}
      }
    },
    {
      "from": [7, 6.25, 7],
      "to": [7.5, 9.75, 9],
      "faces": {
        "down": {"uv": [4, 7, 6, 9], "texture": "#side"},
        "up": {"uv": [4, 7, 6, 9], "texture": "#side"}
      }
    },
    {
      "from": [7.5, 6, 7],
      "to": [8.5, 10, 9],
      "faces": {
        "down": {"uv": [6, 7, 10, 9], "texture": "#side"},
        "up": {"uv": [6, 7, 10, 9], "texture": "#side"}
      }
    },
    {
      "from": [8.5, 6.25, 7],
      "to": [9, 9.75, 9],
      "faces": {
        "down": {"uv": [10, 7, 12, 9], "texture": "#side"},
        "up": {"uv": [10, 7, 12, 9], "texture": "#side"}
      }
    },
    {
      "from": [9, 6.5, 7],
      "to": [9.25, 9.5, 9],
      "faces": {
        "down": {"uv": [12, 7, 13, 9], "texture": "#side"},
        "up": {"uv": [12, 7, 13, 9], "texture": "#side"}
      }
    },
    {
      "from": [9.25, 6.75, 7],
      "to": [9.5, 9.25, 9],
      "faces": {
        "down": {"uv": [13, 7, 14, 9], "texture": "#side"},
        "up": {"uv": [13, 7, 14, 9], "texture": "#side"}
      }
    },
    {
      "from": [9.5, 7, 7],
      "to": [9.75, 9, 9],
      "faces": {
        "down": {"uv": [14, 7, 15, 9], "texture": "#side"},
        "up": {"uv": [14, 7, 15, 9], "texture": "#side"}
      }
    },
    {
      "from": [9.75, 7.5, 7],
      "to": [10, 8.5, 9],
      "faces": {
        "down": {"uv": [15, 7, 16, 9], "texture": "#side"},
        "up": {"uv": [15, 7, 16, 9], "texture": "#side"}
      }
    },
    {
      "from": [7.5, 6, 7],
      "to": [8.5, 6.25, 9],
      "faces": {
        "west": {"uv": [0, 7, 1, 9], "texture": "#side"},
        "east": {"uv": [0, 7, 1, 9], "texture": "#side"}
      }
    },
    {
      "from": [7, 6.25, 7],
      "to": [9, 6.5, 9],
      "faces": {
        "west": {"uv": [1, 7, 2, 9], "texture": "#side"},
        "east": {"uv": [1, 7, 2, 9], "texture": "#side"}
      }
    },
    {
      "from": [6.75, 6.5, 7],
      "to": [9.25, 6.75, 9],
      "faces": {
        "west": {"uv": [2, 7, 3, 9], "texture": "#side"},
        "east": {"uv": [2, 7, 3, 9], "texture": "#side"}
      }
    },
    {
      "from": [6.5, 6.75, 7],
      "to": [9.5, 7, 9],
      "faces": {
        "west": {"uv": [3, 7, 4, 9], "texture": "#side"},
        "east": {"uv": [3, 7, 4, 9], "texture": "#side"}
      }
    },
    {
      "from": [6.25, 7, 7],
      "to": [9.75, 7.5, 9],
      "faces": {
        "west": {"uv": [4, 7, 6, 9], "texture": "#side"},
        "east": {"uv": [4, 7, 6, 9], "texture": "#side"}
      }
    },
    {
      "from": [6, 7.5, 7],
      "to": [10, 8.5, 9],
      "faces": {
        "west": {"uv": [6, 7, 10, 9], "texture": "#side"},
        "east": {"uv": [6, 7, 10, 9], "texture": "#side"}
      }
    },
    {
      "from": [6.25, 8.5, 7],
      "to": [9.75, 9, 9],
      "faces": {
        "west": {"uv": [10, 7, 12, 9], "texture": "#side"},
        "east": {"uv": [10, 7, 12, 9], "texture": "#side"}
      }
    },
    {
      "from": [6.5, 9, 7],
      "to": [9.5, 9.25, 9],
      "faces": {
        "west": {"uv": [12, 7, 13, 9], "texture": "#side"},
        "east": {"uv": [12, 7, 13, 9], "texture": "#side"}
      }
    },
    {
      "from": [6.75, 9.25, 7],
      "to": [9.25, 9.5, 9],
      "faces": {
        "west": {"uv": [13, 7, 14, 9], "texture": "#side"},
        "east": {"uv": [13, 7, 14, 9], "texture": "#side"}
      }
    },
    {
      "from": [7, 9.5, 7],
      "to": [9, 9.75, 9],
      "faces": {
        "west": {"uv": [14, 7, 15, 9], "texture": "#side"},
        "east": {"uv": [14, 7, 15, 9], "texture": "#side"}
      }
    },
    {
      "from": [7.5, 9.75, 7],
      "to": [8.5, 10, 9],
      "faces": {
        "west": {"uv": [15, 7, 16, 9], "texture": "#side"},
        "east": {"uv": [15, 7, 16, 9], "texture": "#side"}
      }
    }
  ]
}
