{
  "parent": "minecraft:recipes/root",
  "criteria": {
    "has_white_concrete": {
      "conditions": {"items": [{"items": ["minecraft:white_concrete"]}]},
      "trigger": "minecraft:inventory_changed"
    },
    "has_the_recipe": {
      "conditions": {"recipe": "regedt32:cntrafficsymbols/white_floor_line_eighth"},
      "trigger": "minecraft:recipe_unlocked"
    }
  },
  "requirements": [
    [
      "has_the_recipe",
      "has_white_concrete"
    ]
  ],
  "rewards": {"recipes": ["regedt32:cntrafficsymbols/white_floor_line_eighth"]},
  "sends_telemetry_event": false
}
