sku;reference_min_price;reference_price;reference_currency_code;stock;grading;warranty;shipping_profile_id;taxation;this_column_is_ignored
fooobar1;90;140;EUR;20;C;M24;8;GROSS;all fields defined by you
fooobar2;;;;;;;8;;mandatory only, defaults will be taken
