{
  "id": 458381,
  "num_rows": 20,
  "file_format": "sql",
  "name": "feedbacks.complaint_sign",
  "table_name": "feedbacks.complaint_sign",
  "include_create_sql": false,
  "columns": [
    {
      "name": "complaint_party_friend_id",
      "null_percentage": 0,
      "type": "Number",
      "min": 1,
      "max": 20,
      "decimals": 0,
      "formula": null
    },
    {
      "name": "signer_client_id",
      "null_percentage": 0,
      "type": "Number",
      "min": 1,
      "max": 10,
      "decimals": 0,
      "formula": null
    }
  ]
}