{
  "id": 458273,
  "num_rows": 20,
  "file_format": "sql",
  "name": "gifts.gift",
  "table_name": "gifts.gift",
  "include_create_sql": false,
  "columns": [
    {
      "name": "creator_client_id",
      "null_percentage": 0,
      "type": "Number",
      "min": 1,
      "max": 10,
      "decimals": 0,
      "formula": null
    },
    {
      "name": "description",
      "null_percentage": 0,
      "type": "Sentences",
      "min": 1,
      "max": 2,
      "formula": null
    }
  ]
}