^C:\USERS\משתמש\CHESSCODES\CHESS\CHESS\X64\DEBUG\BASEPIECE.OBJ|C:\USERS\משתמש\CHESSCODES\CHESS\CHESS\X64\DEBUG\BISHOP.OBJ|C:\USERS\משתמש\CHESSCODES\CHESS\CHESS\X64\DEBUG\BOARD.OBJ|C:\USERS\משתמש\CHESSCODES\CHESS\CHESS\X64\DEBUG\COMMUNICATION.OBJ|C:\USERS\משתמש\CHESSCODES\CHESS\CHESS\X64\DEBUG\KING.OBJ|C:\USERS\משתמש\CHESSCODES\CHESS\CHESS\X64\DEBUG\KNIGHT.OBJ|C:\USERS\משתמש\CHESSCODES\CHESS\CHESS\X64\DEBUG\MAIN.OBJ|C:\USERS\משתמש\CHESSCODES\CHESS\CHESS\X64\DEBUG\MENU.OBJ|C:\USERS\משתמש\CHESSCODES\CHESS\CHESS\X64\DEBUG\PAWN.OBJ|C:\USERS\משתמש\CHESSCODES\CHESS\CHESS\X64\DEBUG\QUEEN.OBJ|C:\USERS\משתמש\CHESSCODES\CHESS\CHESS\X64\DEBUG\ROOK.OBJ|C:\USERS\משתמש\CHESSCODES\CHESS\CHESS\X64\DEBUG\STDAFX.OBJ
C:\USERS\משתמש\CHESSCODES\CHESS\X64\DEBUG\CHESS.EXE
C:\USERS\משתמש\CHESSCODES\CHESS\X64\DEBUG\CHESS.ILK
C:\USERS\משתמש\CHESSCODES\CHESS\X64\DEBUG\CHESS.PDB
