<svg width="512" height="512" xmlns="http://www.w3.org/2000/svg">

 <g>
  <title>background</title>
  <rect fill="none" id="canvas_background" height="514" width="514" y="-1" x="-1"/>
 </g>
 <g>
  <title>Layer 1</title>
  <path stroke="null" fill="#001dff" d="m256.000001,2c-140.208,0 -254.000001,113.792 -254.000001,254.000001c0,140.208 113.792,254.000001 254.000001,254.000001c140.208,0 254.000001,-113.792 254.000001,-254.000001c0,-140.208 -113.792,-254.000001 -254.000001,-254.000001zm35.814,408.686001l0,48.514l-67.818,0l0,-49.022c-43.434,-9.144 -80.264,-37.084 -83.058,-86.36l49.784,0c2.54,26.67 20.828,47.498 67.31,47.498c49.784,0 60.96,-24.892 60.96,-40.386c0,-21.082 -11.176,-40.894 -67.818,-54.356c-62.992,-15.24 -106.172,-41.148 -106.172,-93.218c0,-43.688 35.306,-72.136 78.994,-81.534l0,-49.022l67.818,0l0,49.53c47.244,11.43 70.866,47.244 72.39,86.106l-49.784,0c-1.27,-28.194 -16.256,-47.498 -56.388,-47.498c-38.1,0 -60.96,17.272 -60.96,41.656c0,21.336 16.51,35.306 67.818,48.514c51.308,13.208 106.172,35.306 106.172,99.314c-0.254,46.482 -35.052,71.882 -79.248,80.264z" id="path"/>
 </g>
</svg>