{
    "$schema": "https://json-schema.org/draft/2019-09/schema",
    "title": "pgva-module-schema",
    "description": "A schema to define the configuration file of the pgva tool",
    "type": "object",
    "properties": {
        "dimensions": {
            "type": "object",
            "properties": {
                "xDimension": {"type": "number"},
                "yDimension": {"type": "number"},
                "zDimension": {"type": "number"},
                "additionalProperties": false
            }
        },
        "referencePoint": {"type": "string"},
        "devices": {
            "type": "array",
            "$defs": {
                "positive-number":{
                    "type": "number",
                    "minimum": 0
                }
            },
            "items": {
                "type": "object",
                "properties":{
                    "unique_id": {
                        "$ref": "#/$defs/positive-number"
                    },
                    "interface":{
                        "type": "string",
                        "description": "selection of interface"
                    },
                    "baudrate":{
                        "$ref": "#/$defs/positive-number",
                        "description": "Baudrate in serial mode"
                    },
                    "comPort": {
                        "type": "string",
                        "description": "the com port when using the serial interface"
                    },
                    "ip": {
                        "type": "string",
                        "description": "Ip address of the pgva"
                    },
                    "tcpPort": {
                        "$ref": "#/$defs/positive-number",
                        "description": "tcp modbus port"
                    },
                    "modbusSlave": {
                        "$ref": "#/$defs/positive-number",
                        "description": "The Slave ID"
                    }
                },
                "required": ["unique_id", "interface", "baudrate", "comPort", "ip", "tcpPort", "modbusSlave"]
            }
        }
    }
}