{
    "publisher": {
        "name": "fedora",
        "host": "localhost",
        "app_id": "fedora"
    },
    "exchange": {
        "name": "amq.topic",
        "exchange_type": "topic",
        "durable": "True"
    },
    "messages": [
        {
            "header": {
                "x-received-from": [
                    {
                        "uri": "amqp://guest:guest@localhost:5672/",
                        "exchange": "amq.topic"
                    }
                ]
            },
            "message_id": "random",
            "content_encoding": "utf-8",
            "body": {
                "artifact": {
                    "component": "exec-maven-plugin",
                    "scratch": false,
                    "id": 68771870,
                    "nvr": "exec-maven-plugin-3.0.0-1.fc35",
                    "type": "koji-build",
                    "issuer": "deamn"
                }
            },
            "routing_keys": "org.centos.prod.ci.product-build.artifact"
        },
        {
            "header": {
                "x-received-from": [
                    {
                        "uri": "amqp://guest:guest@localhost:5672/",
                        "exchange": "amq.topic"
                    }
                ]
            },
            "message_id": "random",
            "content_encoding": "utf-8",
            "body": {
                "artifact": {
                    "component": "exec-maven-plugin",
                    "scratch": false,
                    "id": 68771870,
                    "type": "koji-build",
                    "issuer": "deamn"
                }
            },
            "routing_keys": "org.centos.prod.ci.koji-build.artifact"
        },
        {
            "header": {
                "x-received-from": [
                    {
                        "uri": "amqp://guest:guest@localhost:5672/",
                        "exchange": "amq.topic"
                    }
                ]
            },
            "message_id": "random",
            "content_encoding": "utf-8",
            "body": {
                "artifact": {
                    "component": "exec-maven-plugin",
                    "scratch": false,
                    "id": 68771870,
                    "type": "non-matching",
                    "issuer": "deamn"
                }
            },
            "routing_keys": "org.centos.prod.buildsys.artifact"
        },
        {
            "header": {
                "x-received-from": [
                    {
                        "uri": "amqp://guest:guest@localhost:5672/",
                        "exchange": "amq.topic"
                    }
                ]
            },
            "message_id": "random",
            "content_encoding": "utf-8",
            "body": {
                "artifact": {
                    "component": "some-plugin",
                    "scratch": false,
                    "id": 68771870,
                    "nvr": "something-plugin-3.0.0-1.fc35",
                    "type": "non-matching",
                    "issuer": "deamn"
                }
            },
            "routing_keys": "org.centos.prod.ci.something.artifact"
        }
    ],
    "app_config": {
        "message_iteration": "1"
    }
}
