{
    "14864": {
        "build_id": 14864,
        "cg_id": "None",
        "completion_time": "2021-10-25 18:14:19.533976+00:00",
        "completion_ts": 1635185659.53398,
        "creation_event_id": 621343,
        "creation_time": "2021-10-25 18:13:03.216995+00:00",
        "creation_ts": 1635185583.217,
        "epoch": "None",
        "extra": {
            "source": {
                "original_url": "git+https://gitlab.com/redhat/centos-stream/rpms/accountsservice#cfaad780eacbd66b5239fbc90b5e08b7ad8cd74f"
            }
        },
        "id": 14864,
        "name": "accountsservice",
        "nvr": "accountsservice-0.6.55-9.el9",
        "owner_id": 75,
        "owner_name": "rstrode",
        "package_id": 22,
        "package_name": "accountsservice",
        "release": "9.el9",
        "source": "git+https://gitlab.com/redhat/centos-stream/rpms/accountsservice#cfaad780eacbd66b5239fbc90b5e08b7ad8cd74f",
        "start_time": "2021-10-25 18:13:03.212713+00:00",
        "start_ts": 1635185583.21271,
        "state": 1,
        "task_id": 746959,
        "version": "0.6.55",
        "volume_id": 0,
        "volume_name": "DEFAULT",
        "cg_name": "None"
    },
    "13311": {
        "build_id": 13311,
        "cg_id": "None",
        "completion_time": "2021-08-10 06:27:40.163949+00:00",
        "completion_ts": 1628576860.16395,
        "creation_event_id": 441396,
        "creation_time": "2021-08-10 06:11:20.547419+00:00",
        "creation_ts": 1628575880.54742,
        "epoch": "None",
        "extra": {
            "source": {
                "original_url": "git+https://gitlab.com/redhat/centos-stream/rpms/zlib#9999a0ed119b49c113ab07e6b3f1622621c7c817"
            }
        },
        "id": 13311,
        "name": "zlib",
        "nvr": "zlib-1.2.11-31.el9",
        "owner_id": 21,
        "owner_name": "mboddu",
        "package_id": 2368,
        "package_name": "zlib",
        "release": "31.el9",
        "source": "git+https://gitlab.com/redhat/centos-stream/rpms/zlib#9999a0ed119b49c113ab07e6b3f1622621c7c817",
        "start_time": "2021-08-10 06:11:20.542339+00:00",
        "start_ts": 1628575880.54234,
        "state": 1,
        "task_id": 563375,
        "version": "1.2.11",
        "volume_id": 0,
        "volume_name": "DEFAULT",
        "cg_name": "None"
    },
    "10884": {
        "build_id": 10884,
        "cg_id": "None",
        "completion_time": "2021-08-09 19:34:44.108130+00:00",
        "completion_ts": 1628537684.10813,
        "creation_event_id": 416232,
        "creation_time": "2021-08-09 19:33:35.780003+00:00",
        "creation_ts": 1628537615.78,
        "epoch": "None",
        "extra": {
            "source": {
                "original_url": "git+https://gitlab.com/redhat/centos-stream/rpms/biosdevname#fb2ba88eb2ba6d04ca7fa8dd74a2bfe65a1e0703"
            }
        },
        "id": 10884,
        "name": "biosdevname",
        "nvr": "biosdevname-0.7.3-9.el9",
        "owner_id": 21,
        "owner_name": "mboddu",
        "package_id": 115,
        "package_name": "biosdevname",
        "release": "9.el9",
        "source": "git+https://gitlab.com/redhat/centos-stream/rpms/biosdevname#fb2ba88eb2ba6d04ca7fa8dd74a2bfe65a1e0703",
        "start_time": "2021-08-09 19:33:35.775454+00:00",
        "start_ts": 1628537615.77545,
        "state": 1,
        "task_id": 553081,
        "version": "0.7.3",
        "volume_id": 0,
        "volume_name": "DEFAULT",
        "cg_name": "None"
    },
    "14336": {
        "build_id": 14336,
        "cg_id": "None",
        "completion_time": "2021-09-21 13:34:46.683069+00:00",
        "completion_ts": 1632231286.68307,
        "creation_event_id": 544209,
        "creation_time": "2021-09-21 13:33:45.397157+00:00",
        "creation_ts": 1632231225.39716,
        "epoch": "None",
        "extra": {
            "source": {
                "original_url": "git+https://gitlab.com/redhat/centos-stream/rpms/usbredir#62dc28ca77f9a6e71f49e676bad231de58d9d806"
            }
        },
        "id": 14336,
        "name": "usbredir",
        "nvr": "usbredir-0.8.0-9.el9",
        "owner_id": 339,
        "owner_name": "vtosodec",
        "package_id": 2252,
        "package_name": "usbredir",
        "release": "9.el9",
        "source": "git+https://gitlab.com/redhat/centos-stream/rpms/usbredir#62dc28ca77f9a6e71f49e676bad231de58d9d806",
        "start_time": "2021-09-21 13:33:45.392760+00:00",
        "start_ts": 1632231225.39276,
        "state": 1,
        "task_id": 674861,
        "version": "0.8.0",
        "volume_id": 0,
        "volume_name": "DEFAULT",
        "cg_name": "None"
    },
    "14955": {
        "build_id": 14955,
        "cg_id": "None",
        "completion_time": "2021-11-01 07:48:34.976483+00:00",
        "completion_ts": 1635752914.97648,
        "creation_event_id": 626131,
        "creation_time": "2021-11-01 07:44:02.380103+00:00",
        "creation_ts": 1635752642.3801,
        "epoch": "None",
        "extra": {
            "source": {
                "original_url": "git+https://gitlab.com/redhat/centos-stream/rpms/edk2#0ee943c68292f1d65adee180c37a487599f7dea4"
            }
        },
        "id": 14955,
        "name": "edk2",
        "nvr": "edk2-20210527gite1999b264f1f-7.el9",
        "owner_id": 36,
        "owner_name": "mrezanin",
        "package_id": 282,
        "package_name": "edk2",
        "release": "7.el9",
        "source": "git+https://gitlab.com/redhat/centos-stream/rpms/edk2#0ee943c68292f1d65adee180c37a487599f7dea4",
        "start_time": "2021-11-01 07:44:02.374309+00:00",
        "start_ts": 1635752642.37431,
        "state": 1,
        "task_id": 755267,
        "version": "20210527gite1999b264f1f",
        "volume_id": 0,
        "volume_name": "DEFAULT",
        "cg_name": "None"
    },
    "3875": {
        "build_id": 3875,
        "cg_id": "None",
        "completion_time": "2021-04-05 19:41:45.073842+00:00",
        "completion_ts": 1617651705.07384,
        "creation_event_id": 61152,
        "creation_time": "2021-04-05 19:41:45.079292+00:00",
        "creation_ts": 1617651705.07929,
        "epoch": "None",
        "extra": "None",
        "id": 3875,
        "name": "shim",
        "nvr": "shim-15-15.el8_2",
        "owner_id": 14,
        "owner_name": "bstinson",
        "package_id": 3318,
        "package_name": "shim",
        "release": "15.el8_2",
        "source": "None",
        "start_time": "2021-04-05 19:41:45.073842+00:00",
        "start_ts": 1617651705.07384,
        "state": 1,
        "task_id": "None",
        "version": "15",
        "volume_id": 0,
        "volume_name": "DEFAULT",
        "cg_name": "None"
    }
}
