{
    "cs8": {
        "common": [
            "abattis-cantarell-fonts-0.0.25-6.el8",
            "zlib-1.2.11-17.el8"
        ],
        "arch": {
            "x86_64": [
                "aspell-0.60.6.1-22.el8",
                "usbredir-0.8.0-1.el8"
            ],
            "aarch64": [
                "edk2-aarch64-20210527gite1999b264f1f-3.el8",
                "shim-aa64-15-15.el8_2"
            ]
        }
    }
}
