{
  "untriaged_builds": [],
  "non_booting_builds": [
    {
        "id": "rt_tier1_zstream:dry-run-checkout-id_x86_64_kernel-rt_kcidb_tool_17977646_10"
    }
  ],
  "regression_tests": [
    {
      "build_id": "rt_tier1_zstream:dry-run-checkout-id_x86_64_kernel-rt",
      "id": "rt_tier1_zstream:dry-run-checkout-id_x86_64_kernel-rt_kcidb_tool_17977646_11",
      "comment": "distribution/ltp/lite",
      "status": "ERROR",
      "misc": {
        "maintainers": [
          {
            "name": "test@redhat.com",
            "email": "test@redhat.com",
            "gitlab_username": null
          }
        ],
        "results": [
          {
            "id": "rt_tier1_zstream:dry-run-checkout-id_x86_64_kernel-rt_kcidb_tool_17977646_11.2",
            "name": "clock_gettime05",
            "status": "ERROR",
            "misc": {
              "iid": 48746636
            },
            "comment": "clock_gettime04",
            "test_id": "rt_tier1_zstream:dry-run-checkout-id_x86_64_kernel-rt_kcidb_tool_17977646_11"
          }
        ]
      }
    }
  ],
  "untriaged_tests": [
    {
      "build_id": "rt_tier1_zstream:dry-run-checkout-id_x86_64_kernel-rt",
      "id": "rt_tier1_zstream:dry-run-checkout-id_x86_64_kernel-rt_kcidb_tool_17977643_11",
      "comment": "distribution/ltp/lite",
      "status": "FAIL",
      "misc": {
        "maintainers": [
          {
            "name": "test@redhat.com",
            "email": "test@redhat.com",
            "gitlab_username": null
          }
        ],
        "results": [
          {
            "id": "rt_tier1_zstream:dry-run-checkout-id_x86_64_kernel-rt_kcidb_tool_17977643_11.2",
            "name": "clock_gettime04",
            "status": "FAIL",
            "misc": {
              "iid": 48746483
            },
            "comment": "clock_gettime04",
            "test_id": "rt_tier1_zstream:dry-run-checkout-id_x86_64_kernel-rt_kcidb_tool_17977643_11"
          }
        ]
      }
    }
  ],
  "missed_tests": []
}
