1: (7->7) いち
2: (14->14) に
3: (18->18) さん
4: (25->25) よん
5: (32->32) ご
6: (36->36) ろく
7: (43->43) なな
8: (50->50) はち
9: (57->57) きゅう
255: (6207->6207) にひゃくごじゅうご
256: (6235->6235) にひゃくごじゅうろく
0: (0->0) ゼロ
3: (18->18) さん
