{
    "name": "8_koji",
    "description": "List of koji 8 allowlist entries witoug c8s branch an zuul config",
    "header": [
        "package"
    ],
    "data": [
        "389-ds-base",
        "Judy",
        "Package",
        "SLOF",
        "ant",
        "ant-contrib",
        "antlr",
        "aopalliance",
        "apache-commons-beanutils",
        "apache-commons-cli",
        "apache-commons-codec",
        "apache-commons-collections",
        "apache-commons-compress",
        "apache-commons-exec",
        "apache-commons-io",
        "apache-commons-jxpath",
        "apache-commons-lang",
        "apache-commons-lang3",
        "apache-commons-logging",
        "apache-commons-net",
        "apache-commons-parent",
        "apache-ivy",
        "apache-parent",
        "apache-resource-bundles",
        "aqute-bnd",
        "assertj-core",
        "atinject",
        "bcel",
        "bea-stax",
        "beignet",
        "beust-jcommander",
        "bind-dyndb-ldap",
        "bsf",
        "bsh",
        "buildah",
        "byaccj",
        "byte-buddy",
        "cal10n",
        "cargo-vendor",
        "cc-config",
        "cdi-api",
        "centos-bookmarks",
        "centos-obsolete-packages",
        "centos-release-stream",
        "centos-repos",
        "centpkg-minimal",
        "cglib",
        "cjose",
        "clang",
        "cobbler",
        "cockpit-podman",
        "compiler-rt",
        "conmon",
        "container-selinux",
        "containernetworking-plugins",
        "containers-common",
        "crun",
        "custodia",
        "devtoolset-7",
        "devtoolset-7-binutils",
        "devtoolset-7-gcc",
        "disruptor",
        "djvulibre",
        "dnf-plugin-spacewalk",
        "dom4j",
        "easymock",
        "exec-maven-plugin",
        "felix-osgi-compendium",
        "felix-osgi-core",
        "felix-osgi-foundation",
        "felix-parent",
        "felix-utils",
        "festival",
        "flatpak-runtime",
        "forge-parent",
        "freeradius",
        "fuse-overlayfs",
        "fusesource-pom",
        "galera",
        "gcc-toolset-9-gcc-toolset-9",
        "gcc-toolset-9-gdb",
        "geronimo-annotation",
        "geronimo-jms",
        "geronimo-jpa",
        "geronimo-parent-poms",
        "ghc-JuicyPixels",
        "gimp",
        "glassfish-annotation-api",
        "glassfish-el",
        "glassfish-fastinfoset",
        "glassfish-jax-rs-api",
        "glassfish-jaxb",
        "glassfish-jaxb-api",
        "glassfish-jsp-api",
        "glassfish-legal",
        "glassfish-master-pom",
        "glassfish-servlet-api",
        "glibc32",
        "go-toolset",
        "golang",
        "golang-ecosystem",
        "golang-github-osbuild-composer",
        "google-guice",
        "guava20",
        "hamcrest",
        "hawtjni",
        "hivex",
        "httpcomponents-client",
        "httpcomponents-core",
        "httpcomponents-project",
        "httpd",
        "idm",
        "ignition",
        "inkscape",
        "insight-client",
        "ipa",
        "ipa-idoverride-memberof",
        "isorelax",
        "iwlfifi_dup",
        "jackson-annotations",
        "jackson-core",
        "jackson-databind",
        "jackson-jaxrs-providers",
        "jackson-module-jaxb-annotations",
        "jakarta-commons-httpclient",
        "jakarta-oro",
        "jansi",
        "jansi-native",
        "java_cup",
        "javacc",
        "javacc-maven-plugin",
        "javamail",
        "javapackages-tools",
        "javassist",
        "jaxen",
        "jboss-interceptors-1.2-api",
        "jboss-parent",
        "jctools",
        "jdepend",
        "jdependency",
        "jdom",
        "jdom2",
        "jflex",
        "jigdo",
        "jline",
        "jsch",
        "jsoup",
        "jsr-305",
        "jss",
        "jtidy",
        "junit",
        "jvnet-parent",
        "jzlib",
        "kmod-redhat-btusb",
        "kmod-redhat-iwlwifi",
        "ldapjdk",
        "libecap",
        "libguestfs",
        "libguestfs-winsupport",
        "libiscsi",
        "libomp",
        "libserf",
        "libslirp",
        "libssh2",
        "libtpms",
        "libvirt",
        "libvirt-dbus",
        "libvirt-python",
        "libxcam",
        "libzip",
        "lld",
        "lldb",
        "llvm",
        "llvm-toolset",
        "llvm-toolset-6.0",
        "llvm-toolset-6.0-clang",
        "llvm-toolset-6.0-compiler-rt",
        "llvm-toolset-6.0-libomp",
        "llvm-toolset-6.0-lld",
        "llvm-toolset-6.0-lldb",
        "llvm-toolset-6.0-llvm",
        "llvm-toolset-6.0-python-lit",
        "log4j",
        "log4j12",
        "mailman",
        "mariadb",
        "maven",
        "maven-antrun-plugin",
        "maven-archiver",
        "maven-artifact-resolver",
        "maven-artifact-transfer",
        "maven-assembly-plugin",
        "maven-clean-plugin",
        "maven-common-artifact-filters",
        "maven-compiler-plugin",
        "maven-dependency-analyzer",
        "maven-dependency-plugin",
        "maven-dependency-tree",
        "maven-doxia",
        "maven-doxia-sitetools",
        "maven-enforcer",
        "maven-file-management",
        "maven-filtering",
        "maven-install-plugin",
        "maven-invoker",
        "maven-invoker-plugin",
        "maven-jar-plugin",
        "maven-parent",
        "maven-plugin-build-helper",
        "maven-plugin-bundle",
        "maven-plugin-testing",
        "maven-plugin-tools",
        "maven-plugins-pom",
        "maven-remote-resources-plugin",
        "maven-reporting-api",
        "maven-reporting-impl",
        "maven-resolver",
        "maven-resources-plugin",
        "maven-script-interpreter",
        "maven-shade-plugin",
        "maven-shared",
        "maven-shared-incremental",
        "maven-shared-io",
        "maven-shared-utils",
        "maven-source-plugin",
        "maven-surefire",
        "maven-verifier",
        "maven-wagon",
        "maven2",
        "mecab",
        "mecab-ipadic",
        "mercurial",
        "mingw-libgcrypt",
        "mingw-libgpg-error",
        "mingw-qemu-ga-win",
        "mockito",
        "mod_auth_openidc",
        "mod_http2",
        "modello",
        "mojo-parent",
        "msv",
        "munge-maven-plugin",
        "mysql",
        "nbdkit",
        "netcf",
        "nginx",
        "nodejs",
        "nodejs-nodemon",
        "nodejs-packaging",
        "objectweb-asm",
        "objectweb-pom",
        "objenesis",
        "oci-seccomp-bpf-hook",
        "oci-systemd-hook",
        "oci-umount",
        "opendnssec",
        "os-maven-plugin",
        "osad",
        "osgi-annotation",
        "osgi-compendium",
        "osgi-core",
        "parfait",
        "perl-FCGI",
        "perl-Sys-Virt",
        "pg_repack",
        "php",
        "php-pear",
        "php-pecl-apcu",
        "php-pecl-rrd",
        "php-pecl-xdebug",
        "php-pecl-zip",
        "pki-core",
        "pki-servlet-container",
        "plexus-ant-factory",
        "plexus-archiver",
        "plexus-bsh-factory",
        "plexus-build-api",
        "plexus-cipher",
        "plexus-classworlds",
        "plexus-cli",
        "plexus-compiler",
        "plexus-component-api",
        "plexus-component-factories-pom",
        "plexus-components-pom",
        "plexus-containers",
        "plexus-i18n",
        "plexus-interactivity",
        "plexus-interpolation",
        "plexus-io",
        "plexus-languages",
        "plexus-pom",
        "plexus-resources",
        "plexus-sec-dispatcher",
        "plexus-utils",
        "plexus-velocity",
        "podman",
        "postgres-decoderbufs",
        "postgresql",
        "powermock",
        "pybind11",
        "pygobject2",
        "pygtk2",
        "python-PyMySQL",
        "python-atomicwrites",
        "python-backports",
        "python-backports-ssl_match_hostname",
        "python-distro",
        "python-docs",
        "python-funcsigs",
        "python-iniconfig",
        "python-ipaddress",
        "python-jwcrypto",
        "python-kdcproxy",
        "python-lit",
        "python-more-itertools",
        "python-nss",
        "python-podman",
        "python-podman-api",
        "python-pymongo",
        "python-pyvmomi",
        "python-qrcode",
        "python-setuptools-rust",
        "python-toml",
        "python-virtualenv",
        "python-wcwidth",
        "python-websocket-client",
        "python-yubico",
        "python2-pip",
        "python2-pycairo",
        "python2-rpm-macros",
        "python2-setuptools",
        "python2-six",
        "pyusb",
        "qdox",
        "qemu-kvm",
        "quagga",
        "rapidjson",
        "redis",
        "regexp",
        "relaxngDatatype",
        "relaxngcc",
        "resteasy",
        "rhn-client-tools",
        "rhn-custom-info",
        "rhn-virtualization",
        "rhncfg",
        "rhnlib",
        "rhnpush",
        "rhnsd",
        "rmd",
        "ruby",
        "rubygem-abrt",
        "rubygem-bson",
        "rubygem-bundler",
        "rubygem-mongo",
        "rubygem-mysql2",
        "rubygem-pg",
        "runc",
        "rust",
        "rust-toolset",
        "sapconf",
        "scala",
        "scipy",
        "seabios",
        "sgabios",
        "si-units",
        "sisu",
        "sisu-mojos",
        "skopeo",
        "slapi-nis",
        "slf4j",
        "slirp4netns",
        "sonatype-oss-parent",
        "sonatype-plugins-parent",
        "spacewalk-abrt",
        "spacewalk-backend",
        "spacewalk-client-cert",
        "spacewalk-koan",
        "spacewalk-oscap",
        "spacewalk-remote-utils",
        "spacewalk-usix",
        "spec-version-maven-plugin",
        "spice-parent",
        "spice-qxl-wddm",
        "spice-usbdk-win",
        "squid",
        "stax-ex",
        "subversion",
        "supermin",
        "swig",
        "testng",
        "tomcatjss",
        "toolbox",
        "tree",
        "unit-api",
        "uom-lib",
        "uom-parent",
        "uom-se",
        "uom-systems",
        "userspace",
        "utf8proc",
        "varnish",
        "varnish-modules",
        "velocity",
        "weld-parent",
        "xalan-j2",
        "xbean",
        "xerces-j2",
        "xml-commons-apis",
        "xml-commons-resolver",
        "xml-stylebook",
        "xmlstreambuffer",
        "xmlunit",
        "xmvn",
        "xpp3",
        "xsom",
        "xz-java"
    ],
    "type": "list",
    "utcnow": [
        null
    ]
}