{
    "name": "9_branches",
    "description": "List of packages where there is either c8s branch or koji allowlist entry missing",
    "header": [
        "package",
        "c9s",
        "koji_allowlist_9",
        "zuul_centos_distgit"
    ],
    "table": [
        [
            "OpenEXR",
            1,
            0,
            0
        ],
        [
            "SDL",
            1,
            0,
            0
        ],
        [
            "SLOF",
            1,
            0,
            0
        ],
        [
            "SuperLU",
            1,
            0,
            0
        ],
        [
            "alex",
            1,
            0,
            0
        ],
        [
            "amanda",
            1,
            0,
            0
        ],
        [
            "ant-contrib",
            1,
            0,
            0
        ],
        [
            "aopalliance",
            1,
            0,
            0
        ],
        [
            "apache-commons-exec",
            1,
            0,
            0
        ],
        [
            "apache-commons-lang",
            1,
            0,
            0
        ],
        [
            "apache-ivy",
            1,
            0,
            0
        ],
        [
            "atf",
            1,
            0,
            0
        ],
        [
            "autoconf213",
            1,
            0,
            0
        ],
        [
            "autogen",
            1,
            0,
            0
        ],
        [
            "awscli",
            1,
            0,
            0
        ],
        [
            "bsh",
            1,
            0,
            0
        ],
        [
            "cal10n",
            1,
            0,
            0
        ],
        [
            "cdparanoia",
            1,
            0,
            0
        ],
        [
            "cdrdao",
            1,
            0,
            0
        ],
        [
            "cdrkit",
            1,
            0,
            0
        ],
        [
            "centos-release",
            1,
            0,
            0
        ],
        [
            "centos-stream-release",
            0,
            1,
            0
        ],
        [
            "ceres-solver",
            1,
            0,
            0
        ],
        [
            "compat-libtiff3",
            1,
            0,
            0
        ],
        [
            "cppcheck",
            1,
            0,
            0
        ],
        [
            "custodia",
            1,
            0,
            0
        ],
        [
            "dom4j",
            1,
            0,
            0
        ],
        [
            "dotnet-build-reference-packages",
            1,
            0,
            0
        ],
        [
            "dotnet3.1",
            1,
            0,
            0
        ],
        [
            "drpm",
            1,
            0,
            0
        ],
        [
            "dump",
            1,
            0,
            0
        ],
        [
            "dvdplusrw-tools",
            1,
            0,
            0
        ],
        [
            "exec-maven-plugin",
            1,
            0,
            0
        ],
        [
            "extra-enforcer-rules",
            0,
            1,
            0
        ],
        [
            "fence-virt",
            1,
            0,
            0
        ],
        [
            "file-roller",
            1,
            0,
            0
        ],
        [
            "forge-parent",
            1,
            0,
            0
        ],
        [
            "fuse-sshfs",
            1,
            0,
            0
        ],
        [
            "gcc-toolset-12",
            0,
            1,
            0
        ],
        [
            "gcc-toolset-12-annobin",
            0,
            1,
            0
        ],
        [
            "gcc-toolset-12-binutils",
            0,
            1,
            0
        ],
        [
            "gcc-toolset-12-dwz",
            0,
            1,
            0
        ],
        [
            "gcc-toolset-12-gcc",
            0,
            1,
            0
        ],
        [
            "gcc-toolset-12-gdb",
            0,
            1,
            0
        ],
        [
            "genwqe-tools",
            1,
            0,
            0
        ],
        [
            "gfbgraph",
            1,
            0,
            0
        ],
        [
            "gflags",
            1,
            0,
            0
        ],
        [
            "ghc",
            1,
            0,
            0
        ],
        [
            "ghc-Glob",
            1,
            0,
            0
        ],
        [
            "ghc-HTTP",
            1,
            0,
            0
        ],
        [
            "ghc-HUnit",
            1,
            0,
            0
        ],
        [
            "ghc-JuicyPixels",
            1,
            0,
            0
        ],
        [
            "ghc-QuickCheck",
            1,
            0,
            0
        ],
        [
            "ghc-SHA",
            1,
            0,
            0
        ],
        [
            "ghc-aeson",
            1,
            0,
            0
        ],
        [
            "ghc-aeson-pretty",
            1,
            0,
            0
        ],
        [
            "ghc-ansi-terminal",
            1,
            0,
            0
        ],
        [
            "ghc-ansi-wl-pprint",
            1,
            0,
            0
        ],
        [
            "ghc-asn1-encoding",
            1,
            0,
            0
        ],
        [
            "ghc-asn1-parse",
            1,
            0,
            0
        ],
        [
            "ghc-asn1-types",
            1,
            0,
            0
        ],
        [
            "ghc-async",
            1,
            0,
            0
        ],
        [
            "ghc-attoparsec",
            1,
            0,
            0
        ],
        [
            "ghc-base-compat",
            1,
            0,
            0
        ],
        [
            "ghc-base16-bytestring",
            1,
            0,
            0
        ],
        [
            "ghc-base64-bytestring",
            1,
            0,
            0
        ],
        [
            "ghc-basement",
            1,
            0,
            0
        ],
        [
            "ghc-blaze-builder",
            1,
            0,
            0
        ],
        [
            "ghc-blaze-html",
            1,
            0,
            0
        ],
        [
            "ghc-blaze-markup",
            1,
            0,
            0
        ],
        [
            "ghc-call-stack",
            1,
            0,
            0
        ],
        [
            "ghc-case-insensitive",
            1,
            0,
            0
        ],
        [
            "ghc-cereal",
            1,
            0,
            0
        ],
        [
            "ghc-clock",
            1,
            0,
            0
        ],
        [
            "ghc-cmark-gfm",
            1,
            0,
            0
        ],
        [
            "ghc-cmdargs",
            1,
            0,
            0
        ],
        [
            "ghc-colour",
            1,
            0,
            0
        ],
        [
            "ghc-connection",
            1,
            0,
            0
        ],
        [
            "ghc-cookie",
            1,
            0,
            0
        ],
        [
            "ghc-cryptonite",
            1,
            0,
            0
        ],
        [
            "ghc-data-default",
            1,
            0,
            0
        ],
        [
            "ghc-data-default-class",
            1,
            0,
            0
        ],
        [
            "ghc-data-default-instances-containers",
            1,
            0,
            0
        ],
        [
            "ghc-data-default-instances-dlist",
            1,
            0,
            0
        ],
        [
            "ghc-data-default-instances-old-locale",
            1,
            0,
            0
        ],
        [
            "ghc-digest",
            1,
            0,
            0
        ],
        [
            "ghc-dlist",
            1,
            0,
            0
        ],
        [
            "ghc-doctemplates",
            1,
            0,
            0
        ],
        [
            "ghc-exceptions",
            1,
            0,
            0
        ],
        [
            "ghc-foundation",
            1,
            0,
            0
        ],
        [
            "ghc-haddock-library",
            1,
            0,
            0
        ],
        [
            "ghc-hashable",
            1,
            0,
            0
        ],
        [
            "ghc-hourglass",
            1,
            0,
            0
        ],
        [
            "ghc-hslua",
            1,
            0,
            0
        ],
        [
            "ghc-hslua-module-text",
            1,
            0,
            0
        ],
        [
            "ghc-hspec",
            1,
            0,
            0
        ],
        [
            "ghc-hspec-core",
            1,
            0,
            0
        ],
        [
            "ghc-hspec-discover",
            1,
            0,
            0
        ],
        [
            "ghc-hspec-expectations",
            1,
            0,
            0
        ],
        [
            "ghc-http-client",
            1,
            0,
            0
        ],
        [
            "ghc-http-client-tls",
            1,
            0,
            0
        ],
        [
            "ghc-http-types",
            1,
            0,
            0
        ],
        [
            "ghc-hxt",
            1,
            0,
            0
        ],
        [
            "ghc-hxt-charproperties",
            1,
            0,
            0
        ],
        [
            "ghc-hxt-regex-xmlschema",
            1,
            0,
            0
        ],
        [
            "ghc-hxt-unicode",
            1,
            0,
            0
        ],
        [
            "ghc-integer-logarithms",
            1,
            0,
            0
        ],
        [
            "ghc-memory",
            1,
            0,
            0
        ],
        [
            "ghc-mime-types",
            1,
            0,
            0
        ],
        [
            "ghc-network",
            1,
            0,
            0
        ],
        [
            "ghc-network-uri",
            1,
            0,
            0
        ],
        [
            "ghc-old-locale",
            1,
            0,
            0
        ],
        [
            "ghc-optparse-applicative",
            1,
            0,
            0
        ],
        [
            "ghc-pandoc-types",
            1,
            0,
            0
        ],
        [
            "ghc-pem",
            1,
            0,
            0
        ],
        [
            "ghc-primitive",
            1,
            0,
            0
        ],
        [
            "ghc-quickcheck-io",
            1,
            0,
            0
        ],
        [
            "ghc-random",
            1,
            0,
            0
        ],
        [
            "ghc-regex-base",
            1,
            0,
            0
        ],
        [
            "ghc-regex-pcre",
            1,
            0,
            0
        ],
        [
            "ghc-safe",
            1,
            0,
            0
        ],
        [
            "ghc-scientific",
            1,
            0,
            0
        ],
        [
            "ghc-semigroups",
            1,
            0,
            0
        ],
        [
            "ghc-setenv",
            1,
            0,
            0
        ],
        [
            "ghc-skylighting",
            1,
            0,
            0
        ],
        [
            "ghc-socks",
            1,
            0,
            0
        ],
        [
            "ghc-split",
            1,
            0,
            0
        ],
        [
            "ghc-streaming-commons",
            1,
            0,
            0
        ],
        [
            "ghc-syb",
            1,
            0,
            0
        ],
        [
            "ghc-tagged",
            1,
            0,
            0
        ],
        [
            "ghc-tagsoup",
            1,
            0,
            0
        ],
        [
            "ghc-tasty",
            1,
            0,
            0
        ],
        [
            "ghc-tasty-hunit",
            1,
            0,
            0
        ],
        [
            "ghc-tasty-quickcheck",
            1,
            0,
            0
        ],
        [
            "ghc-temporary",
            1,
            0,
            0
        ],
        [
            "ghc-texmath",
            1,
            0,
            0
        ],
        [
            "ghc-tf-random",
            1,
            0,
            0
        ],
        [
            "ghc-th-abstraction",
            1,
            0,
            0
        ],
        [
            "ghc-tls",
            1,
            0,
            0
        ],
        [
            "ghc-transformers-compat",
            1,
            0,
            0
        ],
        [
            "ghc-unbounded-delays",
            1,
            0,
            0
        ],
        [
            "ghc-unordered-containers",
            1,
            0,
            0
        ],
        [
            "ghc-utf8-string",
            1,
            0,
            0
        ],
        [
            "ghc-uuid-types",
            1,
            0,
            0
        ],
        [
            "ghc-vector",
            1,
            0,
            0
        ],
        [
            "ghc-x509",
            1,
            0,
            0
        ],
        [
            "ghc-x509-store",
            1,
            0,
            0
        ],
        [
            "ghc-x509-system",
            1,
            0,
            0
        ],
        [
            "ghc-x509-validation",
            1,
            0,
            0
        ],
        [
            "ghc-xml",
            1,
            0,
            0
        ],
        [
            "ghc-zip-archive",
            1,
            0,
            0
        ],
        [
            "ghc-zlib",
            1,
            0,
            0
        ],
        [
            "glew",
            1,
            0,
            0
        ],
        [
            "glog",
            1,
            0,
            0
        ],
        [
            "gnome-online-miners",
            1,
            0,
            0
        ],
        [
            "gssntlmssp",
            1,
            0,
            0
        ],
        [
            "gtest",
            1,
            0,
            0
        ],
        [
            "guile",
            1,
            0,
            0
        ],
        [
            "hawtjni",
            1,
            0,
            0
        ],
        [
            "hscolour",
            1,
            0,
            0
        ],
        [
            "isorelax",
            1,
            0,
            0
        ],
        [
            "jakarta-commons-httpclient",
            1,
            0,
            0
        ],
        [
            "jansi-native",
            1,
            0,
            0
        ],
        [
            "java-atk-wrapper",
            1,
            0,
            0
        ],
        [
            "javacc",
            1,
            0,
            0
        ],
        [
            "javacc-maven-plugin",
            1,
            0,
            0
        ],
        [
            "javamail",
            1,
            0,
            0
        ],
        [
            "javassist",
            1,
            0,
            0
        ],
        [
            "jaxen",
            1,
            0,
            0
        ],
        [
            "jboss-annotations-1.2-api",
            1,
            0,
            0
        ],
        [
            "jboss-logmanager",
            1,
            0,
            0
        ],
        [
            "jboss-modules",
            1,
            0,
            0
        ],
        [
            "jline",
            1,
            0,
            0
        ],
        [
            "jtidy",
            1,
            0,
            0
        ],
        [
            "kyua",
            1,
            0,
            0
        ],
        [
            "latexmk",
            1,
            0,
            0
        ],
        [
            "lensfun",
            1,
            0,
            0
        ],
        [
            "libIDL",
            1,
            0,
            0
        ],
        [
            "libXNVCtrl",
            1,
            0,
            0
        ],
        [
            "libaec",
            1,
            0,
            0
        ],
        [
            "libavc1394",
            1,
            0,
            0
        ],
        [
            "libcacard",
            1,
            0,
            0
        ],
        [
            "libcgroup",
            1,
            0,
            0
        ],
        [
            "libcxl",
            1,
            0,
            0
        ],
        [
            "libdap",
            1,
            0,
            0
        ],
        [
            "libdc1394",
            1,
            0,
            0
        ],
        [
            "libdv",
            1,
            0,
            0
        ],
        [
            "libgovirt",
            1,
            0,
            0
        ],
        [
            "libidn",
            1,
            0,
            0
        ],
        [
            "libiec61883",
            1,
            0,
            0
        ],
        [
            "libmemcached",
            1,
            0,
            0
        ],
        [
            "libmetalink",
            1,
            0,
            0
        ],
        [
            "libmusicbrainz5",
            1,
            0,
            0
        ],
        [
            "liboauth",
            1,
            0,
            0
        ],
        [
            "liboggz",
            1,
            0,
            0
        ],
        [
            "libraw1394",
            1,
            0,
            0
        ],
        [
            "libtar",
            1,
            0,
            0
        ],
        [
            "libucil",
            1,
            0,
            0
        ],
        [
            "libunicap",
            1,
            0,
            0
        ],
        [
            "libvarlink",
            1,
            0,
            0
        ],
        [
            "libvncserver",
            1,
            0,
            0
        ],
        [
            "libyami",
            1,
            0,
            0
        ],
        [
            "log4j12",
            1,
            0,
            0
        ],
        [
            "lohit-malayalam-fonts",
            1,
            0,
            0
        ],
        [
            "lua-filesystem",
            1,
            0,
            0
        ],
        [
            "lua-json",
            1,
            0,
            0
        ],
        [
            "lua-lpeg",
            1,
            0,
            0
        ],
        [
            "lutok",
            1,
            0,
            0
        ],
        [
            "mailx",
            1,
            0,
            0
        ],
        [
            "maven-artifact-resolver",
            1,
            0,
            0
        ],
        [
            "maven-clean-plugin",
            1,
            0,
            0
        ],
        [
            "maven-doxia",
            1,
            0,
            0
        ],
        [
            "maven-doxia-sitetools",
            1,
            0,
            0
        ],
        [
            "maven-install-plugin",
            1,
            0,
            0
        ],
        [
            "maven-invoker",
            1,
            0,
            0
        ],
        [
            "maven-invoker-plugin",
            1,
            0,
            0
        ],
        [
            "maven-reporting-api",
            1,
            0,
            0
        ],
        [
            "maven-reporting-impl",
            1,
            0,
            0
        ],
        [
            "maven-script-interpreter",
            1,
            0,
            0
        ],
        [
            "maven2",
            1,
            0,
            0
        ],
        [
            "mcpp",
            1,
            0,
            0
        ],
        [
            "mercurial",
            1,
            0,
            0
        ],
        [
            "metacity",
            1,
            0,
            0
        ],
        [
            "metis",
            1,
            0,
            0
        ],
        [
            "msv",
            1,
            0,
            0
        ],
        [
            "nafees-web-naskh-fonts",
            1,
            0,
            0
        ],
        [
            "netcf",
            1,
            0,
            0
        ],
        [
            "nkf",
            1,
            0,
            0
        ],
        [
            "objectweb-pom",
            1,
            0,
            0
        ],
        [
            "opencv",
            1,
            0,
            0
        ],
        [
            "openhpi",
            1,
            0,
            0
        ],
        [
            "openssl-ibmpkcs11",
            1,
            0,
            0
        ],
        [
            "os-maven-plugin",
            1,
            0,
            0
        ],
        [
            "pandoc",
            1,
            0,
            0
        ],
        [
            "passivetex",
            1,
            0,
            0
        ],
        [
            "perl-DateTime-Format-HTTP",
            1,
            0,
            0
        ],
        [
            "perl-DateTime-Format-IBeat",
            1,
            0,
            0
        ],
        [
            "perl-DateTime-Format-Mail",
            1,
            0,
            0
        ],
        [
            "perl-Net-IDN-Encode",
            1,
            0,
            0
        ],
        [
            "perl-Net-LibIDN",
            1,
            0,
            0
        ],
        [
            "perl-Sys-Virt",
            1,
            0,
            0
        ],
        [
            "php-pecl-xdebug",
            1,
            0,
            0
        ],
        [
            "pipewire0.2",
            1,
            0,
            0
        ],
        [
            "plexus-component-api",
            1,
            0,
            0
        ],
        [
            "plexus-i18n",
            1,
            0,
            0
        ],
        [
            "plexus-interactivity",
            1,
            0,
            0
        ],
        [
            "plexus-velocity",
            1,
            0,
            0
        ],
        [
            "pyOpenSSL",
            1,
            0,
            0
        ],
        [
            "pyflakes",
            1,
            0,
            0
        ],
        [
            "python-blinker",
            1,
            0,
            0
        ],
        [
            "python-boto3",
            1,
            0,
            0
        ],
        [
            "python-botocore",
            1,
            0,
            0
        ],
        [
            "python-click",
            1,
            0,
            0
        ],
        [
            "python-coverage",
            1,
            0,
            0
        ],
        [
            "python-cpio",
            1,
            0,
            0
        ],
        [
            "python-cryptography-vectors",
            1,
            0,
            0
        ],
        [
            "python-flask",
            1,
            0,
            0
        ],
        [
            "python-funcsigs",
            1,
            0,
            0
        ],
        [
            "python-gevent",
            1,
            0,
            0
        ],
        [
            "python-html5lib",
            1,
            0,
            0
        ],
        [
            "python-httplib2",
            1,
            0,
            0
        ],
        [
            "python-hypothesis",
            1,
            0,
            0
        ],
        [
            "python-iso8601",
            1,
            0,
            0
        ],
        [
            "python-itsdangerous",
            1,
            0,
            0
        ],
        [
            "python-jwt",
            1,
            0,
            0
        ],
        [
            "python-mock",
            1,
            0,
            0
        ],
        [
            "python-nose",
            1,
            0,
            0
        ],
        [
            "python-nss",
            1,
            0,
            0
        ],
        [
            "python-pillow",
            1,
            0,
            0
        ],
        [
            "python-podman-api",
            1,
            0,
            0
        ],
        [
            "python-pretend",
            1,
            0,
            0
        ],
        [
            "python-pydbus",
            1,
            0,
            0
        ],
        [
            "python-pymongo",
            1,
            0,
            0
        ],
        [
            "python-pytest-mock",
            1,
            0,
            0
        ],
        [
            "python-schedutils",
            1,
            0,
            0
        ],
        [
            "python-semantic_version",
            1,
            0,
            0
        ],
        [
            "python-slip",
            1,
            0,
            0
        ],
        [
            "python-suds",
            1,
            0,
            0
        ],
        [
            "python-sure",
            1,
            0,
            0
        ],
        [
            "python-varlink",
            1,
            0,
            0
        ],
        [
            "python-webencodings",
            1,
            0,
            0
        ],
        [
            "python-werkzeug",
            1,
            0,
            0
        ],
        [
            "python-whoosh",
            1,
            0,
            0
        ],
        [
            "python2-setuptools",
            1,
            0,
            0
        ],
        [
            "qperf",
            1,
            0,
            0
        ],
        [
            "qrencode",
            1,
            0,
            0
        ],
        [
            "qt5-qtcanvas3d",
            1,
            0,
            0
        ],
        [
            "re2c",
            1,
            0,
            0
        ],
        [
            "redhat-menus",
            1,
            0,
            0
        ],
        [
            "rt-setup",
            1,
            0,
            0
        ],
        [
            "rt-tests",
            1,
            0,
            0
        ],
        [
            "rubygem-abrt",
            1,
            0,
            0
        ],
        [
            "rubygem-bundler",
            1,
            0,
            0
        ],
        [
            "rubygem-rspec-its",
            1,
            0,
            0
        ],
        [
            "samyak-fonts",
            1,
            0,
            0
        ],
        [
            "scala",
            1,
            0,
            0
        ],
        [
            "scons",
            1,
            0,
            0
        ],
        [
            "scotch",
            1,
            0,
            0
        ],
        [
            "screen",
            1,
            0,
            0
        ],
        [
            "shrinkwrap",
            1,
            0,
            0
        ],
        [
            "sonatype-oss-parent",
            1,
            0,
            0
        ],
        [
            "sparsehash",
            1,
            0,
            0
        ],
        [
            "spec-version-maven-plugin",
            1,
            0,
            0
        ],
        [
            "spice",
            1,
            0,
            0
        ],
        [
            "spice-gtk",
            1,
            0,
            0
        ],
        [
            "spice-parent",
            1,
            0,
            0
        ],
        [
            "system-storage-manager",
            1,
            0,
            0
        ],
        [
            "tinyxml2",
            1,
            0,
            0
        ],
        [
            "trousers",
            1,
            0,
            0
        ],
        [
            "ucpp",
            1,
            0,
            0
        ],
        [
            "uglify-js",
            1,
            0,
            0
        ],
        [
            "uthash",
            1,
            0,
            0
        ],
        [
            "vorbis-tools",
            1,
            0,
            0
        ],
        [
            "weld-parent",
            1,
            0,
            0
        ],
        [
            "xorg-x11-apps",
            1,
            0,
            0
        ],
        [
            "xorg-x11-drv-qxl",
            1,
            0,
            0
        ],
        [
            "xpp3",
            1,
            0,
            0
        ]
    ],
    "type": "table",
    "utcnow": [
        null
    ]
}