{
  "$schema": "https://docs.renovatebot.com/renovate-schema.json",
  "extends": [
    "github>platform-engineering-org/.github",
    "github>platform-engineering-org/.github//konflux.json"
  ],
  "baseBranches": [
    "/^c\\d+s$/",
    "el9.4-backports"
  ],
  "customDatasources": {
    "dates": {
      "defaultRegistryUrlTemplate": "https://www.timeapi.io/api/Time/current/zone?timeZone=Israel",
      "transformTemplates": [
        "{\"releases\":[{\"version\": $substringBefore($$.dateTime,\"T\")}]}"
      ],
      "format": "json"
    },
    "c9s-compose": {
      "defaultRegistryUrlTemplate": "https://composes.stream.centos.org/production/",
      "format": "html"
    },
    "c10s-compose": {
      "defaultRegistryUrlTemplate": "https://composes.stream.centos.org/stream-10/production/",
      "format": "html"
    }
  },
  "customManagers": [
    {
      "customType": "regex",
      "fileMatch": [
        "date.txt"
      ],
      "matchStrings": [
        "today=(?<currentValue>.*)"
      ],
      "datasourceTemplate": "custom.dates",
      "depNameTemplate": "today",
      "versioningTemplate": "regex:^(?<major>\\d{4})-(?<minor>\\d{2})-(?<patch>\\d{2})$"
    },
    {
      "customType": "regex",
      "fileMatch": [
        "cs.repo",
        "cs-source.repo",
        "Containerfile"
      ],
      "matchStrings": [
        "https://composes.stream.centos.org/production/(?<currentValue>.*)/compose/(.*)",
        "redhat.compose-id=\"(?<currentValue>.*)\""
      ],
      "datasourceTemplate": "custom.c9s-compose",
      "depNameTemplate": "CentOS-Stream-9",
      "versioningTemplate": "regex:CentOS-Stream-9-(?<major>\\d{8})\\.\\d"
    },
    {
      "customType": "regex",
      "fileMatch": [
        "cs.repo",
        "cs-source.repo",
        "Containerfile"
      ],
      "matchStrings": [
        "https://composes.stream.centos.org/stream-10/production/(?<currentValue>.*)/compose/(.*)",
        "redhat.compose-id=\"(?<currentValue>.*)\""
      ],
      "datasourceTemplate": "custom.c10s-compose",
      "depNameTemplate": "CentOS-Stream-10",
      "versioningTemplate": "regex:CentOS-Stream-10-(?<major>\\d{8})\\.\\d"
    }
  ],
  "packageRules": [
    {
      "matchDatasources": [
        "custom.dates"
      ],
      "enabled": true
    },
    {
      "matchDepNames": [
        "konflux-ci/rpm-lockfile-prototype"
      ],
      "enabled": true
    },
    {
      "matchDatasources": [
        "custom.c9s-compose"
      ],
      "extractVersion": "(?<version>.+)/$",
      "automerge": true,
      "schedule": [
        "at any time"
      ],
      "matchBaseBranches": [
        "c9s"
      ],
      "matchPackageNames": [
        "CentOS-Stream-9"
      ]
    },
    {
      "matchDatasources": [
        "custom.c10s-compose"
      ],
      "extractVersion": "(?<version>.+)/$",
      "automerge": true,
      "schedule": [
        "at any time"
      ],
      "matchBaseBranches": [
        "c10s"
      ],
      "matchPackageNames": [
        "CentOS-Stream-10"
      ]
    },
    {
      "matchDatasources": [
        "custom.c9s-compose"
      ],
      "extractVersion": "(?<version>.+)/$",
      "matchBaseBranches": [
        "el9.4-backports"
      ],
      "matchPackageNames": [
        "CentOS-Stream-9"
      ],
      "enabled": false
    },
    {
      "matchPackageNames": [
        "quay.io/centos-bootc/bootc-image-builder"
      ],
      "pinDigests": false
    }
  ],
  "postUpgradeTasks": {
    "commands": [
      "make lockfile CI=CI"
    ],
    "fileFilters": [
      "rpms.lock.yaml"
    ],
    "executionMode": "branch"
  }
}
