{
  "type": "service_account",
  "project_id": "saf-hm4sh7qic8jinlscxpmlhvirxx",
  "private_key_id": "59fec72c74c4bd51ba81312340b0f74b3407a14d",
  "private_key": "-----BEGIN PRIVATE KEY-----\nMIIEugIBADANBgkqhkiG9w0BAQEFAASCBKQwggSgAgEAAoIBAQC4AaFUGdoflxxG\nd/QdRV1JYvOgPosltBhfIvN7zpLzsSDJfUpOmtLNq4qTFkGafEF5VNouiXwpL2hH\n7fXaD9bYc1PZY1OFwnoI8cvwVkCQ8SBp9bkArGC8wu1fJy9uEIu2/1LW2slcSu4O\nAhJ8XJdoN0ThIvfFSiOZ2thQo5Rm4/lZN3fXaJmuU7MHap9s0DPX/YM4YA5pFd6x\nyyEWKsLj/iAVCe4dSVmhzf8pVLt6NnvxuI6umWxLlNra943mXWB3Hj/7lKMYeN9C\nKZJIOBbha2H3NqQSd1w33C8TaWuj3oUgK7anuBM17fGtevL4lY6f64/g6tAj6/4X\nG6dXL/s/AgMBAAECgf8hbCphnFCCbHA2XJN6vZ60NcUK1lFwB8ZlgXO4iU0n9oR+\nFMPqgzTHJuGE1gYUiX1bDI6U5WQoFvRaHF8LvNTJfCk+00vYf/qqpUDl5sTTjvjU\nRk3UUXtAzidPoU58L4UxOC9T12m72eBjqvywmiDmTSO1wSRAMbdFuvqPqybJiU+I\n7VNAflsAgGuTXVJ8OMoQhqcpeyeTte/N9nrkILJaEIpvVBXay/R4cIrMWGENwoMI\nSOMsLcEcnRDQNNMu1omFAsGsuMI/w5/InIf97Z3sJIqDZX808MoELLI3vE43ELgQ\nAsSAORzeMWxRSbacbvwAEVLi0rgdCA8nrhPqaV0CgYEA+9zsQ4gq0GQuDxt5I8T8\n5HIcjkijGPeoOsJQzC2J6+f1PNdXEIlPAjJz+DJDP+ROCX2/SgsIBBSgpuBAL4wN\nwzPsEEZx6r4zZZvatASZwhKC58KZxEN2q5Wx6WiaTtNEqNHdRM2xBtayCj4Vc0fF\nqT4yqz3q2rPB4npSLIGQ6Z0CgYEAuwdfPlW+kkKs81L6Ta/XTdJAGnBgYHptkJUx\nMe2KVbiIGkwuoAK8E+ZMMbLe9UKP//v5tbv6aV44Cxd/jcIEFGl4PHMw2YuxhyZj\nKASHtfmFlN+fkiovghM5nliarvqaOTGDrliz15HZ9SPpdTxkBAaY1GAgaWaGv79B\nUQR5v4sCgYABRKmD5Ymhpv98X/0KKxHC7LgsFz2LAKQ+N4BEpu4M3AwmFEeB888M\nCcj/tPEVv0aNUa7G5qtRqfDtJi/sjV38X6SOqGwmbHLBzjkZsvQ7P/CcziQMEvLk\nBkrxC+/K+dFcsEHW+NotWKNo3csp23CpW4DRz+wA0ermAwuq4bQjGQKBgGiQ0ZZH\nWDnr30hXbyw6ELUoxMBDbg7ixBke4JdaiIoulqGlUDgT71Vs39K1f+Q958al+VG7\nHGEG1WyWIbF+9Mr4wMmDWZ93c7TtKGj6R2ndbOr0MAIHZfJij0dRoIIOCGXLoiS6\n4Sm4GNTu1BrAveZmTdIHQHfNY68W3gzO5MbLAoGAQB/MC3jO8/3KGToBJWUUgbvF\nr+LDX+QU7Cnm0jWnyF6kgeH8PpDhlWOgYT5q9+X1WyR7pfDZT5OQMlBvGLCqspcr\nRg3a6vBB6pNpaduUD7PHW/TnxwXmZXr+WBihhIBGWoq3QJVwEkdQERUuuKeDKQ9g\nYP/AloxUg5Fw1Z1rCvw=\n-----END PRIVATE KEY-----\n",
  "client_email": "mfc-25v4ozqhtgx7q9wvnczirbpp93@saf-hm4sh7qic8jinlscxpmlhvirxx.iam.gserviceaccount.com",
  "client_id": "117989967499687129655",
  "auth_uri": "https://accounts.google.com/o/oauth2/auth",
  "token_uri": "https://oauth2.googleapis.com/token",
  "auth_provider_x509_cert_url": "https://www.googleapis.com/oauth2/v1/certs",
  "client_x509_cert_url": "https://www.googleapis.com/robot/v1/metadata/x509/mfc-25v4ozqhtgx7q9wvnczirbpp93%40saf-hm4sh7qic8jinlscxpmlhvirxx.iam.gserviceaccount.com"
}
