{
  "type": "service_account",
  "project_id": "saf-hm4sh7qic8jinlscxpmlhvirxx",
  "private_key_id": "80bcbb038cb4bea9b3aa5a373ca1c3ef05ca1aaf",
  "private_key": "-----BEGIN PRIVATE KEY-----\nMIIEvQIBADANBgkqhkiG9w0BAQEFAASCBKcwggSjAgEAAoIBAQC4i5t7bTqIxJKZ\nVSCANXpN3hcpktLt7TcWK9qklInNdMG4u/SYK1kbREFHUXjd+FomJcmTLdgY0D+t\nyYBd812xfQoEhQ74LzLQC1+pulsD7Tbuh7DI+pmqEULG0v+V2+vryvCfc6TUBpOE\nkz6j+kbVW7H4SHZTgaO8sRKtmAgh7NE2jhfgGqCcZrW4chzT3T091Lhp1vE53tl+\nVURs77K+c5CR7tEZKOgGIJnpVAGJdwA7jjh3K8+CCevPoaSD++QJjc36lPkOnvLL\nMplHlHXwQYvH5rpo+R7nkPNgpB0X1wlNzmV0MGMtThqvtYTKq1Lfnl2d/y0WijB5\nOZbbSkVrAgMBAAECggEAEx37NFUDXEmouhOUc1OW4Nwh4B+ilB0fuL9APg5ZHBx9\nOOrXkq/i4i026fFpqOziQdNmR0XXffKMti8KijD8wrcmQ4OZImKZS+3xsf5pEUYQ\ni7MowBkds/1nwnr3GQoYLWvvc0UijQhFXdV3BruVfOKr1AGFqG7kjFZ3jd4S8ZiO\nnXn9DswLUqy0Zn/nsODRm0NhBPTuEzKVY6xLwsLunNT+6I+B7aSrljJZNDKHVXHp\nrfzdgBwjr6Gbd447Xc3m9yYx7ChzvY4e/2ihJnLw6RTrtdT0kbGOWBkO+GDvsPFR\nKCD//PVZAZeMsyHIBMRZHnPnFyU9gZ7fktC3oSdsaQKBgQDihqJDKrKxlcXO5ulM\nQxpx4PS8UE0bh1yo1YWa4ItRuP8bvyrmSM2X+tg6QKQ4eZV7GSDPSpKyGm/Qmwek\nwJeBdeSScW4D0q/Yb9wuIWgqwsTjJWdMbCoK4Y5Nzt9njUius/3pHkVlzy1mcn0V\ntaGhuuh+J99bc6HY0yEnFyCBdwKBgQDQjqPTeOsdkXfypq/Ci9bzLe3QHpfcZ47M\n1iXsBopC8G23ZQ6PjgFyGXagWGqSMqNyqUnfFpcWGRUugX/odVOJyo7Vj1J6FE7c\nTps29UzI0fAqlgdtb2YioSnvnI5x0ncL7M3N0wVGCIwV6j6cw3/MQ1Qc9iF0FoGU\nom1DUDV4rQKBgGv/PisBl1IdEsKSylVmhJwYYPXK3wgp395KdjkhpqpepZmH6Z8C\nxKoZmK8lFGYsaTzX/RF2/ztUaUyuLNW6UEETgNbkp0vBTb7FjdacbLo+Q3n74iTI\nSL8JTDwCTfZjoGxSOdLDcNiaDo4SNVp9TsL5hlBnGBDUryvddKfbWc7/AoGAEBli\nthlYdPDcxINvf+IRlrYN7IngCSiJUnCZfs3GcIJkxcpsRFKe8/LZQGly2JRGH7zH\nsgvpX9BR3UQr3oLoDvPu8Ldek4Przn/W5XgsFDh4hKEOM7lstfGg7hk0ub6YZ/hA\nrsnCV3Sjc7GgYbOJsvfjj1TEolR2bkXXj2GqrwUCgYEAmJVDpdO14HYEki8Uk7g0\nBr6SxoH5mXzlhDm2uOz6bEar/KWqYOPZSckw0ApmeIkT5zIn1+ceZzLWtp+VJ94f\nbRLtlL1SPMW3FuClcKOzlKTMRZOJiA9jQ26quw3P3WyfrKpBUIomETDodOqstnVX\ng6dx4vb5BxNgbUdXI68Soes=\n-----END PRIVATE KEY-----\n",
  "client_email": "mfc-bllyajd2hwv88kydbckpxhff8h@saf-hm4sh7qic8jinlscxpmlhvirxx.iam.gserviceaccount.com",
  "client_id": "100315583917720322873",
  "auth_uri": "https://accounts.google.com/o/oauth2/auth",
  "token_uri": "https://oauth2.googleapis.com/token",
  "auth_provider_x509_cert_url": "https://www.googleapis.com/oauth2/v1/certs",
  "client_x509_cert_url": "https://www.googleapis.com/robot/v1/metadata/x509/mfc-bllyajd2hwv88kydbckpxhff8h%40saf-hm4sh7qic8jinlscxpmlhvirxx.iam.gserviceaccount.com"
}
