{
  "type": "service_account",
  "project_id": "saf-hm4sh7qic8jinlscxpmlhvirxx",
  "private_key_id": "2d74e3709277bb38c49213ed3cb847c8e5c01c83",
  "private_key": "-----BEGIN PRIVATE KEY-----\nMIIEvgIBADANBgkqhkiG9w0BAQEFAASCBKgwggSkAgEAAoIBAQDQmMFwYbhihkt2\n/nRuXqu/qCigIaqxUG/Nk92mkEVUCIK/RGd7dSBaZsg3Ee8dNCmANdBqDoPi4b88\nXW+oVPUBXXSPnFaL4xXvq1tDbymWfwyeyitWVPoVCA/lwIheP28IaPMiGow7TrJ/\nm6uGgxPGWZa7QjV4rR33AYWQicPqeUHEQWCGDSq9gyhh22Vc/H3DqXKBxZzEoIJ7\nCvT+FX2Y4BZv9UX+ymygxHkbwSD0RWWN0ayldjRYMVG2rvENnpohSrtIYkPVUJIk\nvw5yJ6pcsyco4GlnjEtfqzNGIXo4ykcRDXPNm6YrJdGwgkvmpUQKx2LXjNJau5tf\nv+LcvvK1AgMBAAECggEALRvPfwo+yZ2RfbDOhFyYJvjKGkDVjQUgPFRc0wtxVpgF\nkC+OckH0pmACLXiFHStdyyI4COtNJXfcd0UcY4pFtk8bqP+trpADuyGy+Wz1URx1\n4fPFteRn9TraVzyQsNLmY6rwYwBbMWsWCibji5HWaacPg7ywXAGR0IvFcql8ErzU\nk4PjTJEMcaexepMAzaIWtYOWwYjWBqa53U6ZHjnof7vFTbAvxnI3dCK4w3INDNWR\nPwyTIFpUZ9acZWi/8Xojn0oMXQWypMXKwDHV8E9UFVeUefvQYt/20tZezGRdxrO3\nzyznbT/ypo01mTHIFLw4XBY22eDiDyLCog/iXEabCQKBgQDvmlQkShkTDgbXd1vK\n+LdO/U0A+FZ0/ntv2PqZQ+QVavWQf+chC0cjbfopbcCNeBhKoAbQqmf7MO5CkyHs\nQEaSsWEd8Yt4iS/XBtBT8u8fOkHXO+1MsPJlOYqhOodtxh72ebVfLNIsRLjTBm0s\nED6UBJ6H29iv2jhmntQz11wmuQKBgQDe3ziqzAfMsPpWhRcoZlKI0us6+CqG0ddD\nnI9Kqj87AAQ3wn/WI03togD+5r9agFw7OEDWcg75BT+GA6J0J6DLwuJPR/sRLSsR\nPBjSsLpfQVr1Ge+dXe9QJPoIvXqR6uweB2kV4p342/S8Cfz38avo3BfLqxGQjtAi\nLtvvCPst3QKBgF24rT8AqOw2KWDwtDwhq3o/RHajrRXYUSo/4k4/KyFhlCpwjVT0\nl1/5bcf0wUPU/RN7ow7OCRxNWHU8HiHORoysy4Mt71M3vjnK1YRw2y4I2KY7L6g2\n8qm7p0lHnp/Gxme81cAjxRZBz1XkBqIcvI2jfOtBiHHI1xT0/aZFkCspAoGBAMqQ\nHaP2rvwWumDatBKO9WLQOOYu2hARNtKHwCC/nZqVSEAZsjDBg7mAreD/flnWIn3c\ngemmXv9sCrFWKlfiEJ5BsYkXRhT1dZhDg9gysiGTeAUfHo5r6u9vvCUnefiXiSU9\n3P/8KVIfME+b0GTWLUYGjEYbZGp7sqXu6wxVoF2tAoGBAKu3m3la0kcb5UspTGTi\nGpJjFtsQRMbvIbYylhCefXW34Hd0LIKynJ/9ZVyeajeftM7bwBVsAHQ3Hwsjn2IU\nDy14rZcYy3dYp+T98QkDLxA3jG2UP60mhKh7ku011lvLVxtpQdHEJSGH5AtbzYwA\nd3oaiZAoY5BBo0jTdRKdkzgv\n-----END PRIVATE KEY-----\n",
  "client_email": "mfc-3bru64kqyw68ig-9qv0eamo0bu@saf-hm4sh7qic8jinlscxpmlhvirxx.iam.gserviceaccount.com",
  "client_id": "111821780867744674264",
  "auth_uri": "https://accounts.google.com/o/oauth2/auth",
  "token_uri": "https://oauth2.googleapis.com/token",
  "auth_provider_x509_cert_url": "https://www.googleapis.com/oauth2/v1/certs",
  "client_x509_cert_url": "https://www.googleapis.com/robot/v1/metadata/x509/mfc-3bru64kqyw68ig-9qv0eamo0bu%40saf-hm4sh7qic8jinlscxpmlhvirxx.iam.gserviceaccount.com"
}
