{
  "type": "service_account",
  "project_id": "saf-hm4sh7qic8jinlscxpmlhvirxx",
  "private_key_id": "36ac8988dd836af65e8274355fe7438af7d65100",
  "private_key": "-----BEGIN PRIVATE KEY-----\nMIIEvQIBADANBgkqhkiG9w0BAQEFAASCBKcwggSjAgEAAoIBAQDsZ7H02KdZiwUt\nXe97QlG4ov1NZtUMPlfqa99iRNELTq8Aw3CHJhP5GEaqi4ac8Tf2NF6xQwpWF5A/\n4e8LeltgpvstqV0zrroAsCBDvMqMtmTYsl8pmdgXU8GoyQasENcuV6tEsIp2YoMu\nJvr1p2VFBVeLmGm2k8paHk6vBH/sdGgog9wBcqXmlDP1RTGN5SO6YD3uRVIZTXjQ\nlWn5fKPsRjiUrdxU4Dr1zh4lsty6NtINS3QVE4ZKMDrAWUL6jr+ordi7bSHxLxnT\n2L5pNYMezbm8sFXPiT5crnLiCpg+YAmOrPpKaA06NIlLgLnQGKeeY+BCZ8ZZEBba\nTrXVrpQRAgMBAAECggEAT0Hks8X/NVIahj88DwMJCvH6In0baGNubjWESxnvS+8x\nVPwxOd5WS+kLqBnnI67rqCueo6dqS7rSrdg9oIeBI0JYa9KgYLdvvNNPveYJsmtk\nHBKRPQ1LGWcHQmNDTWTH/818qibWBSK6ADspYDqjBSTpWO/cYU3jRZtrndnQWaF4\nY/2YjwtnPyUtHw8oO62bioO6Vd9+S0xfydEhAp7DhnuM5jKoLSHrtdska43FLD/K\nUK3mI6/H2CjWh2el0PMm4sTfQjfojHBs/1fcwC5wjkwAN7g4T8Ntqe40BXbfkxWK\ncSiXR9XomYJsmF9MRC51JTtJnJIpqlG7cTqsK5T50QKBgQD4Gqvvr8GK725A9C4F\nbhaK2oGuW3/KtL6MtLKvJ53rAkH4wd7XqYUAZ56F8emkMH0ZLuX4PuH9FB9dr8NI\noTaoQoEyEwrjuFI0TZxz372hm3uYv0h8NNaJdVmaXQeY6F60+PtikAyLrO3W1PSw\n6qgX7yJpKrqOZ5Wyp65ZowScXwKBgQDz7bWphuo3UWqwK5dAIZporwk9q4tFXjBf\nMnpxI/2AyZcnnX97m3CQW35IkebyPAYrsonxQyIRk9Oj4L52lyF495WI401JB8bV\n9gfEOLYu0lskEaxzrgrF5gct8zLBVCyzoIRtc9SgdSVxgpKBYCo4HiuHIE0X65D5\nZEhOs+6ljwKBgQDbXuHl1XaA/UF0RzMl8/gUoC2H2Dl/Jx9Q1Dkl7BaSg/WHGQyL\njcUe3X/qGUMnvQPvr2sBe8BgAFnXgaBe6MSmM99+Qh4fyYtN2c3bGtrWON8o6QET\nabjD47HtbhJYniWXSIsl1A5ztdy6VqNghqtINlYrvO8lGOvhAqiDc0ORawKBgF9E\nq/q2EqvgRIbhv4Twmtnf4wAPC6ngC4xirqeZoty13y89uBiSsPfwg/Xb5hMdllti\ns7Vivt+WmMYcdMbkZ9JTADgiboDjZKkUGhxs+dp3ldkUfgIAK3z3Rj6QCXawZXUS\ncCY/Yv/4QNOAZ6/X2yVnwyBXYUTCYDDHFeaHJ+HJAoGAAN6gELmlCNDdKUiPGjox\nnuBQ7yzCSWI79neRaYKSUpKOMZMUEy6Lp91zAey4LG29VN6z/r/zgqY0RVMn2VpV\nSRu2yQFx9xCgISXTncIIXaySgyZnip0/6WCafPOSw8fTttSpcOyN5S7ZZq8lBIN2\nvTyqLYF6QjiBGyhU93gqkvA=\n-----END PRIVATE KEY-----\n",
  "client_email": "mfc-qduy1acub5mucqclqvllghunah@saf-hm4sh7qic8jinlscxpmlhvirxx.iam.gserviceaccount.com",
  "client_id": "117424891618141085355",
  "auth_uri": "https://accounts.google.com/o/oauth2/auth",
  "token_uri": "https://oauth2.googleapis.com/token",
  "auth_provider_x509_cert_url": "https://www.googleapis.com/oauth2/v1/certs",
  "client_x509_cert_url": "https://www.googleapis.com/robot/v1/metadata/x509/mfc-qduy1acub5mucqclqvllghunah%40saf-hm4sh7qic8jinlscxpmlhvirxx.iam.gserviceaccount.com"
}
