{
  "type": "service_account",
  "project_id": "saf-hm4sh7qic8jinlscxpmlhvirxx",
  "private_key_id": "9fe49b99331f802fe43a8af7600b747af420779c",
  "private_key": "-----BEGIN PRIVATE KEY-----\nMIIEvgIBADANBgkqhkiG9w0BAQEFAASCBKgwggSkAgEAAoIBAQCdw9V+XRA2v27a\nYGolm0Wt5crj4Bypi/lKn9drs8hHS+MEx/AWAflHOCFWlwaSXkiPNbQCkrLm330x\nFKTyhFLFE6PTEwz0LG+f5+taNvFI2xggicO7Qt9rAApYgRqW87py0Q+gR+GO7mGc\nlesu4Cd2+jiKNjP66MTY+OHEdUou3TFmTrPyWC0O0GaL9K2JUPbM6AXJc2H8/JoP\nEXwzPaSLzaBBtXU9wdJFOf90/vFcdkF3e7T6UUjDX6g5zIb7TKojTub60M78mBfB\n6nnka8XqEn/kRke1FXeU3sWbbL82sB1YMy/5A9E8Da5JoiPSvePbhp3Y4EUi8kq2\n7HEhf977AgMBAAECggEAAa5a3Fws1mMse404HwB25Jx55fsMXc4iW5DfyxkA/al/\nA3Jcn49pKEDJMigCfOrI8SW3A6lWg1lG9zqWFgjM7PwBlzfbv8+oEix2zeD0qecT\nwb0Au0Js07IOFNVYrYUZVoHdyG0bp9noa7Jj7X2b+LY/21EqiqDnqrw0LlNln/bd\nIoTQ+EVVuAp9rlOMHAtwaB9EyCoHwExhloMoV4TRCaF384cUMpnvdkxDQv/EF3WK\nvbY2oFL3PG0zgKIXyS91kmQ8L3Z7YGXUZnoTTs1ePkyIThljL71c8StEKBl23+Pm\noVRGExd9rQYfcPLRJdZ6RQ8QYawfXyfsH3aKhQbOGQKBgQDP0lpWowXnRoy1yO6h\nDlXMkOfPU3eC/fHOQUjGMgXPUilmPUADKLV59p/WEgOCZKyYwAiI2cG/Qnv3+Ah+\nAQIcGvIca+CWyjt+OB5Cuvrk7dT88EE2tdNK2VWyCD+F3jtsvF/b29Ze+ViOgCh1\nQH1gl0QGUHkIWZW2MdG61tABnwKBgQDCVsCeaIETyeXyNBfaCnttW8S9FYSjnGG4\nDBMufHSaxhprwKEMScm5nIqumy6Zp2UkCo9GkZ576woVfuPGR23WD4VFWoQinLf0\nN6FIEdqPuZqGgn2Rn2C31zKQkbogCxDo20fBWFt6IwKrjYE5BfyIUwuv0wCTsBTf\nCkxzuzt9JQKBgQDNP/2Ez2FHN4BFEXvMiPHoJb0sIE1KjC/C+us7A7CFP6ovlZKh\nDBWfrRnTPNtGbtOf0Rkcv6QAl1MEZm1MtQY2Z85yj4CyrGzxjc8lLLIaY2IVpdti\ng1V4+QkP2eGS/xdFnw41f/tKtYzmwGA03Up2mS7P5a6DtqaL2MxAcWPiFQKBgATg\nADz5CiPg8K++tsp1cNsxbiIAJC+mgJ0JUIHeBV7MkWUak++m+jR5xNDUe7rHBDZ/\nPVDb3knlf39Ci5wxtoOkKAexWZc0rzilHJqeOAla8pFlPJkmklqKP254+V5MaMQu\nnAIxoTnTHwIGrrMrf0Y8LxLeDCmoRR3DOF++1qMxAoGBALreDTik6NOIf/oyIiDL\nKgR2AZ3EyrOwkT49/DRtZZ6+U0py2cLbqUeqb3dSkmqwgdB5YMSnVQNdTHJUrrAN\nkx3LmEZJN19YJvqDyOjchMoPATKB/JW0Ix4LyIZXmPheOl0DZz5+OCv2wJcFP/Js\nq7Wu0Cuaj+n4j7LStjbhyiwq\n-----END PRIVATE KEY-----\n",
  "client_email": "mfc-1lxoknnme57052ooepxwg5ydhf@saf-hm4sh7qic8jinlscxpmlhvirxx.iam.gserviceaccount.com",
  "client_id": "112520890841889023852",
  "auth_uri": "https://accounts.google.com/o/oauth2/auth",
  "token_uri": "https://oauth2.googleapis.com/token",
  "auth_provider_x509_cert_url": "https://www.googleapis.com/oauth2/v1/certs",
  "client_x509_cert_url": "https://www.googleapis.com/robot/v1/metadata/x509/mfc-1lxoknnme57052ooepxwg5ydhf%40saf-hm4sh7qic8jinlscxpmlhvirxx.iam.gserviceaccount.com"
}
