{
  "type": "service_account",
  "project_id": "saf-hm4sh7qic8jinlscxpmlhvirxx",
  "private_key_id": "2c6cb3d7febb85509eab129e05bfc22e7c16936d",
  "private_key": "-----BEGIN PRIVATE KEY-----\nMIIEvgIBADANBgkqhkiG9w0BAQEFAASCBKgwggSkAgEAAoIBAQDAiWuiiQX8sxjB\nA088SwFBeGIh+palSQX5LS5kzocZMe6iH0PqJRvfLR59e38lEDTVJFFajxUnKDaj\n0z0Xa5yIfVDy666VFhStJjUBPUHYcswckV4O2FgdxaRbpmtHsP2mcpD4D/OxyN15\n5YH020v3iBQoCnLVcMSif4SriiVgNIbq8EyBE2K4tvHaYLelShWVAffkVJ65ixTO\nM+5CZ1/m8tlFgWSpbJWs/Xo+axirihQ3gXLkeRgpd41U5Phj6SQgURyumpHEh3QV\njMQPyvQDGWX3GxEZA0gRrf4da2EFN5RZ62cYjRljckaearqlU0I8FtOptQ23iwNz\nNzJ21wSJAgMBAAECggEAUitz0cqb0QSYWGtyqf8yun/HlcvN9h1rnLPhHGmd861B\nNFSWlfufYQhu/kux8B3yBlL5G2Z8Nxls9E7nQDMPe5rL7NiTyhHB4kGvlmdPzjH0\nFW8ezsQbGx2p7ulf2JlbL2muoAeiz+mzR94gr+DVk38yZwJKjvgRG27DrrgHCn6y\n1nsRDVjZy2NZzrqADTsz4BTbCB/qhA4SyetoFPPdYa9KYlUU2+KXLn+GCoQDBJOV\nRJjg2Al1kWc11pWRzsiAj8pTStaGMxKi2C2CgG5tCqkdb/smL1PlCsfiISUABRoR\nEhQ3O2iwD/7G3Z1tlx1pcEWp+sv2aKZ8bgHwEjcIZwKBgQDjO5UYOGssqA497cw+\n9PtI5S3uaMRBayhgXVNhFgPIDwUgZKQJFNH8jj1R5VrcLvWcp8o6Q7MrtDqZvJaB\nIerQ7vF2IAjnPn4Yi3LtNz/1dr+xu0ETisVDim3+a7YLSRE8Ab8aB4g4fFl8NLdb\n8GeF5YgBlMpm9un1vkGL9ZYs+wKBgQDY6V9RcOFLy9jCCX2tp2wzuODYa0uVks6E\ndj0qEV/9Co96vkfx+uRLy9VRjuLaB2QLoS2PA1+vhQrfzJx2cKD8YVS2VI9gp6EB\nx4W2e2Uxgqkj+aclHUb/cA/elpB/crKS8IKU9yK2Ya/LmDebrYoAVl1f7+mJlNRH\n+6S771HVSwKBgQC67tc2t6Mjd5VPyQLPgAYA79ibWsCo+JicvenL4qp1uDWFcoWn\nmuMsm29CoiXfIRqZJ0esKumIuJnEw2olDVv5SbiGbtAkPDrLwlxnXZ5WNrx4YA2n\nH/AsIgNe3AlEu3VcIiuuJCgiH9oV3eBB2EGx2yPJ+TeRAOtzaHLPytciZQKBgQCj\nSyTX0au5/O7kPHLhnS2GzoJuSm/vXUKdU8n99nCVtTKIi+DrmR3utbeUm4XJ71Bw\ntNjwVfDd2MFz87xCKc330WoNjSEW+XrrNQJDeyeWGzAsBhC/jwfY2ssHnb+QQo+O\nsQMNE/OM64OFOMV8LCu8z0eiJqFgUqtwuU+tr5+iewKBgHkrSfdqpoVNbDAJP5RC\newWrU40pZEbUEZFvPcl7hH//dlindhetQL/7KuhWK7SYv08i6eLJ+g4VDGn8n12W\neZHldx5PzsnwR4ma+dwsGI3WzXuOeoZKr6X+xy0OjF9DsWtiRz42nAQkj2tQDZv3\n7+J71q6B3bCapNRfROBKKBcI\n-----END PRIVATE KEY-----\n",
  "client_email": "mfc-jf4n3e5d6701kxrq4wv3eq91dg@saf-hm4sh7qic8jinlscxpmlhvirxx.iam.gserviceaccount.com",
  "client_id": "105276200712066290980",
  "auth_uri": "https://accounts.google.com/o/oauth2/auth",
  "token_uri": "https://oauth2.googleapis.com/token",
  "auth_provider_x509_cert_url": "https://www.googleapis.com/oauth2/v1/certs",
  "client_x509_cert_url": "https://www.googleapis.com/robot/v1/metadata/x509/mfc-jf4n3e5d6701kxrq4wv3eq91dg%40saf-hm4sh7qic8jinlscxpmlhvirxx.iam.gserviceaccount.com"
}
