{
  "type": "service_account",
  "project_id": "saf-hm4sh7qic8jinlscxpmlhvirxx",
  "private_key_id": "32a17c7550e331e282fffe0eb7fc3181b7ae945d",
  "private_key": "-----BEGIN PRIVATE KEY-----\nMIIEvQIBADANBgkqhkiG9w0BAQEFAASCBKcwggSjAgEAAoIBAQCe3v7xe0sHMY8n\n1aasu+IaFUn6I1A3sMGpfahAyVDWVvXdAdsJKtcX48oSVsJeUA/r9JY8NmQXJlZQ\noxwlfAc0MalsoqV+rtZ4W77AL0hz1sGk0vh44n0a8dSrlgDZEsX/K9K/9K2AOgVd\nCH3CgXna3DMK+ZvpHg5rRSkkWEwSiT+J8hFBzQh1T8LnT/Jgx2ptCF+G6Wbrjnsq\n/ZLkgj2aG8zv67zqc7t5A/oZrexqnKbWLfK8iO5JC+XI70JIhRxIC/Jwb+1lVYLC\nrXwM7RYOAzULCBNwFLVuuN3muKpiXLk68hB5oAkuJ6B3uyGdbHLEIus2MNhJK2/8\nCBY7N9LRAgMBAAECggEANiT6z1L9QZDe4K0cdm88AjayNSlW2/wGLJ0SPC5AOiR9\n+5n3y/qJPu+XvUNLT/hKTNjZYOEKoKcksKu+WnoYPG4Wd1tBOtkcZ/2gl4Al2bDd\n4y4xl4VdLNMxb18an+CZkTsewuQBQ5vCmy/bKHCXFoOIc9uZCsx/DokOGgBrwL7y\no0piZ0bA5wUCT5HHjUNynfySq80d1dKkx7zf5Udv8h5fafMjrduSWpWQAQhNx+Zd\ndAuqXPAIhKqVfp9slf2HEyexi0mqoRV8l7MJBNfFiQwe2LczeXMBnPRIZICHxX2H\nnQH+0epSh2wMRtNpU/5cOU58eEZsjkYmcgemeNFEpwKBgQDgenXXM+nKLTm1Y/US\nWKUNDCkvD28atk+DhevhAHnaw8DKceaoOavo4/YEjJz4FqdMLRFHJKw/6u0T/vuF\n24czcud1cyZPJ0JzX9mPMEyiNfbeLCFFLm4KkUrceOTToek6uJv+kun4LNrtIjwF\nNmhzsqKrCCDt/TXytGou7egYiwKBgQC1LhZggwAPtce4eRoAUBQboTzkQSEejS9l\nSCdyinZkRm3KBetL6ZZEG3uJW8FICnzwxhvBINoaT3uX5lrUnFOrhE0MaIZ/Sxll\nddjLPZ30jcOSLjWbiYnLhnF67g4DwtlRT1qX7xOWeOlmoPr1DNhh8JHIo3D9r/tT\nl4mKwYGRkwKBgDW927x71zrp/OjqV1/fDRTElo+HuGfCweKRC1nAzWuMdfmBr2ES\n/Y8yFFIef+39LmxUVdCcfQiIa93fq8PuPL4agkNiIAfPNF9+0Q0w2Qf0t3eVRRnU\n9c9d3XhPESmBl97RF7eo4I7j3j3rdkchMXyRhdRAi/GuL149xzYZCvnlAoGBAJwF\nGBf8N21P6LEe+BkU3Hv+mWUmANNCWXIqdG3adqFbVOgHuNwiRthXokZi0UqsXXMp\n5nSlSawmjhP8tnMoO5UT1RW+XTP5A+GvXgWHBiK2gZe8W0WZZyPwnoBxx3fNrz6p\nyyXTJ1cIwFU0g2fKq/uLIr9Yn9CWXyNY94SZpm4pAoGAfGVk4m/GK0lp4daZGlR1\nsjTaB3x42LJ8NEcpAKc8aCQA5BuD1GjWSdDZhP+djud9PTmNNyTBZ6mQIoShRqUm\nWwGLhIlALgrQbgtRrSUAOm0Kfdjof1w+LRfxkO8qAlf2ggoOA1osvdvRh3og6eyF\ni+Bvk+6wbogIgKMBc6j4tgc=\n-----END PRIVATE KEY-----\n",
  "client_email": "mfc-i89z3d6aatx-qthmsr5hlsrkls@saf-hm4sh7qic8jinlscxpmlhvirxx.iam.gserviceaccount.com",
  "client_id": "117490312530911325848",
  "auth_uri": "https://accounts.google.com/o/oauth2/auth",
  "token_uri": "https://oauth2.googleapis.com/token",
  "auth_provider_x509_cert_url": "https://www.googleapis.com/oauth2/v1/certs",
  "client_x509_cert_url": "https://www.googleapis.com/robot/v1/metadata/x509/mfc-i89z3d6aatx-qthmsr5hlsrkls%40saf-hm4sh7qic8jinlscxpmlhvirxx.iam.gserviceaccount.com"
}
