{
  "type": "service_account",
  "project_id": "saf-hm4sh7qic8jinlscxpmlhvirxx",
  "private_key_id": "6fd3f8bc348841ab1c35169dfd692a9e6c57de41",
  "private_key": "-----BEGIN PRIVATE KEY-----\nMIIEvgIBADANBgkqhkiG9w0BAQEFAASCBKgwggSkAgEAAoIBAQDAqxqI0er6M1+y\neDFkphImNMo1tOtQqcOt5M7JnyuQIC+O7PbnvnemF1sjWDTaUoJ/RE6R91SvYuyY\nnCBaBMEpt8mGfTiIVwua7x0PGLeI+ll1ggTAeq3KEIEzFh0/NfwAkmt5abWsauGg\nuCDshbv37LXl0aVERwabbHpkDEWkUVNLlYW1LbiQiFdp+bZdQR/pBlqoxIF9fZ4D\nZ9yJCmkg+c57JnVOlkejTZZ4viGXZuWO1ywGiwM0YybqM54O/gzF1Dn4hiEiJR5r\nP9mdMxaM3DTcsb8auc03qw9OkSXXS6CcPh724zwXH+hac+pBv/fQd3VWi1rfaBLk\naAYjy9hzAgMBAAECggEAXm7/EHSjUYMAsr8KpqRnXOae/ffxJpYu3Pq7CEPF3FyK\nMumekzPd/UCRYR+IuEGcyLg4Mn8huN0pzhsoGDcgXkxAsHSL0venLodonM+mlbLv\nShMyNQ1sRRAV425BY4wYOkeJ+faAH0Q71sSpDoT1/qy88ynwcSjG6kMfMg55y/Fe\nWG3oRUdTSUXQJmq9pBh6QlY7WLiR46sIr+5Mz77iG5Jdt7e9W1A5I7+u5yUVIqgv\nqFa/2aVEYtuemZDbbNdfzekwfWgZOGXb6Cj+b+0aTi1MfO+E5vHcOPzD9RmlWDSA\nzrG4vJPQJGpEbkjDMEsW3We3gSw8TS1dwY2w1CSq8QKBgQDsfoNv2QzC8qLL9Cpm\nqiF6YtE9lRCHk7E6FcmHc7cgzI7kolIeyIhvaFh7X+Lzp2MMfAOcxOWhovjhjKuy\n7o6+0BgDVHmFBWY/KLdKCy5yTQ9RjZ+QNPGxajzu2ybz6AtgfSDZ+SH03gffzEkw\nBhNUxfAjgiJ1m0WhBSi4ywu3VwKBgQDQjzlzIHak7Xj0k901umABoW2CVNDB8uBb\n/6t12p+h89J120XAxCQHSHu5MRV7oKCLRRyHI+T+jXI6nOTJ2RWb/Pa1DNQ+Yrnl\nijBla3LoSJoZqOeMCvIloVWazSv7Dpa2dfaGmD/ky+QUqi22Wfj+FQMQiRlUxAiZ\nkcFQvjlCRQKBgQC8HiqpNqsbC2yJ9fAgeCZnNuGgLcnXPplUTe5fy6EY+v6TSbcu\n+27jx8nSYcSi8jwsux0Yf9r1hzCYIZCWpYJwsBDZ3UFImbHqfZXG1Twd+cQ8p/4L\n9MFo0cwkZ7kFfUhHeWE/Yhgrss3qrJJvG/YWkdjiNer5SAjL+9GXpRPtwwKBgQCy\nunrOOXzTfBrS5kCFQbHy08dIEK1R+HTjAmiKuA9jN9MdYwsU1kHV5/z3SKQTbSUI\nFPMMsOsWZlsE9d1vSVUmd5NotpTQ3cRXfKRa1ckEXOuKn9/GeL7pFqiI39kX7nmj\n5dWdpK3kwgI0314LTnF+NL2KlyMZLGH+URVsv4fMTQKBgC3glNF+Suf46xmY3l9s\nVbFodJCSK63BjY1cCDsTQDiJ5cRAmqBE18jJC7UfLhQ5sD+mSg+V9Suk/8E3wkwS\nSOB0EzcAX9MKTb1kTe7qyPoQZ0TOrY5zFl0lE6p+F6BxSbra6i64rwJfDlHytg6k\nWm8dSIfVGJQpBZJ7M3rsuvGe\n-----END PRIVATE KEY-----\n",
  "client_email": "mfc-6p-0zjua0nomm7dcatgot9rxz5@saf-hm4sh7qic8jinlscxpmlhvirxx.iam.gserviceaccount.com",
  "client_id": "110641643512874746356",
  "auth_uri": "https://accounts.google.com/o/oauth2/auth",
  "token_uri": "https://oauth2.googleapis.com/token",
  "auth_provider_x509_cert_url": "https://www.googleapis.com/oauth2/v1/certs",
  "client_x509_cert_url": "https://www.googleapis.com/robot/v1/metadata/x509/mfc-6p-0zjua0nomm7dcatgot9rxz5%40saf-hm4sh7qic8jinlscxpmlhvirxx.iam.gserviceaccount.com"
}
