{
  "type": "service_account",
  "project_id": "saf-hm4sh7qic8jinlscxpmlhvirxx",
  "private_key_id": "3f57981bd1c1fbdf1508b22d07c6d1dd92edb357",
  "private_key": "-----BEGIN PRIVATE KEY-----\nMIIEvQIBADANBgkqhkiG9w0BAQEFAASCBKcwggSjAgEAAoIBAQCrck3FSZAE4zoS\nBYkFNem10H9JJFHqlOcg9YJyk3exi7voM7RAmqOr17R3z8tZyETmlMyv4PeuiCN3\n7G9KujfFhg1Vifw5hGwKKlYsjqDAo/6jx2NcrTtElOKMBESJfzYClhIBNb+j0Zkm\nguJTYWK/zwmqtiVzANmeYj+Z+s18E+Er4HRkaNTuQBq2Vu7pE3uy+I+NOk+ZpGXx\nFmERsa1lMmB53ZzfGkf8jDcC07lmAD7xp+yXvclmLm5XM7ZHy76RgLK/jBHX/uxl\nv4lWssbh+dcHIBMY99v9oU6zEu0NlQf0spBA+/paEDtHLLF0S2xWGhzc3Ete7Vhf\n3LonyuwnAgMBAAECggEAHMRiqUJVIITSBxkXqyCnNOMloGuwNQjEGWMofrogwNE9\n99HJInfwE5LvjJT4vXldmkUIbVB1rrrYHLS23daOKh36mco74JjIGhKNgA90iK5b\nuTZpBTFp+vFya+UBbQLD2L4+iiZvH/k41d3rROtXyvBd4l+KvBe97BX3LwqGtRVI\nih4xPQbAXVOEYlvoP9AR/Ra+gbUTs5rRRCPTr1xwLtmdG2P54kD+368xjDyYasYE\ncLjmvX/qCueKrahAB5TXO5L6Uf8vodhM1QooJZuBLb9BuAErjnp/4AbK6UIOfwqb\nr8b6596/kiIgaAozEWFWV1ZD9m/97/XC3oQK0BxmNQKBgQDSZf9sK4dzjdFwfCVH\n/R7LmPN5y+1Wnkc0cC0zN9qJD/nyWe7v77AraeWG2VEbNHtqemxKE8nrgHNkBOuy\ny6fLkArhGhV+jvLmKx+170auJnibioMTZg/PiCmBysxbnEZjAhcWAUF2/6vA1//T\nlm1+WrneU05mwzZNxdSdlziEZQKBgQDQmwzBbBXVQ22Q3dK/gBpoBcuvgoYaqfzl\n6fjQ16ksnSkoztt5hAOwDF6nbA2bwIe/IrTa+NmnAc30GIxZHPlovD5VS8yyeuEy\nR1va59rwNR8qZKAs1eglK4y1GiptnLjjuakFtkprrhF+y6E91lCRRsEqBdYZaKI+\nnVzg5+QHmwKBgH2b80/K9QThyAYVt9Qwo6/9Um6Gdt1dhTkjN3j6gXeOmDQ9yM5q\nFIz2nddR6oAJZxz8laXsBoKYn0s5PNXzi+uVxUj6X5a9FPqhCD9/6HyT7zE9EmAE\ncK//pHgecL7In6UAXHQAr+qxXQK2cb8KcbgbxhebOJVVOhhYYUTsQQuZAoGBAM8w\ncKbb94NuCTDNYTiav595wih79z4cf/bLQDoNORX6spq5eftjR1ZfstOO2qVLwIfy\nrLagW20ouaorh5oq0P1Zmn+VXaYXrfwGLBFsH2RdHqs4bm6ZtozUiFiHuIROGMT1\n7g6iU6BHr1DEZ03HwxXHtKtMSK3L4vlVyp4HM9DpAoGAdEkdkSQ8e42+ngOPhCRk\nC2KpLvvlLAKSf9XiBSDFvszJ+F7fKCV28s9O7RpcYd3G4zfUByocD73CAptzljAx\no7A8tRtZkt1iQBT+oZqQ53WJV4runqEubn3iHtJYqDt9iLODaNG/lTuI+rfmVem5\nSwcbQ72jhnLlNralnjXthfE=\n-----END PRIVATE KEY-----\n",
  "client_email": "mfc-q6btfkgtq1sqnnji6xf9n98226@saf-hm4sh7qic8jinlscxpmlhvirxx.iam.gserviceaccount.com",
  "client_id": "113211048177474005907",
  "auth_uri": "https://accounts.google.com/o/oauth2/auth",
  "token_uri": "https://oauth2.googleapis.com/token",
  "auth_provider_x509_cert_url": "https://www.googleapis.com/oauth2/v1/certs",
  "client_x509_cert_url": "https://www.googleapis.com/robot/v1/metadata/x509/mfc-q6btfkgtq1sqnnji6xf9n98226%40saf-hm4sh7qic8jinlscxpmlhvirxx.iam.gserviceaccount.com"
}
