{
  "type": "service_account",
  "project_id": "saf-3ch9o1enzs9zsh7q5b9im-8kah",
  "private_key_id": "9094da2c816373a4d4c24d2f20744bf4b610c776",
  "private_key": "-----BEGIN PRIVATE KEY-----\nMIIEvQIBADANBgkqhkiG9w0BAQEFAASCBKcwggSjAgEAAoIBAQDyGQ7hHMFBUjy3\nkDrK/0/ne+lYZcLIE6/u5r971VFxTz9c32kqerah6X68JVBN+hcFBfeeRYKalCaU\nH7/5SLL2gZ8AD9EMysy161tzZsfb3ohUD0RX3ahS/9au8nxpSkNiGacAIqA61yx+\nhz46qRtMk858rjeb7UK9HwLfXdJfKTLJoQU0sMvx3WG4fD/exap4PhEmEQ9h2d3A\nIVqNQDXGDTou+PPsixRQY7cYdwhEkwXsfIydvqjZMrJYim0RMQr/LcQ+NVLtDRlZ\n4RoJ2icZb2W2IJPcbBUb0pMxWh8aoV4oju17pBqX90Z9WiW3XMhK3EXAoPQGkDVz\ntKmcIU8tAgMBAAECggEALEkNqfuk1VJaBXkWbCJCZ1WJFJC+zfMd/G1MyzX1CS1m\nKZK7jdf3Nwx7kKahtzXfhp12E4djEew2V2OsbgkQpZuF7pC2HKkvQ7rbFnPPbOaa\n2QeW6JzFKPOgPY3hWLBLPbN0E0gCN+k6/CU4qqna8snZ3IBQ7066Jda5o4rpy9qm\nE5LYsiGoeUbBUiRPGmpgs5iNNcRRzvq0BrkYbi7KQ6YfxzMeJJnU64uhD6AqcLSd\n5FXxzKGnEKzNT2ELNLEf8m9PBoAMfEzIWWieBlXKTJt7BD41OxPhVRLNP0lbztI4\nf0JSa+sKMbLQ5KUz/5D9ppjk53aF/DJJpF2cNuBxkQKBgQD+pxyIl8LbchawTWCK\nzVJpC59N2rXbGFY+tFefkBYEw7hghvVsJUBuPGB6+SOfFstMydJJham5vzeAc9dB\n0Xak4bde1wX9xJOvKY8yUqH8GrMKBFpK3u2VGijEhbd5MJVqRUrIRZ9yOXjqBYXF\n6Hr72pw+kd5hNvZ2XImwDLl/fQKBgQDzYPFl+P79EqVPFvLJjt/w2Zc+tw+kAZUG\nXWKjuQ5beSuRlYtqh3g6mtpa77pLT/TXtdpKTKxHKiurWjiCI8CZbZVfDIYce1mG\nPn/3uMLH4wnnSaV/CXtwB3gDVrvkYziBwU5exCh/lo25P2z2mGm1V4wxelAa7GxI\nCDAVBwB9cQKBgEwQrr0+V74k/hH7ivLrEcq+5f7jbZ7cTia8x8+pwmn57IEozvZW\nykAjWM5izPkgXem5/05m1qPdMj70W0AVyVLG+Xci029R4KtZxqRJeolLkF9VnYLv\nxBfdkH/jUUKp+Hed6xCXe2ErOartq1/KabIBQtqNx9dSC5yfV6F2q5IhAoGAKCIJ\nTI51xdeoSNV47cHQrc/DwATB4IKeR3FozaS7eFwP0i790XBLZCaa8Tns13R05IlJ\nWM0x735FuzjibptkrChE5GqVRucUSS3PPlNKU1neDTS4xK0UnNGueaZ4z12JOORe\nfwQLxZZXAoAyAKv7anroVFReF0J7TJmFDEKeUxECgYEAg9bqGKdrx1iJZRgNC1a4\nplqa3sexurPnMjxgmEYhXu+jNiS1h3J8U0u27V+yMpKgEF8o093L8QfK6aUe+p0g\nYWGrpbKrKXVeY+jeNQtFNv4Iqkmet7VxwB0nuk6nlGxYWteAFWHz1vYwA65qmKbM\npKOrZgRD5FB7WbP2Q92rgYU=\n-----END PRIVATE KEY-----\n",
  "client_email": "mfc-30-kqvg05ntm56710sr6h5lo7o@saf-3ch9o1enzs9zsh7q5b9im-8kah.iam.gserviceaccount.com",
  "client_id": "110614641763154318913",
  "auth_uri": "https://accounts.google.com/o/oauth2/auth",
  "token_uri": "https://oauth2.googleapis.com/token",
  "auth_provider_x509_cert_url": "https://www.googleapis.com/oauth2/v1/certs",
  "client_x509_cert_url": "https://www.googleapis.com/robot/v1/metadata/x509/mfc-30-kqvg05ntm56710sr6h5lo7o%40saf-3ch9o1enzs9zsh7q5b9im-8kah.iam.gserviceaccount.com"
}
