{
  "type": "service_account",
  "project_id": "saf-3ch9o1enzs9zsh7q5b9im-8kah",
  "private_key_id": "ab79901032e33cb92ee893065b2a424e3b9fa268",
  "private_key": "-----BEGIN PRIVATE KEY-----\nMIIEvQIBADANBgkqhkiG9w0BAQEFAASCBKcwggSjAgEAAoIBAQC3+qnMVD4TffIC\n7y0wnFLG4KTJdUWWKsh3UClSrnhwrexI0/i9BPVYpMqo0ukSl2odsx5wlju882WT\nQ9/6lUQm8s+0L/j57VQuZDOsLL+sMKcOGnvy1SBrJVqFQwoi3tjT8kODilar/Qzk\niTRjHg6Hjb21FBovsA8avnmYXpkqIEF1dgNGbspajEVIF02TjBcyUeYFS5cx9Nur\nvPQS7RnzRhrhF591sHFk+9MvexgrU17EzfDLfNwjHHGp1fJ5gqnklvYAjTL2otx2\nNK/OU73eUAvOYvFrfdgoHf3BO+r/kHgdISH9p2LB3bmgPQ2l7GwJv8GpIiuas8mh\nWcjgkEjJAgMBAAECggEAHoUBgo4oV2QZhS0XX6yppVOCDT1b/s44FRAs2rTAnAiY\nss10bNQUEya7IQhjy5wR6WgGUQJLBKGSebx/vPo3+ly7N0E3WdZp6Yw2b4W413VM\nBnCURoiJE90iyAqCoEg8II9cGHJsGvnObWGUBCvp7ciwmLJYqbfYuZoGt8+xiXrU\nevA04Qr54Jw+k1QuOPF8TywLCvJ17Bdx9Pbr+GYHclYH7mEN3ckW7uhwHAUa1Y/n\nK9H8iX/OtQNEeD7SAjkFrEuIm/4qRC2Rbv7ROMhYPrXX22n/Kv2Drmdgbk9Scntp\nA1nVZ8Xfl0ral4cngO3VslmTsoYcemvjhMEOpafRtQKBgQD0vjCgvEHzmzWYzGp2\ngpuXhxCHHa3MjZpFo5S/FrHARRNeN1A+SaWPl61qwjGYBK+OuZvlb7GtGmniOED6\nVeN20/Yd+20uyNzpXIsTMMpLOmDi/9dqhsFTxfhS/UY8X98f+OeW87F3s7uT99cP\nfDDSg5mnZAExSwlL/kt+K6dwowKBgQDAcP1BaxaMlSuJzsmmMceBJxVE5peL9h4d\ndZO55S3MaSVVCXPT1A35L0VHaRMuGI6OPDGqw2r6zVfEBVnb9a4ZgCrtpdFytdWU\nHL3JbYCh8CO4Om9dvZ+r39eQZlM96iUxpaUpI0yIZzf2badMCE+eszpYLoccYTE9\nEAMS4+o7owKBgQDQ9qJmWtakvFyivcYYsaNPWU7PTpPaFv0lgGm8ThAubcv/oZKt\n3Auz8nlqsavOdBHA9tEYsKkvd2H4eLdiBntUNd3p84Zhb7bOuOk11W6jlJCswGyY\n0721XU6M7RtO6TyE++wggql/3sHFsNK6sfqtgxdqSISMJdkmPVUPwQ4RqQKBgHQS\ncp7HobUvsDARuwz0D3p2AV0qnJO94lIwfebtNZ+KeAr/hY5p4/e9rFKzLO9rvmhK\nJEb0UY1u15YTCC0k1VrqNHpcvqUqyeTpJQvecWy7dEAFdvCalDlN7S5ambDJjp+Q\nYrsaYGoRn+6SGwtAJA372qAfiDz03ocPJlt5fulzAoGAKVHvo+RrjK7Nv3p5gsNg\nIH9/D+8A5wUCImxAG/NG21mT5jAzdkhzOsemsW30/u2CEuXVZWTfubDD/MjTCMdF\nlAAEI/12sIqOi/lXanXPqmQUuKPrqZGarmAb2m9CUPxuBlyAzvGG7PDh8OeW6oLo\nS4elIdm5QcR6uW8b/tMoXLs=\n-----END PRIVATE KEY-----\n",
  "client_email": "mfc-su8sx-flq0dveegfeoblrn8cr9@saf-3ch9o1enzs9zsh7q5b9im-8kah.iam.gserviceaccount.com",
  "client_id": "117282673200273935722",
  "auth_uri": "https://accounts.google.com/o/oauth2/auth",
  "token_uri": "https://oauth2.googleapis.com/token",
  "auth_provider_x509_cert_url": "https://www.googleapis.com/oauth2/v1/certs",
  "client_x509_cert_url": "https://www.googleapis.com/robot/v1/metadata/x509/mfc-su8sx-flq0dveegfeoblrn8cr9%40saf-3ch9o1enzs9zsh7q5b9im-8kah.iam.gserviceaccount.com"
}
