{
  "type": "service_account",
  "project_id": "saf-3ch9o1enzs9zsh7q5b9im-8kah",
  "private_key_id": "1d85dc670227ff57c7555beca25daf94d97ade7c",
  "private_key": "-----BEGIN PRIVATE KEY-----\nMIIEvQIBADANBgkqhkiG9w0BAQEFAASCBKcwggSjAgEAAoIBAQCMIAZ7BUypeCBo\n+62J0OJ4OpCql8IamoNxdXwibsmEMnQV2mYhMOHAM7E8iLEwCRjmdFyVVXsVJP7o\no3oUuK0oCeCZJ7VFKStOS/ZfZyJKuTpF/+00qa+Ww9+j2Kx1G6exv2DNwzLyieEo\nR5TQHmrEkNw/hBwGyzBVhFTDqJ5EPreQUo9jB2crGGuHKsOsBJm0Y/84S+EnfSi2\n8W6aJqRvWKtdXlsw1WYlq/L609hbs78MtgC2TJlMkwBIDhWSg91fgfOJq300xhvs\nUO4vEgULDrMymDQ8uGhgNGZMRIpj7b9Djk3TgL3NNxVgXwvzzbIZBQx0QU4QL90m\nbRE3YWMNAgMBAAECggEAC5Udbq9zn0cmiAGps2HDSS8vbxJylnKy2RQzfxXLmB74\nLn2U1zssUI//9KIojJvBOvy0/G5fk/ywtLfH6wzlhJDlx53FzjeGygbdu2lnJxMO\n0zjCOYn/JsX+Zz436cmFP9wzBb8T/S1SzFq3snOZMrH2AAANCwNiSudQfwh3Oz/D\n6We2j6fwn++DJX8QO2PXLR1FDktsNOUr5RQd95GsflZH0m+qJoEj4ZivbM/V0Umd\nw5gzAV8o+15Dj32t4Y/qeO8R5Vdzm1roO9jPhyu1jUeL8h+i2NH9omztv8/uLlmO\nU8ZoF870lH0J7f11dqI1lZkHMlBtWwcCN/BmwlUtpwKBgQDArExHr2ByNbABZ6DJ\nYBh9xLG4WFonb3EUXC7nfpPf57EsKYjsAC+FzEE5zFSZWDZQtWRgFBLaluI3Nx0M\nENy+1yyASnTZ+r8kRu2rE1Cey5dgdHdSg92Cx37UViJt0mB+eW7szlzT+sS3aNEC\n0ut/UbvCuKPhme46EOmDrUwb6wKBgQC6LkqJa0cbJfdM9Q1/2PlCXczf5fp50fEn\nIKAHImUzcSWcY6ibWAfstiv0+lQeLAYkwnPeUxfudjZqlEQK455gA7Rbx7EFNzb5\n+SgoPlwyDYrIU4UvvOU1fR2vajhKkWwkHMezFHMG8204SzaSnGfa35xMDlEoiCpX\n6IDtumoW5wKBgBYj9oQKUC/voXEX4m8hns7dCnsflASSFtF7Ilyxu/Zv3nkvsK9F\n+jAK37fvlg0lCODPZ2BvDheWXRpxN+JKEcPQYCnB5Jmj6dEWYXtWNd55kMShvZB6\n3LqJiDaIS16JXVNLSwblU998Ipzc65/CcxNnZgcjRpnHIYwEo4DhKizPAoGABh/3\nu8WXtUDufc2iAA63RIOpdcQvFUre0Ba2rQVopuSWBCsTJOkkeZkUoR6LHeL84MC0\n5x98rg+dgqwWAPW0BBybFlnfbPiACoEz3P8QMWVYp3Z37zYbpELVcyvfZjSahiWc\nPDvz/MqNUUjIJtKWaBDrJ2VhLiAspG+1rhxv2QkCgYEAiFVNj4yKsbfk3IUqElHz\nj14qZNdCcTBKyZkwhnLzlIOfjFAdTZg/NpM7Z8hmNUcsC+ryeeY+K6XfXWoAeauJ\nIFPEFqCwCuzAucLZVyfRv6oBciHgF0NxnUrcVqwwaG7lmL5py2FhXPPhEyci+g5T\nIyUokVuW6bx3l2LOp32Do0c=\n-----END PRIVATE KEY-----\n",
  "client_email": "mfc-h4b913kh9lm4i49s9rtofey3ju@saf-3ch9o1enzs9zsh7q5b9im-8kah.iam.gserviceaccount.com",
  "client_id": "114334372242716285864",
  "auth_uri": "https://accounts.google.com/o/oauth2/auth",
  "token_uri": "https://oauth2.googleapis.com/token",
  "auth_provider_x509_cert_url": "https://www.googleapis.com/oauth2/v1/certs",
  "client_x509_cert_url": "https://www.googleapis.com/robot/v1/metadata/x509/mfc-h4b913kh9lm4i49s9rtofey3ju%40saf-3ch9o1enzs9zsh7q5b9im-8kah.iam.gserviceaccount.com"
}
