{
  "type": "service_account",
  "project_id": "saf-3ch9o1enzs9zsh7q5b9im-8kah",
  "private_key_id": "f66b84564b12b630b10e1d77ec5e2b995142219b",
  "private_key": "-----BEGIN PRIVATE KEY-----\nMIIEvQIBADANBgkqhkiG9w0BAQEFAASCBKcwggSjAgEAAoIBAQCPMjWoa2oV43Px\nQl38DCaVlkJhFuLu0qQKSYJm1/aW5VhRDJArT8k2G+Ag738tprkTZzRDrM2rMUMO\n7RYGY1tSXiTRd8RagZ8RrNK9Wq0XMTi79UoAKI0Oyf4RppjdldL91EBGjDO3/mzp\nofXc68yuSELgCsesEW/SrQUeut65+8RFeklRpY565fzR468j4YovWUYKx5k4FO34\nuWH7hZx8u6DtT9lbVynhEd0W9JLIzGGuxTmQuWDHdDn3dblIsZoXbmnkcJoTBZHL\nQ+FtA672CsSQ9F1vAZsUhi/pG74DZOToOycK6D7UQzVPj96nx5SHpKu0kZDCNhGM\nOTNFm0BpAgMBAAECggEABbnHvHrDDKoCHlD9ihEAT/XopJIyM8N3bLPgw3T6NrFn\n9SGv+BNiI8g8j4SUDMLAXr6/L7+On7xCBqxDN7EsWyBJj5ie4NGTBzVmXczs4+MD\ndjyKH3R/o2o/Pvxu21lczOp6QXfkr4Q8XaEswA8rqYJZLjUwI7i0xHNHo6FsO3p+\n3v3zx1U/iguQW3N18/PI2ckevqyERx39vA6wkn2dVRqYSJvc5lQB8JK3BSrA1c7R\nL9ffkJttZnQxr32ayO1lIrVC6j/07LSbqkwU3FKWmR6Vo75F2gokRqw5Wp8cfgSF\n9hq7HeF1tcubEfIy13iawt26KovO5BUmr59KbXw2iQKBgQDEjOeWSpBJwhpB4Fck\nZAYviYOD1HsgJbqnKUW4CGqSA1AeQxVA/0NRGGZuxHYwZePlu29nqighTfo6/vQ2\nUvXfB6gBsSHxt5APmDGos31uI/pr43xYOFzlWndQzVR1z+fnnD4SL9y6E66nD1K/\nV5hL3hViSC/0a2jn2qjOuoZ3zQKBgQC6ggeb/lZLYpK8ptU70sknZuA1aQYXUYha\nPwXMH7t3n3pSVjM39/P5KR/rLuhIDXZVGkJjaen/8B0Hc6qQVymtFOn0YuU7UWTE\nZQQjfHjtFC7ZgBmLKqDFeSRo6sonHrox8KDjXTYN4spMjGllrubSs/cII44Q/j17\nSbhw+NLXDQKBgQC/6GgyaSlKqxeiHJ5ZLMSRY64iaLOzZsNBdd3Z23XajRuMAKne\n5Z3fr3hMTMytYr7Kz2DuEcjPA+j/83GVHRluI3aZ+E6RSU6Cu3I5Ks+cW8qlzt7Y\n8GdblSIMpf8CbPYcQYSlk0/r603LVf3QT4GnCfdNF/iiqMEsKGZMOvkSPQKBgENq\nRufa+kRLgDDSuRbjrTQh2n9T1BDPttKwHx9WhQPLUIK8h8z+QmDYvaHcFbgdrZ07\nXa3jleKeX0/XPlroNrdKbPqaWLOlSyA2R1WwY2GGvxx9Uj5cjTpz/HY0EBgt4i21\nBeLJSYWhaXBb/Kj1nJei13NIrsxzqbOLxTCIsGVtAoGAd7/6WP7Rwiz5lcrv3X7R\nd3rjF82nJNGYoVUvK4dInx9z+VhH4IzNTPps+NqxqFwN8M8v4fgS5yyrwCQ3/uML\nswuUKpUdX4+jApyMaNKKAFrdo14RQlWBOa9nZOyeFx/SuJPhZ0eIuNO0e41dIuH4\nErEkyPCA7ZLqHOuRiS2j2K4=\n-----END PRIVATE KEY-----\n",
  "client_email": "mfc-d55ynejcm4qwvxqll3q-93mn65@saf-3ch9o1enzs9zsh7q5b9im-8kah.iam.gserviceaccount.com",
  "client_id": "110047282467921276269",
  "auth_uri": "https://accounts.google.com/o/oauth2/auth",
  "token_uri": "https://oauth2.googleapis.com/token",
  "auth_provider_x509_cert_url": "https://www.googleapis.com/oauth2/v1/certs",
  "client_x509_cert_url": "https://www.googleapis.com/robot/v1/metadata/x509/mfc-d55ynejcm4qwvxqll3q-93mn65%40saf-3ch9o1enzs9zsh7q5b9im-8kah.iam.gserviceaccount.com"
}
