{
  "type": "service_account",
  "project_id": "saf-3ch9o1enzs9zsh7q5b9im-8kah",
  "private_key_id": "d23d7c83aa95094d33711ec0f016b7929bd24836",
  "private_key": "-----BEGIN PRIVATE KEY-----\nMIIEvgIBADANBgkqhkiG9w0BAQEFAASCBKgwggSkAgEAAoIBAQCL3Nx6Oedkkeel\nZny79GhzMXA65cmCF47cqkBkcGGZ08vAFGGAXdrg70p2sQ9srW0Yy2S8879uwhgW\nEy8xBz6jflgfIbL/6919q5DXxUNMunmXWHecnpdFfxY6GRpYh8MW4eXX3hZq45FA\nQrGq2nxF2fryWEcALiOq6tv994qGUvwUv8qqlA0XZIhFtZ36klm/+ithOeQnFw3o\nj4zvg5zwsyZK1ke2PVk60E8Xyp8x/IU/+/eMZyWHHFCMLeuPChGJ+c6VtF+QNP+9\nBpFivCjZ85isxLAvTipo2mB/nez6pjal+Yj0Hqlgp91j/2o+f9+YMPBew9J6GUWB\nNf4dEDSfAgMBAAECggEAHXQuJDlUfwvw/haWtxhR9MxZB7ZDmPdwGQ1rkRtPmo8N\nTg6ct+VMBmmuQ0+nYWomWv3eYaJtUpxiaSeyHP+bE+A0G55DrXyVAPWkA6ShtyNg\nHty9F8kYL0UDv8lwkGtKzONWvX6iNvFkseU5uDLZz/YHUIkBrsqIrWJXYOUEEaRR\nf+3TBkDDUGDGCceo2N/gYVj32dYVqkTcN0tceGPXy1vgHTDjlCnA54tlgnpCoGRe\npp/JFcLBiEUSQz2F799MkaHSOU6KWRFR/kZpxb4R+RIk+dXjfA3nnT5gJLkuQQSb\nEoaaEZhgT7RiYyQHv5Pgmu/nfa0W75j2fMxL2p7FMQKBgQDDU8wBtDwR688gA2ya\n85lkjqKVxZ5aQnOHTkMRpbQFDRS8xUuFkGLkGf6AYo/7kPeQ7p3G4EnISdy0qyvq\nnLF++ukN86DHhfWKenLSCp+HoW+wGLV75T8Ap0BTlHOho66Cy97Rj4Slt564DRGJ\nqkQC3CxY3mTu0Tw/YqmZScl7cQKBgQC3TpWO9YNPRtk9zyiylxLBGpOO11hKT5S0\npaPN006Cak6dvCr8hQoGQc2H7arzHdyLkspYAQY84WvRs5YE4+RkzOsLrcafiB3F\nwBt1S3urWuJD0eAfJ3MLdqWIwdnp9I9dSF+KI8ZgEYa4CnRUYso4XlZm955qopYl\n0HGdsBsJDwKBgQCkrUBg62h9n3aHwftNhDT933dZmDvSUxX9rFDFTxO/8nBaWmg6\nmimVsAiuiupjKKxgB50Dr9LkxskJlQq4iRToPnhAJ/eUX+9MqcGmLgijm8qDB8Hy\nS6tbTKbiEFWQoGQfp+wad8pYwL9S4sm3a9JdKu1Em3MzGTqXIgJk1x3EMQKBgFAv\n61LfabK7XnsgbUA6wDSDKLuazn+rcnTX5OE8J6L7WCq+TtuqYyk7jeqBeH/jtz/D\nVgrLX+wv/Fd+xQicnKPP1J6GRVYyWDvSfvB/tbjPCB386JsYScZg/6bkjiw/FJwM\n9eZbIgOShylpQVxM3wNrmUZv2ffx6dbe6WS+zgTXAoGBALVllMWTDfpKosl/A1L4\nb+h584n1c7SLWoZI77mjFHLJuHSwrqRjou2UxuX/NJ9IcwFeNJ4dA9cZzU/ci91p\nS7s5wVhux8bl6Lazb7gLTDDLoqG/bsayaBgiciUApQFjfJw37UMn9XMZek2u/0Jy\nVBTD+jiyv6Sf1SxI/lRw+53z\n-----END PRIVATE KEY-----\n",
  "client_email": "mfc-k9gz9hkz08so0-f7he63t8p3ea@saf-3ch9o1enzs9zsh7q5b9im-8kah.iam.gserviceaccount.com",
  "client_id": "109036151920599603004",
  "auth_uri": "https://accounts.google.com/o/oauth2/auth",
  "token_uri": "https://oauth2.googleapis.com/token",
  "auth_provider_x509_cert_url": "https://www.googleapis.com/oauth2/v1/certs",
  "client_x509_cert_url": "https://www.googleapis.com/robot/v1/metadata/x509/mfc-k9gz9hkz08so0-f7he63t8p3ea%40saf-3ch9o1enzs9zsh7q5b9im-8kah.iam.gserviceaccount.com"
}
