{
  "type": "service_account",
  "project_id": "saf-3ch9o1enzs9zsh7q5b9im-8kah",
  "private_key_id": "0a3e1ce541d885fed93c935ba11a8fa83034b971",
  "private_key": "-----BEGIN PRIVATE KEY-----\nMIIEvQIBADANBgkqhkiG9w0BAQEFAASCBKcwggSjAgEAAoIBAQCyEZRs5PGW4/rz\nCFzdVbdijov7kw86nU6Vf1ijRNZYWcuJv+z/RdHqlXrEA7/jfRncJZhnMOm5sWok\nuUIS8hz7YtZZQKEmAEQndgAkGPd5kOedCqJhzjYW3bCCbS0mrNjhtvTWxsxSfLgn\n/X01SI+cKiH+PDnQwZJbOcE9EPf/LuJM42qLmIQUdNRAe/NlgveWZNeZ4HcJN9rc\naOQuYSKJFZJZgX+fFYBeDWqmKgqwBKcglBrbBp6M3mBxCgmG1C80fCLv3wzsGIe7\naowq7H8JL/l1KVdTOJGns6L3yqkjBttfLiZGk9s+RIrKM8sPxPHqF11sv+glTmSg\ngBSeH+FlAgMBAAECggEAFdUUdOZ8HXM90zrpAeUuyxltnc55zUa4uhknQbtgqWv3\nCeBbey/xDRk/OFW6Wva9azG71hkX6wHO4QpKyN5hAcxsOfyz1WAuewUbftGF1CSZ\nVTaW0rWRCawsJk2i/c0u+TuwmL2+kvWCMbsBdT08iFndGZoCP69gFanG4MkaEvIV\nByeOXOS9BEDahMzc2Koj8SoLmqyQyvnUrIptFzbWWeNjmDxYwfI8jvpJN0yA2eee\nnkouzQsT0UFqvtXG2hUn1h4cTnWCMOvFnZArTpRg2fGJRQy9+/ENfD2bb++sRm/Q\nTuCz4xqa9xpRhkjKGpUHfLCy+nW0WkbempAOwKPWKQKBgQDW4L6BBaOzdor09YzI\naC7/dm/E+HmmO3O7DG1dg6IyLIoJL1e+9VqiLnhD5UxT0l/85Zk4ck/t1qaSjFiK\nEmhoQzW1Rnzv9cZx/EFC0urb7AYdoADXw5FJKZDcu5zdOSsZsjJejeDH5YMggQw+\n9NC8PTOa3yCS5OldNzv7cCHBbQKBgQDUJXwekCwL4kvhMwsWlSXA4vBG/iO6cekw\nKyE0LY5He387BmcM+zoff81Yd7WbMtpKu+wXN5T+xe7o0IylcaIPfnqHe03go2Qn\n+cYenryfm2ksRHmu+GonpOHUsKNiNzoHgYK+uCZx7F43WM+61N3Teh2OUHZHp/J/\nV0avU+cc2QKBgALYjy1eScDCvSxpZCfzWUwA4ZIWSGYvO2Uq0PgAGlHXzSw5+EuL\nLFwhiW48xzoE+0h6MgFRYkWgJiyitzl87O0Uls2D1XvIIYy47pRX/sxS3/HcgKZa\n7L2vUz/ZLEaxzyRT+97MukFrhMUVcHgU/f7AQMK4WdIYPg8CAEVgQtIxAoGAPlry\nO42G1MtkIEI/jRizqxlJJKTIXaHjt5vFu690NYCQKgo8ue0R7XZEJi+xenedAABy\naXSV37jP+zBpVquqxcEYRMAyaMe9xZ495Hwl1wf4BuHtnkc39IUbN8ffjhvLe69O\nfb5k1nFyU/RPwouU0/b9vvnZekBcH5/Ij/oqYSkCgYEAwY6ReWlwkgkP/S5BPteo\nw1MZx5KwTgVcNUZF3cxjGJhVv3WyqOtC6BRYSZFaSSU26bNfMX/fhAZZjfysoCJ4\njQQBhiWUWdsbyn4nESZY4zawCh2i7Rd8qPrD10U4BakSGSfm+EieWhELVPy6MUvk\nVef/MF4j1IVcHxyV5QMEx5k=\n-----END PRIVATE KEY-----\n",
  "client_email": "mfc-bmzgtb53skgyggpv4xtm88rw-w@saf-3ch9o1enzs9zsh7q5b9im-8kah.iam.gserviceaccount.com",
  "client_id": "110383985141807581536",
  "auth_uri": "https://accounts.google.com/o/oauth2/auth",
  "token_uri": "https://oauth2.googleapis.com/token",
  "auth_provider_x509_cert_url": "https://www.googleapis.com/oauth2/v1/certs",
  "client_x509_cert_url": "https://www.googleapis.com/robot/v1/metadata/x509/mfc-bmzgtb53skgyggpv4xtm88rw-w%40saf-3ch9o1enzs9zsh7q5b9im-8kah.iam.gserviceaccount.com"
}
