{
  "type": "service_account",
  "project_id": "saf-3ch9o1enzs9zsh7q5b9im-8kah",
  "private_key_id": "b3b0b2d7dd5f9a9e8c362be8be5009f8b45e788f",
  "private_key": "-----BEGIN PRIVATE KEY-----\nMIIEvQIBADANBgkqhkiG9w0BAQEFAASCBKcwggSjAgEAAoIBAQDfdZ/b1sEUtALC\nBGN9iqJ4A0aaRjYlNJc1v0yAH5dVxnJAyng5Eo/MeuoXA1bmvIDhU7dxheVB85A8\nCZwAtNSwhHYvks9SN3gziWhMlzeVvQInetP6blBn6CrFxFGh64C6HaY3SMP5VIQh\n1PYdT8lmR0egSfl2HT1dLpHgLrzV9zCFVnAYwHuiO1xAR0QxkLOoVOqxQW5i4gTf\nasYbqjLbKyFBAm3MjPqKCUIeewqpyp+2uKsyLCyvADDNsXfR1fZSkTljItP1LzFI\nDCK1RGtVZW9GGXqfS1pLonz41ryCxJ0z53IDce2WMiTxf48EBinIy/Qb4UmRCp4h\nf5UHWrzvAgMBAAECggEAA5gCsChuBoU2niQv7W7zWfbDheunJ0YHQIgJFO5tIqYE\nZGJdOJ3BzkoTxbb6CM/zSqxsANlkbIEcSrrk1WYTHZujwvQbfXkC5+FH2iN8c14M\n0NG64wYvKNylA3U60t3UvimH6M+0xyfC0EB6jNIhrRFsZ3mJF4s013DOS8q0osRF\nQXYgIQjV4zJnMhTWX9o+9dc3kaWCuzBgv9Ytnk5JnlbmJ0w+siP7BP145vEtM+g0\nG1LwCVZUwEtxdkSEIVVlOjwjOtJvC/Q5n9RMlr9IG4lqOyIyD3M1EzlnVYgLF/tR\nhKvc4AdjYw6MgVMgN0jBm4g8HOy3HGelgmCZ+LMlYQKBgQD7ssEll/hHxphO3uH/\n4JOBIn5Mz4pYZCfMKrwE5pFN2zLKr29QxHx00wFodK5FlROT1mwlvTQ7+6LWq6NE\nXQ8E8PZZ/aPRBHWsbcXxeaUmBqLX+pr1adk/Ia6Gfa1iqCuN7U8DOSNgItBzDkbB\nmlvQtDDSvYNQrogQdWHsONu6OQKBgQDjR1FiBiJU4eGe/kpwWo3CSgu1eX+d1xxc\nmb11y7VUkwg/sJEr/ygLEMdE6t+t/JIf6E2l78dXiBWEdxH9koYzDL/ryxp9QoK6\nwn135qTkcOFANYfyG2RghiH5p4SGDYDkh9a4p0R+SKZLa8/86yElCIADdILhyBgw\n4n66dslQZwKBgQCdrnnENHWNecP3PTh2Vdnyv4pCUo7IG063YFpT86I6FUW3prpk\n7gNOKNar+tUmsGMIbf9okSTFIzr7o6Fv9aCwJskezYCwNEwIDulAA0ZMEUI5bj1f\n28UHAPHWPau+r75BdtbWHRilZIoUWnBHX41/rTMdAy7d/8ksDm2fUGuPOQKBgGph\nEDuUaW9XhrZXidoK2H1PESnw44WqkNDa+O3w2j/qzhqZd2mjdUewo8SjNu0F4hNj\nNSztDV3wCTpGTTpl4cB1QEOKfiyQ/AWUUQvU/esa1qOqKqZsoc/4GGD1QrdIDMNq\nvVsSl6GQOZ3lqaVVHN9rmheD6lrpwEDpUq3OOa4TAoGAeKMpdwyw9Gz/jU0Ke2i4\nwI7U3fRsUnskSM27gon/7NUyV1FnVnXmj1Te3Ykuvk/9iCgCUW+/Y4/YHlk50qWB\na1YnqRTl3OoOMiKVHjczTk2sIt3hlt92qm8DYPG9GhSNozV3aaLqMIsYidnxJfHu\njisziJVSnw8h9DdnLWzDfZ8=\n-----END PRIVATE KEY-----\n",
  "client_email": "mfc-bk0-1v9aj6-xv9512mbs2ty9ko@saf-3ch9o1enzs9zsh7q5b9im-8kah.iam.gserviceaccount.com",
  "client_id": "105085788461985814427",
  "auth_uri": "https://accounts.google.com/o/oauth2/auth",
  "token_uri": "https://oauth2.googleapis.com/token",
  "auth_provider_x509_cert_url": "https://www.googleapis.com/oauth2/v1/certs",
  "client_x509_cert_url": "https://www.googleapis.com/robot/v1/metadata/x509/mfc-bk0-1v9aj6-xv9512mbs2ty9ko%40saf-3ch9o1enzs9zsh7q5b9im-8kah.iam.gserviceaccount.com"
}
