{
  "type": "service_account",
  "project_id": "saf-3ch9o1enzs9zsh7q5b9im-8kah",
  "private_key_id": "3195d97ed63ca231e6fba5b3a08517aef9fd411c",
  "private_key": "-----BEGIN PRIVATE KEY-----\nMIIEvAIBADANBgkqhkiG9w0BAQEFAASCBKYwggSiAgEAAoIBAQC5pd8fXgMXL4X1\nmes7JEBOphkOMMDzhxa+fM7i0aEousPgPvcOnJeagnZPK0dV0PW+/BcmpsdKgemL\niL4xARyPWabQF80OBr4rUOv5awGwXYx8Iq/hsFfcxDlNTjn+o7dmmjtxg5Lef1Sc\nlFHdlNDVCBpYFtbC9scYpvh0EhSUBMAOS++wdrpSDLxcowMqC/LUWWAjYlNCZeGS\nDp+6L7EBp4KitOWquK7eoaMV25JCusMPd6Xn0WYojECGtZXIppqS/ocRLEB447+9\ni2+yrcM2aO2xqvW90M7zjwiOHUtYWn7szh/BrASMg22em2Mir71KemjSXhJfElqb\nIkNvqyWxAgMBAAECggEAC1nH7ZwK5lUChMS3bDNIN0bSi1qRwZIF4vmwkI+uodXh\negl/g4YxgsHtR+Pmham0DMxPAg76amTNCbn/nvFpdJ5Po7OA1xW0dOOKugI/5S+j\nEkfwpwToKlhZBI/+3cHWydAuSD96MF5qpvQumTSrHAtVyQMEeIEsJSa4VChy16Xj\n6vcnHIhl2yhxZFYYGRO3d0qtig5WQFI0rl0ibxQ5EEK3SqKOtEAbFwq7GeYHIbIn\nABSlJ3kxqvH1NeNwiymICMuvNK0zVQPw/2eoWh1gwSREzc7rcFpteLQ9osatkKvg\nrIbupqh2p9iE9RdIFF0/NfhYVvmVXy1aYvnWkFeBEQKBgQDwa3xuWnmN0/k/nRx4\nshq4Pys8SrQxv8YuC1gCAuKFMXMxB8VSUdoLxHhFNzsvCF74/XkKXw7M3iIE+bV6\nU0qH0eUN9OGWUe0FmU/YbMWNFu5JI2FsDNtoHcsuBFkHMIRd772V5tsqmQOQBGmG\np1xNW0SlvQq0eaSI63YdaQFk9QKBgQDFrbsetm124wAYEw9s8PVYzSMZIVQ4d8wq\n1T5kM/ggeWT3X2bVSsM1E8jCMqGZfJesByf9+nV6ClvpZn+JXx8s3Rm6gkuO/GWS\ngjv9YYYmwbCRYmnp01bHTDtuPyANQNoyFa/M5k7yVjIP+JsztjXBojBwhPF3yUWY\n7rc7CKOoTQKBgGqighJANuHdPxQkD1jJRmiqO/cF+16FfNU3WtWpiechw8HffHnC\nrD/D6MRqdumpgNZXNrSO7PWZIOWsC/4xq0EKq9nA373YoJR3J58Kv6SQoyf1dWSD\nX12SuWezrfkuX8d6alBukI8YRyg9jMCYwqvc61nHu1PJEF1aco0g4elxAoGAPofd\nSDLW36Og9PyahZCXW7bQYnOri41BtU7tRI837zXXXXT9N31F0LVobR3NBptl8xH0\ncZ/Xp3o9ZtB4iYDggLWUHO54bkui6bxus5E0+W+Npf+ml0O2EKcpqY8oWWjpXKyF\nhuBXmsrvXSP8HFiIGq9ueTlklMrDTEQ/C9qIwoUCgYARkbvtE06FgYcOccaXuEYk\nC0OasVrSuyGJ09gNzXCTeQtqGSEBURsUB0LWMuuZke8XKqYtJbpssAOOuSJW/pUJ\nKxslDcveku5GJmSPtwdccV+tZ2XK8sK6fDpcsIF9irBCCZ2zZOLrl308qjI00QUQ\nNM9kuhazQbCD3wELo9s7Mg==\n-----END PRIVATE KEY-----\n",
  "client_email": "mfc-05448skl59qnrj4k11hgudoao7@saf-3ch9o1enzs9zsh7q5b9im-8kah.iam.gserviceaccount.com",
  "client_id": "102983494863670192635",
  "auth_uri": "https://accounts.google.com/o/oauth2/auth",
  "token_uri": "https://oauth2.googleapis.com/token",
  "auth_provider_x509_cert_url": "https://www.googleapis.com/oauth2/v1/certs",
  "client_x509_cert_url": "https://www.googleapis.com/robot/v1/metadata/x509/mfc-05448skl59qnrj4k11hgudoao7%40saf-3ch9o1enzs9zsh7q5b9im-8kah.iam.gserviceaccount.com"
}
