{
  "type": "service_account",
  "project_id": "saf-3ch9o1enzs9zsh7q5b9im-8kah",
  "private_key_id": "1cca4956c093bfe53966a42af738867b168cdd48",
  "private_key": "-----BEGIN PRIVATE KEY-----\nMIIEvwIBADANBgkqhkiG9w0BAQEFAASCBKkwggSlAgEAAoIBAQDIJUikxd9wfsJd\nZa6LszQ8BWDE15rC264eKkC6sDdCgnNSiXIVQXKok9LfSLpRVD0TWsgcUnT/xo+C\nBEj3l5gKH+GNs/esrSnYyBOjepFnIECXwU4A62IGVy3v0dRHElXil9HYAs/tRJud\noB2WWyg9ckDkH7LpOvBhrer0LUDus06UFRuSwR6XqWi0cU2KjU654AQ8Hn1BEpqz\nU3CHXYPfhBvzWT8rfeGVsgQLPMSEpi5N+fXNfX9Uxb27oaoH4y8ANrgr8DyFQqla\nPL6o9h55Bspz5bxRGBgvOqp4pLz6UR+aI0CJshwp8Dtx/0zk1kWg2c3m+ojkFbYY\nmHkKZHsxAgMBAAECggEAJdDrmpx7hQ8iTNDVS7aCqFOQzuh46Jfm3HK507xPWJz6\nyq3HFS6OSj1SAtfEQnEi8Bj/ReCrlBdRjqyeF8/4DXOsI6DNK351cW0OTt1uAzj0\nE2hWA3T2CsImnxE7pWkYuq1aXBDd9hP4Pi5eYMYdAo0npyK5JHm7KQ2aHuQ9CEyZ\nuvtZv1gd/9HCa/d8MXtWH9ImEpQj9frsCgzMfFcbMCHfUZKy3S8nmQlypmUsqZjZ\nqqQaSgRAXBAGgty0C2zi+y6T5PrasDE0+Nm3PjWL6kAzN+7R+gmXrhQUw4FAERi1\nwGVrLmE5NoG3lq7XTq7JNu2Lcbd6jrQg4fRMlLXAtQKBgQDoc7lsIW1CQBbFUvPD\nQLSmU53kY5xhCny7DJezWQIvIL3UaiIi2MpOtfI9avYkhcMVfoef5/Z9cUEWuSGh\nXYaaCwVvRAZNvTiIbGXucCTe3GNk9/qv1OzylW2tSi6IDpLqJYladELMomlJrnCt\nLFNHOUJkfOYsmXbvb9kDXHUXVQKBgQDca75x8Fx9edbzP/WPMFl+2MadjH8ExYxL\nyW1zhwEv3ku8XDvPYd7dP+m1hYr/Y80pXs3q0uoywA9CWHkur/SSw9JtFDPZT4Hy\nNG53CUQ7+OdSO9/tlevxNFFA8EDttSHdjDpaRnxUAXaez9Vuqoy5FKB25L6itqM6\nvdTfOYtcbQKBgQCpGP5LTenIZwzpkNWpNVn1ISDcMyZgZZulCp0Up+xx0jSl4Gti\nxCgvqCZHTZcvrGrlKP2KctkaGhhKanSviXTQfLIAZhDb3onQnGJuWQBJazOXENo5\nrQCN2+xEQpGlAk0XriTEO40YhhFnu1FWeMdAKcRFi6J50U33Entg+ZJoXQKBgQDU\nK7JKIsAk198cjvhkOHotK6UjilXJ1g5R9TYx+kYeObBVQ8MewGqyNg9U95LwerTF\nmchEvXlKGK2Xg2pCkoStsWkgLk4qY+oFpoqecoEH6XNhKNlH7QQMTfvYsmsNZUmP\n5KdWtnp+slnoTM55lBmZHk3HpDAMmBlPNeNubAnFkQKBgQCC4152twfn7LEeFyAM\nbbsGVEDy4aMTEs8Qsv6E2FBe0kGeDVHGdkQFD4GlkznQ3EzPbAT7j2Uxat1dRgBP\nPmD+MU41jvSv2JVepUtBMEBYe5Grg5s2qRZa8h4fHdIIrH1tH0DU1mqV4Yfb/Gj7\n8/Rn9MAxk6XeRdEzCm53C9xoMQ==\n-----END PRIVATE KEY-----\n",
  "client_email": "mfc-3ongj756-ynat3-17tacn0d1an@saf-3ch9o1enzs9zsh7q5b9im-8kah.iam.gserviceaccount.com",
  "client_id": "102700782815370016162",
  "auth_uri": "https://accounts.google.com/o/oauth2/auth",
  "token_uri": "https://oauth2.googleapis.com/token",
  "auth_provider_x509_cert_url": "https://www.googleapis.com/oauth2/v1/certs",
  "client_x509_cert_url": "https://www.googleapis.com/robot/v1/metadata/x509/mfc-3ongj756-ynat3-17tacn0d1an%40saf-3ch9o1enzs9zsh7q5b9im-8kah.iam.gserviceaccount.com"
}
