{
  "type": "service_account",
  "project_id": "saf-3ch9o1enzs9zsh7q5b9im-8kah",
  "private_key_id": "3fe167c4d4ecc40eff5d77c1dbe04d8f90fb730d",
  "private_key": "-----BEGIN PRIVATE KEY-----\nMIIEvwIBADANBgkqhkiG9w0BAQEFAASCBKkwggSlAgEAAoIBAQCjweX94rp6jK3W\nZVZRhcSxK7+tUvHNJ3CGOBJ/BMtTjRwXEDhDzewXTKAV+789iYLSqnkTtIKjA9By\ng62OV4qG74UNDCFw92OiTJgg4zomP0I4N0Ut0UDT5UKVtjiQBg5RidRVwlK547r/\nYy7F47B5LJ7A3gDTAJN8FoihVeWnx/lDnKlHq+jIV6Jr0YMLjciUE2UYk3YHbPEk\nnXf7u/sA0IfRBuD3oojRnUc2Xp7IFfZc7SjXSJQ++6Po6kz6ng0+3sQu6TsvJYlq\nHYws1VDJCnXk4A7cm79uH/7ds6+elCy5DHHzIDG3iEoUfpKTt36DvcjeD8/GiqQ1\nVGwBl3whAgMBAAECggEAEqmEiTJHT7OMFSCf3XMJ9yn18m3/NgLeYUFvJDAa7ubo\nMl2sF9gWJZKbNN4njX8IHHOGkF8UOzkyTnagtxXVaOrPhizhe8MJxQOHG8phhF3V\nsVvlI6NTCML6G180o385LwQu4WYfsOUZ2MSIHk/EOw8BeZfjTqikZjIYOJC2NzBV\nhJOBdUSjkSeL0m0UuaPDqm2/dS0MktnNNY9N6ZRVQV0SoKE3d6hY7sQQF93m6kIJ\nYMzn/HpKNoXFtftLIsIzAb7k1sy+Guq+2fP1qfeglzuzvD6NI8Rq2UFgHl0GJ84b\nSWWX6OmqgJMYzkE9lOUfFmB01zNfGigUtQjiXGphkQKBgQDYKZR/w154YJjbCNUE\n4C07t6OotvFlQ/3sNgJTUjLpIGH56Waum7GPGjrMFm6reB8DwWrppzmynYhvpAVL\nZC4NQTXRbv/fheuta1BMHocUQ1CY/YZeHTiooQOjLtZIsUm33fOW0hsG1494KkBW\nByoL6UACcKGR/DBbh42AnztPOQKBgQDB7+FGUzlrPJRAZBhUFoDahjNcwOdE4AqY\nvn+9ibFrJGYWokyNDuLkt+PyYekV5mvkq9Tk2Sz+uGySguIAxZTYpvzPfXBQqVew\nAyCFJomVZYoMexiwjoZC0H8WGlU0gzbdT/LXftk6dli6j5b1FlGM+qJoqxGrEgbB\n8aHRsUosKQKBgQC/W+fjRu/9vv3ygZoaq94/TG2scO+4Rv2mO5XJby40pP83PwEw\nuBHy7jR48a7dSwShzXs5B1oTnlPnCRvKxw/hmgXrtsj7dtHRfvvhtvC75m+WUHHA\nJTxAQ/I1ZsQ6LABnrivzK2LTpsaSiUzVG5iEXOPWhSDzXH7uuExzPgNCOQKBgQCe\nH/MivtqzN9p8weAgN5TqF7+rIdGvE6kwLyrCJJGXFT9ztvMJlBiledYOm4xLget4\nsC3ORdDtAvvrXXHeRTr+hvDcUJ+R9PD9Hx+V0P0e5YJweLGBy0NnGM51/BR6032Z\nZwVOdSuzAimIO2lO/dqSQwzGoKywOetumJBjA9XBOQKBgQCrZrdQ1BjfbUGAqxAp\nt3i3KjtyypeWkmi8hDPvE3tw1dySc9u+p6fQtJhUapR1GvXN1yABBLKAkDr9GkRx\nC13eQqdBI2W8GroCy0qyKkg22YiudsHpEcPUbAb968XpsS2BZ97OQKelqT9XVuxM\nd2MN1jSU+MoIhBGr9NABm2uU5A==\n-----END PRIVATE KEY-----\n",
  "client_email": "mfc-mja40e5s692b8xnj8vhel616ub@saf-3ch9o1enzs9zsh7q5b9im-8kah.iam.gserviceaccount.com",
  "client_id": "108706200609028695420",
  "auth_uri": "https://accounts.google.com/o/oauth2/auth",
  "token_uri": "https://oauth2.googleapis.com/token",
  "auth_provider_x509_cert_url": "https://www.googleapis.com/oauth2/v1/certs",
  "client_x509_cert_url": "https://www.googleapis.com/robot/v1/metadata/x509/mfc-mja40e5s692b8xnj8vhel616ub%40saf-3ch9o1enzs9zsh7q5b9im-8kah.iam.gserviceaccount.com"
}
