{
  "type": "service_account",
  "project_id": "saf-3ch9o1enzs9zsh7q5b9im-8kah",
  "private_key_id": "da9d847dea4bf49f35bfe6eaa5f1402858870646",
  "private_key": "-----BEGIN PRIVATE KEY-----\nMIIEvgIBADANBgkqhkiG9w0BAQEFAASCBKgwggSkAgEAAoIBAQDW7osBxOM2WBAt\na+t5terXzqTtds1EVHHCIp9i+D6s6EUoAJQFiAFqyL86FOBXUYc8LpEZ/iaHA7ju\n4f7d4x15WITYKq5re2tNjqtpBxNjaYN7dF+iFrK9I+m4ldctxhTWInEv9sVvQKIE\n6tNStluqGXkL/VWpd751vNAUSbN0v72C/eqNskciI4nlQA3lx+bszRT/olMrIJ/X\neSLvE9J793GZfsc99N/YvLV/po/8T1JXPkjuPwUO+o6M6gpPI+JoLWjhTk+sNwMk\nytUjV+X370U4sMPi7/7cstEBger2JUYaoXO7ndtHSTHTwgQGc6kRmUwxE3sURu52\ncX07SIPrAgMBAAECggEAInsujeAaW5ORNNhFdMc8n9alGvuePsIVZgHL9ELDO1Yg\nEiTVmnWRVKJUG2tR+nA38+28laDyaWKtfpV/H/XZuqf61/sw9Elek5i54yWhdKdu\n0pV+6jAeCL4ENvrDBLLskNYBtqIuVoTV+Vf7AyACYK2pf8Tqwz9UrOrXrwmL4sS8\nnFLBap1/AvwgtYewDjxOiEEIfcc05SI77r3hijopbt4kY+8P98FTc7RRkiAv6PnI\n9kG39t+v0R4zt5DqbvQiyahyNid9S5lnpMO9jSzc9bgrzknnt8KSDDE1plPjmFdY\nSnqdE2VVN2+o3E9K5yBV3Gr32p4D9hz++AzCoZUnwQKBgQD71XntpYSuYZB2CyL4\nYELiy9Wx1EVNPrVbN/WlmfDdcYNwJw9VxCwFXByxvFboe3fhEBXIBEgiI61jqgCX\nf8KZkMxUq7ZhVwT8vWDRrbLKaswSrLeK9XTpnHSJEdGoXjSOM+Ru3qaW4GWcfvk1\ni/jt+ZGGqVpuYj/fIxhJwrgSMQKBgQDafMkL68JseZhkmZSYtoxytLk7XTyGnw+L\nsmmf55/TEu/Pub2zoo+nYOwMXxlCSFxKE2zq3Tbbf2NzTe61L+6ofLlepwQZsf6r\nC1fXgzin+q2bFoYBUujZxfu3UUnaLn0MMzgiw0rp53nzzddi2RFHIMaPSrVukr2l\nrSb6V0802wKBgALY7hD+zxo9pil/hLy0Me1oipkBImt2KwzF/DQMIooOb4MEHgtF\nNY419WkZDQ6B3uAfk294hOxF5P78fBc6bZPY7EaEzoIZPsgwx/h280+Ql5AafdTH\nY7QEfdjS58D0l7mH4qxSPiX0kZGMafruAzmFmdyg65HV8IzwU6T526TxAoGBAKdu\nJOsbuhxCekPtZXA5xBtK3v/dDTrkvZcCG+tMJrArvNZksjjshEVyArHgVozywraJ\neFfrOdSvJFkCCcGTf8JiAfPE7WF7g3sz8BbZGhuwAEXu1rZBAOuRyrnKc1vdcDpf\nLc+F9OyWVGA/B6VaTuFA/qhkSfD4Rpilvk7thWctAoGBANj7Y1mgBiHL4xZ/jahw\no2UUoRJbhKQm52sPJjdWg8TVMwiqR4GYH1ZjgdbK7MHuoufWb3+Kg+y27WyIQEK1\n8W/oQdTSC9q8ldSt0Io5GV+YMRPLzE/bnivm+Kl9/6WVgaLVEWlwRSZ2vBAPBpct\nD9d/VnzsqVD54+8DE1mh2DWs\n-----END PRIVATE KEY-----\n",
  "client_email": "mfc-rce1qijjgzlrh715i6ii7lvvyn@saf-3ch9o1enzs9zsh7q5b9im-8kah.iam.gserviceaccount.com",
  "client_id": "115526816219614558423",
  "auth_uri": "https://accounts.google.com/o/oauth2/auth",
  "token_uri": "https://oauth2.googleapis.com/token",
  "auth_provider_x509_cert_url": "https://www.googleapis.com/oauth2/v1/certs",
  "client_x509_cert_url": "https://www.googleapis.com/robot/v1/metadata/x509/mfc-rce1qijjgzlrh715i6ii7lvvyn%40saf-3ch9o1enzs9zsh7q5b9im-8kah.iam.gserviceaccount.com"
}
