{
  "type": "service_account",
  "project_id": "saf-3ch9o1enzs9zsh7q5b9im-8kah",
  "private_key_id": "ee4330db80bc055a9e341897a38a7dfdc0755ddc",
  "private_key": "-----BEGIN PRIVATE KEY-----\nMIIEvgIBADANBgkqhkiG9w0BAQEFAASCBKgwggSkAgEAAoIBAQDksFgCxv1+jJgS\nZUzu7MbEVJCghoEH/R+dpmPSMp8IJa+b6lx04XJnGs8F4bYtDHAF5SoJZFWVbM9R\nkiSu3aK+Yly5lN/XHLI3ndoBccXltFyDEAOZgKVCacJyc2NCzhoaN4tN8HfY+L1R\n5x2Ae4HzsJj+ig14kfyp8MMP/onR5PulSwa8mYibzN0yjodPWfNkLHzEcbU9ebRG\nHs/xWSwCyu4ZTEVgCCSoN4ED0TVPxKh3sASmqEoQ8sTjd4a5jt+biFC/C0jsQCt0\nH91zEVkT8bv4ak0KyhE73sxnC5J6lwjz17MgpnjX/nTHhrkoHWhnptpPHAfyFHme\nIqROqIN5AgMBAAECggEAHeCaHFbHaeqlYuCK4hDbe8Kj7eJUu5NK4ku0RpMoKtDS\n9hby2Fmsms1/rEA2ZFaie2qwCMUWggH9aKX5a+0h5NIF/5WfKZlNVq3P/G39pwqJ\nfEgHKF1hzzZGWgc65HtNIWK4rPM/PStrfzv8zeXqREkCBrNI75knE5lpv/kHJCg7\n/1EuYuNPgbbuEJhIZQQw7rxQPxcZ9Raht+Y4VZ4TJ5nS/eFv4T/+pO2EnFggII4M\nZU6vZVOst3rdceZ98TMk0BkakswrfG/7sskPqroO/4hMr7lhSX+zZE3uhuxxc9c1\nDTeqr6Mie388u/zRiTmutX2Owy5dwtG17egMtjo7ZwKBgQD2zpSSN0NgfToEs1tU\n3exH/5UkgvybYsIY+EP8Ud+DzkkMXp3RhZop7XSR3lxyFXxf61K2P8a79bCk41SC\nq9fOPFIoNJMSLmKNyGPYQOPiZoqCTVxtetHp0erCOubAaa3OllOw7sfKoaep4Qpz\nY1MEVmoKBCx0iSSA8rnLThN6LwKBgQDtNP+vxgg0CdSikDjX4U7LnHwlrfIHBvwm\nnhISrgTQTemCQrqZRCaxhjL+jvFNeuiiEK4Sf7makdmipCJxR1zcvhQZKnJddm2Q\nwF3wisqZ02u7xJNyVcgFFvbH0OSfB61to6l+q4tJ6EBU31VA8E/d6lnXzNkX8QiL\nvn2fuPX61wKBgAHUilmDO2atxw5d3iGE+8mU5aA9sG3ej53ryWVHnia2EuiakwUI\nvpns/t5ODdVyv1dewWBEnM6sBcFTRj8p0xHedKWDrkuGOIjgoYzq/kWhiQlqVXMi\nZAgd3GXQVgG7RuSvTLOVMboY9MtXteIhLG5tzZ+BZGsA0Vp7clFFpPNVAoGBAIgH\nf6V+bE/jX1RGXsK2S2iKectl4EjVYZ6HwZeCwfHu7D0uJTIlmgbuDapbsNec53Gh\nHSIwqvCQOX2CoNnTcdaJDp+L7v/YHWcIWhbKkPr7+mk4htHnjYgVrjnSenkUfwlD\n9LxWhc9BaDsDxDE0XqjFbvZJXCnVqO/ysrn46N8LAoGBAIj99BHyjITyjFwqogKO\nAomsw0azDWHm30wMrmjwwWKX27JPUt0KAfbcDO8aRt+XUP2OlTLssBoy/HyIaLNW\nfG+FAhVWC55dqr2p3cBB6KUr08Z7AQrGG79+PdFe1O/QavDB77ZScfnftzBYNUKn\n+8+VXOQMsOfXkbFogjxG5lO+\n-----END PRIVATE KEY-----\n",
  "client_email": "mfc-y54hu49lblgdlx8r2khhudrlqy@saf-3ch9o1enzs9zsh7q5b9im-8kah.iam.gserviceaccount.com",
  "client_id": "114566474302748165044",
  "auth_uri": "https://accounts.google.com/o/oauth2/auth",
  "token_uri": "https://oauth2.googleapis.com/token",
  "auth_provider_x509_cert_url": "https://www.googleapis.com/oauth2/v1/certs",
  "client_x509_cert_url": "https://www.googleapis.com/robot/v1/metadata/x509/mfc-y54hu49lblgdlx8r2khhudrlqy%40saf-3ch9o1enzs9zsh7q5b9im-8kah.iam.gserviceaccount.com"
}
