{
  "type": "service_account",
  "project_id": "saf-3ch9o1enzs9zsh7q5b9im-8kah",
  "private_key_id": "c07e71cff2e2458634e45a2d3abda7ef4946c94b",
  "private_key": "-----BEGIN PRIVATE KEY-----\nMIIEvAIBADANBgkqhkiG9w0BAQEFAASCBKYwggSiAgEAAoIBAQCvnvuWhhooOBu8\nAVZOkUMjicI/DsSEPB6p1muOLN4Qk+89rLkgGKPjeVKgbDMfhCQPjfv+Kx4l3N8G\nBvDenfE6saQYSiXi9Cbj7esqoy2Qctqb2YZMgfJq892a3tZZg55ngE9P5Y2CrvwS\n1uEp/xb1oqewAeEzGC+56g8QJaloZNcvOHxz5lxaQ0liQ2z2N6wwVBOQD5J2FFRt\nwEjv4SVRuHY4rk4B8NvC/3Un1Y4NMmZiQIeJC+KzyePpItaNLm3fb8OiAoCCHbnH\n7n6cV1wgWvBM8F41RNoc9pgP1nkZhQwLuNfhodS1yfVcgaqdJOhd1VcpnF1RgfCg\nWf3UFgx5AgMBAAECgf8Ak8/mV1MPwf1VWoEa7/SojYT+gSVkQV9pgJnmuX8J8Qwr\ng3kPzsCqHsrtJsM//884JEXDBX8iz6pJ6bepjD2FMb9A5kHGbk+Y0mB+OLoNn4Y+\n3w+ttPtl/HyZw52GIQRiLFR80waEFEaqjXT4lujHFOYWGtppFv53k1gXM13U0X6o\nf/eQ+Bn7Y+OrPlwHehmKedVoyNHmkSqUj1GEcguhtfFww7P0iI2LE+gLcCbQ+01y\niZialXK2Hfc5cAOm3TH3qCa3fqRzeVZ3EASywc1WqPCBVBDPgZjQn9BTYBdTPIDi\ncfigOyPcXUvC/cUgQVDEKKHNw2wDnRNx806ZI1ECgYEA40T6UPAcRd/QJHT425ev\nMN/WmUEyybYk6Gw1JDg19U4ikPXwUes9VsH621DrK8h/Dk6wOJ4DZtdAuijuj/kq\nAfzjZSYpQ06Z5rumCYHWFKFMGpYn/1yZXeS2KXrh6I0RGUJie0ZCfau0H94cdBv5\nn6yjpKI9MbNRz82gOMiUhfECgYEAxdKHmKjvxQXZpfUFGGAfWf8sgVYJHmOUFBgA\nHvpn7XPGHKhamFKcxmSug85x2Az0k6wlSfOvLsEeEHrFrKnSpDgcPfQ2xNNKZFCe\nmlxJZ0OjeGfY1szwLEYUNtUYAnTk6eWgp0wgLnChuUVyYWfF850oFB5PwGhMfn6p\n6POvxwkCgYEA2jt7LktSqtoe0VMtQBfol0Lpm6Iatczcpf56DPyY+6P61z4CdXcx\nIGUGkKCkIhfVwZRX7RX2aENcGSaC5ec5qkz+wjshtkr8x6364vg07PxxyrnTUIfH\nkXy0WyJvWVJUT/AKBxvRb0F4pn0uz2OpkOVDAiz0HAx4C9YE+2HIFNECgYB7Ct6y\nMmmoN2JP2h3IMoltlczdyWC0mSVSdjclDYU06WzRCFoJImFG+PqfGvoucqhxbYJo\nA/zzbMTBZUusgJh28juGwW6LcAx2ZrqvsjUp2KVFz/nMaP3927zY+iQL6x8y6FPL\nmwrtN7svnKVvNnemdhqmoM/kEjt59ljCf0fW2QKBgQCF+xhcajtb9Ml6a1WVwKpZ\n8XIim7W4aDSR44tNB6jtebXwvT1kR+1uiC2lODPEOeZ5TzSS5FFfUgAs9MS5pFFa\nFnDmZCy9QV9SpQBIHcLSYia8ImVuPmvm2AE0hIrIh/gCOpUi4859C8I8MCr9t4l9\nQW0E8WEfDwVkjApocZg5SQ==\n-----END PRIVATE KEY-----\n",
  "client_email": "mfc-jntpguqpee3bp0cqv0-cpnuddd@saf-3ch9o1enzs9zsh7q5b9im-8kah.iam.gserviceaccount.com",
  "client_id": "106585443024535163399",
  "auth_uri": "https://accounts.google.com/o/oauth2/auth",
  "token_uri": "https://oauth2.googleapis.com/token",
  "auth_provider_x509_cert_url": "https://www.googleapis.com/oauth2/v1/certs",
  "client_x509_cert_url": "https://www.googleapis.com/robot/v1/metadata/x509/mfc-jntpguqpee3bp0cqv0-cpnuddd%40saf-3ch9o1enzs9zsh7q5b9im-8kah.iam.gserviceaccount.com"
}
