{
  "type": "service_account",
  "project_id": "saf-3ch9o1enzs9zsh7q5b9im-8kah",
  "private_key_id": "cef64a3732b8c3c94e04f2eced28b8f54c787253",
  "private_key": "-----BEGIN PRIVATE KEY-----\nMIIEvAIBADANBgkqhkiG9w0BAQEFAASCBKYwggSiAgEAAoIBAQCk2+iHi5AvfAzo\nkH15xWSV1wXSMnYRxbl5ryKoX0IV0iFvImaTTivDgBb2BslqhNigIQ+EOnwaVd9l\nRfi0iFtMETI8DIgK78o4OJoP9aYgaf5KXSgLSHJB4o5MT48c8Q+a2c4rPWrVL3dy\nihPk0Zlk8S0LXE82B7epZO/QsnJ9MC9siu6v40uoAV+z9zCuYcrFMp10Rj6Q6qlC\nRiqwe5cny01AlW/wWoSIauYdcP1Zwy1uze2ZBE2Dew2p2gk5DHEeQVWHA1k26pZN\nhU3d42sX+S8MzK4ylKjqkrEIbfsseahC1aUt5C7H9D+hwgFCMJkGXEnqWM1cBqii\npKMJduf/AgMBAAECggEABNPjGikLnAsJbma2I0fqW1BJ0tnNxv/KdSucRmBNFUor\nLCUj6iy6r7BuEQlU16Iz8nMquv1iyftOyJlFIGBH2tE8GTG9as3n1uqivv87Z1ft\n7ZaPHXl4eGvJLVHnx89asiGuXb91g/BZEp5u2QoMRb5MSo4K9x2VvXJVFYBMRana\nA9IGeASKgFytxLRIGjhHFuaKPwxicC5/7+XsI6ZGCsDzFu0FnJo6RjnVEDXLigBX\n0T1te/r5kbAjVBEXFYNXsOfe4hWIQ9yMckQZTk0NMN35kjtYIxDwP4jNKY8JWXwb\nauFll9D8n5/MtGTOmjGYi9ySODdzHCuJbauYlLgbcQKBgQDaQ7K0m6ps3OaxwMgd\nyHgRfc/FQWMRm7Cvogpmc3mYV5eZoWDJ7QoQjmTWXJR62LjuM3UNhsg+zsKrLdG2\nJnZKaDTW0cToXLn57JoCMdoBkNhRACVnnXpcbRn5Q3xGZiaCKozwQs3I93QtbqC6\nx/LbPQ892B3rYUYEYz8BenthjwKBgQDBXIGSqtHM/6LmJT5OY/Bw4+z5Sk1mus8z\nqiro6UtQES/U/H952AcrxhNoEy7BttWrqvaDiD8vf5pY5cGEosrQQ0Hm3s56oFKs\naQcZG52Fo8kPSaWPIxC92qOCm/0fkuLS/mic7IWcC6AE1bXI47op0RECoPVR8gpO\nDJ27qUH6kQKBgEq+gjU9VaiAIXRfy2f/nbaHuh4X3UBLa79Jo3wgMVTNMjpHPGkK\nBrdSvA94ltRW4UWZU411SZ/QmHOcdkOFel7Svr2OCnt0Pa/rqXX08m401w8uGKEa\nGawLJKjqxmUpWCidP7SLfANFUoC4cMxl6rHPgCeymdRgdGTOQ+ZStmvbAoGAKSfE\nWHBNOWHLzUpuCYdR/OU2YhUDhnMKeQemHG7TXdZapO2dQFTPqex94u/6Srbcoa5A\ny9wq/rQdKQC2AMIZgtxd4YLY1dbb4eB0504uZ+xldgCJ4X5oKNCpbro+1QKRjrEh\nmQzqnz0GMSE/kOOPkyjxguq5bFilAtnClNfAuFECgYB9TfEKYd+DOuyyCS8+ho3T\nyL5j9xfM8SrdMZaz1MDPn21gpJeI8UGYEFb1YSZNx3tLNf5a953dhyBSyIdzRvN9\n5Mzxfz8iFefMfB31ybLR0PZFIhRcNyQW7FTRyTD2ITnlCPkIID2Kh9KEpSPSQ1SX\ntAQLLei+9pARrB+uJP4Chw==\n-----END PRIVATE KEY-----\n",
  "client_email": "mfc-x6dnf234uz7i21ifwyg9n6dkga@saf-3ch9o1enzs9zsh7q5b9im-8kah.iam.gserviceaccount.com",
  "client_id": "101525439037989365285",
  "auth_uri": "https://accounts.google.com/o/oauth2/auth",
  "token_uri": "https://oauth2.googleapis.com/token",
  "auth_provider_x509_cert_url": "https://www.googleapis.com/oauth2/v1/certs",
  "client_x509_cert_url": "https://www.googleapis.com/robot/v1/metadata/x509/mfc-x6dnf234uz7i21ifwyg9n6dkga%40saf-3ch9o1enzs9zsh7q5b9im-8kah.iam.gserviceaccount.com"
}
