ERROR - 2020-02-23 08:06:25 --> Severity: Error --> Call to undefined function to_date() D:\new_xampp\htdocs\jts\simrs_pendaftaran_online\application\modules\pendaftaran\models\M_pendaftaran.php 195
ERROR - 2020-02-23 08:12:03 --> Severity: Warning --> unlink(./../simrs/assets/images/pendaftaran_online/file_ktp/): Permission denied D:\new_xampp\htdocs\jts\simrs_pendaftaran_online\application\modules\pendaftaran\models\M_pendaftaran.php 222
ERROR - 2020-02-23 08:12:03 --> Severity: Warning --> unlink(./../simrs/assets/images/pendaftaran_online/file_rujukan/): Permission denied D:\new_xampp\htdocs\jts\simrs_pendaftaran_online\application\modules\pendaftaran\models\M_pendaftaran.php 223
