﻿No;Nama;Umur;BB;LILA;HB;Paritas;
1;Pasien 1;30;58;29;13;3;
2;Pasien 2;17;50;25;12;3;
3;Pasien 3;25;43;21,5;10;1;
4;Pasien 4;23;46;23;11;1;
5;Pasien 5;25;56;28;12;1;
6;Pasien 6;27;52;26;12;2;
7;Pasien 7;33;46;23;11;1;
8;Pasien 8;30;61;30,5;12;2;
9;Pasien 9;32;48;24;12;4;
10;Pasien 10;29;52;26;11;1;
11;Pasien 11;18;46;23;11;2;
12;Pasien 12;18;46;23;12;3;
13;Pasien 13;13;50;25;11;2;
14;Pasien 14;28;60;30;11;3;
15;Pasien 15;29;40;20;13;1;
16;Pasien 16;25;43;21,5;10;1;
17;Pasien 17;38;62;31;13;2;
18;Pasien 18;38;48;24;11;4;
19;Pasien 19;20;52;26;13;1;
20;Pasien 20;26;46;23;11;3;
21;Pasien 21;26;45;22,5;12;1;
22;Pasien 22;38;64;32;13;4;
23;Pasien 23;17;45;22,5;13;1;
24;Pasien 24;22;48;24;12;1;
25;Pasien 25;28;45;22,5;10;2;
26;Pasien 26;19;44;22;12;1;
27;Pasien 27;26;49;24,5;12;4;
28;Pasien 28;;54;25;-;1;
29;Pasien 29;32;50;25;12;2;
30;Pasien 30;23;48;24;11;2;
31;Pasien 31;25;58;29;11;1;
32;Pasien 32;29;46;23;12;3;
33;Pasien 33;30;52;26;13;2;
34;Pasien 34;28;50;25;14;2;
35;Pasien 35;26;58;29;11;2;
36;Pasien 36;35;54;27;11;4;
37;Pasien 37;33;60;30;12;3;
38;Pasien 38;27;52;26;12;1;
39;Pasien 39;30;54;27;12;3;
40;Pasien 40;40;56;28;12;4;
41;Pasien 41;33;62;31;12;1;
42;Pasien 42;29;58;29;12;1;
43;Pasien 43;37;64;32;13;1;
44;Pasien 44;30;56;28;14;1;
45;Pasien 45;30;54;27;10;3;
46;Pasien 46;36;42;-;13;3;
47;Pasien 47;30;52;26;14;1;
48;Pasien 48;31;52;26;13;2;
49;Pasien 49;20;25;-;1;0;
50;Pasien 50;35;62;31;12;3;
51;Pasien 51;31;46;23;11;2;
52;Pasien 52;27;52;26;13;3;
53;Pasien 53;20;44;22;11;2;
54;Pasien 54;31;46;23;12;3;
55;Pasien 55;19;70;35;14;1;
56;Pasien 56;27;64;32;11;2;
57;Pasien 57;39;63;31,5;12;3;
58;Pasien 58;32;54;27;13;2;
59;Pasien 59;28;52;26;10,8;1;
60;Pasien 60;33;48;24;13;1;
61;Pasien 61;30;59;29,5;13;1;
62;Pasien 62;47;25;-;5;0;
63;Pasien 63;32;60;30;14;4;
64;Pasien 64;38;66;33;11,6;6;
65;Pasien 65;;58;22;-;1;
66;Pasien 66;25;44;22;11;1;
67;Pasien 67;37;62;31;12;2;
68;Pasien 68;28;55;27,5;10;1;
69;Pasien 69;31;60;30;13;1;
70;Pasien 70;;50;;11;1;
71;Pasien 71;20;50;25;11;2;
72;Pasien 72;35,9;25;-;2;;
73;Pasien 73;28;53;26,5;12;1;
74;Pasien 74;34;72;36;13;3;
75;Pasien 75;36;57;28,5;11;3;
76;Pasien 76;32;49;24,5;10;3;
77;Pasien 77;34;60;30;11,7;3;
78;Pasien 78;28;50;25;13,8;4;
79;Pasien 79;34;64;32;11,5;3;
80;Pasien 80;29;68;34;12,5;2;
81;Pasien 81;37;48;24;9;5;
82;Pasien 82;36;50;25;10,6;3;
83;Pasien 83;28;52;26;10;1;
84;Pasien 84;30;60;30;11;1;
85;Pasien 85;34;49;24,5;10;1;
86;Pasien 86;20;50;25;11,5;1;
87;Pasien 87;38;56;28;10,8;2;
88;Pasien 88;27;46;23;10,8;2;
89;Pasien 89;33;54;27;12;3;
90;Pasien 90;39;64;32;13;2;
91;Pasien 91;27;60;30;12;1;
92;Pasien 92;43;64;32;12;4;
93;Pasien 93;32;58;29;12;1;
94;Pasien 94;36;50;25;12;5;
95;Pasien 95;15;66;33;12;4;
96;Pasien 96;38;50;25;12;3;
97;Pasien 97;24;50;25;12;2;
98;Pasien 98;38;72;36;11;4;
99;Pasien 99;24;48;24;12;1;
100;Pasien 100;32;46;23;12;3;
101;Pasien 101;30;58;29;13;2;
102;Pasien 102;25;54;23;13;1;
103;Pasien 103;43;43;35;-;4;
104;Pasien 104;32;63;31;-;2;
105;Pasien 105;24;48;24;12;3;
106;Pasien 106;;42;26;-;2;
107;Pasien 107;31;56;28;12;2;
108;Pasien 108;28;50;25;12;1;
109;Pasien 109;;57;24;-;1;
110;Pasien 110;23;52;26;11;2;
111;Pasien 111;;67;24;-;1;
112;Pasien 112;;39,2;20;-;2;
113;Pasien 113;22;49;24,5;11;1;
114;Pasien 114;;37,8;22,5;-;1;
115;Pasien 115;;43;24;-;1;
116;Pasien 116;;-;28;-;5;
117;Pasien 117;;-;25;-;3;
118;Pasien 118;19;51;25,5;12;0;
119;Pasien 119;34;55;27,5;12;3;
120;Pasien 120;35;54;27;11;5;
121;Pasien 121;25;50;25;11;0;
122;Pasien 122;24;48;24;10;2;
123;Pasien 123;33;50;25;12;4;
124;Pasien 124;25;50;25;11;3;
125;Pasien 125;37;60;30;11;3;
126;Pasien 126;25;52;26;12;1;
127;Pasien 127;26;52;26;9;1;
128;Pasien 128;22;48;24;10;0;
129;Pasien 129;35;54;27;12;2;
130;Pasien 130;34;48;24;11;1;
131;Pasien 131;27;64;32;11;3;
132;Pasien 132;23;44;22;11;1;
133;Pasien 133;28;44;22;10;1;
134;Pasien 134;22;51;25,5;9;0;
135;Pasien 135;28;56;28;12;1;
136;Pasien 136;32;50;25;10;4;
137;Pasien 137;31;44;22;10;0;
138;Pasien 138;17;44;22;9;0;
139;Pasien 139;23;54;27;12;0;
140;Pasien 140;16;55;27,5;13;1;
141;Pasien 141;18;50;25;12;0;
142;Pasien 142;37;52;26;11;6;
143;Pasien 143;35;58;29;12;3;
144;Pasien 144;23;50;25;12;0;
145;Pasien 145;19;43;21,5;11;0;
146;Pasien 146;29;68;34;13;1;
147;Pasien 147;25;50;25;11;1;
148;Pasien 148;42;56;28;15;3;
149;Pasien 149;18;45;22,5;12;0;
150;Pasien 150;30;60;30;12;2;
151;Pasien 151;25;40;20;12;0;
152;Pasien 152;34;58;29;12;3;
153;Pasien 153;25;52;26;11;1;
154;Pasien 154;27;50;25;11;2;
155;Pasien 155;27;52;26;13;1;
156;Pasien 156;24;40;20;11;0;
157;Pasien 157;17;46;23;11;0;
