{
  "status": "done",
  "assets": {
    "umi.css": {
      "name": "umi.css",
      "path": "/usr/src/app/dist/umi.css",
      "publicPath": "/react-assets/umi.css"
    },
    "umi.js": {
      "name": "umi.js",
      "path": "/usr/src/app/dist/umi.js",
      "publicPath": "/react-assets/umi.js"
    },
    "umi.css.map": {
      "name": "umi.css.map",
      "path": "/usr/src/app/dist/umi.css.map",
      "publicPath": "/react-assets/umi.css.map"
    },
    "umi.js.map": {
      "name": "umi.js.map",
      "path": "/usr/src/app/dist/umi.js.map",
      "publicPath": "/react-assets/umi.js.map"
    },
    "umi.a09903d1f5d67ea7bee3.hot-update.js": {
      "name": "umi.a09903d1f5d67ea7bee3.hot-update.js",
      "path": "/usr/src/app/dist/umi.a09903d1f5d67ea7bee3.hot-update.js",
      "publicPath": "/react-assets/umi.a09903d1f5d67ea7bee3.hot-update.js"
    },
    "a09903d1f5d67ea7bee3.hot-update.json": {
      "name": "a09903d1f5d67ea7bee3.hot-update.json",
      "path": "/usr/src/app/dist/a09903d1f5d67ea7bee3.hot-update.json",
      "publicPath": "/react-assets/a09903d1f5d67ea7bee3.hot-update.json"
    },
    "umi.a09903d1f5d67ea7bee3.hot-update.js.map": {
      "name": "umi.a09903d1f5d67ea7bee3.hot-update.js.map",
      "path": "/usr/src/app/dist/umi.a09903d1f5d67ea7bee3.hot-update.js.map",
      "publicPath": "/react-assets/umi.a09903d1f5d67ea7bee3.hot-update.js.map"
    },
    "umi.11c72bf85c287c339bf2.hot-update.js": {
      "name": "umi.11c72bf85c287c339bf2.hot-update.js",
      "path": "/usr/src/app/dist/umi.11c72bf85c287c339bf2.hot-update.js",
      "publicPath": "/react-assets/umi.11c72bf85c287c339bf2.hot-update.js"
    },
    "11c72bf85c287c339bf2.hot-update.json": {
      "name": "11c72bf85c287c339bf2.hot-update.json",
      "path": "/usr/src/app/dist/11c72bf85c287c339bf2.hot-update.json",
      "publicPath": "/react-assets/11c72bf85c287c339bf2.hot-update.json"
    },
    "umi.11c72bf85c287c339bf2.hot-update.js.map": {
      "name": "umi.11c72bf85c287c339bf2.hot-update.js.map",
      "path": "/usr/src/app/dist/umi.11c72bf85c287c339bf2.hot-update.js.map",
      "publicPath": "/react-assets/umi.11c72bf85c287c339bf2.hot-update.js.map"
    },
    "7f2ff1688582b89ddd7b.hot-update.json": {
      "name": "7f2ff1688582b89ddd7b.hot-update.json",
      "path": "/usr/src/app/dist/7f2ff1688582b89ddd7b.hot-update.json",
      "publicPath": "/react-assets/7f2ff1688582b89ddd7b.hot-update.json"
    },
    "umi.fee774e1645b21698888.hot-update.js": {
      "name": "umi.fee774e1645b21698888.hot-update.js",
      "path": "/usr/src/app/dist/umi.fee774e1645b21698888.hot-update.js",
      "publicPath": "/react-assets/umi.fee774e1645b21698888.hot-update.js"
    },
    "fee774e1645b21698888.hot-update.json": {
      "name": "fee774e1645b21698888.hot-update.json",
      "path": "/usr/src/app/dist/fee774e1645b21698888.hot-update.json",
      "publicPath": "/react-assets/fee774e1645b21698888.hot-update.json"
    },
    "umi.fee774e1645b21698888.hot-update.js.map": {
      "name": "umi.fee774e1645b21698888.hot-update.js.map",
      "path": "/usr/src/app/dist/umi.fee774e1645b21698888.hot-update.js.map",
      "publicPath": "/react-assets/umi.fee774e1645b21698888.hot-update.js.map"
    },
    "umi.ecc66a858f8362f64ab3.hot-update.js": {
      "name": "umi.ecc66a858f8362f64ab3.hot-update.js",
      "path": "/usr/src/app/dist/umi.ecc66a858f8362f64ab3.hot-update.js",
      "publicPath": "/react-assets/umi.ecc66a858f8362f64ab3.hot-update.js"
    },
    "ecc66a858f8362f64ab3.hot-update.json": {
      "name": "ecc66a858f8362f64ab3.hot-update.json",
      "path": "/usr/src/app/dist/ecc66a858f8362f64ab3.hot-update.json",
      "publicPath": "/react-assets/ecc66a858f8362f64ab3.hot-update.json"
    },
    "umi.ecc66a858f8362f64ab3.hot-update.js.map": {
      "name": "umi.ecc66a858f8362f64ab3.hot-update.js.map",
      "path": "/usr/src/app/dist/umi.ecc66a858f8362f64ab3.hot-update.js.map",
      "publicPath": "/react-assets/umi.ecc66a858f8362f64ab3.hot-update.js.map"
    },
    "umi.06e6e05363ee037f1ef6.hot-update.js": {
      "name": "umi.06e6e05363ee037f1ef6.hot-update.js",
      "path": "/usr/src/app/dist/umi.06e6e05363ee037f1ef6.hot-update.js",
      "publicPath": "/react-assets/umi.06e6e05363ee037f1ef6.hot-update.js"
    },
    "06e6e05363ee037f1ef6.hot-update.json": {
      "name": "06e6e05363ee037f1ef6.hot-update.json",
      "path": "/usr/src/app/dist/06e6e05363ee037f1ef6.hot-update.json",
      "publicPath": "/react-assets/06e6e05363ee037f1ef6.hot-update.json"
    },
    "umi.06e6e05363ee037f1ef6.hot-update.js.map": {
      "name": "umi.06e6e05363ee037f1ef6.hot-update.js.map",
      "path": "/usr/src/app/dist/umi.06e6e05363ee037f1ef6.hot-update.js.map",
      "publicPath": "/react-assets/umi.06e6e05363ee037f1ef6.hot-update.js.map"
    },
    "umi.4dce3cbb9ff9af869099.hot-update.js": {
      "name": "umi.4dce3cbb9ff9af869099.hot-update.js",
      "path": "/usr/src/app/dist/umi.4dce3cbb9ff9af869099.hot-update.js",
      "publicPath": "/react-assets/umi.4dce3cbb9ff9af869099.hot-update.js"
    },
    "4dce3cbb9ff9af869099.hot-update.json": {
      "name": "4dce3cbb9ff9af869099.hot-update.json",
      "path": "/usr/src/app/dist/4dce3cbb9ff9af869099.hot-update.json",
      "publicPath": "/react-assets/4dce3cbb9ff9af869099.hot-update.json"
    },
    "umi.4dce3cbb9ff9af869099.hot-update.js.map": {
      "name": "umi.4dce3cbb9ff9af869099.hot-update.js.map",
      "path": "/usr/src/app/dist/umi.4dce3cbb9ff9af869099.hot-update.js.map",
      "publicPath": "/react-assets/umi.4dce3cbb9ff9af869099.hot-update.js.map"
    },
    "umi.c6332900cb058d548afc.hot-update.js": {
      "name": "umi.c6332900cb058d548afc.hot-update.js",
      "path": "/usr/src/app/dist/umi.c6332900cb058d548afc.hot-update.js",
      "publicPath": "/react-assets/umi.c6332900cb058d548afc.hot-update.js"
    },
    "c6332900cb058d548afc.hot-update.json": {
      "name": "c6332900cb058d548afc.hot-update.json",
      "path": "/usr/src/app/dist/c6332900cb058d548afc.hot-update.json",
      "publicPath": "/react-assets/c6332900cb058d548afc.hot-update.json"
    },
    "umi.c6332900cb058d548afc.hot-update.js.map": {
      "name": "umi.c6332900cb058d548afc.hot-update.js.map",
      "path": "/usr/src/app/dist/umi.c6332900cb058d548afc.hot-update.js.map",
      "publicPath": "/react-assets/umi.c6332900cb058d548afc.hot-update.js.map"
    },
    "umi.d6d8314fb99270833b5a.hot-update.js": {
      "name": "umi.d6d8314fb99270833b5a.hot-update.js",
      "path": "/usr/src/app/dist/umi.d6d8314fb99270833b5a.hot-update.js",
      "publicPath": "/react-assets/umi.d6d8314fb99270833b5a.hot-update.js"
    },
    "d6d8314fb99270833b5a.hot-update.json": {
      "name": "d6d8314fb99270833b5a.hot-update.json",
      "path": "/usr/src/app/dist/d6d8314fb99270833b5a.hot-update.json",
      "publicPath": "/react-assets/d6d8314fb99270833b5a.hot-update.json"
    },
    "umi.d6d8314fb99270833b5a.hot-update.js.map": {
      "name": "umi.d6d8314fb99270833b5a.hot-update.js.map",
      "path": "/usr/src/app/dist/umi.d6d8314fb99270833b5a.hot-update.js.map",
      "publicPath": "/react-assets/umi.d6d8314fb99270833b5a.hot-update.js.map"
    },
    "umi.22f3d8ec4f85d006dd21.hot-update.js": {
      "name": "umi.22f3d8ec4f85d006dd21.hot-update.js",
      "path": "/usr/src/app/dist/umi.22f3d8ec4f85d006dd21.hot-update.js",
      "publicPath": "/react-assets/umi.22f3d8ec4f85d006dd21.hot-update.js"
    },
    "22f3d8ec4f85d006dd21.hot-update.json": {
      "name": "22f3d8ec4f85d006dd21.hot-update.json",
      "path": "/usr/src/app/dist/22f3d8ec4f85d006dd21.hot-update.json",
      "publicPath": "/react-assets/22f3d8ec4f85d006dd21.hot-update.json"
    },
    "umi.22f3d8ec4f85d006dd21.hot-update.js.map": {
      "name": "umi.22f3d8ec4f85d006dd21.hot-update.js.map",
      "path": "/usr/src/app/dist/umi.22f3d8ec4f85d006dd21.hot-update.js.map",
      "publicPath": "/react-assets/umi.22f3d8ec4f85d006dd21.hot-update.js.map"
    },
    "umi.1b49cfe77d8c4428d8d0.hot-update.js": {
      "name": "umi.1b49cfe77d8c4428d8d0.hot-update.js",
      "path": "/usr/src/app/dist/umi.1b49cfe77d8c4428d8d0.hot-update.js",
      "publicPath": "/react-assets/umi.1b49cfe77d8c4428d8d0.hot-update.js"
    },
    "1b49cfe77d8c4428d8d0.hot-update.json": {
      "name": "1b49cfe77d8c4428d8d0.hot-update.json",
      "path": "/usr/src/app/dist/1b49cfe77d8c4428d8d0.hot-update.json",
      "publicPath": "/react-assets/1b49cfe77d8c4428d8d0.hot-update.json"
    },
    "umi.1b49cfe77d8c4428d8d0.hot-update.js.map": {
      "name": "umi.1b49cfe77d8c4428d8d0.hot-update.js.map",
      "path": "/usr/src/app/dist/umi.1b49cfe77d8c4428d8d0.hot-update.js.map",
      "publicPath": "/react-assets/umi.1b49cfe77d8c4428d8d0.hot-update.js.map"
    },
    "umi.4ddbfe10ea33f732921a.hot-update.js": {
      "name": "umi.4ddbfe10ea33f732921a.hot-update.js",
      "path": "/usr/src/app/dist/umi.4ddbfe10ea33f732921a.hot-update.js",
      "publicPath": "/react-assets/umi.4ddbfe10ea33f732921a.hot-update.js"
    },
    "4ddbfe10ea33f732921a.hot-update.json": {
      "name": "4ddbfe10ea33f732921a.hot-update.json",
      "path": "/usr/src/app/dist/4ddbfe10ea33f732921a.hot-update.json",
      "publicPath": "/react-assets/4ddbfe10ea33f732921a.hot-update.json"
    },
    "umi.4ddbfe10ea33f732921a.hot-update.js.map": {
      "name": "umi.4ddbfe10ea33f732921a.hot-update.js.map",
      "path": "/usr/src/app/dist/umi.4ddbfe10ea33f732921a.hot-update.js.map",
      "publicPath": "/react-assets/umi.4ddbfe10ea33f732921a.hot-update.js.map"
    },
    "umi.487375025189442f9966.hot-update.js": {
      "name": "umi.487375025189442f9966.hot-update.js",
      "path": "/usr/src/app/dist/umi.487375025189442f9966.hot-update.js",
      "publicPath": "/react-assets/umi.487375025189442f9966.hot-update.js"
    },
    "487375025189442f9966.hot-update.json": {
      "name": "487375025189442f9966.hot-update.json",
      "path": "/usr/src/app/dist/487375025189442f9966.hot-update.json",
      "publicPath": "/react-assets/487375025189442f9966.hot-update.json"
    },
    "umi.487375025189442f9966.hot-update.js.map": {
      "name": "umi.487375025189442f9966.hot-update.js.map",
      "path": "/usr/src/app/dist/umi.487375025189442f9966.hot-update.js.map",
      "publicPath": "/react-assets/umi.487375025189442f9966.hot-update.js.map"
    },
    "umi.80798b05721b0bdc7690.hot-update.js": {
      "name": "umi.80798b05721b0bdc7690.hot-update.js",
      "path": "/usr/src/app/dist/umi.80798b05721b0bdc7690.hot-update.js",
      "publicPath": "/react-assets/umi.80798b05721b0bdc7690.hot-update.js"
    },
    "80798b05721b0bdc7690.hot-update.json": {
      "name": "80798b05721b0bdc7690.hot-update.json",
      "path": "/usr/src/app/dist/80798b05721b0bdc7690.hot-update.json",
      "publicPath": "/react-assets/80798b05721b0bdc7690.hot-update.json"
    },
    "umi.80798b05721b0bdc7690.hot-update.js.map": {
      "name": "umi.80798b05721b0bdc7690.hot-update.js.map",
      "path": "/usr/src/app/dist/umi.80798b05721b0bdc7690.hot-update.js.map",
      "publicPath": "/react-assets/umi.80798b05721b0bdc7690.hot-update.js.map"
    },
    "umi.17f5cf9003ef0549ad9c.hot-update.js": {
      "name": "umi.17f5cf9003ef0549ad9c.hot-update.js",
      "path": "/usr/src/app/dist/umi.17f5cf9003ef0549ad9c.hot-update.js",
      "publicPath": "/react-assets/umi.17f5cf9003ef0549ad9c.hot-update.js"
    },
    "17f5cf9003ef0549ad9c.hot-update.json": {
      "name": "17f5cf9003ef0549ad9c.hot-update.json",
      "path": "/usr/src/app/dist/17f5cf9003ef0549ad9c.hot-update.json",
      "publicPath": "/react-assets/17f5cf9003ef0549ad9c.hot-update.json"
    },
    "umi.17f5cf9003ef0549ad9c.hot-update.js.map": {
      "name": "umi.17f5cf9003ef0549ad9c.hot-update.js.map",
      "path": "/usr/src/app/dist/umi.17f5cf9003ef0549ad9c.hot-update.js.map",
      "publicPath": "/react-assets/umi.17f5cf9003ef0549ad9c.hot-update.js.map"
    },
    "umi.a265d9c27790b56dd11d.hot-update.js": {
      "name": "umi.a265d9c27790b56dd11d.hot-update.js",
      "path": "/usr/src/app/dist/umi.a265d9c27790b56dd11d.hot-update.js",
      "publicPath": "/react-assets/umi.a265d9c27790b56dd11d.hot-update.js"
    },
    "a265d9c27790b56dd11d.hot-update.json": {
      "name": "a265d9c27790b56dd11d.hot-update.json",
      "path": "/usr/src/app/dist/a265d9c27790b56dd11d.hot-update.json",
      "publicPath": "/react-assets/a265d9c27790b56dd11d.hot-update.json"
    },
    "umi.a265d9c27790b56dd11d.hot-update.js.map": {
      "name": "umi.a265d9c27790b56dd11d.hot-update.js.map",
      "path": "/usr/src/app/dist/umi.a265d9c27790b56dd11d.hot-update.js.map",
      "publicPath": "/react-assets/umi.a265d9c27790b56dd11d.hot-update.js.map"
    },
    "umi.95ab2cb31effb6d0789f.hot-update.js": {
      "name": "umi.95ab2cb31effb6d0789f.hot-update.js",
      "path": "/usr/src/app/dist/umi.95ab2cb31effb6d0789f.hot-update.js",
      "publicPath": "/react-assets/umi.95ab2cb31effb6d0789f.hot-update.js"
    },
    "95ab2cb31effb6d0789f.hot-update.json": {
      "name": "95ab2cb31effb6d0789f.hot-update.json",
      "path": "/usr/src/app/dist/95ab2cb31effb6d0789f.hot-update.json",
      "publicPath": "/react-assets/95ab2cb31effb6d0789f.hot-update.json"
    },
    "umi.95ab2cb31effb6d0789f.hot-update.js.map": {
      "name": "umi.95ab2cb31effb6d0789f.hot-update.js.map",
      "path": "/usr/src/app/dist/umi.95ab2cb31effb6d0789f.hot-update.js.map",
      "publicPath": "/react-assets/umi.95ab2cb31effb6d0789f.hot-update.js.map"
    },
    "umi.2597946a2ba80c14ef35.hot-update.js": {
      "name": "umi.2597946a2ba80c14ef35.hot-update.js",
      "path": "/usr/src/app/dist/umi.2597946a2ba80c14ef35.hot-update.js",
      "publicPath": "/react-assets/umi.2597946a2ba80c14ef35.hot-update.js"
    },
    "2597946a2ba80c14ef35.hot-update.json": {
      "name": "2597946a2ba80c14ef35.hot-update.json",
      "path": "/usr/src/app/dist/2597946a2ba80c14ef35.hot-update.json",
      "publicPath": "/react-assets/2597946a2ba80c14ef35.hot-update.json"
    },
    "umi.2597946a2ba80c14ef35.hot-update.js.map": {
      "name": "umi.2597946a2ba80c14ef35.hot-update.js.map",
      "path": "/usr/src/app/dist/umi.2597946a2ba80c14ef35.hot-update.js.map",
      "publicPath": "/react-assets/umi.2597946a2ba80c14ef35.hot-update.js.map"
    },
    "umi.a60b9c3cca0cb647cdd5.hot-update.js": {
      "name": "umi.a60b9c3cca0cb647cdd5.hot-update.js",
      "path": "/usr/src/app/dist/umi.a60b9c3cca0cb647cdd5.hot-update.js",
      "publicPath": "/react-assets/umi.a60b9c3cca0cb647cdd5.hot-update.js"
    },
    "a60b9c3cca0cb647cdd5.hot-update.json": {
      "name": "a60b9c3cca0cb647cdd5.hot-update.json",
      "path": "/usr/src/app/dist/a60b9c3cca0cb647cdd5.hot-update.json",
      "publicPath": "/react-assets/a60b9c3cca0cb647cdd5.hot-update.json"
    },
    "umi.a60b9c3cca0cb647cdd5.hot-update.js.map": {
      "name": "umi.a60b9c3cca0cb647cdd5.hot-update.js.map",
      "path": "/usr/src/app/dist/umi.a60b9c3cca0cb647cdd5.hot-update.js.map",
      "publicPath": "/react-assets/umi.a60b9c3cca0cb647cdd5.hot-update.js.map"
    },
    "umi.d825648730a5f8417717.hot-update.js": {
      "name": "umi.d825648730a5f8417717.hot-update.js",
      "path": "/usr/src/app/dist/umi.d825648730a5f8417717.hot-update.js",
      "publicPath": "/react-assets/umi.d825648730a5f8417717.hot-update.js"
    },
    "d825648730a5f8417717.hot-update.json": {
      "name": "d825648730a5f8417717.hot-update.json",
      "path": "/usr/src/app/dist/d825648730a5f8417717.hot-update.json",
      "publicPath": "/react-assets/d825648730a5f8417717.hot-update.json"
    },
    "umi.d825648730a5f8417717.hot-update.js.map": {
      "name": "umi.d825648730a5f8417717.hot-update.js.map",
      "path": "/usr/src/app/dist/umi.d825648730a5f8417717.hot-update.js.map",
      "publicPath": "/react-assets/umi.d825648730a5f8417717.hot-update.js.map"
    },
    "umi.3000e5ef342c10915150.hot-update.js": {
      "name": "umi.3000e5ef342c10915150.hot-update.js",
      "path": "/usr/src/app/dist/umi.3000e5ef342c10915150.hot-update.js",
      "publicPath": "/react-assets/umi.3000e5ef342c10915150.hot-update.js"
    },
    "3000e5ef342c10915150.hot-update.json": {
      "name": "3000e5ef342c10915150.hot-update.json",
      "path": "/usr/src/app/dist/3000e5ef342c10915150.hot-update.json",
      "publicPath": "/react-assets/3000e5ef342c10915150.hot-update.json"
    },
    "umi.3000e5ef342c10915150.hot-update.js.map": {
      "name": "umi.3000e5ef342c10915150.hot-update.js.map",
      "path": "/usr/src/app/dist/umi.3000e5ef342c10915150.hot-update.js.map",
      "publicPath": "/react-assets/umi.3000e5ef342c10915150.hot-update.js.map"
    },
    "umi.b65f8c7f5fee2e13b845.hot-update.js": {
      "name": "umi.b65f8c7f5fee2e13b845.hot-update.js",
      "path": "/usr/src/app/dist/umi.b65f8c7f5fee2e13b845.hot-update.js",
      "publicPath": "/react-assets/umi.b65f8c7f5fee2e13b845.hot-update.js"
    },
    "b65f8c7f5fee2e13b845.hot-update.json": {
      "name": "b65f8c7f5fee2e13b845.hot-update.json",
      "path": "/usr/src/app/dist/b65f8c7f5fee2e13b845.hot-update.json",
      "publicPath": "/react-assets/b65f8c7f5fee2e13b845.hot-update.json"
    },
    "umi.b65f8c7f5fee2e13b845.hot-update.js.map": {
      "name": "umi.b65f8c7f5fee2e13b845.hot-update.js.map",
      "path": "/usr/src/app/dist/umi.b65f8c7f5fee2e13b845.hot-update.js.map",
      "publicPath": "/react-assets/umi.b65f8c7f5fee2e13b845.hot-update.js.map"
    },
    "umi.46a85e4a7e3561850c7d.hot-update.js": {
      "name": "umi.46a85e4a7e3561850c7d.hot-update.js",
      "path": "/usr/src/app/dist/umi.46a85e4a7e3561850c7d.hot-update.js",
      "publicPath": "/react-assets/umi.46a85e4a7e3561850c7d.hot-update.js"
    },
    "46a85e4a7e3561850c7d.hot-update.json": {
      "name": "46a85e4a7e3561850c7d.hot-update.json",
      "path": "/usr/src/app/dist/46a85e4a7e3561850c7d.hot-update.json",
      "publicPath": "/react-assets/46a85e4a7e3561850c7d.hot-update.json"
    },
    "umi.46a85e4a7e3561850c7d.hot-update.js.map": {
      "name": "umi.46a85e4a7e3561850c7d.hot-update.js.map",
      "path": "/usr/src/app/dist/umi.46a85e4a7e3561850c7d.hot-update.js.map",
      "publicPath": "/react-assets/umi.46a85e4a7e3561850c7d.hot-update.js.map"
    },
    "umi.af9f93bccd1b9cef68cb.hot-update.js": {
      "name": "umi.af9f93bccd1b9cef68cb.hot-update.js",
      "path": "/usr/src/app/dist/umi.af9f93bccd1b9cef68cb.hot-update.js",
      "publicPath": "/react-assets/umi.af9f93bccd1b9cef68cb.hot-update.js"
    },
    "af9f93bccd1b9cef68cb.hot-update.json": {
      "name": "af9f93bccd1b9cef68cb.hot-update.json",
      "path": "/usr/src/app/dist/af9f93bccd1b9cef68cb.hot-update.json",
      "publicPath": "/react-assets/af9f93bccd1b9cef68cb.hot-update.json"
    },
    "umi.af9f93bccd1b9cef68cb.hot-update.js.map": {
      "name": "umi.af9f93bccd1b9cef68cb.hot-update.js.map",
      "path": "/usr/src/app/dist/umi.af9f93bccd1b9cef68cb.hot-update.js.map",
      "publicPath": "/react-assets/umi.af9f93bccd1b9cef68cb.hot-update.js.map"
    },
    "umi.4ba3a8da39dc6e5e396c.hot-update.js": {
      "name": "umi.4ba3a8da39dc6e5e396c.hot-update.js",
      "path": "/usr/src/app/dist/umi.4ba3a8da39dc6e5e396c.hot-update.js",
      "publicPath": "/react-assets/umi.4ba3a8da39dc6e5e396c.hot-update.js"
    },
    "4ba3a8da39dc6e5e396c.hot-update.json": {
      "name": "4ba3a8da39dc6e5e396c.hot-update.json",
      "path": "/usr/src/app/dist/4ba3a8da39dc6e5e396c.hot-update.json",
      "publicPath": "/react-assets/4ba3a8da39dc6e5e396c.hot-update.json"
    },
    "umi.4ba3a8da39dc6e5e396c.hot-update.js.map": {
      "name": "umi.4ba3a8da39dc6e5e396c.hot-update.js.map",
      "path": "/usr/src/app/dist/umi.4ba3a8da39dc6e5e396c.hot-update.js.map",
      "publicPath": "/react-assets/umi.4ba3a8da39dc6e5e396c.hot-update.js.map"
    },
    "umi.41238b7eb1c7e9265ce9.hot-update.js": {
      "name": "umi.41238b7eb1c7e9265ce9.hot-update.js",
      "path": "/usr/src/app/dist/umi.41238b7eb1c7e9265ce9.hot-update.js",
      "publicPath": "/react-assets/umi.41238b7eb1c7e9265ce9.hot-update.js"
    },
    "41238b7eb1c7e9265ce9.hot-update.json": {
      "name": "41238b7eb1c7e9265ce9.hot-update.json",
      "path": "/usr/src/app/dist/41238b7eb1c7e9265ce9.hot-update.json",
      "publicPath": "/react-assets/41238b7eb1c7e9265ce9.hot-update.json"
    },
    "umi.41238b7eb1c7e9265ce9.hot-update.js.map": {
      "name": "umi.41238b7eb1c7e9265ce9.hot-update.js.map",
      "path": "/usr/src/app/dist/umi.41238b7eb1c7e9265ce9.hot-update.js.map",
      "publicPath": "/react-assets/umi.41238b7eb1c7e9265ce9.hot-update.js.map"
    },
    "umi.84af36b0376ec7c6e21d.hot-update.js": {
      "name": "umi.84af36b0376ec7c6e21d.hot-update.js",
      "path": "/usr/src/app/dist/umi.84af36b0376ec7c6e21d.hot-update.js",
      "publicPath": "/react-assets/umi.84af36b0376ec7c6e21d.hot-update.js"
    },
    "84af36b0376ec7c6e21d.hot-update.json": {
      "name": "84af36b0376ec7c6e21d.hot-update.json",
      "path": "/usr/src/app/dist/84af36b0376ec7c6e21d.hot-update.json",
      "publicPath": "/react-assets/84af36b0376ec7c6e21d.hot-update.json"
    },
    "umi.84af36b0376ec7c6e21d.hot-update.js.map": {
      "name": "umi.84af36b0376ec7c6e21d.hot-update.js.map",
      "path": "/usr/src/app/dist/umi.84af36b0376ec7c6e21d.hot-update.js.map",
      "publicPath": "/react-assets/umi.84af36b0376ec7c6e21d.hot-update.js.map"
    },
    "umi.eae455ce6bd67d58cb04.hot-update.js": {
      "name": "umi.eae455ce6bd67d58cb04.hot-update.js",
      "path": "/usr/src/app/dist/umi.eae455ce6bd67d58cb04.hot-update.js",
      "publicPath": "/react-assets/umi.eae455ce6bd67d58cb04.hot-update.js"
    },
    "eae455ce6bd67d58cb04.hot-update.json": {
      "name": "eae455ce6bd67d58cb04.hot-update.json",
      "path": "/usr/src/app/dist/eae455ce6bd67d58cb04.hot-update.json",
      "publicPath": "/react-assets/eae455ce6bd67d58cb04.hot-update.json"
    },
    "umi.eae455ce6bd67d58cb04.hot-update.js.map": {
      "name": "umi.eae455ce6bd67d58cb04.hot-update.js.map",
      "path": "/usr/src/app/dist/umi.eae455ce6bd67d58cb04.hot-update.js.map",
      "publicPath": "/react-assets/umi.eae455ce6bd67d58cb04.hot-update.js.map"
    },
    "dbd656e9ec1a4f7b85c8.hot-update.json": {
      "name": "dbd656e9ec1a4f7b85c8.hot-update.json",
      "path": "/usr/src/app/dist/dbd656e9ec1a4f7b85c8.hot-update.json",
      "publicPath": "/react-assets/dbd656e9ec1a4f7b85c8.hot-update.json"
    },
    "umi.7edf635c8e2267016126.hot-update.js": {
      "name": "umi.7edf635c8e2267016126.hot-update.js",
      "path": "/usr/src/app/dist/umi.7edf635c8e2267016126.hot-update.js",
      "publicPath": "/react-assets/umi.7edf635c8e2267016126.hot-update.js"
    },
    "7edf635c8e2267016126.hot-update.json": {
      "name": "7edf635c8e2267016126.hot-update.json",
      "path": "/usr/src/app/dist/7edf635c8e2267016126.hot-update.json",
      "publicPath": "/react-assets/7edf635c8e2267016126.hot-update.json"
    },
    "umi.7edf635c8e2267016126.hot-update.js.map": {
      "name": "umi.7edf635c8e2267016126.hot-update.js.map",
      "path": "/usr/src/app/dist/umi.7edf635c8e2267016126.hot-update.js.map",
      "publicPath": "/react-assets/umi.7edf635c8e2267016126.hot-update.js.map"
    },
    "umi.dfccc0c4e75db613fb99.hot-update.js": {
      "name": "umi.dfccc0c4e75db613fb99.hot-update.js",
      "path": "/usr/src/app/dist/umi.dfccc0c4e75db613fb99.hot-update.js",
      "publicPath": "/react-assets/umi.dfccc0c4e75db613fb99.hot-update.js"
    },
    "dfccc0c4e75db613fb99.hot-update.json": {
      "name": "dfccc0c4e75db613fb99.hot-update.json",
      "path": "/usr/src/app/dist/dfccc0c4e75db613fb99.hot-update.json",
      "publicPath": "/react-assets/dfccc0c4e75db613fb99.hot-update.json"
    },
    "umi.dfccc0c4e75db613fb99.hot-update.js.map": {
      "name": "umi.dfccc0c4e75db613fb99.hot-update.js.map",
      "path": "/usr/src/app/dist/umi.dfccc0c4e75db613fb99.hot-update.js.map",
      "publicPath": "/react-assets/umi.dfccc0c4e75db613fb99.hot-update.js.map"
    },
    "umi.6fb7547515566dc4e9d7.hot-update.js": {
      "name": "umi.6fb7547515566dc4e9d7.hot-update.js",
      "path": "/usr/src/app/dist/umi.6fb7547515566dc4e9d7.hot-update.js",
      "publicPath": "/react-assets/umi.6fb7547515566dc4e9d7.hot-update.js"
    },
    "6fb7547515566dc4e9d7.hot-update.json": {
      "name": "6fb7547515566dc4e9d7.hot-update.json",
      "path": "/usr/src/app/dist/6fb7547515566dc4e9d7.hot-update.json",
      "publicPath": "/react-assets/6fb7547515566dc4e9d7.hot-update.json"
    },
    "umi.6fb7547515566dc4e9d7.hot-update.js.map": {
      "name": "umi.6fb7547515566dc4e9d7.hot-update.js.map",
      "path": "/usr/src/app/dist/umi.6fb7547515566dc4e9d7.hot-update.js.map",
      "publicPath": "/react-assets/umi.6fb7547515566dc4e9d7.hot-update.js.map"
    },
    "umi.d3e0ff08e8c68d212176.hot-update.js": {
      "name": "umi.d3e0ff08e8c68d212176.hot-update.js",
      "path": "/usr/src/app/dist/umi.d3e0ff08e8c68d212176.hot-update.js",
      "publicPath": "/react-assets/umi.d3e0ff08e8c68d212176.hot-update.js"
    },
    "d3e0ff08e8c68d212176.hot-update.json": {
      "name": "d3e0ff08e8c68d212176.hot-update.json",
      "path": "/usr/src/app/dist/d3e0ff08e8c68d212176.hot-update.json",
      "publicPath": "/react-assets/d3e0ff08e8c68d212176.hot-update.json"
    },
    "umi.d3e0ff08e8c68d212176.hot-update.js.map": {
      "name": "umi.d3e0ff08e8c68d212176.hot-update.js.map",
      "path": "/usr/src/app/dist/umi.d3e0ff08e8c68d212176.hot-update.js.map",
      "publicPath": "/react-assets/umi.d3e0ff08e8c68d212176.hot-update.js.map"
    },
    "umi.4199018685e5f4263170.hot-update.js": {
      "name": "umi.4199018685e5f4263170.hot-update.js",
      "path": "/usr/src/app/dist/umi.4199018685e5f4263170.hot-update.js",
      "publicPath": "/react-assets/umi.4199018685e5f4263170.hot-update.js"
    },
    "4199018685e5f4263170.hot-update.json": {
      "name": "4199018685e5f4263170.hot-update.json",
      "path": "/usr/src/app/dist/4199018685e5f4263170.hot-update.json",
      "publicPath": "/react-assets/4199018685e5f4263170.hot-update.json"
    },
    "umi.4199018685e5f4263170.hot-update.js.map": {
      "name": "umi.4199018685e5f4263170.hot-update.js.map",
      "path": "/usr/src/app/dist/umi.4199018685e5f4263170.hot-update.js.map",
      "publicPath": "/react-assets/umi.4199018685e5f4263170.hot-update.js.map"
    },
    "umi.27d335aa1febbfadb596.hot-update.js": {
      "name": "umi.27d335aa1febbfadb596.hot-update.js",
      "path": "/usr/src/app/dist/umi.27d335aa1febbfadb596.hot-update.js",
      "publicPath": "/react-assets/umi.27d335aa1febbfadb596.hot-update.js"
    },
    "27d335aa1febbfadb596.hot-update.json": {
      "name": "27d335aa1febbfadb596.hot-update.json",
      "path": "/usr/src/app/dist/27d335aa1febbfadb596.hot-update.json",
      "publicPath": "/react-assets/27d335aa1febbfadb596.hot-update.json"
    },
    "umi.27d335aa1febbfadb596.hot-update.js.map": {
      "name": "umi.27d335aa1febbfadb596.hot-update.js.map",
      "path": "/usr/src/app/dist/umi.27d335aa1febbfadb596.hot-update.js.map",
      "publicPath": "/react-assets/umi.27d335aa1febbfadb596.hot-update.js.map"
    },
    "umi.8cfe7e42a1de6fe95d21.hot-update.js": {
      "name": "umi.8cfe7e42a1de6fe95d21.hot-update.js",
      "path": "/usr/src/app/dist/umi.8cfe7e42a1de6fe95d21.hot-update.js",
      "publicPath": "/react-assets/umi.8cfe7e42a1de6fe95d21.hot-update.js"
    },
    "8cfe7e42a1de6fe95d21.hot-update.json": {
      "name": "8cfe7e42a1de6fe95d21.hot-update.json",
      "path": "/usr/src/app/dist/8cfe7e42a1de6fe95d21.hot-update.json",
      "publicPath": "/react-assets/8cfe7e42a1de6fe95d21.hot-update.json"
    },
    "umi.8cfe7e42a1de6fe95d21.hot-update.js.map": {
      "name": "umi.8cfe7e42a1de6fe95d21.hot-update.js.map",
      "path": "/usr/src/app/dist/umi.8cfe7e42a1de6fe95d21.hot-update.js.map",
      "publicPath": "/react-assets/umi.8cfe7e42a1de6fe95d21.hot-update.js.map"
    },
    "umi.afbb64621b6337213a04.hot-update.js": {
      "name": "umi.afbb64621b6337213a04.hot-update.js",
      "path": "/usr/src/app/dist/umi.afbb64621b6337213a04.hot-update.js",
      "publicPath": "/react-assets/umi.afbb64621b6337213a04.hot-update.js"
    },
    "afbb64621b6337213a04.hot-update.json": {
      "name": "afbb64621b6337213a04.hot-update.json",
      "path": "/usr/src/app/dist/afbb64621b6337213a04.hot-update.json",
      "publicPath": "/react-assets/afbb64621b6337213a04.hot-update.json"
    },
    "umi.afbb64621b6337213a04.hot-update.js.map": {
      "name": "umi.afbb64621b6337213a04.hot-update.js.map",
      "path": "/usr/src/app/dist/umi.afbb64621b6337213a04.hot-update.js.map",
      "publicPath": "/react-assets/umi.afbb64621b6337213a04.hot-update.js.map"
    }
  },
  "chunks": {
    "umi": [
      "umi.css",
      "umi.js",
      "umi.afbb64621b6337213a04.hot-update.js",
      "umi.css.map",
      "umi.js.map",
      "umi.afbb64621b6337213a04.hot-update.js.map"
    ]
  },
  "publicPath": "/react-assets/",
  "error": "ModuleBuildError",
  "message": "Module build failed (from ./node_modules/@umijs/deps/compiled/babel-loader/index.js):\nSyntaxError: /usr/src/app/src/components/get-occupancy.tsx: Unexpected token, expected \",\" (23:66)\n\n  21 |             wrapperCol={{ span: 16 }}\n  22 |             form={form}\n> 23 |             initialValues={{ ts: moment(new Date(new Date() - 15) })}\n     |                                                                   ^\n  24 |         >\n  25 |             <Form.Item\n  26 |                 label=\"Date\"\n    at Object._raise (/usr/src/app/node_modules/@umijs/deps/compiled/babel/bundle.js:28077:17)\n    at Object.raiseWithData (/usr/src/app/node_modules/@umijs/deps/compiled/babel/bundle.js:28070:17)\n    at Object.raise (/usr/src/app/node_modules/@umijs/deps/compiled/babel/bundle.js:28031:17)\n    at Object.unexpected (/usr/src/app/node_modules/@umijs/deps/compiled/babel/bundle.js:37201:16)\n    at Object.expect (/usr/src/app/node_modules/@umijs/deps/compiled/babel/bundle.js:37175:28)\n    at Object.parseCallExpressionArguments (/usr/src/app/node_modules/@umijs/deps/compiled/babel/bundle.js:38356:14)\n    at Object.parseCoverCallAndAsyncArrowHead (/usr/src/app/node_modules/@umijs/deps/compiled/babel/bundle.js:38282:29)\n    at Object.parseSubscript (/usr/src/app/node_modules/@umijs/deps/compiled/babel/bundle.js:38218:19)\n    at Object.parseSubscript (/usr/src/app/node_modules/@umijs/deps/compiled/babel/bundle.js:34369:18)\n    at Object.parseSubscripts (/usr/src/app/node_modules/@umijs/deps/compiled/babel/bundle.js:38191:19)"
}