%YAML 1.1
%TAG !u! tag:unity3d.com,2011:
--- !u!114 &11400000
MonoBehaviour:
  m_ObjectHideFlags: 0
  m_CorrespondingSourceObject: {fileID: 0}
  m_PrefabInstance: {fileID: 0}
  m_PrefabAsset: {fileID: 0}
  m_GameObject: {fileID: 0}
  m_Enabled: 1
  m_EditorHideFlags: 0
  m_Script: {fileID: 11500000, guid: c1aa5796c0a443178dec09f5f7bba1b0, type: 3}
  m_Name: Global Emitters
  m_EditorClassIdentifier: 
  assets:
  - {fileID: 11400000, guid: 74b60c6a912770e42a91333a6011ebce, type: 2}
