%YAML 1.1
%TAG !u! tag:unity3d.com,2011:
--- !u!114 &11400000
MonoBehaviour:
  m_ObjectHideFlags: 0
  m_CorrespondingSourceObject: {fileID: 0}
  m_PrefabInstance: {fileID: 0}
  m_PrefabAsset: {fileID: 0}
  m_GameObject: {fileID: 0}
  m_Enabled: 1
  m_EditorHideFlags: 0
  m_Script: {fileID: 11500000, guid: 89333069d4e1417fb5d286558b1d2bcb, type: 3}
  m_Name: Boxes Destroyed Count
  m_EditorClassIdentifier: 
  fallbackValue:
    useConstant: 1
    constantValue: 0
    variable: {fileID: 0}
  store: {fileID: 11400000, guid: fa4963a235a5e124e883a01fa8a995c5, type: 2}
