%YAML 1.1
%TAG !u! tag:unity3d.com,2011:
--- !u!114 &11400000
MonoBehaviour:
  m_ObjectHideFlags: 0
  m_CorrespondingSourceObject: {fileID: 0}
  m_PrefabInstance: {fileID: 0}
  m_PrefabAsset: {fileID: 0}
  m_GameObject: {fileID: 0}
  m_Enabled: 1
  m_EditorHideFlags: 0
  m_Script: {fileID: 11500000, guid: 097c2bcd7fbf4e4bb668949de2a36e12, type: 3}
  m_Name: Bullet Color
  m_EditorClassIdentifier: 
  notePad:
    notes: []
  color: {r: 0, g: 0.89260936, b: 1, a: 1}
