<?xml version="1.0" encoding="UTF-8" standalone="no"?>
<!DOCTYPE svg PUBLIC "-//W3C//DTD SVG 1.1//EN"
 "http://www.w3.org/Graphics/SVG/1.1/DTD/svg11.dtd">
<!-- Generated by graphviz version 2.38.0 (20140413.2041)
 -->
<!-- Title: G Pages: 1 -->
<svg width="742pt" height="395pt"
 viewBox="0.00 0.00 741.82 394.71" xmlns="http://www.w3.org/2000/svg" xmlns:xlink="http://www.w3.org/1999/xlink">
<g id="graph0" class="graph" transform="scale(1 1) rotate(0) translate(4 390.706)">
<title>G</title>
<polygon fill="white" stroke="none" points="-4,4 -4,-390.706 737.817,-390.706 737.817,4 -4,4"/>
<!-- tcpclientserver_local_logger -->
<g id="node1" class="node"><title>tcpclientserver_local_logger</title>
<ellipse fill="#b83d3d" stroke="black" cx="608.15" cy="-99.6396" rx="58.8803" ry="21.4286"/>
<text text-anchor="middle" x="608.15" y="-102.64" font-family="Helvetica,sans-Serif" font-size="10.00" fill="#ffffff">tcpclientserver.</text>
<text text-anchor="middle" x="608.15" y="-91.6396" font-family="Helvetica,sans-Serif" font-size="10.00" fill="#ffffff">local_logger</text>
</g>
<!-- tcpclientserver_server -->
<g id="node2" class="node"><title>tcpclientserver_server</title>
<ellipse fill="#883a3a" stroke="black" cx="369.15" cy="-21.2132" rx="58.8803" ry="21.4286"/>
<text text-anchor="middle" x="369.15" y="-24.2132" font-family="Helvetica,sans-Serif" font-size="10.00" fill="#ffffff">tcpclientserver.</text>
<text text-anchor="middle" x="369.15" y="-13.2132" font-family="Helvetica,sans-Serif" font-size="10.00" fill="#ffffff">server</text>
</g>
<!-- tcpclientserver_local_logger&#45;&gt;tcpclientserver_server -->
<g id="edge1" class="edge"><title>tcpclientserver_local_logger&#45;&gt;tcpclientserver_server</title>
<path fill="none" stroke="black" d="M565.421,-84.9761C525.187,-72.1101 464.818,-52.8054 421.664,-39.0059"/>
<polygon fill="black" stroke="black" points="422.501,-35.5992 411.91,-35.887 420.369,-42.2666 422.501,-35.5992"/>
</g>
<!-- nmapwrapper -->
<g id="node3" class="node"><title>nmapwrapper</title>
<ellipse fill="#4747c2" stroke="black" cx="44.1497" cy="-178.066" rx="44.3" ry="18"/>
<text text-anchor="middle" x="44.1497" y="-175.566" font-family="Helvetica,sans-Serif" font-size="10.00" fill="#ffffff">nmapwrapper</text>
</g>
<!-- nmapwrapper&#45;&gt;tcpclientserver_server -->
<g id="edge2" class="edge"><title>nmapwrapper&#45;&gt;tcpclientserver_server</title>
<path fill="none" stroke="black" d="M74.9722,-165.061C102.212,-152.876 140.962,-131.409 163.15,-100.64"/>
<path fill="none" stroke="black" d="M163.15,-98.6396C194.849,-54.681 254.812,-35.9751 301.904,-28.0318"/>
<polygon fill="black" stroke="black" points="302.704,-31.4495 312.046,-26.4514 301.626,-24.533 302.704,-31.4495"/>
</g>
<!-- nmapwrapper_nmap_wrapper -->
<g id="node4" class="node"><title>nmapwrapper_nmap_wrapper</title>
<ellipse fill="#4c4cb3" stroke="black" cx="163.15" cy="-178.066" rx="56.6372" ry="21.4286"/>
<text text-anchor="middle" x="163.15" y="-181.066" font-family="Helvetica,sans-Serif" font-size="10.00" fill="#ffffff">nmapwrapper.</text>
<text text-anchor="middle" x="163.15" y="-170.066" font-family="Helvetica,sans-Serif" font-size="10.00" fill="#ffffff">nmap_wrapper</text>
</g>
<!-- nmapwrapper_nmap_wrapper&#45;&gt;tcpclientserver_server -->
<g id="edge3" class="edge"><title>nmapwrapper_nmap_wrapper&#45;&gt;tcpclientserver_server</title>
<path fill="none" stroke="black" d="M157.162,-156.911C153.509,-140.247 151.509,-116.783 163.15,-100.64"/>
</g>
<!-- ipaddress -->
<g id="node5" class="node"><title>ipaddress</title>
<ellipse fill="#53b653" stroke="black" cx="272.15" cy="-178.066" rx="34.9638" ry="18"/>
<text text-anchor="middle" x="272.15" y="-175.566" font-family="Helvetica,sans-Serif" font-size="10.00" fill="#000000">ipaddress</text>
</g>
<!-- ipaddress&#45;&gt;tcpclientserver_server -->
<g id="edge4" class="edge"><title>ipaddress&#45;&gt;tcpclientserver_server</title>
<path fill="none" stroke="black" d="M249.383,-164.218C215.641,-144.778 156.948,-109.239 163.15,-100.64"/>
</g>
<!-- tcpclientserver_external_configuration -->
<g id="node6" class="node"><title>tcpclientserver_external_configuration</title>
<ellipse fill="#c04040" stroke="black" cx="316.15" cy="-99.6396" rx="79.3924" ry="21.4286"/>
<text text-anchor="middle" x="316.15" y="-102.64" font-family="Helvetica,sans-Serif" font-size="10.00" fill="#ffffff">tcpclientserver.</text>
<text text-anchor="middle" x="316.15" y="-91.6396" font-family="Helvetica,sans-Serif" font-size="10.00" fill="#ffffff">external_configuration</text>
</g>
<!-- tcpclientserver_external_configuration&#45;&gt;tcpclientserver_server -->
<g id="edge5" class="edge"><title>tcpclientserver_external_configuration&#45;&gt;tcpclientserver_server</title>
<path fill="none" stroke="black" d="M330.075,-78.5595C336.086,-69.8911 343.221,-59.6022 349.739,-50.2038"/>
<polygon fill="black" stroke="black" points="352.678,-52.1069 355.501,-41.8949 346.926,-48.1178 352.678,-52.1069"/>
</g>
<!-- socket -->
<g id="node7" class="node"><title>socket</title>
<ellipse fill="#3bcece" stroke="black" cx="488.15" cy="-368.706" rx="27.1572" ry="18"/>
<text text-anchor="middle" x="488.15" y="-366.206" font-family="Helvetica,sans-Serif" font-size="10.00" fill="#000000">socket</text>
</g>
<!-- socket&#45;&gt;tcpclientserver_server -->
<g id="edge6" class="edge"><title>socket&#45;&gt;tcpclientserver_server</title>
<path fill="none" stroke="black" d="M486.955,-350.437C486.531,-340.036 486.505,-326.554 488.15,-314.706"/>
<path fill="none" stroke="black" d="M488.15,-313.706C491.718,-287.991 455.666,-299.871 442.15,-277.706 395.208,-200.725 436.978,-162.402 404.15,-78.4264 400.391,-68.8108 394.962,-59.0239 389.497,-50.3691"/>
<polygon fill="black" stroke="black" points="392.284,-48.2375 383.858,-41.8145 386.44,-52.09 392.284,-48.2375"/>
</g>
<!-- logging_handlers -->
<g id="node8" class="node"><title>logging_handlers</title>
<ellipse fill="#acac49" stroke="black" cx="488.15" cy="-256.492" rx="37.4533" ry="21.4286"/>
<text text-anchor="middle" x="488.15" y="-259.492" font-family="Helvetica,sans-Serif" font-size="10.00" fill="#000000">logging.</text>
<text text-anchor="middle" x="488.15" y="-248.492" font-family="Helvetica,sans-Serif" font-size="10.00" fill="#000000">handlers</text>
</g>
<!-- socket&#45;&gt;logging_handlers -->
<g id="edge11" class="edge"><title>socket&#45;&gt;logging_handlers</title>
<path fill="none" stroke="black" d="M488.15,-313.706C489.3,-305.414 489.68,-296.367 489.676,-288.002"/>
<polygon fill="black" stroke="black" points="493.173,-287.816 489.495,-277.88 486.174,-287.941 493.173,-287.816"/>
</g>
<!-- tcpclientserver_client -->
<g id="node10" class="node"><title>tcpclientserver_client</title>
<ellipse fill="#ac4949" stroke="black" cx="602.15" cy="-256.492" rx="58.8803" ry="21.4286"/>
<text text-anchor="middle" x="602.15" y="-259.492" font-family="Helvetica,sans-Serif" font-size="10.00" fill="#ffffff">tcpclientserver.</text>
<text text-anchor="middle" x="602.15" y="-248.492" font-family="Helvetica,sans-Serif" font-size="10.00" fill="#ffffff">client</text>
</g>
<!-- socket&#45;&gt;tcpclientserver_client -->
<g id="edge9" class="edge"><title>socket&#45;&gt;tcpclientserver_client</title>
<path fill="none" stroke="black" d="M488.15,-313.706C490.146,-299.321 520.225,-284.868 548.982,-274.22"/>
<polygon fill="black" stroke="black" points="550.407,-277.427 558.641,-270.76 548.046,-270.837 550.407,-277.427"/>
</g>
<!-- logging_handlers&#45;&gt;tcpclientserver_local_logger -->
<g id="edge7" class="edge"><title>logging_handlers&#45;&gt;tcpclientserver_local_logger</title>
<path fill="none" stroke="black" d="M516.679,-242.438C522.422,-239.957 528.446,-237.459 534.15,-235.279 609.277,-206.576 704.091,-259.463 706.15,-179.066"/>
<path fill="none" stroke="black" d="M706.15,-177.066C706.84,-150.099 683.481,-131.243 659.399,-119.008"/>
<polygon fill="black" stroke="black" points="660.718,-115.76 650.182,-114.64 657.72,-122.086 660.718,-115.76"/>
</g>
<!-- logging -->
<g id="node9" class="node"><title>logging</title>
<ellipse fill="#c2c247" stroke="black" cx="706.15" cy="-256.492" rx="27.8353" ry="18"/>
<text text-anchor="middle" x="706.15" y="-253.992" font-family="Helvetica,sans-Serif" font-size="10.00" fill="#000000">logging</text>
</g>
<!-- logging&#45;&gt;tcpclientserver_local_logger -->
<g id="edge8" class="edge"><title>logging&#45;&gt;tcpclientserver_local_logger</title>
<path fill="none" stroke="black" d="M705.901,-238.491C705.733,-223.001 705.627,-199.493 706.15,-179.066"/>
</g>
<!-- configparser -->
<g id="node11" class="node"><title>configparser</title>
<ellipse fill="#b653b6" stroke="black" cx="335.15" cy="-256.492" rx="41.4139" ry="18"/>
<text text-anchor="middle" x="335.15" y="-253.992" font-family="Helvetica,sans-Serif" font-size="10.00" fill="#ffffff">configparser</text>
</g>
<!-- configparser&#45;&gt;tcpclientserver_external_configuration -->
<g id="edge10" class="edge"><title>configparser&#45;&gt;tcpclientserver_external_configuration</title>
<path fill="none" stroke="black" d="M333.044,-238.329C329.875,-212.506 323.835,-163.278 319.902,-131.219"/>
<polygon fill="black" stroke="black" points="323.348,-130.564 318.656,-121.064 316.4,-131.416 323.348,-130.564"/>
</g>
</g>
</svg>
