digraph G {
    concentrate = true;
    rankdir = TB;
    node [style=filled,fillcolor="#ffffff",fontcolor="#000000",fontname=Helvetica,fontsize=10];

    tcpclientserver_local_logger -> tcpclientserver_server [weight="5"];
    nmapwrapper -> tcpclientserver_server [weight="5",minlen="2"];
    nmapwrapper_nmap_wrapper -> tcpclientserver_server [weight="5",minlen="2"];
    ipaddress -> tcpclientserver_server [weight="5",minlen="2"];
    tcpclientserver_external_configuration -> tcpclientserver_server [weight="5"];
    socket -> tcpclientserver_server [weight="5",minlen="2"];
    logging_handlers -> tcpclientserver_local_logger [weight="5",minlen="2"];
    logging -> tcpclientserver_local_logger [weight="5",minlen="2"];
    socket -> tcpclientserver_client [weight="5",minlen="2"];
    configparser -> tcpclientserver_external_configuration [weight="5",minlen="2"];
    socket -> logging_handlers [weight="5",minlen="2"];
    tcpclientserver_server [label="tcpclientserver\.\nserver",fillcolor="#883a3a",fontcolor="#ffffff"];
    logging_handlers [label="logging\.\nhandlers",fillcolor="#acac49"];
    logging [fillcolor="#c2c247"];
    ipaddress [fillcolor="#53b653"];
    tcpclientserver_external_configuration [label="tcpclientserver\.\nexternal_configuration",fillcolor="#c04040",fontcolor="#ffffff"];
    socket [fillcolor="#3bcece"];
    tcpclientserver_local_logger [label="tcpclientserver\.\nlocal_logger",fillcolor="#b83d3d",fontcolor="#ffffff"];
    nmapwrapper [fillcolor="#4747c2",fontcolor="#ffffff"];
    configparser [fillcolor="#b653b6",fontcolor="#ffffff"];
    nmapwrapper_nmap_wrapper [label="nmapwrapper\.\nnmap_wrapper",fillcolor="#4c4cb3",fontcolor="#ffffff"];
    tcpclientserver_client [label="tcpclientserver\.\nclient",fillcolor="#ac4949",fontcolor="#ffffff"];
}

