<?xml version="1.0" encoding="UTF-8" standalone="no"?>
<svg
   width="64"
   height="64"
   viewBox="0 0 16.933332 16.933334"
   version="1.1"
   id="svg1798"
   inkscape:version="1.1.2 (0a00cf5339, 2022-02-04, custom)"
   sodipodi:docname="recbox-workflow-studio.svg"
   inkscape:export-filename="/home/recbox/Pictures/recbox/recbox-theming.png"
   inkscape:export-xdpi="96"
   inkscape:export-ydpi="96"
   xmlns:inkscape="http://www.inkscape.org/namespaces/inkscape"
   xmlns:sodipodi="http://sodipodi.sourceforge.net/DTD/sodipodi-0.dtd"
   xmlns="http://www.w3.org/2000/svg"
   xmlns:svg="http://www.w3.org/2000/svg"
   xmlns:rdf="http://www.w3.org/1999/02/22-rdf-syntax-ns#"
   xmlns:cc="http://creativecommons.org/ns#"
   xmlns:dc="http://purl.org/dc/elements/1.1/">
  <defs
     id="defs1792">
    <inkscape:perspective
       sodipodi:type="inkscape:persp3d"
       inkscape:vp_x="0 : 71.966675 : 1"
       inkscape:vp_y="0 : 1000 : 0"
       inkscape:vp_z="135.46666 : 71.966675 : 1"
       inkscape:persp3d-origin="67.73333 : -73.37778 : 1"
       id="perspective903" />
    <clipPath
       clipPathUnits="userSpaceOnUse"
       id="clipPath2158">
      <g
         inkscape:label="Clip"
         id="use2160">
        <g
           id="g2170"
           transform="matrix(0.58256259,0.35755662,-0.35755662,0.58256259,203.68176,39.212694)">
          <circle
             style="fill:#a3a3a3;fill-opacity:1;stroke-width:0.236557"
             id="circle2166"
             cx="154.66324"
             cy="243.81778"
             r="15.269843" />
          <circle
             style="fill:#b3b3b3;fill-opacity:1;stroke-width:0.217657"
             id="circle2168"
             cx="154.66324"
             cy="243.81778"
             r="14.049853" />
        </g>
      </g>
    </clipPath>
  </defs>
  <sodipodi:namedview
     id="base"
     pagecolor="#ffffff"
     bordercolor="#666666"
     borderopacity="1.0"
     inkscape:pageopacity="0.0"
     inkscape:pageshadow="2"
     inkscape:zoom="4.8629646"
     inkscape:cx="27.966479"
     inkscape:cy="37.322912"
     inkscape:document-units="px"
     inkscape:current-layer="layer1"
     inkscape:document-rotation="0"
     showgrid="false"
     units="px"
     inkscape:window-width="1366"
     inkscape:window-height="736"
     inkscape:window-x="0"
     inkscape:window-y="32"
     inkscape:window-maximized="1"
     showguides="false"
     inkscape:pagecheckerboard="0" />
  <metadata
     id="metadata1795">
    <rdf:RDF>
      <cc:Work
         rdf:about="">
        <dc:format>image/svg+xml</dc:format>
        <dc:type
           rdf:resource="http://purl.org/dc/dcmitype/StillImage" />
      </cc:Work>
    </rdf:RDF>
  </metadata>
  <g
     inkscape:label="Layer 1"
     inkscape:groupmode="layer"
     id="layer1">
    <g
       id="g1757"
       transform="matrix(0.12500001,0,0,0.12500001,2.3861694e-6,2.3861694e-6)" />
    <g
       id="g1048"
       transform="matrix(0.12500001,0,0,0.12500001,2.3861694e-6,2.3861694e-6)">
      <path
         id="rect919"
         style="fill:#ececec;stroke-width:0.999999"
         d="M 478.53516,212.44727 31,299.21289 V 463.39844 H 481 V 225.16016 Z"
         transform="scale(0.26458333)" />
      <g
         id="g1033">
        <rect
           style="fill:#e03838;fill-opacity:1;stroke-width:0.395189"
           id="rect838"
           width="119.0625"
           height="119.0625"
           x="8.2020826"
           y="8.2020826"
           ry="3.4719627" />
        <path
           style="fill:#d8d8d8;fill-opacity:1;stroke:none;stroke-width:0.264583px;stroke-linecap:butt;stroke-linejoin:miter;stroke-opacity:1"
           d="M 8.2020832,79.166743 V 122.6075 H 127.26458 l -0.65215,-66.397494 z"
           id="path943" />
      </g>
      <path
         id="rect984"
         style="fill:#c60000;fill-opacity:1;stroke-width:0.39519"
         d="M 122.6075,8.2020906 V 119.13588 c 0,1.92347 -1.54815,3.47162 -3.47162,3.47162 H 8.2020852 v 1.18494 c 0,1.92347 1.548672,3.47214 3.4721398,3.47214 H 123.79244 c 1.92347,0 3.47214,-1.54867 3.47214,-3.47214 V 11.674231 c 0,-1.9234684 -1.54867,-3.4721404 -3.47214,-3.4721404 z" />
      <g
         id="g1029">
        <path
           id="rect957"
           style="fill:#151515;fill-opacity:1;stroke-width:0.413635"
           d="m 467.45508,287.25977 c -4.41484,1.69862 -8.81251,3.75471 -12.91797,6.125 l -77.91016,44.98242 c -15.61753,9.01678 -20.93088,18.91738 -11.91406,22.19922 l 4.04883,1.47461 c 9.01678,3.28184 28.84926,-1.33479 44.4668,-10.35157 l 54.22656,-31.30859 z m -69.12891,30.19335 -36.67578,21.17579 c -15.27681,8.82006 -21.39025,18.85486 -16.99609,25.60742 -0.38521,0.0379 -0.77239,0.0798 -1.16407,0.12695 -13.81455,1.66192 -47.11718,17.0918 -47.11718,17.0918 l -27.59961,15.93359 43.5,15.83399 27.59961,-15.93555 c 0,0 25.23523,-18.36556 25.63476,-24.91016 0.0113,-0.18553 0.0115,-0.36823 0.004,-0.54883 15.34299,0.43138 35.27753,-4.5723 50.55469,-13.39257 l 36.67773,-21.17578 -5.50586,-2.00391 -35.58984,20.54883 c -16.14894,9.32358 -38.82948,13.30608 -50.85352,8.92969 -12.02407,-4.3764 -8.70362,-15.40689 7.44531,-24.73047 l 35.58985,-20.54688 z"
           transform="scale(0.26458333)" />
        <g
           id="g955">
          <g
             id="g948">
            <rect
               style="fill:#212121;fill-opacity:1;stroke-width:0.221756"
               id="rect897"
               width="25.05541"
               height="53.075222"
               x="55.205627"
               y="26.134985"
               ry="11.141583" />
            <path
               id="rect895"
               style="fill:#483737;stroke-width:0.329703"
               d="m 49.107294,55.971595 v 14.495536 c 0,8.001282 8.307577,14.442168 18.626331,14.442168 10.318756,0 18.625745,-6.440886 18.625745,-14.442168 V 55.971595 H 82.591053 V 70.03788 c 0,6.382457 -6.626369,11.520628 -14.857428,11.520628 -8.23106,0 -14.858011,-5.138171 -14.858014,-11.520628 V 55.971595 Z" />
            <path
               style="fill:#483737;fill-opacity:1;stroke:none;stroke-width:0.195273px;stroke-linecap:butt;stroke-linejoin:miter;stroke-opacity:1"
               d="M 60.197656,84.047305 C 55.606025,86.85619 52.844454,98.423906 52.844454,98.423906 V 109.33167 H 82.622211 V 98.423906 c 0,0 -2.76157,-11.567716 -7.353202,-14.376601 -4.285504,-2.621619 -10.785849,-2.621619 -15.071353,0 z"
               id="path1006"
               sodipodi:nodetypes="accccaa" />
          </g>
          <rect
             style="fill:#212121;fill-opacity:1;stroke:none;stroke-width:0.184115"
             id="rect1046"
             width="29.777796"
             height="5.9333839"
             x="52.844433"
             y="103.39829"
             ry="0" />
        </g>
      </g>
    </g>
  </g>
</svg>
