<?xml version="1.0" encoding="UTF-8" standalone="no"?>
<svg
   width="24"
   height="24"
   viewBox="0 0 6.3499997 6.3500002"
   version="1.1"
   id="svg1798"
   inkscape:version="1.1.1 (3bf5ae0d25, 2021-09-20, custom)"
   sodipodi:docname="recbox-xfce-shortcuts.svg"
   inkscape:export-filename="/home/recbox/Pictures/recbox/recbox-theming.png"
   inkscape:export-xdpi="96"
   inkscape:export-ydpi="96"
   xmlns:inkscape="http://www.inkscape.org/namespaces/inkscape"
   xmlns:sodipodi="http://sodipodi.sourceforge.net/DTD/sodipodi-0.dtd"
   xmlns="http://www.w3.org/2000/svg"
   xmlns:svg="http://www.w3.org/2000/svg"
   xmlns:rdf="http://www.w3.org/1999/02/22-rdf-syntax-ns#"
   xmlns:cc="http://creativecommons.org/ns#"
   xmlns:dc="http://purl.org/dc/elements/1.1/">
  <defs
     id="defs1792" />
  <sodipodi:namedview
     id="base"
     pagecolor="#ffffff"
     bordercolor="#666666"
     borderopacity="1.0"
     inkscape:pageopacity="0.0"
     inkscape:pageshadow="2"
     inkscape:zoom="15.016893"
     inkscape:cx="8.9898755"
     inkscape:cy="7.7579296"
     inkscape:document-units="px"
     inkscape:current-layer="layer1"
     inkscape:document-rotation="0"
     showgrid="false"
     units="px"
     inkscape:window-width="1366"
     inkscape:window-height="736"
     inkscape:window-x="0"
     inkscape:window-y="32"
     inkscape:window-maximized="1"
     showguides="false"
     inkscape:pagecheckerboard="0" />
  <metadata
     id="metadata1795">
    <rdf:RDF>
      <cc:Work
         rdf:about="">
        <dc:format>image/svg+xml</dc:format>
        <dc:type
           rdf:resource="http://purl.org/dc/dcmitype/StillImage" />
      </cc:Work>
    </rdf:RDF>
  </metadata>
  <g
     inkscape:label="Layer 1"
     inkscape:groupmode="layer"
     id="layer1">
    <g
       id="g1926"
       transform="scale(0.046875)">
      <g
         id="g1814">
        <g
           id="g928">
          <rect
             style="fill:#e03838;fill-opacity:1;stroke-width:0.395189"
             id="rect838"
             width="119.0625"
             height="119.0625"
             x="8.2020826"
             y="8.2020826"
             ry="3.4719627" />
          <path
             id="rect984"
             style="fill:#c60000;fill-opacity:1;stroke-width:1.49363"
             d="m 463.39844,31 v 419.27734 c 0,7.2698 -5.8513,13.1211 -13.1211,13.1211 H 31 v 4.47851 C 31,475.14675 36.853249,481 44.123047,481 H 467.87695 C 475.14675,481 481,475.14675 481,467.87695 V 44.123047 C 481,36.853249 475.14675,31 467.87695,31 Z"
             transform="scale(0.26458333)" />
        </g>
        <g
           id="g1706">
          <g
             id="g1232">
            <g
               id="g1085">
              <path
                 id="path913"
                 style="fill:#e6e6e6;fill-opacity:1;stroke-width:0.264583"
                 d="m 89.904079,32.890053 c -2.510912,0 -5.831557,1.548669 -7.445539,3.47214 L 22.025536,108.3826 c -1.613983,1.92347 -0.891889,3.47214 1.619023,3.47214 H 127.26458 V 32.890053 Z" />
              <path
                 id="rect915"
                 style="fill:#b3b3b3;stroke-width:1.7575"
                 d="m 21.219376,109.8305 -1.92443,6.47093 H 127.26458 v -6.47093 z" />
            </g>
            <g
               id="g1197">
              <g
                 id="g955"
                 transform="translate(85.641804,-54.835478)">
                <rect
                   style="fill:#999999;stroke-width:0.260182"
                   id="rect942"
                   width="28.339783"
                   height="18.569149"
                   x="82.944901"
                   y="185.60959"
                   ry="3.3515418"
                   transform="matrix(1,0,-0.64278761,0.76604444,0,0)" />
                <rect
                   style="fill:#b3b3b3;stroke-width:0.260182"
                   id="rect930"
                   width="28.339783"
                   height="18.569149"
                   x="79.871269"
                   y="182.36353"
                   ry="3.3515418"
                   transform="matrix(1,0,-0.64278761,0.76604444,0,0)" />
                <rect
                   style="fill:#cccccc;stroke-width:0.260182"
                   id="rect950"
                   width="28.339783"
                   height="18.569149"
                   x="79.383018"
                   y="181.60385"
                   ry="3.3515418"
                   transform="matrix(1,0,-0.64278761,0.76604444,0,0)" />
              </g>
              <g
                 id="g963"
                 transform="translate(122.04347,-54.835478)">
                <rect
                   style="fill:#999999;stroke-width:0.260182"
                   id="rect957"
                   width="28.339783"
                   height="18.569149"
                   x="82.944901"
                   y="185.60959"
                   ry="3.3515418"
                   transform="matrix(1,0,-0.64278761,0.76604444,0,0)" />
                <rect
                   style="fill:#b3b3b3;stroke-width:0.260182"
                   id="rect959"
                   width="28.339783"
                   height="18.569149"
                   x="79.871269"
                   y="182.36353"
                   ry="3.3515418"
                   transform="matrix(1,0,-0.64278761,0.76604444,0,0)" />
                <rect
                   style="fill:#cccccc;stroke-width:0.260182"
                   id="rect961"
                   width="28.339783"
                   height="18.569149"
                   x="79.383018"
                   y="181.60385"
                   ry="3.3515418"
                   transform="matrix(1,0,-0.64278761,0.76604444,0,0)" />
              </g>
              <g
                 id="g1166">
                <path
                   id="rect967"
                   style="fill:#999999;stroke-width:0.86068"
                   d="m 474.08203,330.14062 c -7.01765,0 -16.29968,4.3273 -20.81055,9.70313 l -28.82812,34.35547 c -4.51086,5.37583 -2.49226,9.70508 4.52539,9.70508 H 481 v -53.76368 z"
                   transform="scale(0.26458333)" />
                <path
                   id="rect969"
                   style="fill:#b3b3b3;stroke-width:0.86068"
                   d="m 470.35156,320.74219 c -7.01765,0 -16.29968,4.32729 -20.81054,9.70312 l -28.82813,34.35547 c -4.51086,5.37584 -2.49226,9.70508 4.52539,9.70508 H 481 v -53.76367 z"
                   transform="scale(0.26458333)" />
                <path
                   id="rect971"
                   style="fill:#cccccc;stroke-width:0.86068"
                   d="m 470.35156,318.54297 c -7.01765,0 -16.29968,4.32729 -20.81054,9.70312 l -28.82813,34.35547 c -4.51086,5.37584 -2.49226,9.70508 4.52539,9.70508 H 481 v -53.76367 z"
                   transform="scale(0.26458333)" />
              </g>
              <g
                 id="g993"
                 transform="translate(123.66352,-95.946337)">
                <rect
                   style="fill:#999999;stroke-width:0.260182"
                   id="rect987"
                   width="28.339783"
                   height="18.569149"
                   x="82.944901"
                   y="185.60959"
                   ry="3.3515418"
                   transform="matrix(1,0,-0.64278761,0.76604444,0,0)" />
                <rect
                   style="fill:#b3b3b3;stroke-width:0.260182"
                   id="rect989"
                   width="28.339783"
                   height="18.569149"
                   x="79.871269"
                   y="182.36353"
                   ry="3.3515418"
                   transform="matrix(1,0,-0.64278761,0.76604444,0,0)" />
                <rect
                   style="fill:#cccccc;stroke-width:0.260182"
                   id="rect991"
                   width="28.339783"
                   height="18.569149"
                   x="79.383018"
                   y="181.60385"
                   ry="3.3515418"
                   transform="matrix(1,0,-0.64278761,0.76604444,0,0)" />
              </g>
              <g
                 id="g1023"
                 transform="translate(0,-0.19411166)">
                <g
                   id="g1028"
                   transform="translate(116.40616,-68.909902)">
                  <rect
                     style="fill:#999999;stroke-width:0.254383"
                     id="rect1006"
                     width="42.605923"
                     height="18.569149"
                     x="65.916077"
                     y="177.40263"
                     ry="3.098099"
                     transform="matrix(1,0,-0.64278761,0.76604444,0,0)" />
                  <rect
                     style="fill:#b3b3b3;stroke-width:0.254383"
                     id="rect1010"
                     width="42.605923"
                     height="18.569149"
                     x="62.842442"
                     y="174.15657"
                     ry="3.098099"
                     transform="matrix(1,0,-0.64278761,0.76604444,0,0)" />
                  <rect
                     style="fill:#cccccc;stroke-width:0.254383"
                     id="rect1018"
                     width="42.605923"
                     height="18.569149"
                     x="62.354191"
                     y="173.3969"
                     ry="3.098099"
                     transform="matrix(1,0,-0.64278761,0.76604444,0,0)" />
                </g>
              </g>
              <g
                 id="g1150">
                <path
                   id="rect1032"
                   style="fill:#999999;stroke-width:0.86068"
                   d="m 462.27148,252.45117 c -7.01765,0 -16.29773,4.32729 -20.80859,9.70313 l -28.82812,34.35547 c -4.51087,5.37583 -2.49422,9.70312 4.52343,9.70312 H 481 v -53.76172 z"
                   transform="scale(0.26458333)" />
                <path
                   id="rect1034"
                   style="fill:#b3b3b3;stroke-width:0.86068"
                   d="m 458.54102,243.05273 c -7.01766,0 -16.29969,4.32729 -20.81055,9.70313 l -28.82617,34.35547 c -4.51086,5.37583 -2.49422,9.70508 4.52343,9.70508 H 481 v -53.76368 z"
                   transform="scale(0.26458333)" />
                <path
                   id="rect1036"
                   style="fill:#cccccc;stroke-width:0.86068"
                   d="m 458.54102,240.85352 c -7.01766,0 -16.29774,4.32729 -20.8086,9.70312 l -28.82812,34.35547 c -4.51086,5.37583 -2.49422,9.70312 4.52343,9.70312 H 481 v -53.76171 z"
                   transform="scale(0.26458333)" />
              </g>
              <g
                 id="g1133">
                <path
                   id="rect1042"
                   style="fill:#999999;stroke-width:0.86068"
                   d="m 480.20508,174.76172 c -7.01766,0 -16.29969,4.32729 -20.81055,9.70312 l -28.82812,34.35547 c -4.51086,5.37584 -2.49227,9.70313 4.52539,9.70313 H 481 v -53.76172 z"
                   transform="scale(0.26458333)" />
                <path
                   id="rect1044"
                   style="fill:#b3b3b3;stroke-width:0.86068"
                   d="m 476.47461,165.36328 c -7.01765,0 -16.29969,4.32729 -20.81055,9.70313 l -28.82812,34.35547 c -4.51086,5.37583 -2.49227,9.70312 4.52539,9.70312 H 481 v -53.76172 z"
                   transform="scale(0.26458333)" />
                <path
                   id="rect1046"
                   style="fill:#cccccc;stroke-width:0.86068"
                   d="m 476.47461,163.16406 c -7.01765,0 -16.29969,4.32729 -20.81055,9.70313 l -28.82812,34.35547 c -4.51086,5.37583 -2.49227,9.70312 4.52539,9.70312 H 481 v -53.76172 z"
                   transform="scale(0.26458333)" />
              </g>
            </g>
          </g>
          <g
             id="g1534">
            <g
               id="g1472">
              <path
                 id="path1468"
                 style="fill:#e6e6e6;fill-opacity:1;stroke-width:0.264583"
                 d="m 89.904079,32.890053 c -2.510912,0 -5.831557,1.548669 -7.445539,3.47214 L 22.025536,108.3826 c -1.613983,1.92347 -0.891889,3.47214 1.619023,3.47214 H 127.26458 V 32.890053 Z" />
              <path
                 id="path1470"
                 style="fill:#b3b3b3;stroke-width:1.7575"
                 d="m 21.219376,109.8305 -1.92443,6.47093 H 127.26458 v -6.47093 z" />
            </g>
            <g
               id="g1532">
              <g
                 id="g1480"
                 transform="translate(85.641804,-54.835478)">
                <rect
                   style="fill:#999999;stroke-width:0.260182"
                   id="rect1474"
                   width="28.339783"
                   height="18.569149"
                   x="82.944901"
                   y="185.60959"
                   ry="3.3515418"
                   transform="matrix(1,0,-0.64278761,0.76604444,0,0)" />
                <rect
                   style="fill:#b3b3b3;stroke-width:0.260182"
                   id="rect1476"
                   width="28.339783"
                   height="18.569149"
                   x="79.871269"
                   y="182.36353"
                   ry="3.3515418"
                   transform="matrix(1,0,-0.64278761,0.76604444,0,0)" />
                <rect
                   style="fill:#cccccc;stroke-width:0.260182"
                   id="rect1478"
                   width="28.339783"
                   height="18.569149"
                   x="79.383018"
                   y="181.60385"
                   ry="3.3515418"
                   transform="matrix(1,0,-0.64278761,0.76604444,0,0)" />
              </g>
              <g
                 id="g1488"
                 transform="translate(122.04347,-54.835478)">
                <rect
                   style="fill:#999999;stroke-width:0.260182"
                   id="rect1482"
                   width="28.339783"
                   height="18.569149"
                   x="82.944901"
                   y="185.60959"
                   ry="3.3515418"
                   transform="matrix(1,0,-0.64278761,0.76604444,0,0)" />
                <rect
                   style="fill:#b3b3b3;stroke-width:0.260182"
                   id="rect1484"
                   width="28.339783"
                   height="18.569149"
                   x="79.871269"
                   y="182.36353"
                   ry="3.3515418"
                   transform="matrix(1,0,-0.64278761,0.76604444,0,0)" />
                <rect
                   style="fill:#cccccc;stroke-width:0.260182"
                   id="rect1486"
                   width="28.339783"
                   height="18.569149"
                   x="79.383018"
                   y="181.60385"
                   ry="3.3515418"
                   transform="matrix(1,0,-0.64278761,0.76604444,0,0)" />
              </g>
              <g
                 id="g1496">
                <path
                   id="path1490"
                   style="fill:#999999;stroke-width:0.86068"
                   d="m 474.08203,330.14062 c -7.01765,0 -16.29968,4.3273 -20.81055,9.70313 l -28.82812,34.35547 c -4.51086,5.37583 -2.49226,9.70508 4.52539,9.70508 H 481 v -53.76368 z"
                   transform="scale(0.26458333)" />
                <path
                   id="path1492"
                   style="fill:#b3b3b3;stroke-width:0.86068"
                   d="m 470.35156,320.74219 c -7.01765,0 -16.29968,4.32729 -20.81054,9.70312 l -28.82813,34.35547 c -4.51086,5.37584 -2.49226,9.70508 4.52539,9.70508 H 481 v -53.76367 z"
                   transform="scale(0.26458333)" />
                <path
                   id="path1494"
                   style="fill:#cccccc;stroke-width:0.86068"
                   d="m 470.35156,318.54297 c -7.01765,0 -16.29968,4.32729 -20.81054,9.70312 l -28.82813,34.35547 c -4.51086,5.37584 -2.49226,9.70508 4.52539,9.70508 H 481 v -53.76367 z"
                   transform="scale(0.26458333)" />
              </g>
              <g
                 id="g1504"
                 transform="translate(123.66352,-95.946337)">
                <rect
                   style="fill:#999999;stroke-width:0.260182"
                   id="rect1498"
                   width="28.339783"
                   height="18.569149"
                   x="82.944901"
                   y="185.60959"
                   ry="3.3515418"
                   transform="matrix(1,0,-0.64278761,0.76604444,0,0)" />
                <rect
                   style="fill:#b3b3b3;stroke-width:0.260182"
                   id="rect1500"
                   width="28.339783"
                   height="18.569149"
                   x="79.871269"
                   y="182.36353"
                   ry="3.3515418"
                   transform="matrix(1,0,-0.64278761,0.76604444,0,0)" />
                <rect
                   style="fill:#cccccc;stroke-width:0.260182"
                   id="rect1502"
                   width="28.339783"
                   height="18.569149"
                   x="79.383018"
                   y="181.60385"
                   ry="3.3515418"
                   transform="matrix(1,0,-0.64278761,0.76604444,0,0)" />
              </g>
              <g
                 id="g1514"
                 transform="translate(0,-0.19411166)">
                <g
                   id="g1512"
                   transform="translate(116.40616,-68.909902)">
                  <rect
                     style="fill:#999999;stroke-width:0.254383"
                     id="rect1506"
                     width="42.605923"
                     height="18.569149"
                     x="65.916077"
                     y="177.40263"
                     ry="3.098099"
                     transform="matrix(1,0,-0.64278761,0.76604444,0,0)" />
                  <rect
                     style="fill:#b3b3b3;stroke-width:0.254383"
                     id="rect1508"
                     width="42.605923"
                     height="18.569149"
                     x="62.842442"
                     y="174.15657"
                     ry="3.098099"
                     transform="matrix(1,0,-0.64278761,0.76604444,0,0)" />
                  <rect
                     style="fill:#cccccc;stroke-width:0.254383"
                     id="rect1510"
                     width="42.605923"
                     height="18.569149"
                     x="62.354191"
                     y="173.3969"
                     ry="3.098099"
                     transform="matrix(1,0,-0.64278761,0.76604444,0,0)" />
                </g>
              </g>
              <g
                 id="g1522">
                <path
                   id="path1516"
                   style="fill:#999999;stroke-width:0.86068"
                   d="m 462.27148,252.45117 c -7.01765,0 -16.29773,4.32729 -20.80859,9.70313 l -28.82812,34.35547 c -4.51087,5.37583 -2.49422,9.70312 4.52343,9.70312 H 481 v -53.76172 z"
                   transform="scale(0.26458333)" />
                <path
                   id="path1518"
                   style="fill:#b3b3b3;stroke-width:0.86068"
                   d="m 458.54102,243.05273 c -7.01766,0 -16.29969,4.32729 -20.81055,9.70313 l -28.82617,34.35547 c -4.51086,5.37583 -2.49422,9.70508 4.52343,9.70508 H 481 v -53.76368 z"
                   transform="scale(0.26458333)" />
                <path
                   id="path1520"
                   style="fill:#cccccc;stroke-width:0.86068"
                   d="m 458.54102,240.85352 c -7.01766,0 -16.29774,4.32729 -20.8086,9.70312 l -28.82812,34.35547 c -4.51086,5.37583 -2.49422,9.70312 4.52343,9.70312 H 481 v -53.76171 z"
                   transform="scale(0.26458333)" />
              </g>
              <g
                 id="g1530">
                <path
                   id="path1524"
                   style="fill:#999999;stroke-width:0.86068"
                   d="m 480.20508,174.76172 c -7.01766,0 -16.29969,4.32729 -20.81055,9.70312 l -28.82812,34.35547 c -4.51086,5.37584 -2.49227,9.70313 4.52539,9.70313 H 481 v -53.76172 z"
                   transform="scale(0.26458333)" />
                <path
                   id="path1526"
                   style="fill:#b3b3b3;stroke-width:0.86068"
                   d="m 476.47461,165.36328 c -7.01765,0 -16.29969,4.32729 -20.81055,9.70313 l -28.82812,34.35547 c -4.51086,5.37583 -2.49227,9.70312 4.52539,9.70312 H 481 v -53.76172 z"
                   transform="scale(0.26458333)" />
                <path
                   id="path1528"
                   style="fill:#cccccc;stroke-width:0.86068"
                   d="m 476.47461,163.16406 c -7.01765,0 -16.29969,4.32729 -20.81055,9.70313 l -28.82812,34.35547 c -4.51086,5.37583 -2.49227,9.70312 4.52539,9.70312 H 481 v -53.76172 z"
                   transform="scale(0.26458333)" />
              </g>
            </g>
          </g>
          <g
             id="g1602">
            <g
               id="g1540">
              <path
                 id="path1536"
                 style="fill:#e6e6e6;fill-opacity:1;stroke-width:0.264583"
                 d="m 89.904079,32.890053 c -2.510912,0 -5.831557,1.548669 -7.445539,3.47214 L 22.025536,108.3826 c -1.613983,1.92347 -0.891889,3.47214 1.619023,3.47214 H 127.26458 V 32.890053 Z" />
              <path
                 id="path1538"
                 style="fill:#b3b3b3;stroke-width:1.7575"
                 d="m 21.219376,109.8305 -1.92443,6.47093 H 127.26458 v -6.47093 z" />
            </g>
            <g
               id="g1600">
              <g
                 id="g1548"
                 transform="translate(85.641804,-54.835478)">
                <rect
                   style="fill:#999999;stroke-width:0.260182"
                   id="rect1542"
                   width="28.339783"
                   height="18.569149"
                   x="82.944901"
                   y="185.60959"
                   ry="3.3515418"
                   transform="matrix(1,0,-0.64278761,0.76604444,0,0)" />
                <rect
                   style="fill:#b3b3b3;stroke-width:0.260182"
                   id="rect1544"
                   width="28.339783"
                   height="18.569149"
                   x="79.871269"
                   y="182.36353"
                   ry="3.3515418"
                   transform="matrix(1,0,-0.64278761,0.76604444,0,0)" />
                <rect
                   style="fill:#cccccc;stroke-width:0.260182"
                   id="rect1546"
                   width="28.339783"
                   height="18.569149"
                   x="79.383018"
                   y="181.60385"
                   ry="3.3515418"
                   transform="matrix(1,0,-0.64278761,0.76604444,0,0)" />
              </g>
              <g
                 id="g1556"
                 transform="translate(122.04347,-54.835478)">
                <rect
                   style="fill:#999999;stroke-width:0.260182"
                   id="rect1550"
                   width="28.339783"
                   height="18.569149"
                   x="82.944901"
                   y="185.60959"
                   ry="3.3515418"
                   transform="matrix(1,0,-0.64278761,0.76604444,0,0)" />
                <rect
                   style="fill:#b3b3b3;stroke-width:0.260182"
                   id="rect1552"
                   width="28.339783"
                   height="18.569149"
                   x="79.871269"
                   y="182.36353"
                   ry="3.3515418"
                   transform="matrix(1,0,-0.64278761,0.76604444,0,0)" />
                <rect
                   style="fill:#cccccc;stroke-width:0.260182"
                   id="rect1554"
                   width="28.339783"
                   height="18.569149"
                   x="79.383018"
                   y="181.60385"
                   ry="3.3515418"
                   transform="matrix(1,0,-0.64278761,0.76604444,0,0)" />
              </g>
              <g
                 id="g1564">
                <path
                   id="path1558"
                   style="fill:#999999;stroke-width:0.86068"
                   d="m 474.08203,330.14062 c -7.01765,0 -16.29968,4.3273 -20.81055,9.70313 l -28.82812,34.35547 c -4.51086,5.37583 -2.49226,9.70508 4.52539,9.70508 H 481 v -53.76368 z"
                   transform="scale(0.26458333)" />
                <path
                   id="path1560"
                   style="fill:#b3b3b3;stroke-width:0.86068"
                   d="m 470.35156,320.74219 c -7.01765,0 -16.29968,4.32729 -20.81054,9.70312 l -28.82813,34.35547 c -4.51086,5.37584 -2.49226,9.70508 4.52539,9.70508 H 481 v -53.76367 z"
                   transform="scale(0.26458333)" />
                <path
                   id="path1562"
                   style="fill:#cccccc;stroke-width:0.86068"
                   d="m 470.35156,318.54297 c -7.01765,0 -16.29968,4.32729 -20.81054,9.70312 l -28.82813,34.35547 c -4.51086,5.37584 -2.49226,9.70508 4.52539,9.70508 H 481 v -53.76367 z"
                   transform="scale(0.26458333)" />
              </g>
              <g
                 id="g1572"
                 transform="translate(123.66352,-95.946337)">
                <rect
                   style="fill:#999999;stroke-width:0.260182"
                   id="rect1566"
                   width="28.339783"
                   height="18.569149"
                   x="82.944901"
                   y="185.60959"
                   ry="3.3515418"
                   transform="matrix(1,0,-0.64278761,0.76604444,0,0)" />
                <rect
                   style="fill:#b3b3b3;stroke-width:0.260182"
                   id="rect1568"
                   width="28.339783"
                   height="18.569149"
                   x="79.871269"
                   y="182.36353"
                   ry="3.3515418"
                   transform="matrix(1,0,-0.64278761,0.76604444,0,0)" />
                <rect
                   style="fill:#cccccc;stroke-width:0.260182"
                   id="rect1570"
                   width="28.339783"
                   height="18.569149"
                   x="79.383018"
                   y="181.60385"
                   ry="3.3515418"
                   transform="matrix(1,0,-0.64278761,0.76604444,0,0)" />
              </g>
              <g
                 id="g1582"
                 transform="translate(0,-0.19411166)">
                <g
                   id="g1580"
                   transform="translate(116.40616,-68.909902)">
                  <rect
                     style="fill:#999999;stroke-width:0.254383"
                     id="rect1574"
                     width="42.605923"
                     height="18.569149"
                     x="65.916077"
                     y="177.40263"
                     ry="3.098099"
                     transform="matrix(1,0,-0.64278761,0.76604444,0,0)" />
                  <rect
                     style="fill:#b3b3b3;stroke-width:0.254383"
                     id="rect1576"
                     width="42.605923"
                     height="18.569149"
                     x="62.842442"
                     y="174.15657"
                     ry="3.098099"
                     transform="matrix(1,0,-0.64278761,0.76604444,0,0)" />
                  <rect
                     style="fill:#cccccc;stroke-width:0.254383"
                     id="rect1578"
                     width="42.605923"
                     height="18.569149"
                     x="62.354191"
                     y="173.3969"
                     ry="3.098099"
                     transform="matrix(1,0,-0.64278761,0.76604444,0,0)" />
                </g>
              </g>
              <g
                 id="g1590">
                <path
                   id="path1584"
                   style="fill:#999999;stroke-width:0.86068"
                   d="m 462.27148,252.45117 c -7.01765,0 -16.29773,4.32729 -20.80859,9.70313 l -28.82812,34.35547 c -4.51087,5.37583 -2.49422,9.70312 4.52343,9.70312 H 481 v -53.76172 z"
                   transform="scale(0.26458333)" />
                <path
                   id="path1586"
                   style="fill:#b3b3b3;stroke-width:0.86068"
                   d="m 458.54102,243.05273 c -7.01766,0 -16.29969,4.32729 -20.81055,9.70313 l -28.82617,34.35547 c -4.51086,5.37583 -2.49422,9.70508 4.52343,9.70508 H 481 v -53.76368 z"
                   transform="scale(0.26458333)" />
                <path
                   id="path1588"
                   style="fill:#cccccc;stroke-width:0.86068"
                   d="m 458.54102,240.85352 c -7.01766,0 -16.29774,4.32729 -20.8086,9.70312 l -28.82812,34.35547 c -4.51086,5.37583 -2.49422,9.70312 4.52343,9.70312 H 481 v -53.76171 z"
                   transform="scale(0.26458333)" />
              </g>
              <g
                 id="g1598">
                <path
                   id="path1592"
                   style="fill:#999999;stroke-width:0.86068"
                   d="m 480.20508,174.76172 c -7.01766,0 -16.29969,4.32729 -20.81055,9.70312 l -28.82812,34.35547 c -4.51086,5.37584 -2.49227,9.70313 4.52539,9.70313 H 481 v -53.76172 z"
                   transform="scale(0.26458333)" />
                <path
                   id="path1594"
                   style="fill:#b3b3b3;stroke-width:0.86068"
                   d="m 476.47461,165.36328 c -7.01765,0 -16.29969,4.32729 -20.81055,9.70313 l -28.82812,34.35547 c -4.51086,5.37583 -2.49227,9.70312 4.52539,9.70312 H 481 v -53.76172 z"
                   transform="scale(0.26458333)" />
                <path
                   id="path1596"
                   style="fill:#cccccc;stroke-width:0.86068"
                   d="m 476.47461,163.16406 c -7.01765,0 -16.29969,4.32729 -20.81055,9.70313 l -28.82812,34.35547 c -4.51086,5.37583 -2.49227,9.70312 4.52539,9.70312 H 481 v -53.76172 z"
                   transform="scale(0.26458333)" />
              </g>
            </g>
          </g>
        </g>
      </g>
      <g
         id="g939"
         transform="matrix(0.60169113,0,0,0.60169113,-0.03119438,12.859065)">
        <path
           d="m 43.333446,65.191664 a 43.281601,43.281601 0 1 1 0,-86.563203 43.281601,43.281601 0 1 1 0,86.563203 z"
           id="path4343"
           style="fill:#00aade;fill-opacity:1;stroke:none;stroke-width:0.338138" />
        <path
           d="M 59.80496,-5.4232796 C 56.838625,-4.9728906 55.389584,13.397444 56.715171,15.879982 58.983837,14.398686 62.367454,7.3171467 63.423261,4.9031086 62.599768,7.143016 61.566987,17.763966 61.992202,17.88834 62.888331,19.086875 75.047526,-0.95966496 71.51362,-2.3904093 71.005677,-2.5960578 67.592439,3.6732348 64.748615,10.066306 64.780974,7.3316325 66.990324,-0.9313358 66.090233,-3.4393085 64.289434,-3.9727441 60.866086,3.8747445 59.463458,7.5456904 59.024934,5.6815349 61.387406,-4.5189511 59.80496,-5.4232796 Z m -26.824218,1.9351813 c -0.899344,0.021235 -1.604729,0.294139 -1.853872,0.2927188 -5.757018,0.8088858 -4.03327,8.8818242 -1.593679,16.4490405 0.208284,1.937038 -1.802783,1.12612 -3.114179,-0.902543 C 21.99613,1.5267278 20.041564,1.8760475 18.808382,1.5612651 17.62716,1.3177689 13.521518,3.4758707 13.612663,7.854667 c 0.01543,1.2579121 1.581971,7.185473 1.593679,9.025428 -5.185196,8.905947 -7.2959506,17.718814 -0.796839,26.832351 6.553712,8.684128 26.058948,8.97398 29.548108,6.927605 C 45.288757,49.705034 65.19473,39.897639 69.781714,36.093683 76.61999,30.438357 69.60407,23.313337 67.952238,22.319743 53.784286,13.053349 39.302583,14.983417 39.111526,13.513855 39.011325,11.815248 39.070946,7.092904 38.826942,5.4153632 37.865323,-2.3911025 34.959295,-3.5348289 32.980742,-3.4880983 Z M 52.19433,25.482709 c -0.498814,2.724769 -5.97041,8.81354 -7.667549,10.578452 1.276114,-1.440019 11.274056,-6.843598 11.562304,-6.488551 1.451953,0.36247 -11.875764,17.657771 -14.562649,14.952962 -0.3862,-0.388777 2.951771,-5.189769 8.4156,-9.391347 -2.509061,1.088147 -9.795823,5.079485 -12.456715,5.220109 -1.188777,-1.454042 6.457716,-6.312476 8.090362,-9.106733 -1.888609,0.317072 -11.864202,5.003925 -13.31047,3.894756 -0.732677,-2.909501 16.7567,-8.002159 19.929117,-9.659648 z"
           id="path602"
           style="fill:#ffffff;fill-opacity:1;fill-rule:evenodd;stroke:none;stroke-width:0.338138" />
      </g>
    </g>
  </g>
</svg>
