<?xml version="1.0" encoding="UTF-8" standalone="no"?>
<svg
   width="64"
   height="64"
   viewBox="0 0 16.933332 16.933334"
   version="1.1"
   id="svg1798"
   inkscape:version="1.1.2 (0a00cf5339, 2022-02-04, custom)"
   sodipodi:docname="recbox-workflow-settings.svg"
   inkscape:export-filename="/home/recbox/Pictures/recbox/recbox-theming.png"
   inkscape:export-xdpi="96"
   inkscape:export-ydpi="96"
   xmlns:inkscape="http://www.inkscape.org/namespaces/inkscape"
   xmlns:sodipodi="http://sodipodi.sourceforge.net/DTD/sodipodi-0.dtd"
   xmlns="http://www.w3.org/2000/svg"
   xmlns:svg="http://www.w3.org/2000/svg"
   xmlns:rdf="http://www.w3.org/1999/02/22-rdf-syntax-ns#"
   xmlns:cc="http://creativecommons.org/ns#"
   xmlns:dc="http://purl.org/dc/elements/1.1/">
  <defs
     id="defs1792">
    <clipPath
       clipPathUnits="userSpaceOnUse"
       id="clipPath2158">
      <g
         inkscape:label="Clip"
         id="use2160">
        <g
           id="g2170"
           transform="matrix(0.58256259,0.35755662,-0.35755662,0.58256259,203.68176,39.212694)">
          <circle
             style="fill:#a3a3a3;fill-opacity:1;stroke-width:0.236557"
             id="circle2166"
             cx="154.66324"
             cy="243.81778"
             r="15.269843" />
          <circle
             style="fill:#b3b3b3;fill-opacity:1;stroke-width:0.217657"
             id="circle2168"
             cx="154.66324"
             cy="243.81778"
             r="14.049853" />
        </g>
      </g>
    </clipPath>
  </defs>
  <sodipodi:namedview
     id="base"
     pagecolor="#ffffff"
     bordercolor="#666666"
     borderopacity="1.0"
     inkscape:pageopacity="0.0"
     inkscape:pageshadow="2"
     inkscape:zoom="6.063217"
     inkscape:cx="51.78769"
     inkscape:cy="33.563041"
     inkscape:document-units="px"
     inkscape:current-layer="layer1"
     inkscape:document-rotation="0"
     showgrid="false"
     units="px"
     inkscape:window-width="1366"
     inkscape:window-height="736"
     inkscape:window-x="0"
     inkscape:window-y="32"
     inkscape:window-maximized="1"
     showguides="false"
     inkscape:pagecheckerboard="0" />
  <metadata
     id="metadata1795">
    <rdf:RDF>
      <cc:Work
         rdf:about="">
        <dc:format>image/svg+xml</dc:format>
        <dc:type
           rdf:resource="http://purl.org/dc/dcmitype/StillImage" />
      </cc:Work>
    </rdf:RDF>
  </metadata>
  <g
     inkscape:label="Layer 1"
     inkscape:groupmode="layer"
     id="layer1">
    <g
       id="g1757"
       transform="matrix(0.12500001,0,0,0.12500001,2.3861694e-6,2.3861694e-6)" />
    <g
       id="g1524"
       transform="matrix(0.12500001,0,0,0.12500001,2.3861694e-6,2.3861694e-6)">
      <rect
         style="fill:#e03838;fill-opacity:1;stroke-width:0.395189"
         id="rect838"
         width="119.0625"
         height="119.0625"
         x="8.2020826"
         y="8.2020826"
         ry="3.4719627" />
      <path
         id="rect984"
         style="fill:#c60000;fill-opacity:1;stroke-width:0.39519"
         d="M 122.6075,8.2020906 V 119.13588 c 0,1.92347 -1.54815,3.47162 -3.47162,3.47162 H 8.2020852 v 1.18494 c 0,1.92347 1.548672,3.47214 3.4721398,3.47214 H 123.79244 c 1.92347,0 3.47214,-1.54867 3.47214,-3.47214 V 11.674231 c 0,-1.9234684 -1.54867,-3.4721404 -3.47214,-3.4721404 z" />
      <g
         id="g1423">
        <g
           id="g1178"
           transform="matrix(0.52365163,0,0,0.52365163,-67.938165,4.0658779)">
          <g
             id="g981"
             transform="translate(21.656654,43.684995)">
            <g
               id="g960">
              <g
                 id="g944">
                <g
                   id="g928"
                   transform="matrix(0.90740386,0,0,0.90740386,18.903445,6.3488329)">
                  <rect
                     style="fill:#cccccc;fill-opacity:1;stroke:none;stroke-width:0.215821"
                     id="rect880"
                     width="2.9348836"
                     height="13.232668"
                     x="169.41997"
                     y="103.48088" />
                  <rect
                     style="fill:#cccccc;fill-opacity:1;stroke:none;stroke-width:0.249833"
                     id="rect900"
                     width="3.9328077"
                     height="13.232668"
                     x="180.27753"
                     y="103.48088" />
                  <rect
                     style="fill:#cccccc;fill-opacity:1;stroke:none;stroke-width:0.249833"
                     id="rect908"
                     width="3.9328077"
                     height="13.232668"
                     x="192.133"
                     y="103.48088" />
                  <rect
                     style="fill:#cccccc;fill-opacity:1;stroke:none;stroke-width:0.249833"
                     id="rect914"
                     width="3.9328077"
                     height="13.232668"
                     x="186.20526"
                     y="103.48088" />
                  <rect
                     style="fill:#cccccc;fill-opacity:1;stroke:none;stroke-width:0.215821"
                     id="rect916"
                     width="2.9348836"
                     height="13.232668"
                     x="198.06073"
                     y="103.48088" />
                  <rect
                     style="fill:#cccccc;fill-opacity:1;stroke:none;stroke-width:0.249833"
                     id="rect920"
                     width="3.9328077"
                     height="13.232668"
                     x="174.34979"
                     y="103.48088" />
                </g>
                <g
                   id="g932">
                  <rect
                     style="fill:#999999;stroke-width:0.264583"
                     id="rect899"
                     width="40.349194"
                     height="80.698387"
                     x="166.787"
                     y="22.782495"
                     ry="14.52174" />
                  <path
                     id="rect901"
                     style="fill:#999999;stroke-width:0.280606"
                     d="m 166.78723,89.274133 v 4.333793 c 0,5.469505 3.91454,9.873094 8.77724,9.873094 h 22.79448 c 4.86271,0 8.77724,-4.403589 8.77724,-9.873094 v -4.333793 z" />
                </g>
              </g>
              <g
                 id="g868">
                <path
                   style="fill:#cccccc;fill-opacity:1;stroke:none;stroke-width:0.264583px;stroke-linecap:butt;stroke-linejoin:miter;stroke-opacity:1"
                   d="M 186.96161,14.440292 C 183.3457,25.892481 175.74508,32.535009 166.787,37.539035 l 40.34922,6e-6 C 196.78359,31.759511 190.0263,24.077089 186.96161,14.440292 Z"
                   id="path851"
                   sodipodi:nodetypes="cccc" />
                <path
                   id="rect853"
                   style="fill:#cccccc;stroke-width:0.999999"
                   d="m 685.26172,86.107422 c -30.40645,0 -54.88477,24.478308 -54.88477,54.884768 v 5.03906 h 152.5 v -5.03906 c 0,-30.40646 -24.47831,-54.884768 -54.88476,-54.884768 z"
                   transform="scale(0.26458333)" />
              </g>
            </g>
            <g
               id="g1004"
               transform="matrix(1.1394828,0,0,1.1394828,-33.986983,-32.264724)"
               style="fill:#ececec">
              <path
                 id="rect994"
                 style="fill:#ececec;fill-opacity:1;stroke:none;stroke-width:0.999999"
                 d="m 668.02148,499.74609 v 26.5918 h 129.67774 v -26.5918 z"
                 transform="scale(0.26458333)" />
              <rect
                 style="fill:#ececec;fill-opacity:1;stroke:none;stroke-width:0.264583"
                 id="rect992"
                 width="34.310764"
                 height="14.516438"
                 x="176.74713"
                 y="124.7439"
                 ry="7.2582188" />
            </g>
          </g>
          <g
             id="g1073"
             transform="matrix(0.38646041,0,0,0.38646041,200.06186,126.81333)">
            <rect
               style="fill:#8b0000;fill-opacity:1;stroke-width:0.264583"
               id="rect985"
               width="62.392994"
               height="66.450958"
               x="262.34668"
               y="36.976799" />
            <rect
               style="fill:#ececec;stroke-width:0.159004"
               id="rect989"
               width="80.429207"
               height="8.5932827"
               x="253.32858"
               y="28.383514" />
            <rect
               style="fill:#ececec;stroke-width:0.159004"
               id="rect991"
               width="80.429207"
               height="8.5932827"
               x="253.32858"
               y="103.42776" />
            <g
               id="g1056">
              <rect
                 style="fill:#dc0000;fill-opacity:1;stroke-width:0.161982"
                 id="rect993"
                 width="62.392982"
                 height="1.7873346"
                 x="262.34668"
                 y="62.753113" />
              <rect
                 style="fill:#dc0000;fill-opacity:1;stroke-width:0.161982"
                 id="rect995"
                 width="62.392982"
                 height="1.7873346"
                 x="262.34668"
                 y="38.228592" />
              <rect
                 style="fill:#dc0000;fill-opacity:1;stroke-width:0.161982"
                 id="rect997"
                 width="62.392982"
                 height="1.7873346"
                 x="262.34668"
                 y="41.97319" />
              <rect
                 style="fill:#dc0000;fill-opacity:1;stroke-width:0.161982"
                 id="rect999"
                 width="62.392982"
                 height="1.7873346"
                 x="262.34668"
                 y="75.453758" />
              <rect
                 style="fill:#dc0000;fill-opacity:1;stroke-width:0.161982"
                 id="rect1001"
                 width="62.392982"
                 height="1.7873346"
                 x="262.34668"
                 y="51.006889" />
              <rect
                 style="fill:#dc0000;fill-opacity:1;stroke-width:0.161982"
                 id="rect1003"
                 width="62.392982"
                 height="1.7873346"
                 x="262.34668"
                 y="71.687805" />
              <rect
                 style="fill:#dc0000;fill-opacity:1;stroke-width:0.161982"
                 id="rect1005"
                 width="62.392982"
                 height="1.7873346"
                 x="262.34668"
                 y="56.728912" />
              <rect
                 style="fill:#dc0000;fill-opacity:1;stroke-width:0.161982"
                 id="rect1007"
                 width="62.392982"
                 height="1.7873346"
                 x="262.34668"
                 y="83.071938" />
              <rect
                 style="fill:#dc0000;fill-opacity:1;stroke-width:0.161982"
                 id="rect1009"
                 width="62.392982"
                 height="1.7873346"
                 x="262.34668"
                 y="86.899956" />
              <rect
                 style="fill:#dc0000;fill-opacity:1;stroke-width:0.161982"
                 id="rect1011"
                 width="62.392982"
                 height="1.7873346"
                 x="262.34668"
                 y="93.519356" />
              <rect
                 style="fill:#dc0000;fill-opacity:1;stroke-width:0.161982"
                 id="rect1013"
                 width="62.392982"
                 height="1.7873346"
                 x="262.34668"
                 y="100.76733" />
            </g>
          </g>
          <g
             id="g1122"
             transform="matrix(1.3615173,0,0,1.2642851,11.23423,10.274058)">
            <g
               id="g1114">
              <g
                 id="g1106">
                <g
                   id="g1098"
                   transform="matrix(0.90740386,0,0,0.90740386,18.903445,6.3488329)">
                  <rect
                     style="fill:#cccccc;fill-opacity:1;stroke:none;stroke-width:0.215821"
                     id="rect1086"
                     width="2.9348836"
                     height="13.232668"
                     x="169.41997"
                     y="103.48088" />
                  <rect
                     style="fill:#cccccc;fill-opacity:1;stroke:none;stroke-width:0.249833"
                     id="rect1088"
                     width="3.9328077"
                     height="13.232668"
                     x="180.27753"
                     y="103.48088" />
                  <rect
                     style="fill:#cccccc;fill-opacity:1;stroke:none;stroke-width:0.249833"
                     id="rect1090"
                     width="3.9328077"
                     height="13.232668"
                     x="192.133"
                     y="103.48088" />
                  <rect
                     style="fill:#cccccc;fill-opacity:1;stroke:none;stroke-width:0.249833"
                     id="rect1092"
                     width="3.9328077"
                     height="13.232668"
                     x="186.20526"
                     y="103.48088" />
                  <rect
                     style="fill:#cccccc;fill-opacity:1;stroke:none;stroke-width:0.215821"
                     id="rect1094"
                     width="2.9348836"
                     height="13.232668"
                     x="198.06073"
                     y="103.48088" />
                  <rect
                     style="fill:#cccccc;fill-opacity:1;stroke:none;stroke-width:0.249833"
                     id="rect1096"
                     width="3.9328077"
                     height="13.232668"
                     x="174.34979"
                     y="103.48088" />
                </g>
                <g
                   id="g1104">
                  <rect
                     style="fill:#999999;stroke-width:0.264583"
                     id="rect1100"
                     width="40.349194"
                     height="80.698387"
                     x="166.787"
                     y="22.782495"
                     ry="14.52174" />
                  <path
                     id="path1102"
                     style="fill:#999999;stroke-width:0.280606"
                     d="m 166.78723,89.274133 v 4.333793 c 0,5.469505 3.91454,9.873094 8.77724,9.873094 h 22.79448 c 4.86271,0 8.77724,-4.403589 8.77724,-9.873094 v -4.333793 z" />
                </g>
              </g>
              <g
                 id="g1112">
                <path
                   style="fill:#cccccc;fill-opacity:1;stroke:none;stroke-width:0.264583px;stroke-linecap:butt;stroke-linejoin:miter;stroke-opacity:1"
                   d="M 186.96161,14.440292 C 183.3457,25.892481 175.74508,32.535009 166.787,37.539035 l 40.34922,6e-6 C 196.78359,31.759511 190.0263,24.077089 186.96161,14.440292 Z"
                   id="path1108"
                   sodipodi:nodetypes="cccc" />
                <path
                   id="path1110"
                   style="fill:#cccccc;stroke-width:0.999999"
                   d="m 685.26172,86.107422 c -30.40645,0 -54.88477,24.478308 -54.88477,54.884768 v 5.03906 h 152.5 v -5.03906 c 0,-30.40646 -24.47831,-54.884768 -54.88476,-54.884768 z"
                   transform="scale(0.26458333)" />
              </g>
            </g>
            <g
               id="g1120"
               transform="matrix(1.1394828,0,0,1.1394828,-33.986983,-32.264724)"
               style="fill:#ececec">
              <path
                 id="path1116"
                 style="fill:#ececec;fill-opacity:1;stroke:none;stroke-width:0.999999"
                 d="m 668.02148,499.74609 v 26.5918 h 129.67774 v -26.5918 z"
                 transform="scale(0.26458333)" />
              <rect
                 style="fill:#ececec;fill-opacity:1;stroke:none;stroke-width:0.264583"
                 id="rect1118"
                 width="34.310764"
                 height="14.516438"
                 x="176.74713"
                 y="124.7439"
                 ry="7.2582188" />
            </g>
          </g>
        </g>
        <g
           id="g1325">
          <g
             id="g1084"
             style="fill:#393939;fill-opacity:1"
             transform="matrix(0.52365163,0,0,0.52365163,-67.938165,4.0658779)">
            <path
               id="rect1075"
               style="fill:#393939;fill-opacity:1;stroke-width:0.999999"
               d="m 632.33789,724.63086 v 86.59375 h 693.77931 v -86.59375 z"
               transform="scale(0.26458333)" />
            <rect
               style="fill:#393939;fill-opacity:1;stroke-width:0.264583"
               id="rect1077"
               width="183.56242"
               height="44.531425"
               x="167.30615"
               y="170.10503"
               ry="22.265713" />
          </g>
          <g
             id="g1283"
             transform="translate(0,-1.1645242)">
            <g
               id="g1188"
               transform="matrix(0.52365163,0,0,0.52365163,-67.938165,4.0658779)">
              <rect
                 style="fill:#cccccc;fill-opacity:1;stroke-width:0.14228"
                 id="rect1182"
                 width="151.7673"
                 height="34.328545"
                 x="182.7075"
                 y="180.30797" />
              <rect
                 style="fill:#e6e6e6;fill-opacity:1;stroke-width:0.127527"
                 id="rect1184"
                 width="145.1086"
                 height="28.843765"
                 x="186.03687"
                 y="183.20416" />
            </g>
            <g
               id="g1245"
               transform="translate(-5.0722659,-42.100578)">
              <g
                 id="g1195">
                <g
                   id="g1165"
                   transform="matrix(0.08369787,-0.51691943,0.51691943,0.08369787,-104.01375,291.9084)">
                  <circle
                     style="fill:#666666;fill-opacity:1;stroke-width:0.223166"
                     id="circle1163"
                     cx="313.65475"
                     cy="236.55267"
                     r="10.758407" />
                </g>
                <circle
                   style="fill:#d4d4d4;fill-opacity:1;stroke-width:0.0846724"
                   id="circle1167"
                   cx="-153.96519"
                   cy="-25.467993"
                   r="5.4656334"
                   transform="rotate(-115.96696)" />
                <circle
                   style="fill:#757575;fill-opacity:1;stroke-width:0.0779073"
                   id="circle1169"
                   cx="-153.96519"
                   cy="-25.467993"
                   r="5.0289545"
                   transform="rotate(-115.96696)" />
                <g
                   id="g1175"
                   transform="matrix(0.08369787,-0.51691943,0.51691943,0.08369787,-104.01375,291.9084)">
                  <path
                     id="path1171"
                     style="fill:#b7b7b7;fill-opacity:1;stroke-width:0.0272998"
                     d="m 308.2589,228.89336 3.54303,7.23602 2.29214,2.35371 1.23062,-0.86695 -1.44475,-2.95069 z" />
                  <rect
                     style="fill:#cdcdcd;fill-opacity:1;stroke-width:0.0758025"
                     id="rect1173"
                     width="2.5419712"
                     height="3.2442441"
                     x="118.90701"
                     y="372.61053"
                     transform="rotate(-35.164276)" />
                </g>
              </g>
              <g
                 id="g1179">
                <g
                   id="g1181"
                   transform="matrix(0.47389432,-0.22278959,0.22278959,0.47389432,-138.13777,107.35116)">
                  <circle
                     style="fill:#666666;fill-opacity:1;stroke-width:0.223166"
                     id="circle1179"
                     cx="313.65475"
                     cy="236.55267"
                     r="10.758407" />
                </g>
                <circle
                   style="fill:#d4d4d4;fill-opacity:1;stroke-width:0.0846724"
                   id="circle1183"
                   cx="-98.707794"
                   cy="128.93214"
                   r="5.4656334"
                   transform="rotate(-60.343668)" />
                <circle
                   style="fill:#757575;fill-opacity:1;stroke-width:0.0779073"
                   id="circle1185"
                   cx="-98.707794"
                   cy="128.93214"
                   r="5.0289545"
                   transform="rotate(-60.343668)" />
                <g
                   id="g1191"
                   transform="matrix(0.47389432,-0.22278959,0.22278959,0.47389432,-138.13777,107.35116)">
                  <path
                     id="path1187"
                     style="fill:#b7b7b7;fill-opacity:1;stroke-width:0.0272998"
                     d="m 308.2589,228.89336 3.54303,7.23602 2.29214,2.35371 1.23062,-0.86695 -1.44475,-2.95069 z" />
                  <rect
                     style="fill:#cdcdcd;fill-opacity:1;stroke-width:0.0758025"
                     id="rect1189"
                     width="2.5419712"
                     height="3.2442441"
                     x="118.90701"
                     y="372.61053"
                     transform="rotate(-35.164276)" />
                </g>
              </g>
              <g
                 id="g1161">
                <g
                   id="g1197"
                   transform="matrix(-0.04238571,0.52193341,-0.52193341,-0.04238571,218.64789,-4.1073285)">
                  <circle
                     style="fill:#666666;fill-opacity:1;stroke-width:0.223166"
                     id="circle1195"
                     cx="313.65475"
                     cy="236.55267"
                     r="10.758407" />
                </g>
                <circle
                   style="fill:#d4d4d4;fill-opacity:1;stroke-width:0.0846724"
                   id="circle1199"
                   cx="170.43617"
                   cy="5.4204683"
                   r="5.4656334"
                   transform="rotate(59.478471)" />
                <circle
                   style="fill:#757575;fill-opacity:1;stroke-width:0.0779073"
                   id="circle1201"
                   cx="170.43617"
                   cy="5.4204683"
                   r="5.0289545"
                   transform="rotate(59.478471)" />
                <g
                   id="g1207"
                   transform="matrix(-0.04238571,0.52193341,-0.52193341,-0.04238571,218.64789,-4.1073285)">
                  <path
                     id="path1203"
                     style="fill:#b7b7b7;fill-opacity:1;stroke-width:0.0272998"
                     d="m 308.2589,228.89336 3.54303,7.23602 2.29214,2.35371 1.23062,-0.86695 -1.44475,-2.95069 z" />
                  <rect
                     style="fill:#cdcdcd;fill-opacity:1;stroke-width:0.0758025"
                     id="rect1205"
                     width="2.5419712"
                     height="3.2442441"
                     x="118.90701"
                     y="372.61053"
                     transform="rotate(-35.164276)" />
                </g>
              </g>
              <g
                 id="g1211">
                <g
                   id="g1213"
                   transform="matrix(0.52365163,0,0,0.52365163,-63.671419,25.701923)">
                  <circle
                     style="fill:#666666;fill-opacity:1;stroke-width:0.223166"
                     id="circle1211"
                     cx="313.65475"
                     cy="236.55267"
                     r="10.758407" />
                </g>
                <circle
                   style="fill:#d4d4d4;fill-opacity:1;stroke-width:0.0846724"
                   id="circle1215"
                   cx="-3.9225676"
                   cy="180.19972"
                   r="5.4656334"
                   transform="rotate(-35.164276)" />
                <circle
                   style="fill:#757575;fill-opacity:1;stroke-width:0.0779073"
                   id="circle1217"
                   cx="-3.9225676"
                   cy="180.19972"
                   r="5.0289545"
                   transform="rotate(-35.164276)" />
                <g
                   id="g1223"
                   transform="matrix(0.52365163,0,0,0.52365163,-63.671419,25.701923)">
                  <path
                     id="path1219"
                     style="fill:#b7b7b7;fill-opacity:1;stroke-width:0.0272998"
                     d="m 308.2589,228.89336 3.54303,7.23602 2.29214,2.35371 1.23062,-0.86695 -1.44475,-2.95069 z" />
                  <rect
                     style="fill:#cdcdcd;fill-opacity:1;stroke-width:0.0758025"
                     id="rect1221"
                     width="2.5419712"
                     height="3.2442441"
                     x="118.90701"
                     y="372.61053"
                     transform="rotate(-35.164276)" />
                </g>
              </g>
            </g>
          </g>
        </g>
      </g>
    </g>
  </g>
</svg>
