<?xml version="1.0" encoding="UTF-8" standalone="no"?>
<svg
   width="22"
   height="22"
   viewBox="0 0 5.820833 5.8208334"
   version="1.1"
   id="svg1798"
   inkscape:version="1.1.1 (3bf5ae0d25, 2021-09-20, custom)"
   sodipodi:docname="recbox-nightlight-settings.svg"
   inkscape:export-filename="/home/recbox/Pictures/recbox/recbox-theming.png"
   inkscape:export-xdpi="96"
   inkscape:export-ydpi="96"
   xmlns:inkscape="http://www.inkscape.org/namespaces/inkscape"
   xmlns:sodipodi="http://sodipodi.sourceforge.net/DTD/sodipodi-0.dtd"
   xmlns="http://www.w3.org/2000/svg"
   xmlns:svg="http://www.w3.org/2000/svg"
   xmlns:rdf="http://www.w3.org/1999/02/22-rdf-syntax-ns#"
   xmlns:cc="http://creativecommons.org/ns#"
   xmlns:dc="http://purl.org/dc/elements/1.1/">
  <defs
     id="defs1792" />
  <sodipodi:namedview
     id="base"
     pagecolor="#ffffff"
     bordercolor="#666666"
     borderopacity="1.0"
     inkscape:pageopacity="0.0"
     inkscape:pageshadow="2"
     inkscape:zoom="10.086672"
     inkscape:cx="-5.2544587"
     inkscape:cy="8.1791102"
     inkscape:document-units="px"
     inkscape:current-layer="g2883"
     inkscape:document-rotation="0"
     showgrid="false"
     units="px"
     inkscape:window-width="1366"
     inkscape:window-height="736"
     inkscape:window-x="0"
     inkscape:window-y="32"
     inkscape:window-maximized="1"
     showguides="false"
     inkscape:pagecheckerboard="0" />
  <metadata
     id="metadata1795">
    <rdf:RDF>
      <cc:Work
         rdf:about="">
        <dc:format>image/svg+xml</dc:format>
        <dc:type
           rdf:resource="http://purl.org/dc/dcmitype/StillImage" />
      </cc:Work>
    </rdf:RDF>
  </metadata>
  <g
     inkscape:label="Layer 1"
     inkscape:groupmode="layer"
     id="layer1">
    <g
       id="g2883">
      <g
         id="g1022"
         transform="matrix(0.04296875,0,0,0.04296875,2.6098728e-6,2.6098728e-6)">
        <g
           id="g2849">
          <rect
             style="fill:#e03838;fill-opacity:1;stroke-width:0.395189"
             id="rect838"
             width="119.0625"
             height="119.0625"
             x="8.2020826"
             y="8.2020826"
             ry="3.4719627" />
          <g
             id="g2817">
            <path
               id="rect1629"
               style="fill:#b3b3b3;fill-opacity:1;stroke-width:0.39519"
               d="m 8.2020832,82.416673 v 41.375767 c 0,1.92347 1.5486721,3.47214 3.4721398,3.47214 H 123.79244 c 1.92347,0 3.47214,-1.54867 3.47214,-3.47214 V 82.416673 Z" />
            <g
               id="g2757">
              <g
                 id="g1735">
                <rect
                   style="fill:#242424;fill-opacity:1;stroke-width:0.198125"
                   id="rect1613"
                   width="10.965473"
                   height="20.175533"
                   x="60.449196"
                   y="75.399048"
                   ry="0" />
                <rect
                   style="fill:#242424;fill-opacity:1;stroke-width:0.312347"
                   id="rect1611"
                   width="93.376839"
                   height="48.898205"
                   x="19.243513"
                   y="29.302471"
                   ry="4.36095" />
                <rect
                   style="fill:#242424;fill-opacity:1;stroke-width:0.264583"
                   id="rect1615"
                   width="30.988932"
                   height="7.4632621"
                   x="50.437466"
                   y="93.74292"
                   ry="3.731631" />
                <rect
                   style="fill:#191919;fill-opacity:1;stroke-width:0.177282"
                   id="rect1617"
                   width="30.988932"
                   height="3.350692"
                   x="50.437466"
                   y="97.855492"
                   ry="0" />
              </g>
              <g
                 id="g2729">
                <g
                   id="g2707">
                  <rect
                     style="fill:#cccccc;stroke-width:0.279286"
                     id="rect1638"
                     width="86.96064"
                     height="41.979107"
                     x="22.451611"
                     y="32.76202"
                     ry="2.1800122" />
                  <path
                     id="rect2548"
                     style="fill:#e6e6e6;stroke-width:0.279286"
                     d="m 24.631571,32.761824 c -1.207727,0 -2.179712,0.972503 -2.179712,2.180228 v 2.1947 h 86.960581 v -2.1947 c 0,-1.207725 -0.9725,-2.180228 -2.18023,-2.180228 z" />
                </g>
                <g
                   id="g2703">
                  <rect
                     style="fill:#ececec;fill-opacity:1;stroke-width:0.304067"
                     id="rect2551"
                     width="67.431335"
                     height="29.94072"
                     x="32.216484"
                     y="41.270741"
                     ry="1.6694254" />
                  <g
                     id="g2685">
                    <g
                       id="g2669">
                      <g
                         id="g2559"
                         transform="matrix(0.69738431,0,0,0.69738431,56.19958,57.453636)">
                        <rect
                           style="fill:#00a700;fill-opacity:1;stroke-width:0.227062"
                           id="rect2553"
                           width="17.60161"
                           height="6.6716313"
                           x="40.113918"
                           y="-18.417768"
                           ry="3.3358157" />
                        <circle
                           style="fill:#f9f9f9;fill-opacity:1;stroke-width:0.164365"
                           id="path2555"
                           cx="54.379662"
                           cy="-15.081953"
                           r="2.8701274" />
                      </g>
                      <g
                         id="g2571"
                         transform="matrix(-0.69738431,0,0,0.69738431,124.4243,66.759018)">
                        <rect
                           style="fill:#2323ff;fill-opacity:1;stroke-width:0.227062"
                           id="rect2567"
                           width="17.60161"
                           height="6.6716313"
                           x="40.113918"
                           y="-18.417768"
                           ry="3.3358157" />
                        <circle
                           style="fill:#f9f9f9;fill-opacity:1;stroke-width:0.164365"
                           id="circle2569"
                           cx="54.379662"
                           cy="-15.081953"
                           r="2.8701274" />
                      </g>
                      <g
                         id="g2583"
                         transform="matrix(0.69738431,0,0,0.69738431,56.19958,76.0644)">
                        <rect
                           style="fill:#00a700;fill-opacity:1;stroke-width:0.227062"
                           id="rect2579"
                           width="17.60161"
                           height="6.6716313"
                           x="40.113918"
                           y="-18.417768"
                           ry="3.3358157" />
                        <circle
                           style="fill:#f9f9f9;fill-opacity:1;stroke-width:0.164365"
                           id="circle2581"
                           cx="54.379662"
                           cy="-15.081953"
                           r="2.8701274" />
                      </g>
                    </g>
                    <g
                       id="g2658">
                      <rect
                         style="fill:#666666;fill-opacity:1;stroke-width:0.181969"
                         id="rect2645"
                         width="26.189766"
                         height="4.652698"
                         x="35.772366"
                         y="44.609371"
                         ry="2.326349" />
                      <rect
                         style="fill:#666666;fill-opacity:1;stroke-width:0.204517"
                         id="rect2649"
                         width="33.082409"
                         height="4.652698"
                         x="35.772366"
                         y="53.914753"
                         ry="2.326349" />
                      <rect
                         style="fill:#666666;fill-opacity:1;stroke-width:0.170324"
                         id="rect2653"
                         width="22.945232"
                         height="4.652698"
                         x="35.772366"
                         y="63.220135"
                         ry="2.326349" />
                    </g>
                  </g>
                </g>
              </g>
            </g>
          </g>
        </g>
        <path
           id="rect984"
           style="fill:#c60000;fill-opacity:1;stroke-width:0.39519"
           d="M 122.6075,8.2020906 V 119.13588 c 0,1.92347 -1.54815,3.47162 -3.47162,3.47162 H 8.2020852 v 1.18494 c 0,1.92347 1.548672,3.47214 3.4721398,3.47214 H 123.79244 c 1.92347,0 3.47214,-1.54867 3.47214,-3.47214 V 11.674231 c 0,-1.9234684 -1.54867,-3.4721404 -3.47214,-3.4721404 z" />
      </g>
    </g>
  </g>
</svg>
