<?xml version="1.0" encoding="UTF-8" standalone="no"?>
<svg
   width="24"
   height="24"
   viewBox="0 0 6.3499996 6.3500001"
   version="1.1"
   id="svg1798"
   inkscape:version="1.1.1 (3bf5ae0d25, 2021-09-20, custom)"
   sodipodi:docname="recbox-nightlight.svg"
   inkscape:export-filename="/home/recbox/Pictures/recbox/recbox-theming.png"
   inkscape:export-xdpi="96"
   inkscape:export-ydpi="96"
   xmlns:inkscape="http://www.inkscape.org/namespaces/inkscape"
   xmlns:sodipodi="http://sodipodi.sourceforge.net/DTD/sodipodi-0.dtd"
   xmlns="http://www.w3.org/2000/svg"
   xmlns:svg="http://www.w3.org/2000/svg"
   xmlns:rdf="http://www.w3.org/1999/02/22-rdf-syntax-ns#"
   xmlns:cc="http://creativecommons.org/ns#"
   xmlns:dc="http://purl.org/dc/elements/1.1/">
  <defs
     id="defs1792">
    <filter
       inkscape:collect="always"
       style="color-interpolation-filters:sRGB"
       id="filter1727"
       x="-0.049682672"
       width="1.0993653"
       y="-0.046381682"
       height="1.0927634">
      <feGaussianBlur
         inkscape:collect="always"
         stdDeviation="0.47141765"
         id="feGaussianBlur1729" />
    </filter>
  </defs>
  <sodipodi:namedview
     id="base"
     pagecolor="#ffffff"
     bordercolor="#666666"
     borderopacity="1.0"
     inkscape:pageopacity="0.0"
     inkscape:pageshadow="2"
     inkscape:zoom="22.566364"
     inkscape:cx="7.3560809"
     inkscape:cy="9.6382385"
     inkscape:document-units="px"
     inkscape:current-layer="g1817"
     inkscape:document-rotation="0"
     showgrid="false"
     units="px"
     inkscape:window-width="1366"
     inkscape:window-height="736"
     inkscape:window-x="0"
     inkscape:window-y="32"
     inkscape:window-maximized="1"
     showguides="false"
     inkscape:pagecheckerboard="0"
     width="16px" />
  <metadata
     id="metadata1795">
    <rdf:RDF>
      <cc:Work
         rdf:about="">
        <dc:format>image/svg+xml</dc:format>
        <dc:type
           rdf:resource="http://purl.org/dc/dcmitype/StillImage" />
      </cc:Work>
    </rdf:RDF>
  </metadata>
  <g
     inkscape:label="Layer 1"
     inkscape:groupmode="layer"
     id="layer1">
    <g
       id="g1817">
      <g
         id="g1632"
         transform="matrix(0.046875,0,0,0.046875,3.9627456e-6,3.9627456e-6)">
        <rect
           style="fill:#e03838;fill-opacity:1;stroke-width:0.395189"
           id="rect838"
           width="119.0625"
           height="119.0625"
           x="8.2020826"
           y="8.2020826"
           ry="3.4719627" />
        <g
           id="g1799">
          <g
             id="g1612">
            <g
               id="g1771">
              <path
                 id="rect1629"
                 style="fill:#b3b3b3;fill-opacity:1;stroke-width:1.49363"
                 d="M 31,311.49609 V 467.87695 C 31,475.14675 36.853249,481 44.123047,481 H 467.87695 C 475.14675,481 481,475.14675 481,467.87695 V 311.49609 Z"
                 transform="scale(0.26458333)" />
              <g
                 id="g1757">
                <g
                   id="g1590">
                  <g
                     id="g1735">
                    <rect
                       style="fill:#242424;fill-opacity:1;stroke-width:0.198125"
                       id="rect1613"
                       width="10.965473"
                       height="20.175533"
                       x="60.449196"
                       y="75.399048"
                       ry="0" />
                    <rect
                       style="fill:#242424;fill-opacity:1;stroke-width:0.312347"
                       id="rect1611"
                       width="93.376839"
                       height="48.898205"
                       x="19.243513"
                       y="29.302471"
                       ry="4.36095" />
                    <rect
                       style="fill:#242424;fill-opacity:1;stroke-width:0.264583"
                       id="rect1615"
                       width="30.988932"
                       height="7.4632621"
                       x="50.437466"
                       y="93.74292"
                       ry="3.731631" />
                    <rect
                       style="fill:#191919;fill-opacity:1;stroke-width:0.177282"
                       id="rect1617"
                       width="30.988932"
                       height="3.350692"
                       x="50.437466"
                       y="97.855492"
                       ry="0" />
                  </g>
                  <g
                     id="g1745"
                     transform="matrix(1.0081885,0,0,1,-0.53988363,0)">
                    <rect
                       style="fill:#550000;stroke-width:0.27815"
                       id="rect1638"
                       width="86.254349"
                       height="41.979107"
                       x="22.804758"
                       y="32.76202"
                       ry="2.1800122" />
                    <g
                       id="g1739">
                      <path
                         id="path1640"
                         style="fill:#916f6f;stroke-width:0.106998"
                         d="m 61.723293,42.635416 a 12.196692,12.196692 0 0 0 -6.114406,16.096657 12.196692,12.196692 0 0 0 16.114085,6.152854 12.196692,12.196692 0 0 0 5.595247,-5.057794 10.635186,9.3494806 65.898399 0 1 -3.125941,2.429318 10.635186,9.3494806 65.898399 0 1 -12.877297,-5.890216 10.635186,9.3494806 65.898399 0 1 4.191452,-13.525779 10.635186,9.3494806 65.898399 0 1 5.775521,-0.409244 12.196692,12.196692 0 0 0 -9.520127,0.186966 12.196692,12.196692 0 0 0 -0.03853,0.01724 z" />
                      <path
                         id="path1649"
                         style="fill:#e9afaf;stroke-width:0.106998;filter:url(#filter1727)"
                         d="m 61.723293,42.635416 a 12.196692,12.196692 0 0 0 -6.114406,16.096657 12.196692,12.196692 0 0 0 16.114085,6.152854 12.196692,12.196692 0 0 0 5.595247,-5.057794 10.635186,9.3494806 65.898399 0 1 -3.125941,2.429318 10.635186,9.3494806 65.898399 0 1 -12.877297,-5.890216 10.635186,9.3494806 65.898399 0 1 4.191452,-13.525779 10.635186,9.3494806 65.898399 0 1 5.775521,-0.409244 12.196692,12.196692 0 0 0 -9.520127,0.186966 12.196692,12.196692 0 0 0 -0.03853,0.01724 z" />
                    </g>
                  </g>
                </g>
              </g>
            </g>
            <path
               id="rect984"
               style="fill:#c60000;fill-opacity:1;stroke-width:0.39519"
               d="M 122.6075,8.2020906 V 119.13588 c 0,1.92347 -1.54815,3.47162 -3.47162,3.47162 H 8.2020852 v 1.18494 c 0,1.92347 1.548672,3.47214 3.4721398,3.47214 H 123.79244 c 1.92347,0 3.47214,-1.54867 3.47214,-3.47214 V 11.674231 c 0,-1.9234684 -1.54867,-3.4721404 -3.47214,-3.4721404 z" />
          </g>
        </g>
      </g>
    </g>
  </g>
</svg>
