<svg xmlns="http://www.w3.org/2000/svg" width="103.14603" height="200">
  <defs>
    <clipPath id="a">
      <path d="M0 320.763h165.427V0H0v320.763z"/>
    </clipPath>
  </defs>
  <g clip-path="url(#a)" transform="matrix(0.62351389,0,0,-0.62351389,0,200)">
    <path fill="#333" d="M0 10.8827v298.997c0 5.986 4.897 10.883 10.883 10.883h143.661c5.986 0 10.883-4.897 10.883-10.883V10.8827c0-5.986-4.897-10.883-10.883-10.883H10.883C4.897-.0003 0 4.8967 0 10.8827"/>
    <path fill="#a6a8ab" fill-rule="evenodd" d="M96.9834 55.815c-.724.638-1.304 1.388-1.726 2.255-.425.872-.71 1.788-.805 2.757-.042.431-.083.866-.08 1.299.006.856.126 1.7.337 2.532.216.854.518 1.676.913 2.464.348.693.727 1.368 1.218 1.971.418.515.833 1.037 1.29 1.516 1.898 1.987 3.811 3.959 5.719 5.937.057.06.115.12.181.188.386-.372.761-.733 1.159-1.117-.052-.055-.108-.113-.164-.171-1.407-1.459-2.827-2.907-4.215-4.384-.441-.468-.804-1.011-1.194-1.526-.474-.626-.822-1.325-1.139-2.038-.486-1.094-.841-2.228-.933-3.426-.051-.656-.099-1.32-.048-1.973.115-1.477.539-2.864 1.416-4.085.028-.039.048-.083.072-.125-.667-.691-1.334-1.383-2.001-2.074m6.5366 21.4889c-4.612-4.782-9.225-9.563-13.848-14.356-.578.558-1.149 1.108-1.738 1.677 4.616 4.785 9.232 9.571 13.847 14.356.58-.559 1.159-1.118 1.739-1.677m4.8587-21.8521c2.26 1.487 4.512 2.965 6.764 4.443.017-.016.026-.041.043-.058-1.431-2.253-2.862-4.507-4.309-6.795l-2.498 2.41zm2.532-11.759c1.56 3.055 3.127 6.118 4.686 9.173.78 1.511 1.577 3.005 2.323 4.532.446.908.884 1.824 1.169 2.787.46 1.572-.593 3.067-1.543 3.521-1.086.518-2.133.323-3.115-.216-2.632-1.41-5.246-2.853-7.852-4.287-1.465-.8-2.913-1.616-4.37-2.408-1.225-.652-2.449-1.288-3.682-1.932l-.148-.154c.975-.941 1.951-1.882 2.909-2.824.214-.206.375-.262.666-.097.973.581 1.981 1.112 2.997 1.669 1.318-1.272 2.635-2.526 3.919-3.797.094-.091.116-.377.043-.504-.511-1.027-1.057-2.037-1.593-3.039l3.234-3.12c.13.255.244.475.357.696m28.5134-28.7355c4.535 4.701 9.07 9.403 13.66 14.161 1.08-1.042 2.14-2.064 3.2-3.086-4.553-4.721-9.107-9.441-13.66-14.162-1.067 1.029-2.133 2.058-3.2 3.087M80.5725 71.6447c.652.676 1.277 1.328 1.911 1.973.041.042.164.063.209.033.643-.433 1.343-.75 2.091-.934.596-.146 1.207-.254 1.817-.31 1.057-.097 2.106.005 3.138.258.842.206 1.667.471 2.43.881.704.377 1.387.795 2.06 1.225.319.205.619.455.886.725 1.624 1.648 3.236 3.307 4.853 4.962.029.03.057.06.096.1.387-.372.764-.737 1.159-1.118-.058-.061-.115-.12-.173-.179-2.083-2.16-4.159-4.328-6.257-6.474-.415-.424-.909-.774-1.379-1.142-.611-.478-1.28-.866-1.977-1.203-1.104-.533-2.252-.93-3.474-1.072-.562-.066-1.13-.123-1.695-.117-1.097.012-2.158.239-3.174.663-.897.374-1.694.89-2.373 1.586-.043.044-.088.086-.148.143m62.287-37.9142c-3.673-3.808-7.285-7.552-10.928-11.329-1.003.968-1.994 1.924-3.04 2.932.139.144.288.299.437.453 3.728 3.865 7.483 7.704 11.164 11.614.836.888 2.923 1.042 3.932.07.974-.938 1.975-1.849 2.912-2.821 1.804-1.871 2.429-4.726 1.193-7.094-.973-1.864-3.147-2.989-5.216-2.607-.619.114-1.232.258-1.891.396-.764-3.222-1.541-6.495-2.334-9.837-.141.106-.244.167-.327.247-1.042 1.001-2.086 1.999-3.113 3.014-.115.114-.217.353-.178.494.775 2.818 1.58 5.628 2.362 8.444.597 2.148 1.852 2.207 3.566 1.574.572-.211 1.181-.397 1.783-.439 1.161-.081 1.603.657 1.726 1.563.111.808-.03 1.56-.769 2.111-.453.337-.828.78-1.279 1.215m-16.5717 4.4298c2.26 1.487 4.504 2.957 6.756 4.435.017-.017.034-.05.051-.066-1.422-2.246-2.853-4.5-4.309-6.779l-2.498 2.41zm2.549-11.759c1.56 3.055 3.11 6.119 4.686 9.174.942 1.85 1.901 3.7 2.852 5.541.414.807.81 1.663.743 2.586-.13 2.075-1.898 3.632-4.06 2.778-.919-.37-1.793-.865-2.658-1.335-3.614-1.965-7.202-3.938-10.807-5.912-1.082-.591-2.173-1.191-3.306-1.8 1.036-.998 2.011-1.956 3.021-2.896.094-.091.371-.111.496-.034 1.025.532 2.032 1.096 3.073 1.662 1.309-1.263 2.626-2.517 3.91-3.789.103-.099.116-.376.06-.503-.528-1.027-1.073-2.038-1.601-3.048l3.225-3.111c.131.237.244.458.366.687M111.841 41.7746c3.647 3.781 7.267 7.534 10.915 11.316-.927.894-1.828 1.763-2.762 2.664.88.912 1.733 1.796 2.612 2.708 2.846-2.745 5.702-5.5 8.583-8.279-.851-.883-1.704-1.767-2.585-2.68-.885.855-1.76 1.698-2.675 2.581-3.656-3.792-7.285-7.554-10.942-11.345-1.057 1.02-2.074 2.001-3.146 3.035"/>
    <path fill="#2b2a2b" d="M74.7958 265.0456c.268 23.076 18.541 41.948 42.201 41.764 22.922-.174 41.405-18.959 41.376-42.394-.028-23.153-18.885-42.151-41.74-42.045-22.903-.116-42.125 18.756-41.837 42.675m86.53-107.467c-.038 6.22-.278 12.44-.297 18.64-.134 45.048-.067 90.086-.067 135.135v2.228c-.47.717-.872 1.172-1.496 1.463H5.4168c-.403-.388-.806-.766-1.189-1.124-.365-1.763.067-2.974 1.169-4.108 4.823-4.989 9.808-9.794 14.505-14.919 6.481-7.072 13.556-13.572 20.056-20.654 6.576-7.16 13.747-13.747 20.324-20.916 6.451-7.024 13.479-13.486 19.94-20.519 6.625-7.208 13.834-13.834 20.458-21.052 6.404-6.984 13.393-13.398 19.807-20.383 6.662-7.256 13.92-13.921 20.592-21.177 4.86-5.29 10.076-10.259 15.137-15.365.432-.436.892-.843 1.256-1.192h2.09c1.515.969 1.774 2.384 1.764 3.943"/>
    <path fill="#4a4a4c" d="M.0547 73.509c-.018 14.363-.046 28.726-.046 43.079 0 5.687.037 11.374.064 17.051 1.212.137 5.559 5.131 6.753 6.325 5.423 5.395 10.836 10.8 16.222 16.231 1.267 1.276 2.434 2.661 3.664 3.983.383.419.747.92 1.422.911-.128-.383-.21-.793-.401-1.139-2.47-4.456-3.609-9.113-2.817-14.272 1.313-8.512 6.079-14.226 13.871-17.461 3.345-1.394 6.881-1.905 10.599-1.358 2.944.438 5.605 1.495 8.302 2.561-.829-1.959-2.551-3.181-4.055-4.493-4.065-3.545-7.592-7.637-11.574-11.255-4.848-4.411-9.25-9.287-14.08-13.698-4.202-3.827-7.984-8.074-12.194-11.865-4.056-3.636-15.666-14.591-15.73-14.6M3.4906 2.944s-3.491 3.044-3.491 7.472c0 17.079.01 32.116.01 49.195 0 .173 7.345 7.391 9.423 9.442 5.76 5.695 11.216 11.709 17.033 17.361.503.489 0 0 2.999 2.765-.643-1.229-1.641-2.592-1.915-3.039-1.877-3.053-2.788-6.452-2.879-9.952-.183-6.744 2.132-12.558 7.199-17.142 5.514-4.976 11.93-6.744 19.22-5.377 5.44 1.371 6.31 2.714 8.27 3.765-5.727-6.007-4.223-4.704-5.727-6.007-3.582-3.108-6.735-6.653-10.171-9.897-6.798-6.425-13.26-13.187-20.049-19.603-5.14-4.867-19.238-18.564-19.922-18.983"/>
    <path fill="#1f1718" d="M26.3834 76.3524c.118 10.982 9.505 19.794 20.943 19.658 10.817-.119 19.694-9.405 19.566-20.451-.118-11.364-9.141-20.204-20.459-20.059-11.456.146-20.168 9.214-20.05 20.852m24.707-22.683c2.305.437 6.151 1.831 9.459 4.538 6.927 5.815 9.442 13.233 7.811 22.046-.894 4.802-3.391 8.639-7.082 11.956-5.459 4.922-11.71 6.17-18.628 4.903-4.903-.893-9.058-3.335-12.467-6.99-.738-.792-2.36-3.536-2.633-3.982-1.878-3.053-2.789-6.452-2.88-9.952-.183-6.744 2.132-12.558 7.199-17.142 5.514-4.976 11.93-6.744 19.221-5.377m-24.707 95.627c.018 11.055 9.177 20.214 20.25 20.232 11.21.018 20.186-9.077 20.287-20.323.109-11.173-9.442-20.587-20.305-20.195-10.572-.319-20.25 8.621-20.232 20.286m23.002-22.437c2.944.437 5.605 1.494 8.303 2.561 1.175.464 1.886 1.522 2.834 2.26 5.504 4.32 8.129 10.125 8.375 16.969.265 7.446-2.943 13.533-8.667 18.017-6.735 5.286-14.362 5.578-22.173 2.525-4.146-1.623-7.09-4.821-9.924-8.102-.128-.383-.21-.793-.401-1.139-2.47-4.457-3.609-9.114-2.816-14.272 1.312-8.512 6.078-14.226 13.87-17.461 3.345-1.395 6.881-1.905 10.599-1.358"/>
    <path fill="#b82c31" d="M46.4366 55.5026c-11.461.148-20.176 9.21-20.054 20.851.115 10.978 9.509 19.794 20.947 19.661 10.811-.127 19.687-9.408 19.566-20.459-.125-11.361-9.142-20.199-20.459-20.053m.1796 73.5073c-10.575-.32-20.254 8.62-20.235 20.289.018 11.05 9.18 20.207 20.249 20.225 11.214.018 20.187-9.077 20.293-20.32.106-11.175-9.444-20.583-20.307-20.194"/>
    <path fill="#59585a" d="M106.2213 232.9402c0 4.108-.192 8.409.058 12.691.21 3.536-2.464 6.781-6.692 6.675-3.758-.097-7.516-.029-11.284-.02-2.118.01-2.444.34-2.454 2.51-.01 6.413 0 12.826 0 19.046.345.794.834 1.153 1.457 1.598 4.209 0 8.523-.009 12.827.01 3.864.01 6.059 2.219 6.078 6.113.02 3.924 0 7.847.01 11.771.01 2.276.748 3.032 2.981 3.042 5.427.019 10.843-.01 16.269.009 1.735.01 2.857-.629 2.886-2.567-.307-5.154-1.151-10.337.767-15.384.009-.116.009-.223.019-.349.288-.165.355-.436.374-.746.259-.262.508-.504.767-.756.239-.232.47-.465.709-.697 2.685-1.463 5.589-1.647 8.561-1.56 2.646.078 5.283 0 7.928.02 1.045.009 1.956-.31 1.966-1.463.057-6.326.029-12.653.029-18.775-.835-.998-1.726-1.085-2.675-1.076-2.886.02-5.781-.029-8.667.02-1.783.029-3.537-.107-5.292-.407h-.009c-.163-.281-.432-.349-.738-.368-.163-.291-.432-.368-.738-.378-.125-.126-.24-.252-.374-.378-.135-.349-.374-.6-.729-.736-.115-.116-.24-.233-.355-.349-1.236-2.228-2.051-4.553-1.888-7.188.211-3.188.134-9.882.029-10.027.009-1.221-.585-1.86-1.793-1.87h-18.493c-.729.397-1.16.833-1.534 1.589m52.152 31.476c.029 23.434-18.454 42.219-41.376 42.393-23.661.184-41.933-18.687-42.201-41.764-.288-23.919 18.933-42.791 41.836-42.674 22.855-.107 41.712 18.891 41.741 42.045"/>
    <path fill="#6e6d6e" d="M102.4057 263.8734c.134 8.186 7.133 15.539 15.837 15.413 7.89-.116 15.406-7.44 15.061-16.188-.297-7.808-7.037-15.375-15.454-14.929-8.436-.504-15.588 7.392-15.444 15.704m25.635-30.652c.105.145.182 6.839-.029 10.027-.163 2.635.652 4.96 1.889 7.188.115.116 2.77 1.928 2.933 2.209l.01.009v-.009c1.754.3 3.509.436 5.292.407 2.885-.049 5.781 0 8.666-.02.949-.009 1.841.078 2.675 1.076 0 6.122.029 12.449-.029 18.775-.009 1.152-.92 1.472-1.965 1.462-2.646-.019-5.282.058-7.928-.019-2.972-.087-5.877.097-8.561 1.56-.24.232-1.86 2.431-1.87 2.548-1.917 5.047-1.073 10.23-.767 15.384-.028 1.937-1.15 2.577-2.885 2.567-5.426-.019-10.843.01-16.269-.01-2.234-.009-2.972-.765-2.981-3.042-.01-3.923.009-7.847-.01-11.77-.019-3.895-2.215-6.103-6.078-6.113-4.305-.02-8.619-.01-12.827-.01-.623-.445-1.112-.804-1.457-1.598 0-6.22-.01-12.633 0-19.047.009-2.17.335-2.499 2.454-2.509 3.767-.009 7.525-.077 11.283.02 4.228.106 6.903-3.139 6.692-6.675-.249-4.282-.057-8.584-.057-12.691.373-.756.805-1.192 1.533-1.589h18.493c1.208.01 1.803.649 1.793 1.87"/>
    <path fill="#363638" d="M106.7265 263.6338c0 6.413 3.851 11.056 10.977 11.275 6.167.181 10.917-4.025 11.493-11.154-.564-6.801-4.415-11.323-11.277-11.408-6.598-.073-11.205 4.328-11.193 11.287m30.46-.691c.432 10.947-8.974 20.112-18.847 20.258-10.893.157-19.651-9.044-19.819-19.288-.18-10.402 8.77-20.282 19.327-19.652 10.533-.558 18.967 8.911 19.339 18.682"/>
    <path fill="#4f4e4f" d="M135.4034 263.8445c-.873-10.581-6.859-17.608-17.518-17.733-10.274-.121-17.426 6.718-17.414 17.53.012 9.981 5.996 17.208 17.079 17.54 9.585.287 16.966-6.259 17.853-17.337"/>
  </g>
</svg>