<?xml version="1.0" encoding="utf-8"?>
<!-- Generator: Adobe Illustrator 23.1.0, SVG Export Plug-In . SVG Version: 6.00 Build 0)  -->
<svg version="1.1" id="Calque_1" xmlns="http://www.w3.org/2000/svg" xmlns:xlink="http://www.w3.org/1999/xlink" x="0px" y="0px"
	 viewBox="0 0 128 128" style="enable-background:new 0 0 128 128;" xml:space="preserve">
<style type="text/css">
	.st0{opacity:0.6;}
	.st1{fill:#E5E5E5;stroke:#858585;stroke-width:0.5;}
	.st2{fill:url(#SVGID_1_);}
	.st3{opacity:0.5;clip-path:url(#SVGID_3_);filter:url(#Gaussian_Blur);enable-background:new    ;}
	.st4{fill:#FF3D45;}
	.st5{opacity:0.5;clip-path:url(#SVGID_5_);filter:url(#Gaussian_Blur);enable-background:new    ;}
	.st6{fill:#E0FFFF;}
	.st7{clip-path:url(#SVGID_7_);filter:url(#Gaussian_Blur);}
	.st8{fill:#FFFFFF;}
	.st9{opacity:0.5;clip-path:url(#SVGID_9_);filter:url(#Gaussian_Blur);enable-background:new    ;}
	.st10{fill:#FF8000;}
	.st11{opacity:0.5;clip-path:url(#SVGID_11_);filter:url(#Gaussian_Blur);enable-background:new    ;}
	.st12{fill:#FFFF00;}
	.st13{opacity:0.5;clip-path:url(#SVGID_13_);filter:url(#Gaussian_Blur);enable-background:new    ;}
	.st14{fill:#5EFF00;}
	.st15{opacity:0.5;clip-path:url(#SVGID_15_);filter:url(#Gaussian_Blur);enable-background:new    ;}
	.st16{fill:#00D3DF;}
	.st17{opacity:0.5;clip-path:url(#SVGID_17_);filter:url(#Gaussian_Blur);enable-background:new    ;}
	.st18{fill:#0012DF;}
	.st19{opacity:0.5;clip-path:url(#SVGID_19_);filter:url(#Gaussian_Blur);enable-background:new    ;}
	.st20{fill:#6B476B;}
	.st21{opacity:0.22;fill:#636363;stroke:#000000;stroke-width:0.25;enable-background:new    ;}
	.st22{opacity:0.5;fill:none;stroke:#505050;stroke-width:0.25;enable-background:new    ;}
	.st23{opacity:0.3;fill:none;stroke:#505050;stroke-width:0.25;enable-background:new    ;}
</style>
<filter  id="Gaussian_Blur">
	<feGaussianBlur  in="SourceGraphic" stdDeviation="3"></feGaussianBlur>
</filter>
<g>
	<g id="Layer_3" class="st0">
		<g>
			<path d="M63.1,8.7C32.6,8.7,8,33.3,8,63.8c0,30.4,24.7,55.1,55.1,55.1c30.4,0,55.1-24.7,55.1-55.1C118.2,33.3,93.5,8.7,63.1,8.7z
				 M63.1,79c-7.6,0-13.8-6.2-13.8-13.8c0-7.6,6.2-13.8,13.8-13.8c7.6,0,13.8,6.2,13.8,13.8C76.8,72.9,70.7,79,63.1,79z"/>
		</g>
	</g>
	<g id="Layer_3_copy">
		<g>
			<path class="st1" d="M61.5,6.5C31.1,6.5,6.4,31.1,6.4,61.6c0,30.4,24.7,55.1,55.1,55.1c30.4,0,55.1-24.7,55.1-55.1
				C116.6,31.1,91.9,6.5,61.5,6.5z M61.5,76.8c-7.6,0-13.8-6.2-13.8-13.8s6.2-13.8,13.8-13.8c7.6,0,13.8,6.2,13.8,13.8
				S69.1,76.8,61.5,76.8z"/>
		</g>
	</g>
	<g id="Layer_1">
		<g>
			
				<linearGradient id="SVGID_1_" gradientUnits="userSpaceOnUse" x1="56.6857" y1="116.0845" x2="66.3527" y2="20.418" gradientTransform="matrix(1 0 0 -1 0 130)">
				<stop  offset="0" style="stop-color:#CCCCCC"/>
				<stop  offset="1" style="stop-color:#A1A6A8"/>
			</linearGradient>
			<path class="st2" d="M61.5,8.4C32.1,8.4,8.3,32.2,8.3,61.6s23.8,53.2,53.2,53.2s53.2-23.8,53.2-53.2S90.9,8.4,61.5,8.4z
				 M61.5,76.3c-7.3,0-13.3-6-13.3-13.3s6-13.3,13.3-13.3c7.3,0,13.3,6,13.3,13.3S68.8,76.3,61.5,76.3z"/>
		</g>
		<g>
			<g>
				<g>
					<defs>
						<path id="SVGID_2_" d="M61.5,8.4C32.1,8.4,8.3,32.2,8.3,61.6s23.8,53.2,53.2,53.2s53.2-23.8,53.2-53.2S90.9,8.4,61.5,8.4z
							 M61.5,76.3c-7.3,0-13.3-6-13.3-13.3s6-13.3,13.3-13.3c7.3,0,13.3,6,13.3,13.3S68.8,76.3,61.5,76.3z"/>
					</defs>
					<clipPath id="SVGID_3_">
						<use xlink:href="#SVGID_2_"  style="overflow:visible;"/>
					</clipPath>
					<g class="st3">
						<polygon class="st4" points="152.2,72.9 61.5,64.3 -29.2,72.9 -29.2,55.7 61.5,64.3 152.2,55.7 						"/>
					</g>
				</g>
				<g>
					<defs>
						<path id="SVGID_4_" d="M61.5,8.4C32.1,8.4,8.3,32.2,8.3,61.6s23.8,53.2,53.2,53.2s53.2-23.8,53.2-53.2S90.9,8.4,61.5,8.4z
							 M61.5,76.3c-7.3,0-13.3-6-13.3-13.3s6-13.3,13.3-13.3c7.3,0,13.3,6,13.3,13.3S68.8,76.3,61.5,76.3z"/>
					</defs>
					<clipPath id="SVGID_5_">
						<use xlink:href="#SVGID_4_"  style="overflow:visible;"/>
					</clipPath>
					<g class="st5">
						<polygon class="st6" points="-10.9,127.1 61.2,63 75.7,-32.4 133.3,-1.1 61.2,63 46.7,158.4 						"/>
					</g>
				</g>
				<g>
					<defs>
						<path id="SVGID_6_" d="M61.5,8.4C32.1,8.4,8.3,32.2,8.3,61.6s23.8,53.2,53.2,53.2s53.2-23.8,53.2-53.2S90.9,8.4,61.5,8.4z
							 M61.5,76.3c-7.3,0-13.3-6-13.3-13.3s6-13.3,13.3-13.3c7.3,0,13.3,6,13.3,13.3S68.8,76.3,61.5,76.3z"/>
					</defs>
					<clipPath id="SVGID_7_">
						<use xlink:href="#SVGID_6_"  style="overflow:visible;"/>
					</clipPath>
					<g class="st7">
						<polygon class="st8" points="0.1,133.1 61.2,63 86.8,-26.4 122.2,-7.1 61.2,63 35.6,152.4 						"/>
					</g>
				</g>
				<g>
					<defs>
						<path id="SVGID_8_" d="M61.5,8.4C32.1,8.4,8.3,32.2,8.3,61.6s23.8,53.2,53.2,53.2s53.2-23.8,53.2-53.2S90.9,8.4,61.5,8.4z
							 M61.5,76.3c-7.3,0-13.3-6-13.3-13.3s6-13.3,13.3-13.3c7.3,0,13.3,6,13.3,13.3S68.8,76.3,61.5,76.3z"/>
					</defs>
					<clipPath id="SVGID_9_">
						<use xlink:href="#SVGID_8_"  style="overflow:visible;"/>
					</clipPath>
					<g class="st9">
						<polygon class="st10" points="144.8,84.6 61.5,64.3 -24.1,60 -21.8,44 61.5,64.3 147.1,68.6 						"/>
					</g>
				</g>
				<g>
					<defs>
						<path id="SVGID_10_" d="M61.5,8.4C32.1,8.4,8.3,32.2,8.3,61.6s23.8,53.2,53.2,53.2s53.2-23.8,53.2-53.2S90.9,8.4,61.5,8.4z
							 M61.5,76.3c-7.3,0-13.3-6-13.3-13.3s6-13.3,13.3-13.3c7.3,0,13.3,6,13.3,13.3S68.8,76.3,61.5,76.3z"/>
					</defs>
					<clipPath id="SVGID_11_">
						<use xlink:href="#SVGID_10_"  style="overflow:visible;"/>
					</clipPath>
					<g class="st11">
						<polygon class="st12" points="137.3,96.2 61.5,64.3 -19,47.1 -14.3,32.3 61.5,64.3 142,81.4 						"/>
					</g>
				</g>
				<g>
					<defs>
						<path id="SVGID_12_" d="M61.5,8.4C32.1,8.4,8.3,32.2,8.3,61.6s23.8,53.2,53.2,53.2s53.2-23.8,53.2-53.2S90.9,8.4,61.5,8.4z
							 M61.5,76.3c-7.3,0-13.3-6-13.3-13.3s6-13.3,13.3-13.3c7.3,0,13.3,6,13.3,13.3S68.8,76.3,61.5,76.3z"/>
					</defs>
					<clipPath id="SVGID_13_">
						<use xlink:href="#SVGID_12_"  style="overflow:visible;"/>
					</clipPath>
					<g class="st13">
						<polygon class="st14" points="129.9,107.9 61.5,64.3 -13.9,34.3 -6.9,20.6 61.5,64.3 136.9,94.3 						"/>
					</g>
				</g>
				<g>
					<defs>
						<path id="SVGID_14_" d="M61.5,8.4C32.1,8.4,8.3,32.2,8.3,61.6s23.8,53.2,53.2,53.2s53.2-23.8,53.2-53.2S90.9,8.4,61.5,8.4z
							 M61.5,76.3c-7.3,0-13.3-6-13.3-13.3s6-13.3,13.3-13.3c7.3,0,13.3,6,13.3,13.3S68.8,76.3,61.5,76.3z"/>
					</defs>
					<clipPath id="SVGID_15_">
						<use xlink:href="#SVGID_14_"  style="overflow:visible;"/>
					</clipPath>
					<g class="st15">
						<polygon class="st16" points="122.4,119.6 61.5,64.3 -8.7,21.4 0.6,9 61.5,64.3 131.7,107.2 						"/>
					</g>
				</g>
				<g>
					<defs>
						<path id="SVGID_16_" d="M61.5,8.4C32.1,8.4,8.3,32.2,8.3,61.6s23.8,53.2,53.2,53.2s53.2-23.8,53.2-53.2S90.9,8.4,61.5,8.4z
							 M61.5,76.3c-7.3,0-13.3-6-13.3-13.3s6-13.3,13.3-13.3c7.3,0,13.3,6,13.3,13.3S68.8,76.3,61.5,76.3z"/>
					</defs>
					<clipPath id="SVGID_17_">
						<use xlink:href="#SVGID_16_"  style="overflow:visible;"/>
					</clipPath>
					<g class="st17">
						<polygon class="st18" points="115,131.3 61.5,64.3 -3.6,8.5 8,-2.7 61.5,64.3 126.6,120 						"/>
					</g>
				</g>
				<g>
					<defs>
						<path id="SVGID_18_" d="M61.5,8.4C32.1,8.4,8.3,32.2,8.3,61.6s23.8,53.2,53.2,53.2s53.2-23.8,53.2-53.2S90.9,8.4,61.5,8.4z
							 M61.5,76.3c-7.3,0-13.3-6-13.3-13.3s6-13.3,13.3-13.3c7.3,0,13.3,6,13.3,13.3S68.8,76.3,61.5,76.3z"/>
					</defs>
					<clipPath id="SVGID_19_">
						<use xlink:href="#SVGID_18_"  style="overflow:visible;"/>
					</clipPath>
					<g class="st19">
						<polygon class="st20" points="107.5,143 61.5,64.3 1.5,-4.3 15.5,-14.4 61.5,64.3 121.5,132.9 						"/>
					</g>
				</g>
			</g>
		</g>
	</g>
	<g id="Layer_2">
		<g>
			<path class="st21" d="M61.5,46.7c-9,0-16.3,7.3-16.3,16.3c0,9,7.3,16.3,16.3,16.3S77.8,72,77.8,63S70.5,46.7,61.5,46.7z
				 M61.5,68.3c-3,0-5.4-2.4-5.4-5.4c0-3,2.4-5.4,5.4-5.4c3,0,5.4,2.4,5.4,5.4C66.9,65.9,64.5,68.3,61.5,68.3z"/>
		</g>
		<circle class="st22" cx="61.5" cy="62.9" r="10.7"/>
		<ellipse class="st23" cx="61.5" cy="62.9" rx="6.8" ry="6.7"/>
	</g>
</g>
</svg>
