<svg version="1.1" id="Layer_1" xmlns="http://www.w3.org/2000/svg" x="0" y="0" viewBox="0 0 300 100.5" style="enable-background:new 0 0 300 100.5" xml:space="preserve">
    <style>
        .st0{fill:#dce0df}.st1{fill:none}
    </style>
    <path class="st0" d="M178.1 51.4c0 17.4-13.1 31-31.8 31-18.1 0-31.8-14.1-31.8-31.6S128.2 19 145.6 19s32.5 12.3 32.5 32.4zm-31.7-19.8c-10.5 0-19.3 8.6-19.3 19.5S135.9 71 146.4 71s20-8.5 20-19.4c.1-10.9-9.5-20-20-20zm115.8 49v-31h-18.1V61h5.6v9.2c-8.8 0-16-10.9-16.1-18.5-.2-9.7 7.4-19.7 19.5-19.9 4.9 0 6.6 1.2 9.1 2.1V20.8c-3.7-1.5-8.1-1.7-9.7-1.7-6.1 0-11 1.7-15.7 4.5-9.5 5.6-15.6 14.8-15.6 26.9 0 16.8 13.2 31.7 30.6 31.7 4.3-.1 8.3-.8 10.4-1.6z"/>
    <path class="st0" d="M199.3 20.2c-11.9 0-21.1 7.7-21.1 18.9v42.3h12.6V40.6c0-4.2 3.7-7.7 9-7.7 6.5 0 9 4.1 9 7.7v40.8h12.6V39.1c0-11.2-11.2-18.9-22.1-18.9zm-83.5 19.9c0 12.5-9.9 19.5-19 19.5h-6.9v23.2H77.6V21.3H96c9.8 0 19.8 6.9 19.8 18.8zm-12.2.4c0-7.8-7.3-8.1-7.3-8.1h-6.8V48h6.9c.1 0 7.2-.4 7.2-7.5zm-42.3 25 .1.1s0 .1.1.1V66c0 .1-.1.1-.2.1.1 0 .1.1.1.1v.5h-.3v-.4h-.5v.5h-.3v-1.2h.6c.3-.1.3-.1.4-.1zm-.6.1v.4h.4l.1-.1c0-.1 0-.1-.1-.1H61l-.3-.2z"/>
    <path class="st0" d="M61 64.8c-.7 0-1.3.6-1.3 1.2s.6 1.2 1.3 1.2 1.3-.6 1.3-1.2-.6-1.2-1.3-1.2zm0 2.2c-.6 0-1-.4-1-1s.5-1 1-1 1 .4 1 1-.5 1-1 1zM33.5 52.6c1.5-1.3 2.8-2.8 3.7-4.6.5-1.1.9-2.3 1.2-3.5.3-1.8.4-3.5.5-5.3.1-1.2.1-2.5.1-3.7V31h-2v2.2c-.1 2.2-.2 4.4-.5 6.5-.3 1.7-.6 3.4-1.3 4.9-.6 1.4-1.4 2.6-2.4 3.7s-2.1 2-3.4 2.7c-1.1.6-2.2 1-3.5 1.2V56c1-.1 2-.4 2.9-.7 1.7-.6 3.4-1.5 4.7-2.7zm6.2-4.6v7.9h3.5V31.1h-3.5c-.1 0-.1 16.9 0 16.9zm15.7 3.9c-1.7-.6-3.3-1.5-4.7-2.8-1.4-1.3-2.5-3-3.2-4.7-.8-1.8-1.1-3.8-1.4-5.8-.3-2.5-.4-5.1-.4-7.6h-1.9v4.1c0 2.4.1 4.8.3 7.2.1 1.1.2 2.2.5 3.3.3 1.1.7 2.1 1.3 3.1.7 1.2 1.7 2.4 2.7 3.3.6.6 1.3 1.1 2 1.6 1 .6 2.1 1.2 3.2 1.6 1 .3 1.9.6 2.9.7v-3.7c-.3 0-.8-.2-1.3-.3zm-17 7.4v-1.4H32v1.4h2.4v7.9H36v-7.9h2.4zm13.7 4c.3-.2.7-.3 1-.6.6-.4.9-1 1-1.7.1-.6.1-1.2-.3-1.8-.5-.8-1.6-1.4-2.7-1.4h-2c-.2 0-.3 0-.5.1-.5.1-1 .6-1 1.1v8.1h1.7v-7.6c0-.2.2-.3.4-.3H51c.6 0 1.2.4 1.4.9.1.4.1.8-.1 1.2-.3.5-.9.8-1.5 1-.3.1-.6.3-.7.6-.2.4-.1.8.2 1.1.9 1.1 1.7 2.1 2.6 3.2h2c-.9-1.1-1.9-2.2-2.8-3.4-.2-.1-.2-.4 0-.5z"/>
    <path class="st1" d="M59.6 66.6c0-.3-.4-.6-.8-.5-.3.1-.5.3-.5.5 0 .3.2.5.6.5.3.1.7-.2.7-.5zm-.7.5c-.4 0-.6-.4-.5-.6.1-.1.2-.2.3-.2.3-.1.6.1.7.3.1.2-.2.5-.5.5z"/>
    <path class="st0" d="M42.6 57.9c-.5-.1-1.1.1-1.4.4-.2.2-.2.5-.3.7-1 2.7-1.9 5.4-2.9 8.1h1.8c.3-.8.5-1.6.8-2.3H44c.3.8.5 1.6.8 2.3h1.8c-1-2.8-2-5.6-3-8.5-.1-.3-.5-.6-1-.7zM41 63.5c.4-1.2.8-2.4 1.2-3.5.4 1.2.8 2.4 1.2 3.5H41zm-12-5.4c-.5-.4-1.5-.3-1.9.2-.2.2-.3.5-.4.8-1 2.7-1.9 5.4-2.9 8.1h1.8c.3-.8.5-1.6.8-2.3h3.5c.3.8.5 1.6.8 2.3h1.8l-3-8.5c-.1-.2-.3-.4-.5-.6zm-2.1 5.4c.4-1.2.8-2.4 1.3-3.5.4 1.2.8 2.4 1.2 3.5h-2.5z"/>
    <path class="st1" d="M59.1 66.4c-.2-.1-.3 0-.5-.1v.6h.1v-.3c.1 0 .1 0 .2.1s.1.3.3.2c-.1-.1-.1-.2-.2-.3.1.1.2-.1.1-.2zm-.4.2v-.2c.1 0 .2 0 .3.1 0 .2-.2.1-.3.1z"/>
    <path class="st0" d="M55.9 57.9v9.3h1.8v-9.3h-1.8z"/>
    <path d="M269.1 24.4v-1.9h1.3c.6 0 1.3.1 1.3.9 0 .9-.7 1-1.5 1h-1.1m.1.8h1.1l1.6 2.7h1.1l-1.8-2.7c.9-.1 1.6-.6 1.6-1.7 0-1.2-.7-1.8-2.2-1.8h-2.4v6.2h.9l.1-2.7zm1.1 5c2.9 0 5.4-2.3 5.4-5.4 0-3.1-2.5-5.3-5.4-5.3-3 0-5.5 2.3-5.5 5.3 0 3.1 2.5 5.4 5.5 5.4zm-4.4-5.4c0-2.5 1.9-4.4 4.4-4.4 2.4 0 4.3 1.9 4.3 4.4 0 2.6-1.9 4.5-4.3 4.5-2.5 0-4.4-1.9-4.4-4.5z" style="fill:#fff"/>
</svg>
