<?xml version="1.0" encoding="utf-8"?>
<!-- Generator: Adobe Illustrator 23.1.0, SVG Export Plug-In . SVG Version: 6.00 Build 0)  -->
<svg version="1.1"
	 id="Capa_1" xmlns:cc="http://creativecommons.org/ns#" xmlns:dc="http://purl.org/dc/elements/1.1/" xmlns:inkscape="http://www.inkscape.org/namespaces/inkscape" xmlns:rdf="http://www.w3.org/1999/02/22-rdf-syntax-ns#" xmlns:sodipodi="http://sodipodi.sourceforge.net/DTD/sodipodi-0.dtd" xmlns:svg="http://www.w3.org/2000/svg"
	 xmlns="http://www.w3.org/2000/svg" xmlns:xlink="http://www.w3.org/1999/xlink" x="0px" y="0px" viewBox="0 0 662.6 400"
	 style="enable-background:new 0 0 662.6 400;" xml:space="preserve">
<style type="text/css">
	.st0{fill:#585B59;}
	.st1{fill:#988072;}
	.st2{fill:#505254;}
	.st3{fill:#A0A3A4;}
	.st4{fill-rule:evenodd;clip-rule:evenodd;fill:#3F4040;}
	.st5{fill:none;stroke:#979395;stroke-width:0.5908;stroke-miterlimit:5.9084;}
	.st6{fill:none;stroke:#151315;stroke-width:1.7725;stroke-miterlimit:5.9084;}
	.st7{fill:none;stroke:#797576;stroke-width:0.5908;stroke-miterlimit:5.9084;}
	.st8{fill:#0B0F11;}
	.st9{fill:#CBC9C8;}
	.st10{fill:#741C49;}
	.st11{fill:#283B89;stroke:#000000;stroke-width:0.5908;stroke-miterlimit:5.9084;}
	.st12{fill:#938270;}
	.st13{fill-rule:evenodd;clip-rule:evenodd;fill:#A18B77;}
	.st14{fill:#A18B77;}
	.st15{fill:#948472;}
	.st16{fill:#1C2728;}
	.st17{fill:url(#ellipse157_1_);}
	.st18{fill:#080E12;}
	.st19{fill:#0C1215;}
	.st20{fill:none;stroke:#000000;stroke-width:0.2954;stroke-miterlimit:5.9084;}
	.st21{fill:#80696B;}
	.st22{fill-rule:evenodd;clip-rule:evenodd;fill:#80696B;}
</style>
<sodipodi:namedview  bordercolor="#666666" borderopacity="1" fit-margin-bottom="0" fit-margin-left="0" fit-margin-right="0" fit-margin-top="0" gridtolerance="10" guidetolerance="10" id="namedview133" inkscape:current-layer="Capa_1" inkscape:cx="209.2" inkscape:cy="210.64999" inkscape:pageopacity="0" inkscape:pageshadow="2" inkscape:window-height="1013" inkscape:window-maximized="1" inkscape:window-width="1920" inkscape:window-x="-9" inkscape:window-y="-9" inkscape:zoom="0.56043694" objecttolerance="10" pagecolor="#ffffff" showgrid="false">
	</sodipodi:namedview>
<g>
	<g id="g130" transform="matrix(0.9494422,0,0,0.9494422,0,0.09494422)">
		<path id="path2" inkscape:connector-curvature="0" class="st0" d="M46.2,409c-20.3,0-36.9-16.5-36.9-36.9v-326
			c0-20.3,16.5-36.9,36.9-36.9h326c20.3,0,36.9,16.5,36.9,36.9v326c0,20.3-16.5,36.9-36.9,36.9H46.2z"/>
		<path id="path4" inkscape:connector-curvature="0" class="st1" d="M385.6,416.4L385.6,416.4c-4.3,1.2-8.7,1.9-13.4,1.9
			c-4.6,0-9.1-0.7-13.3-1.9l0,0l-0.5,1.6c-0.2,0.6,0.2,1.3,0.8,1.4c4.2,1.1,8.5,1.8,13.1,1.8c4.5,0,8.9-0.6,13.1-1.8
			c0.6-0.2,1-0.8,0.8-1.4L385.6,416.4z"/>
		<path id="path6" inkscape:connector-curvature="0" class="st1" d="M32.9,416.4L32.9,416.4c4.3,1.2,8.7,1.9,13.4,1.9
			c4.6,0,9.1-0.7,13.3-1.9l0,0l0.5,1.6c0.2,0.6-0.2,1.3-0.8,1.4c-4.2,1.1-8.5,1.8-13.1,1.8c-4.5,0-8.9-0.6-13.1-1.8
			c-0.6-0.2-1-0.8-0.8-1.4L32.9,416.4z"/>
		<polygon id="polygon8" class="st0" points="336.3,342.7 331.2,350.2 327.8,358.6 326,367.6 326,376.7 327.8,385.6 331.2,394 
			336.3,401.6 342.7,408 350.3,413.1 358.7,416.6 367.7,418.4 376.8,418.4 385.7,416.6 394.1,413.1 401.7,408 408.1,401.6 
			413.2,394 416.7,385.6 418.4,376.7 418.4,367.6 416.7,358.6 413.2,350.2 408.1,342.7 401.7,336.2 394.1,331.2 385.7,327.7 
			376.8,325.9 367.7,325.9 358.7,327.7 350.3,331.2 342.7,336.2 		"/>
		<polygon id="polygon10" class="st0" points="10.3,342.7 5.3,350.2 1.8,358.6 0,367.6 0,376.7 1.8,385.6 5.3,394 10.3,401.6 
			16.8,408 24.3,413.1 32.7,416.6 41.7,418.4 50.8,418.4 59.7,416.6 68.1,413.1 75.7,408 82.1,401.6 87.2,394 90.7,385.6 
			92.5,376.7 92.5,367.6 90.7,358.6 87.2,350.2 82.1,342.7 75.7,336.2 68.1,331.2 59.7,327.7 50.8,325.9 41.7,325.9 32.7,327.7 
			24.3,331.2 16.8,336.2 		"/>
		<polygon id="polygon12" class="st0" points="336.3,16.7 331.2,24.2 327.8,32.7 326,41.6 326,50.7 327.8,59.6 331.2,68 336.3,75.6 
			342.7,82.1 350.3,87.1 358.7,90.6 367.7,92.4 376.8,92.4 385.7,90.6 394.1,87.1 401.7,82.1 408.1,75.6 413.2,68 416.7,59.6 
			418.4,50.7 418.4,41.6 416.7,32.7 413.2,24.2 408.1,16.7 401.7,10.2 394.1,5.2 385.7,1.7 376.8,-0.1 367.7,-0.1 358.7,1.7 
			350.3,5.2 342.7,10.2 		"/>
		<polygon id="polygon14" class="st0" points="10.3,16.7 5.3,24.2 1.8,32.7 0,41.6 0,50.7 1.8,59.6 5.3,68 10.3,75.6 16.8,82.1 
			24.3,87.1 32.7,90.6 41.7,92.4 50.8,92.4 59.7,90.6 68.1,87.1 75.7,82.1 82.1,75.6 87.2,68 90.7,59.6 92.5,50.7 92.5,41.6 
			90.7,32.7 87.2,24.2 82.1,16.7 75.7,10.2 68.1,5.2 59.7,1.7 50.8,-0.1 41.7,-0.1 32.7,1.7 24.3,5.2 16.8,10.2 		"/>
		<path id="path16" inkscape:connector-curvature="0" class="st2" d="M372.2,386.3h-326c-7.8,0-14.2-6.4-14.2-14.2v-326
			c0-7.8,6.4-14.2,14.2-14.2h326c7.8,0,14.2,6.4,14.2,14.2v326C386.4,379.9,380,386.3,372.2,386.3L372.2,386.3z"/>
		<g id="g106">
			<g id="g104">
				<g id="g38">
					<g id="g36">
						<path id="path18" inkscape:connector-curvature="0" class="st3" d="M166.7,232.4h-10.8l10.7,6.4h4.3l-7.3-4.2h3.8
							c1.9,0,3.5-1.9,3.5-4.3c0-2.4-1.5-4.3-3.5-4.3h-16v12.8h2.4v-10.6h12.8c1,0,1.8,0.9,1.8,2.1
							C168.5,231.4,167.7,232.4,166.7,232.4z"/>
						<g id="g24">
							<rect id="rect20" x="186.2" y="231.1" class="st3" width="12.6" height="2.4"/>
							<polygon id="polygon22" class="st3" points="202.1,238.8 182.2,238.8 182.2,226 202.1,226 202.1,228.4 184.4,228.4 
								184.4,236.6 202.1,236.6 							"/>
						</g>
						<rect id="rect26" x="174.9" y="230.1" class="st3" width="4.1" height="4.1"/>
						<rect id="rect28" x="206.2" y="230.1" class="st3" width="4.1" height="4.1"/>
						<rect id="rect30" x="238.3" y="230.1" class="st3" width="4.1" height="4.1"/>
						<polygon id="polygon32" class="st3" points="247.1,226 249.5,226 249.5,236.6 267,236.6 267,238.8 247.1,238.8 						"/>
						<path id="path34" inkscape:connector-curvature="0" class="st3" d="M231.3,235.5l3.6,3.3h3.8l-14.1-12.7
							c-0.2-0.2-0.5-0.2-0.7,0l-13.2,12.7h3.2l10.4-9.7l4.2,4.2h-6.3l-2.2,2.2H231.3z"/>
					</g>
				</g>
				<g id="g42">
					<rect id="rect40" x="151.5" y="240.8" class="st3" width="115.5" height="1.2"/>
				</g>
				<g id="g102">
					<g id="g100">
						<g id="g50">
							<path id="path44" inkscape:connector-curvature="0" class="st3" d="M153.5,245.8c0,0.2,0.1,0.3,0.2,0.4
								c0.1,0.1,0.3,0.1,0.5,0.1c0.4,0,0.6-0.2,0.6-0.4c0-0.4-0.9-0.4-1.2-0.4V245c0.3,0,1.2,0,1.2-0.3c0-0.2-0.3-0.3-0.6-0.3
								s-0.6,0.1-0.6,0.4h-1.3c0-0.8,0.9-1.1,1.9-1.1c1.1,0,1.8,0.4,1.8,0.9c0,0.3-0.2,0.5-0.6,0.7c0.4,0.1,0.7,0.4,0.7,0.7
								c0,0.8-0.8,1.2-2.1,1.2c-1.1,0-1.9-0.4-1.9-1.2h1.4L153.5,245.8z"/>
							<path id="path46" inkscape:connector-curvature="0" class="st3" d="M157.1,247v-3.2h2c1.4,0,2.3,0.5,2.3,1.5
								c0,1.2-0.9,1.6-2.4,1.6L157.1,247L157.1,247z M158.6,246.3h0.3c0.7,0,1.1-0.3,1.1-0.9c0-0.7-0.3-0.8-1.1-0.8h-0.3V246.3z"/>
							<path id="path48" inkscape:connector-curvature="0" class="st3" d="M166.4,245.4c0,1.1-1,1.7-2.4,1.7s-2.3-0.6-2.3-1.7
								c0-1,1-1.6,2.3-1.6C165.6,243.7,166.4,244.6,166.4,245.4z M163.1,245.4c0,0.4,0.2,0.9,0.9,0.9c0.6,0,0.9-0.4,0.9-0.9
								c0-0.4-0.2-0.9-0.9-0.9S163.1,245,163.1,245.4z"/>
						</g>
						<g id="g74">
							<path id="path52" inkscape:connector-curvature="0" class="st3" d="M171,247v-3.2h1.4v3.2H171z"/>
							<path id="path54" inkscape:connector-curvature="0" class="st3" d="M176,245.6l-0.1-0.7v-1h1.3v3.2H176l-1.5-1.7l0.1,0.7v1
								h-1.3v-3.2h1.3L176,245.6z"/>
							<path id="path56" inkscape:connector-curvature="0" class="st3" d="M177.7,243.8h3.9v0.8h-1.2v2.3H179v-2.3h-1.2v-0.8H177.7z
								"/>
							<path id="path58" inkscape:connector-curvature="0" class="st3" d="M182,247v-3.2h3.7v0.7h-2.2v0.5h1.9v0.7h-1.9v0.5h2.3v0.7
								H182V247z"/>
							<path id="path60" inkscape:connector-curvature="0" class="st3" d="M187.9,245.9v1.1h-1.5v-3.2h2.1c1.5,0,2,0.3,2,0.9
								c0,0.4-0.2,0.7-0.8,0.8c0.5,0.1,0.8,0.2,0.8,0.8c0,0.4,0,0.6,0.2,0.6v0.1h-1.5c0-0.1-0.1-0.3-0.1-0.6c0-0.4-0.1-0.5-0.8-0.5
								L187.9,245.9z M187.9,245.2h0.6c0.5,0,0.7-0.1,0.7-0.3s-0.2-0.3-0.6-0.3h-0.7V245.2z"/>
							<path id="path62" inkscape:connector-curvature="0" class="st3" d="M191.1,247l1.5-3.2h1.4l1.5,3.2h-1.4l-0.2-0.4h-1.4
								l-0.2,0.4H191.1z M193.3,244.8l-0.4,1.1h0.9L193.3,244.8z"/>
							<path id="path64" inkscape:connector-curvature="0" class="st3" d="M198.7,245c0-0.3-0.3-0.5-0.8-0.5s-0.8,0.3-0.8,0.9
								c0,0.4,0.1,0.9,0.8,0.9c0.4,0,0.7-0.2,0.7-0.5h1.3c-0.1,0.8-0.9,1.3-2,1.3c-1.4,0-2.2-0.6-2.2-1.7c0-1,0.9-1.7,2.1-1.7
								c1.3,0,2,0.5,2.1,1.3H198.7z"/>
							<path id="path66" inkscape:connector-curvature="0" class="st3" d="M200.3,243.8h3.9v0.8H203v2.3h-1.4v-2.3h-1.2v-0.8H200.3z
								"/>
							<path id="path68" inkscape:connector-curvature="0" class="st3" d="M204.6,247v-3.2h1.4v3.2H204.6z"/>
							<path id="path70" inkscape:connector-curvature="0" class="st3" d="M206.4,243.8h1.4l0.7,2.1l0.8-2.1h1.4l-1.5,3.2h-1.4
								L206.4,243.8z"/>
							<path id="path72" inkscape:connector-curvature="0" class="st3" d="M211.3,247v-3.2h3.6v0.7h-2.2v0.5h1.8v0.7h-1.8v0.5h2.2
								v0.7h-3.6V247z"/>
						</g>
						<g id="g98">
							<path id="path76" inkscape:connector-curvature="0" class="st3" d="M219.5,247v-3.2h1.9l0.9,2l0.9-2h1.9v3.2h-1.4v-1v-0.5
								l0.1-0.6l0,0l-0.9,2h-1.1l-0.9-2l0,0l0.1,0.5v0.5v1.1H219.5z"/>
							<path id="path78" inkscape:connector-curvature="0" class="st3" d="M226.1,243.8h1.4v1.9c0,0.3,0.1,0.6,0.7,0.6
								c0.5,0,0.7-0.2,0.7-0.6v-1.9h1.4v1.8c0,1-0.6,1.5-2.1,1.5c-1.3,0-2.1-0.4-2.1-1.5L226.1,243.8z"/>
							<path id="path80" inkscape:connector-curvature="0" class="st3" d="M231.1,247v-3.2h1.4v2.4h1.9v0.7h-3.3L231.1,247z"/>
							<path id="path82" inkscape:connector-curvature="0" class="st3" d="M234.1,243.8h4v0.8h-1.3v2.3h-1.4v-2.3h-1.3V243.8z"/>
							<path id="path84" inkscape:connector-curvature="0" class="st3" d="M238.4,247v-3.2h1.4v3.2H238.4z"/>
							<path id="path86" inkscape:connector-curvature="0" class="st3" d="M240.8,247v-3.2h2.1c1.2,0,1.8,0.4,1.8,1.1
								c0,0.7-0.6,1.1-1.8,1.1h-0.7v1L240.8,247z M242.8,245.3c0.3,0,0.6-0.1,0.6-0.4c0-0.3-0.5-0.3-0.8-0.3h-0.4v0.7H242.8z"/>
							<path id="path88" inkscape:connector-curvature="0" class="st3" d="M245.2,246.9v-3.2h1.4v2.4h1.9v0.7h-3.3L245.2,246.9z"/>
							<path id="path90" inkscape:connector-curvature="0" class="st3" d="M248.8,246.9l1.5-3.2h1.4l1.5,3.2h-1.4l-0.2-0.4h-1.4
								l-0.2,0.4H248.8z M251,244.7l-0.4,1.1h0.9L251,244.7z"/>
							<path id="path92" inkscape:connector-curvature="0" class="st3" d="M255.9,247h-1.4v-1.2l-1.6-2h1.6l0.7,1.1l0.7-1.1h1.6
								l-1.6,2V247z"/>
							<path id="path94" inkscape:connector-curvature="0" class="st3" d="M257.7,247v-3.2h3.5v0.7h-2.1v0.5h1.8v0.7h-1.8v0.5h2.2
								v0.7h-3.6V247z"/>
							<path id="path96" inkscape:connector-curvature="0" class="st3" d="M263.5,245.9v1.1H262v-3.2h2.1c1.5,0,2,0.3,2,0.9
								c0,0.4-0.2,0.7-0.7,0.8c0.5,0.1,0.8,0.2,0.8,0.8c0,0.4,0,0.6,0.2,0.6v0.1h-1.5c0-0.1-0.1-0.3-0.1-0.6c0-0.4-0.1-0.5-0.8-0.5
								L263.5,245.9z M263.5,245.2h0.6c0.5,0,0.7-0.1,0.7-0.3s-0.2-0.3-0.6-0.3h-0.7V245.2z"/>
						</g>
					</g>
				</g>
			</g>
		</g>
		<g id="g128">
			<path id="path108" inkscape:connector-curvature="0" class="st4" d="M150.9,190c0-5.5-0.7-9.9-11.6-9.9c-9.1,0-12.2,3.3-12.1,8.7
				l0,0h8.2l0,0c0.2-2,2.1-2.9,3.4-2.9c1,0,3,0.2,3,1.9c0,5-15.8,0.4-15.8,11.1c0,4.8,5,6.7,7.6,6.7c3.4-0.1,6.1-0.7,8.7-3.1l0,0
				l1,2.5h8.1l0,0C151,204.1,150.9,190,150.9,190z M137.6,200.3c-1.8,0-2.6-1.2-2.6-2.4c0-2,4.1-1.9,7.1-3.3
				C142.3,197.8,140.8,200.3,137.6,200.3z"/>
			<path id="path110" inkscape:connector-curvature="0" class="st4" d="M312.6,195.3c-0.3,1.8-1.2,4-3.6,4c-2.9,0-4.5-2.8-4.5-6.3
				c0-2.7,1-6.4,4.5-6.4c1,0,1.8,0.3,2.4,0.9c0.6,0.6,0.9,1.4,1,2.4l0,0h8.8l0,0c-0.7-6.8-6-9.5-12.2-9.5c-7.6,0-13.3,4.5-13.3,12.4
				c0,7.8,5.8,12.6,13.3,12.6c6.4,0,11.5-3.2,12.3-10.2l0,0h-8.7L312.6,195.3z"/>
			<polygon id="polygon112" class="st4" points="294.8,205 294.8,181.3 286,181.3 286,205 			"/>
			<polygon id="polygon114" class="st4" points="294.8,177.6 294.8,171.6 286,171.6 286,177.6 			"/>
			<path id="path116" inkscape:connector-curvature="0" class="st4" d="M244.4,180.2c-7.8,0-13.2,4.7-13.2,12.7
				c0,7.9,5.8,12.6,13.2,12.6c7.4,0,13.2-4.6,13.2-13C257.7,185.3,252.5,180.2,244.4,180.2L244.4,180.2z M244.4,199.3
				c-2.3,0-4.1-2.5-4.1-6.9c0-2.6,1.1-5.8,4.2-5.8c2.4-0.1,4.1,2.6,4.1,6C248.6,197,246.9,199.3,244.4,199.3z"/>
			<path id="path118" inkscape:connector-curvature="0" class="st4" d="M215.2,187c0-1.1,1.3-1.7,2.9-1.7c0.7,0,1.7,0.2,2.2,0.6
				c0.2,0.2,0.8,0.9,0.9,1.7l0,0h8.3l0,0c-0.2-6.2-6.3-7.4-11.7-7.4c-4.8,0-11,1.9-11,7.8c0,9.7,14.8,6.1,14.8,9.8
				c0,1.6-1.2,2.2-3.4,2.2c-0.9,0-1.8-0.6-2.4-1c-0.6-0.5-0.9-1.1-1-2.1l0,0h-8.2l0,0c0.2,6.5,6.1,8.9,11.3,8.9
				c9.8,0,12.6-4.3,12.7-9.1C230.6,187.4,215.2,190.3,215.2,187L215.2,187z"/>
			<path id="path120" inkscape:connector-curvature="0" class="st4" d="M205.2,190c0-5.5-0.7-9.9-11.6-9.9c-9.1,0-12.2,3.3-12.1,8.7
				l0,0h8.2l0,0c0.2-2,2.1-2.9,3.4-2.9c1,0,3,0.2,3,1.9c0,5-15.8,0.4-15.8,11.1c0,4.8,5,6.7,7.6,6.7c3.4-0.1,6.1-0.7,8.7-3.1l0,0
				l1,2.5h8.1l0,0C205.2,204.1,205.2,190,205.2,190L205.2,190z M191.8,200.3c-1.8,0-2.6-1.2-2.6-2.4c0-2,4.1-1.9,7.1-3.3
				C196.5,197.8,195,200.3,191.8,200.3z"/>
			<path id="path122" inkscape:connector-curvature="0" class="st4" d="M112.8,170.8H97.1V205h10.1v-10.6h5.9l0,0
				c9.1,0,13.6-4.9,13.6-11.7C126.7,176.1,121.9,170.8,112.8,170.8z M112.3,186.8h-5.1v-7.7h3.7l0,0c2.2,0,5.5,0.6,5.5,3.5
				C116.5,185.4,114.7,186.8,112.3,186.8z"/>
			<path id="path124" inkscape:connector-curvature="0" class="st4" d="M275.5,180.2c-3.5,0-4.9,0.6-8.2,3.5l0,0v-2.6h-8.4V205h8.4
				v-12.5l0,0c0-3,1.5-4.8,4.3-4.8c2.6,0,3.2,1.4,3.2,3.7l0,0V205h9.2v-14.6l0,0C284,184,281.5,180.2,275.5,180.2z"/>
			<path id="path126" inkscape:connector-curvature="0" class="st4" d="M170.2,180.2c-3.5,0-4.9,0.6-8.2,3.5l0,0v-2.6h-8.4V205h8.8
				v-12.5l0,0c0-3,1.2-5.1,4-5.1c2.6,0,3.1,1.7,3.1,4l0,0V205h9.2v-14.6l0,0C178.8,184,176.3,180.2,170.2,180.2L170.2,180.2z"/>
		</g>
	</g>
	<g id="g533" transform="matrix(0.59084195,0,0,0.59084195,462.58104,200.05908)">
		<path id="path2-9" inkscape:connector-curvature="0" class="st5" d="M169.3,337.9c-93,0-168.8-75.7-168.8-168.7
			S76.2,0.4,169.3,0.4c93,0,168.8,75.7,168.8,168.8C338,262.2,262.3,337.9,169.3,337.9z"/>
		<path id="path4-5" inkscape:connector-curvature="0" class="st6" d="M169.3,335.9c-91.9,0-166.8-74.8-166.8-166.7
			c0-92,74.8-166.8,166.8-166.8C261.2,2.4,336,77.2,336,169.1C336,261.1,261.2,335.9,169.3,335.9L169.3,335.9z"/>
		<circle id="circle6" class="st7" cx="169.3" cy="169.1" r="22.8"/>
		<path id="path8" inkscape:connector-curvature="0" class="st8" d="M169.3,233.9c-35.7,0-64.7-29-64.7-64.7s29-64.8,64.7-64.8
			s64.8,29,64.8,64.8C234,204.8,205,233.9,169.3,233.9z M219,168.6c0-27.4-22.3-49.8-49.8-49.8s-49.8,22.3-49.8,49.8
			s22.3,49.7,49.8,49.7S219,196.1,219,168.6z"/>
		<path id="path10" inkscape:connector-curvature="0" class="st9" d="M169.3,224.4c-30.7,0-55.8-25-55.8-55.7s25-55.8,55.8-55.8
			s55.8,25,55.8,55.8S200,224.4,169.3,224.4z M219,168.6c0-27.4-22.3-49.8-49.8-49.8s-49.8,22.3-49.8,49.8s22.3,49.7,49.8,49.7
			S219,196.1,219,168.6z"/>
		<g id="g16">
			<path id="path12" inkscape:connector-curvature="0" class="st10" d="M330.1,212.2c-4-2.6-3.7-6.8-11.8-8.1
				c-5-0.8-10.2,0.1-13.1-0.9c-11-3.5-19.3-26.7-26.6-23.1c-18.6,9.1-24.2,14.2-34.4,18.8c-14.3,6.5-18.3,15.3-20.3,15.8
				c-2.6,0.7-8,2.7-10.2,2l-0.5-0.6c12.8-11.7,20.8-28.1,20.8-47c0-35.7-28.9-64.8-64.6-64.8c-35.2,0-63.5,28.3-64.2,63.4l-0.6-0.6
				c-3.5-14.5-8-19.7-11.8-20.8c-8.6-2.5-12.4,7.9-23.2,5.4c-7.4-1.7-13.5-18.5-19.5-21.7c-7-3.7-22.2,11.4-47.4,31.3l-0.4,0.4
				C6.1,73.1,79.9,2.4,169.4,2.4c91.9,0,166.8,74.8,166.8,166.8c0,15-2,29.5-5.7,43.3"/>
			<path id="path14" inkscape:connector-curvature="0" class="st11" d="M330.5,212.5c1.2-4.6-4-6.6-12.1-7.9
				c-5-0.8-10.2,0.1-13.1-0.8c-11-3.5-19.4-26.7-26.8-23.1c-18.6,9.1-24.3,14.2-34.5,18.8c-14.3,6.5-18.3,15.1-20.3,15.7
				c-2.6,0.7-8.3,2.3-10.5,1.6c-11.5,10.6-26.9,17.1-43.8,17.1c-35.7,0-64.8-29-64.8-64.7c0-0.5,0-0.9,0-1.4
				c-3.5-14.5-8-20.3-11.9-21.4c-8.6-2.5-12.3,8.2-23,5.7c-7.4-1.7-13.7-18.5-19.7-21.7c-7-3.7-22.1,11.7-47.3,31.6
				c-0.1,2.4-0.2,4.7-0.2,7.1c0,91.9,74.8,166.7,166.8,166.7C246.4,335.9,311.4,283.5,330.5,212.5z"/>
		</g>
		<g id="g531">
			<g id="g106-1">
				<g id="g104-2">
					<g id="g38-9">
						<g id="g36-7">
							<path id="path18-7" inkscape:connector-curvature="0" class="st12" d="M130.1,80.8h-10.6l10.5,6.3h4.2l-7.2-4.2h3.8
								c1.9,0,3.4-1.9,3.4-4.2c0-2.3-1.5-4.2-3.4-4.2h-15.7v12.6h2.4V76.7h12.6c1,0,1.8,0.9,1.8,2S131.1,80.8,130.1,80.8z"/>
							<g id="g24-2">
								<rect id="rect20-7" x="149.3" y="79.5" class="st12" width="12.4" height="2.4"/>
								<polygon id="polygon22-2" class="st12" points="164.8,74.5 164.8,76.9 147.5,76.9 147.5,84.9 164.8,84.9 164.8,87.1 
									145.3,87.1 145.3,74.5 								"/>
							</g>
							<rect id="rect26-8" x="138.1" y="78.5" class="st12" width="4" height="4"/>
							<rect id="rect28-7" x="168.8" y="78.5" class="st12" width="4" height="4"/>
							<rect id="rect30-4" x="200.3" y="78.5" class="st12" width="4" height="4"/>
							<polygon id="polygon32-3" class="st12" points="211.3,74.5 211.3,84.9 228.5,84.9 228.5,87.1 209,87.1 209,74.5 							"/>
							<path id="path34-1" inkscape:connector-curvature="0" class="st12" d="M193.5,83.9l3.6,3.2h3.8L187,74.6
								c-0.2-0.2-0.5-0.2-0.7,0l-13,12.5h3.2l10.2-9.5l4.2,4.1h-6.1l-2.2,2.1h10.9L193.5,83.9z"/>
						</g>
					</g>
					<g id="g42-0">
						<rect id="rect40-9" x="115.1" y="89.1" class="st12" width="113.4" height="1.2"/>
					</g>
					<g id="g102-1">
						<g id="g100-9">
							<g id="g50-9">
								<path id="path44-4" inkscape:connector-curvature="0" class="st12" d="M117.1,94c0,0.1,0.1,0.3,0.2,0.3
									c0.1,0.1,0.3,0.1,0.5,0.1c0.4,0,0.6-0.2,0.6-0.4c0-0.4-0.9-0.4-1.2-0.4v-0.5c0.3,0,1.1,0,1.1-0.3c0-0.2-0.3-0.3-0.5-0.3
									c-0.3,0-0.6,0.1-0.6,0.3H116c0-0.7,0.9-1.1,1.9-1.1c1.1,0,1.8,0.4,1.8,0.9c0,0.3-0.2,0.5-0.5,0.6c0.4,0.1,0.7,0.4,0.7,0.7
									c0,0.8-0.8,1.1-2.1,1.1c-1.1,0-1.9-0.4-1.9-1.2h1.2V94z"/>
								<path id="path46-1" inkscape:connector-curvature="0" class="st12" d="M120.7,95.1V92h1.9c1.4,0,2.3,0.5,2.3,1.5
									c0,1.2-0.9,1.6-2.3,1.6H120.7z M122.1,94.4h0.3c0.7,0,1-0.3,1-0.8c0-0.6-0.3-0.8-1.1-0.8H122L122.1,94.4L122.1,94.4z"/>
								<path id="path48-9" inkscape:connector-curvature="0" class="st12" d="M129.7,93.6c0,1.1-1,1.7-2.3,1.7
									c-1.4,0-2.3-0.6-2.3-1.7c0-1,0.9-1.6,2.3-1.6C129,91.9,129.7,92.7,129.7,93.6z M126.6,93.6c0,0.4,0.2,0.9,0.9,0.9
									c0.6,0,0.9-0.4,0.9-0.9c0-0.4-0.2-0.9-0.9-0.9C126.8,92.7,126.6,93.2,126.6,93.6z"/>
							</g>
							<g id="g74-7">
								<path id="path52-8" inkscape:connector-curvature="0" class="st12" d="M134.3,95.1V92h1.4v3.1H134.3z"/>
								<path id="path54-3" inkscape:connector-curvature="0" class="st12" d="M139.2,93.7l-0.1-0.7v-1h1.3v3.1h-1.3l-1.5-1.7
									l0.1,0.7v1h-1.3V92h1.3L139.2,93.7z"/>
								<path id="path56-6" inkscape:connector-curvature="0" class="st12" d="M140.9,92h3.8v0.8h-1.2v2.3h-1.4v-2.3h-1.2L140.9,92z
									"/>
								<path id="path58-4" inkscape:connector-curvature="0" class="st12" d="M145.1,95.1V92h3.6v0.7h-2.2v0.4h1.8v0.7h-1.8v0.5
									h2.2V95L145.1,95.1L145.1,95.1z"/>
								<path id="path60-4" inkscape:connector-curvature="0" class="st12" d="M150.9,94v1.1h-1.4V92h2.1c1.5,0,1.9,0.3,1.9,0.9
									c0,0.4-0.2,0.7-0.7,0.8c0.5,0.1,0.7,0.2,0.7,0.8c0,0.4,0,0.5,0.2,0.5v0.1h-1.5c0-0.1-0.1-0.3-0.1-0.5c0-0.4-0.1-0.5-0.8-0.5
									h-0.4V94z M150.9,93.4h0.6c0.4,0,0.7-0.1,0.7-0.3c0-0.2-0.2-0.3-0.6-0.3h-0.7V93.4z"/>
								<path id="path62-0" inkscape:connector-curvature="0" class="st12" d="M154,95.1l1.5-3.1h1.4l1.5,3.1H157l-0.2-0.4h-1.4
									l-0.2,0.4H154z M156.2,93l-0.4,1.1h0.9L156.2,93z"/>
								<path id="path64-8" inkscape:connector-curvature="0" class="st12" d="M161.5,93.2c0-0.3-0.3-0.5-0.7-0.5
									c-0.5,0-0.8,0.3-0.8,0.9c0,0.4,0.1,0.8,0.8,0.8c0.4,0,0.6-0.2,0.7-0.5h1.3c-0.1,0.8-0.9,1.3-2,1.3c-1.4,0-2.2-0.6-2.2-1.6
									s0.9-1.6,2.1-1.6c1.3,0,2,0.5,2.1,1.3h-1.3L161.5,93.2z"/>
								<path id="path66-1" inkscape:connector-curvature="0" class="st12" d="M163,92h3.8v0.8h-1.2v2.3h-1.4v-2.3H163V92z"/>
								<path id="path68-1" inkscape:connector-curvature="0" class="st12" d="M167.3,95.1V92h1.4v3.1H167.3z"/>
								<path id="path70-5" inkscape:connector-curvature="0" class="st12" d="M169.1,92h1.4l0.7,2.1L172,92h1.4l-1.4,3.1h-1.4
									L169.1,92z"/>
								<path id="path72-9" inkscape:connector-curvature="0" class="st12" d="M173.8,95.1V92h3.5v0.7h-2.1v0.4h1.8v0.7h-1.8v0.5
									h2.2V95L173.8,95.1L173.8,95.1z"/>
							</g>
							<g id="g98-1">
								<path id="path76-6" inkscape:connector-curvature="0" class="st12" d="M181.9,95.1V92h1.9l0.8,1.9l0.8-1.9h1.9v3.1H186v-0.9
									v-0.5l0.1-0.6l0,0l-0.9,2h-1.1l-0.9-2l0,0l0.1,0.5v0.5v1.1L181.9,95.1L181.9,95.1z"/>
								<path id="path78-0" inkscape:connector-curvature="0" class="st12" d="M188.4,92h1.4v1.9c0,0.3,0.1,0.6,0.7,0.6
									c0.5,0,0.6-0.2,0.6-0.6V92h1.4v1.8c0,1-0.6,1.4-2,1.4c-1.3,0-2-0.4-2-1.4L188.4,92L188.4,92z"/>
								<path id="path80-5" inkscape:connector-curvature="0" class="st12" d="M193.3,95.1V92h1.4v2.4h1.9v0.7H193.3z"/>
								<path id="path82-5" inkscape:connector-curvature="0" class="st12" d="M196.2,92h3.9v0.8h-1.2v2.3h-1.4v-2.3h-1.2V92H196.2z
									"/>
								<path id="path84-0" inkscape:connector-curvature="0" class="st12" d="M200.4,95.1V92h1.4v3.1H200.4z"/>
								<path id="path86-4" inkscape:connector-curvature="0" class="st12" d="M202.8,95.1V92h2c1.2,0,1.8,0.4,1.8,1
									c0,0.7-0.5,1.1-1.8,1.1h-0.7v1H202.8z M204.7,93.4c0.3,0,0.6-0.1,0.6-0.4s-0.4-0.3-0.7-0.3h-0.4v0.7L204.7,93.4z"/>
								<path id="path88-7" inkscape:connector-curvature="0" class="st12" d="M207.1,95.1V92h1.4v2.4h1.9v0.7H207.1z"/>
								<path id="path90-5" inkscape:connector-curvature="0" class="st12" d="M210.6,95.1l1.5-3.1h1.4l1.5,3.1h-1.4l-0.2-0.4H212
									l-0.2,0.4H210.6z M212.9,92.9l-0.4,1.1h0.9L212.9,92.9z"/>
								<path id="path92-4" inkscape:connector-curvature="0" class="st12" d="M217.6,95.1h-1.4V94l-1.6-2h1.6l0.7,1.1l0.7-1.1h1.5
									l-1.6,2v1.1H217.6z"/>
								<path id="path94-7" inkscape:connector-curvature="0" class="st12" d="M219.4,95.1V92h3.5v0.7h-2.1v0.4h1.7v0.7h-1.7v0.5
									h2.1V95L219.4,95.1L219.4,95.1z"/>
								<path id="path96-6" inkscape:connector-curvature="0" class="st12" d="M225.1,94v1.1h-1.4V92h2.1c1.5,0,1.9,0.3,1.9,0.9
									c0,0.4-0.2,0.7-0.7,0.8c0.5,0.1,0.7,0.2,0.7,0.8c0,0.4,0,0.5,0.2,0.5v0.1h-1.5c0-0.1-0.1-0.3-0.1-0.5c0-0.4-0.1-0.5-0.8-0.5
									h-0.4V94z M225.1,93.4h0.6c0.4,0,0.7-0.1,0.7-0.3c0-0.2-0.2-0.3-0.6-0.3h-0.7V93.4z"/>
							</g>
						</g>
					</g>
				</g>
			</g>
			<g id="g132">
				<path id="path108-9" inkscape:connector-curvature="0" class="st13" d="M132.1,51.3c0-3.9-0.4-7-7.8-7c-6.1,0-8.1,2.3-8.1,6.2
					l0,0h5.5l0,0c0.1-1.4,1.4-2,2.3-2c0.6,0,2,0.2,2,1.3c0,3.6-10.6,0.3-10.6,7.8c0,3.4,3.3,4.8,5.1,4.7c2.3-0.1,4.1-0.5,5.8-2.2
					l0,0l0.7,1.7h5.4l0,0C132.2,61.3,132.1,51.3,132.1,51.3z M123.2,58.6c-1.2,0-1.7-0.9-1.7-1.7c0-1.4,2.7-1.3,4.7-2.4
					C126.3,56.8,125.3,58.6,123.2,58.6z"/>
				<path id="path110-2" inkscape:connector-curvature="0" class="st13" d="M240.5,55.1c-0.2,1.3-0.8,2.9-2.4,2.9c-1.9,0-3-2-3-4.5
					c0-1.9,0.7-4.5,3-4.5c0.7,0,1.2,0.2,1.6,0.7c0.4,0.4,0.6,1,0.6,1.7l0,0h5.9l0,0c-0.4-4.8-4-6.7-8.1-6.7c-5.1,0-8.9,3.2-8.9,8.8
					c0,5.5,3.9,8.9,8.9,8.9c4.3,0,7.7-2.3,8.3-7.2l0,0h-5.9L240.5,55.1z"/>
				<polygon id="polygon112-1" class="st13" points="222.6,61.9 228.6,61.9 228.6,45.1 222.6,45.1 				"/>
				<polygon id="polygon114-6" class="st13" points="222.6,42.5 228.6,42.5 228.6,38.2 222.6,38.2 				"/>
				<path id="path116-2" inkscape:connector-curvature="0" class="st13" d="M194.8,44.4c-5.2,0-8.8,3.3-8.8,9c0,5.6,3.9,8.9,8.8,8.9
					c5,0,8.9-3.2,8.9-9.2C203.7,48,200.2,44.4,194.8,44.4z M194.8,57.9c-1.6,0-2.8-1.8-2.8-4.9c0-1.8,0.7-4.1,2.8-4.1
					c1.6-0.1,2.7,1.8,2.7,4.3C197.6,56.3,196.5,57.9,194.8,57.9z"/>
				<path id="path118-0" inkscape:connector-curvature="0" class="st13" d="M175.2,49.2c0-0.8,0.8-1.2,1.9-1.2
					c0.5,0,1.1,0.1,1.5,0.4c0.2,0.1,0.5,0.6,0.6,1.2l0,0h5.6l0,0c-0.2-4.4-4.2-5.3-7.8-5.3c-3.2,0-7.4,1.3-7.4,5.5
					c0,6.9,9.9,4.4,9.9,7c0,1.2-0.8,1.6-2.3,1.6c-0.6,0-1.2-0.4-1.6-0.7c-0.4-0.3-0.6-0.7-0.6-1.5l0,0h-5.5l0,0
					c0.1,4.6,4.1,6.3,7.6,6.3c6.6,0,8.5-3,8.5-6.4C185.5,49.5,175.2,51.6,175.2,49.2z"/>
				<path id="path120-3" inkscape:connector-curvature="0" class="st13" d="M168.5,51.3c0-3.9-0.4-7-7.8-7c-6.1,0-8.2,2.3-8.1,6.2
					l0,0h5.5l0,0c0.1-1.4,1.4-2,2.3-2c0.6,0,2,0.2,2,1.3c0,3.6-10.6,0.3-10.6,7.8c0,3.4,3.3,4.8,5.1,4.7c2.3-0.1,4.1-0.5,5.8-2.2
					l0,0l0.7,1.7h5.4l0,0C168.5,61.3,168.5,51.3,168.5,51.3z M159.5,58.6c-1.2,0-1.7-0.9-1.7-1.7c0-1.4,2.7-1.3,4.7-2.4
					C162.7,56.8,161.7,58.6,159.5,58.6z"/>
				<path id="path122-0" inkscape:connector-curvature="0" class="st13" d="M106.6,37.7H96v24.2h6.8v-7.5h4l0,0
					c6.1,0,9.1-3.5,9.1-8.3C115.9,41.5,112.7,37.7,106.6,37.7z M106.2,49.1h-3.4v-5.5h2.5l0,0c1.5,0,3.7,0.4,3.7,2.5
					C109,48,107.9,49.1,106.2,49.1z"/>
				<path id="path124-1" inkscape:connector-curvature="0" class="st13" d="M215.6,44.4c-2.3,0-3.3,0.4-5.5,2.5l0,0V45h-5.6v16.9
					h5.6V53l0,0c0-2.1,1-3.4,2.9-3.4c1.7,0,2.2,1,2.2,2.6l0,0v9.7h6.1V51.6l0,0C221.3,47.1,219.7,44.4,215.6,44.4z"/>
				<path id="path126-3" inkscape:connector-curvature="0" class="st13" d="M145,44.4c-2.3,0-3.3,0.4-5.5,2.5l0,0V45h-5.6v16.9h5.9
					V53l0,0c0-2.1,0.8-3.6,2.7-3.6c1.7,0,2.1,1.2,2.1,2.8l0,0v9.7h6.1V51.6l0,0C150.8,47.1,149.1,44.4,145,44.4z"/>
				<g id="g130-6">
					<path id="path128" inkscape:connector-curvature="0" class="st14" d="M243.3,42.2c0-1.7,1.3-3,3-3s3,1.4,3,3s-1.4,3-3,3
						C244.7,45.3,243.3,43.9,243.3,42.2z M248.6,42.2c0-1.4-0.9-2.3-2.2-2.3s-2.2,1-2.2,2.3s0.9,2.3,2.2,2.3
						C247.6,44.5,248.6,43.6,248.6,42.2z M247.8,43.9H247l-0.7-1.4h-0.5v1.4h-0.7v-3.3h1.6c0.9,0,1.3,0.2,1.3,1
						c0,0.6-0.3,0.8-0.9,0.9L247.8,43.9z M246.7,42c0.4,0,0.6-0.1,0.6-0.5s-0.5-0.4-0.8-0.4h-0.7V42H246.7z"/>
				</g>
			</g>
			<g id="g173">
				<path id="path134" inkscape:connector-curvature="0" class="st15" d="M190.6,328.6h-39.1c-1.1,0-2-0.9-2-2v-82.3
					c0-1.1,0.9-2,2-2h39.1c1.1,0,2,0.9,2,2v82.3C192.6,327.7,191.7,328.6,190.6,328.6z"/>
				<g id="g171">
					<g id="g167">
						<g id="g165">
							<g id="g163">
								<rect id="rect136" x="150.6" y="310" width="40.8" height="16.8"/>
								<ellipse id="ellipse138" class="st16" cx="171" cy="299.1" rx="7.3" ry="1.3"/>
								<g id="g148">
									<g id="g146">
										<path id="path140" inkscape:connector-curvature="0" class="st15" d="M157.4,317.6L157.4,317.6c1.2,0,2.1,0.3,2.7,0.8
											c0.6,0.5,0.9,1,0.9,1.7s-0.3,1.3-1,1.8s-1.5,0.7-2.7,0.7c-1,0-1.7-0.2-2.2-0.6s-0.8-0.8-0.8-1.3c0-0.3,0.1-0.6,0.4-0.8
											c0.2-0.2,0.5-0.3,0.8-0.3s0.6,0.1,0.8,0.3c0.2,0.2,0.3,0.4,0.3,0.7c0,0.4-0.3,0.7-0.8,1c-0.1,0.1-0.2,0.1-0.2,0.2
											s0.1,0.2,0.4,0.3c0.3,0.1,0.6,0.1,0.9,0.1c1,0,1.5-0.7,1.5-2.2c0-1.4-0.6-2.1-1.8-2.1h-1c-0.2,0-0.3-0.1-0.3-0.2
											c0-0.2,0.1-0.3,0.3-0.3h0.7c0.7,0,1.2-0.2,1.5-0.5c0.2-0.3,0.4-0.8,0.4-1.4s-0.1-1.1-0.3-1.4s-0.5-0.4-1-0.4
											c-0.2,0-0.5,0-0.7,0.1s-0.3,0.2-0.3,0.2c0,0.1,0.1,0.2,0.2,0.2c0.4,0.2,0.6,0.5,0.6,0.8s-0.1,0.5-0.3,0.7
											s-0.4,0.2-0.7,0.2s-0.6-0.1-0.8-0.3c-0.2-0.2-0.4-0.4-0.4-0.7c0-0.5,0.3-0.9,0.8-1.2c0.5-0.3,1.2-0.5,2-0.5
											c0.9,0,1.7,0.2,2.3,0.6s0.9,0.9,0.9,1.5C160.8,316.6,159.7,317.4,157.4,317.6L157.4,317.6z"/>
										<path id="path142" inkscape:connector-curvature="0" class="st15" d="M168.5,313.8v8.2h0.8c1.2,0,2-0.3,2.2-1
											c0.3-0.6,0.4-1.7,0.4-3.3c0-1.2-0.1-2.1-0.2-2.6c-0.2-0.5-0.4-0.9-0.7-1.1s-0.7-0.3-1.2-0.3L168.5,313.8L168.5,313.8z
											 M166,322v-8.2h-1.3v-0.4h5.2c1.5,0,2.7,0.4,3.5,1.3c0.9,0.8,1.3,1.9,1.3,3.2c0,0.7-0.1,1.3-0.4,1.9
											c-0.3,0.6-0.7,1.1-1.2,1.6c-0.6,0.5-1.1,0.8-1.7,0.9c-0.6,0.1-1.3,0.2-2.1,0.2h-4.5V322H166z"/>
										<path id="path144" inkscape:connector-curvature="0" class="st15" d="M184.7,317.9c0-1.4,0-2.3-0.1-2.8
											c-0.1-0.4-0.2-0.8-0.4-1.1c-0.2-0.3-0.6-0.4-1.2-0.4c-0.5,0-0.8,0.1-1.1,0.3c-0.3,0.2-0.4,0.6-0.5,1.1s-0.1,1.4-0.1,2.8
											s0,2.3,0.1,2.8c0.1,0.4,0.2,0.8,0.5,1.1c0.2,0.3,0.6,0.4,1.2,0.4c0.4,0,0.8-0.1,1.1-0.3c0.3-0.2,0.5-0.6,0.5-1
											C184.6,320.2,184.7,319.3,184.7,317.9z M178.4,317.8c0-1.4,0.4-2.5,1.3-3.3c0.9-0.9,2-1.3,3.2-1.3s2.2,0.4,3.1,1.2
											c0.9,0.8,1.4,2,1.4,3.5c0,1.4-0.4,2.5-1.3,3.4c-0.9,0.8-1.9,1.3-3.2,1.3c-1.4,0-2.5-0.5-3.3-1.3
											C178.8,320.3,178.4,319.2,178.4,317.8L178.4,317.8z"/>
									</g>
								</g>
								
									<radialGradient id="ellipse157_1_" cx="-521.3314" cy="-370.4586" r="7.4743" gradientTransform="matrix(0.5908 0 0 -0.5908 479.8935 66.9034)" gradientUnits="userSpaceOnUse">
									<stop  offset="0" style="stop-color:#948472"/>
									<stop  offset="0.8933" style="stop-color:#000000"/>
									<stop  offset="1" style="stop-color:#000000"/>
								</radialGradient>
								<circle id="ellipse157" class="st17" cx="171" cy="287" r="6.2"/>
								<path id="path159" inkscape:connector-curvature="0" class="st18" d="M165.2,270.8c-0.9,0.6-1.2,4.1-1.2,4.1
									s0.2,3.5,1.2,4.1c0.9,0.6,5.8,1,5.8,1s4.9-0.4,5.8-1c0.9-0.6,1.2-4.1,1.2-4.1s-0.2-3.5-1.2-4.1c-0.9-0.6-5.8-1-5.8-1
									S166.2,270.2,165.2,270.8z"/>
								<polygon id="polygon161" class="st19" points="171,254.9 178.3,262.2 171,269.5 163.8,262.2 								"/>
							</g>
						</g>
					</g>
					<rect id="rect169" x="150.6" y="244.1" class="st20" width="40.8" height="82.7"/>
				</g>
			</g>
			<g id="g377">
				<path id="path175" inkscape:connector-curvature="0" class="st21" d="M211.7,262.7c0,0.2,0,0.4,0.1,0.5s0.2,0.2,0.4,0.2
					c0.3,0,0.5-0.3,0.5-0.5c0-0.5-0.4-0.5-0.7-0.5v-0.8c0.3,0,0.6,0,0.6-0.5c0-0.3-0.2-0.4-0.4-0.4c-0.3,0-0.4,0.2-0.5,0.5h-1
					c0-1,0.7-1.5,1.5-1.5c0.9,0,1.4,0.5,1.4,1.3c0,0.4-0.1,0.7-0.4,0.9c0.3,0.2,0.5,0.5,0.5,0.9c0,1-0.6,1.6-1.6,1.6
					c-0.8,0-1.5-0.5-1.5-1.7H211.7z"/>
				<path id="path177" inkscape:connector-curvature="0" class="st21" d="M214.3,264.2v-4.6h1.6c1.2,0,1.9,0.7,1.9,2.2
					c0,1.7-0.8,2.4-2,2.4H214.3z M215.5,263.2h0.3c0.6,0,0.9-0.4,0.9-1.2c0-1-0.3-1.2-0.9-1.2h-0.2v2.4L215.5,263.2z"/>
				<path id="path179" inkscape:connector-curvature="0" class="st21" d="M222,261.9c0,1.6-0.8,2.4-1.9,2.4c-1.2,0-1.9-0.9-1.9-2.5
					c0-1.4,0.8-2.4,1.9-2.4C221.4,259.5,222,260.7,222,261.9z M219.3,261.9c0,0.6,0.1,1.3,0.7,1.3c0.5,0,0.7-0.6,0.7-1.3
					c0-0.6-0.2-1.3-0.7-1.3S219.3,261.3,219.3,261.9z"/>
				<path id="path181" inkscape:connector-curvature="0" class="st21" d="M222.5,264.8c0.2,0,0.3-0.1,0.4-0.2
					c0.1-0.1,0.1-0.2,0.1-0.4h-0.5v-1.3h1.1v1.1c0,0.9-0.4,1.3-1.1,1.3V264.8z"/>
				<path id="path183" inkscape:connector-curvature="0" class="st21" d="M226,264.2v-4.6h1.2v4.6H226z"/>
				<path id="path185" inkscape:connector-curvature="0" class="st21" d="M227.8,260.9h1v0.5c0.2-0.4,0.5-0.6,0.9-0.6
					c0.7,0,1,0.5,1,1.4v2h-1.1v-1.8c0-0.3-0.1-0.6-0.4-0.6c-0.3,0-0.4,0.3-0.4,0.7v1.7h-1.1v-3.3L227.8,260.9z"/>
				<path id="path187" inkscape:connector-curvature="0" class="st21" d="M233,264.2c-1.4,0.1-1.6,0-1.6-1.2v-1.4H231v-0.8h0.4v-1h1
					v1h0.5v0.8h-0.5v1.2c0,0.3,0,0.4,0.3,0.4h0.2v1H233z"/>
				<path id="path189" inkscape:connector-curvature="0" class="st21" d="M234.5,262.9c0,0.4,0.2,0.7,0.5,0.7c0.2,0,0.3-0.1,0.4-0.3
					h1c-0.2,0.8-0.9,1.1-1.5,1.1c-0.9,0-1.5-0.6-1.5-1.7s0.7-1.8,1.5-1.8c1,0,1.6,0.9,1.6,2.1h-2V262.9z M235.4,262.2
					c0-0.3-0.2-0.6-0.5-0.6s-0.5,0.2-0.5,0.6H235.4z"/>
				<path id="path191" inkscape:connector-curvature="0" class="st21" d="M236.9,260.9h1v0.7l0,0c0.1-0.5,0.4-0.8,0.8-0.8h0.1v1.3
					c-0.1,0-0.1,0-0.2,0c-0.4,0-0.7,0.3-0.7,1v1.2h-1.1L236.9,260.9L236.9,260.9z"/>
				<path id="path193" inkscape:connector-curvature="0" class="st21" d="M241.1,264.2l-0.1-0.4c-0.3,0.4-0.6,0.5-1,0.5
					c-0.5,0-1-0.3-1-1c0-1.5,1.9-0.8,1.9-1.5c0-0.2-0.2-0.3-0.3-0.3s-0.3,0-0.4,0.3h-1c0-0.7,0.4-1.1,1.5-1.1c1.3,0,1.3,0.6,1.3,1.4
					v1.6c0,0.2,0,0.3,0.1,0.4v0.1H241.1z M241,262.8c-0.3,0.2-0.8,0.1-0.8,0.5c0,0.2,0.1,0.3,0.3,0.3
					C240.9,263.6,241,263.2,241,262.8z"/>
				<path id="path195" inkscape:connector-curvature="0" class="st21" d="M244.4,262.2c0-0.1,0-0.3-0.1-0.3
					c-0.1-0.1-0.2-0.1-0.3-0.1c-0.4,0-0.5,0.5-0.5,0.9c0,0.5,0.2,0.8,0.5,0.8s0.4-0.2,0.4-0.5h1.1c0,0.5-0.2,0.9-0.5,1.1
					s-0.6,0.3-1,0.3c-0.9,0-1.5-0.6-1.5-1.7s0.6-1.8,1.5-1.8c0.7,0,1.4,0.4,1.5,1.4L244.4,262.2L244.4,262.2z"/>
				<path id="path197" inkscape:connector-curvature="0" class="st21" d="M247.7,264.2c-1.4,0.1-1.6,0-1.6-1.2v-1.4h-0.4v-0.8h0.4
					v-1h1v1h0.5v0.8h-0.5v1.2c0,0.3,0,0.4,0.3,0.4h0.2v1H247.7z"/>
				<path id="path199" inkscape:connector-curvature="0" class="st21" d="M248.3,259.5h1.1v0.9h-1.1V259.5z M248.3,264.2v-3.4h1.1
					v3.4H248.3z"/>
				<path id="path201" inkscape:connector-curvature="0" class="st21" d="M249.8,260.9h1.1l0.5,2.1l0.5-2.1h1l-0.9,3.4h-1.2
					L249.8,260.9z"/>
				<path id="path203" inkscape:connector-curvature="0" class="st21" d="M254,262.9c0,0.4,0.2,0.7,0.5,0.7c0.2,0,0.3-0.1,0.4-0.3h1
					c-0.2,0.8-0.9,1.1-1.5,1.1c-0.9,0-1.5-0.6-1.5-1.7s0.7-1.8,1.5-1.8c1,0,1.6,0.9,1.6,2.1h-2V262.9z M255,262.2
					c0-0.3-0.2-0.6-0.5-0.6s-0.5,0.2-0.5,0.6H255z"/>
				<path id="path205" inkscape:connector-curvature="0" class="st21" d="M258.2,264.2v-4.6h1.5l0.6,2.9l0.6-2.9h1.5v4.6h-1.1v-1.4
					v-0.7l0.1-0.8l0,0l-0.7,3h-0.8l-0.7-3l0,0l0.1,0.7v0.7v1.6h-1.1V264.2z"/>
				<path id="path207" inkscape:connector-curvature="0" class="st21" d="M265.9,264.2h-1v-0.5c-0.3,0.5-0.5,0.6-1,0.6
					c-0.6,0-1-0.4-1-1.4v-2h1.1v1.8c0,0.5,0.1,0.6,0.4,0.6s0.4-0.3,0.4-0.8v-1.6h1.1V264.2z"/>
				<path id="path209" inkscape:connector-curvature="0" class="st21" d="M266.5,264.2v-4.6h1.1v4.6H266.5z"/>
				<path id="path211" inkscape:connector-curvature="0" class="st21" d="M269.9,264.2c-1.4,0.1-1.6,0-1.6-1.2v-1.4h-0.4v-0.8h0.4
					v-1h1v1h0.5v0.8h-0.5v1.2c0,0.3,0,0.4,0.3,0.4h0.2v1H269.9z"/>
				<path id="path213" inkscape:connector-curvature="0" class="st21" d="M270.4,259.5h1.1v0.9h-1.1V259.5z M270.4,264.2v-3.4h1.1
					v3.4H270.4z"/>
				<path id="path215" inkscape:connector-curvature="0" class="st21" d="M273,260.9v0.5l0,0c0.1-0.4,0.5-0.6,0.8-0.6
					c0.8,0,1.2,0.8,1.2,1.7c0,1.3-0.7,1.8-1.3,1.8c-0.3,0-0.5-0.1-0.7-0.4v1.5h-1.1v-4.5H273z M274,262.6c0-0.5-0.2-0.8-0.5-0.8
					s-0.4,0.3-0.4,0.8s0.2,0.8,0.4,0.8C273.8,263.3,274,263,274,262.6z"/>
				<path id="path217" inkscape:connector-curvature="0" class="st21" d="M275.6,264.2v-4.6h1.1v4.6H275.6z"/>
				<path id="path219" inkscape:connector-curvature="0" class="st21" d="M279.1,264.2l-0.1-0.4c-0.3,0.4-0.6,0.5-1,0.5
					c-0.5,0-1-0.3-1-1c0-1.5,1.9-0.8,1.9-1.5c0-0.2-0.2-0.3-0.3-0.3c-0.1,0-0.3,0-0.4,0.3h-1c0-0.7,0.4-1.1,1.5-1.1
					c1.3,0,1.3,0.6,1.3,1.4v1.6c0,0.2,0,0.3,0.1,0.4v0.1H279.1z M279,262.8c-0.3,0.2-0.8,0.1-0.8,0.5c0,0.2,0.1,0.3,0.3,0.3
					C278.9,263.6,279,263.2,279,262.8z"/>
				<path id="path221" inkscape:connector-curvature="0" class="st21" d="M281.9,263l0.5-2.1h1l-0.9,3.1c-0.3,1-0.4,1.4-1.3,1.4
					c-0.2,0-0.4,0-0.5,0v-0.9c0.1,0,0.1,0,0.2,0c0.3,0,0.4-0.1,0.3-0.5l-0.9-3h1.1L281.9,263z"/>
				<path id="path223" inkscape:connector-curvature="0" class="st21" d="M284.7,262.9c0,0.4,0.2,0.7,0.5,0.7c0.2,0,0.3-0.1,0.4-0.3
					h1c-0.2,0.8-0.9,1.1-1.5,1.1c-0.9,0-1.5-0.6-1.5-1.7s0.7-1.8,1.5-1.8c1,0,1.6,0.9,1.6,2.1h-2V262.9z M285.7,262.2
					c0-0.3-0.2-0.6-0.5-0.6s-0.5,0.2-0.5,0.6H285.7z"/>
				<path id="path225" inkscape:connector-curvature="0" class="st21" d="M287.1,260.9h1v0.7l0,0c0.1-0.5,0.4-0.8,0.8-0.8h0.1v1.3
					c-0.1,0-0.1,0-0.2,0c-0.4,0-0.7,0.3-0.7,1v1.2H287v-3.4L287.1,260.9z"/>
				<path id="path227" inkscape:connector-curvature="0" class="st21" d="M212.7,271.9l-0.1-0.4c-0.3,0.4-0.6,0.5-1,0.5
					c-0.5,0-1-0.3-1-1c0-1.5,1.9-0.8,1.9-1.5c0-0.2-0.2-0.3-0.3-0.3s-0.3,0-0.4,0.3h-1c0-0.7,0.4-1.1,1.5-1.1c1.3,0,1.3,0.6,1.3,1.4
					v1.6c0,0.2,0,0.3,0.1,0.4v0.1H212.7z M212.6,270.4c-0.3,0.2-0.8,0.1-0.8,0.5c0,0.2,0.1,0.3,0.3,0.3
					C212.5,271.3,212.6,270.9,212.6,270.4z"/>
				<path id="path229" inkscape:connector-curvature="0" class="st21" d="M214.2,268.6h1v0.5c0.2-0.4,0.5-0.6,0.9-0.6
					c0.7,0,1,0.5,1,1.4v2H216v-1.8c0-0.3-0.1-0.6-0.4-0.6c-0.3,0-0.4,0.3-0.4,0.7v1.7h-1.1L214.2,268.6L214.2,268.6z"/>
				<path id="path231" inkscape:connector-curvature="0" class="st21" d="M219.6,271.9v-0.4c-0.3,0.4-0.5,0.5-0.8,0.5
					c-0.8,0-1.2-0.8-1.2-1.7c0-1.1,0.5-1.8,1.1-1.8c0.3,0,0.6,0.1,0.8,0.4v-1.6h1.1v4.6H219.6z M219.5,270.3c0-0.4-0.1-0.8-0.5-0.8
					s-0.5,0.4-0.5,0.8s0.1,0.8,0.4,0.8C219.4,271,219.5,270.7,219.5,270.3z"/>
				<path id="path233" inkscape:connector-curvature="0" class="st21" d="M222.6,267.3h3.4v1.2h-1.1v3.4h-1.2v-3.4h-1.1L222.6,267.3
					z"/>
				<path id="path235" inkscape:connector-curvature="0" class="st21" d="M226.4,267.3h1.1v1.7c0.2-0.3,0.5-0.5,0.8-0.5
					c0.7,0,1,0.5,1,1.4v2h-1.1v-1.8c0-0.3-0.1-0.6-0.4-0.6c-0.3,0-0.4,0.3-0.4,0.7v1.7h-1.1L226.4,267.3L226.4,267.3z"/>
				<path id="path237" inkscape:connector-curvature="0" class="st21" d="M230.8,270.5c0,0.4,0.2,0.7,0.5,0.7c0.2,0,0.3-0.1,0.4-0.3
					h1c-0.2,0.8-0.9,1.1-1.5,1.1c-0.9,0-1.5-0.6-1.5-1.7s0.7-1.8,1.5-1.8c1,0,1.6,0.9,1.6,2.1h-2V270.5z M231.7,269.9
					c0-0.3-0.2-0.6-0.5-0.6s-0.5,0.2-0.5,0.6H231.7z"/>
				<path id="path239" inkscape:connector-curvature="0" class="st21" d="M235.9,270.3c0,0.2,0,0.4,0.1,0.5s0.2,0.2,0.4,0.2
					c0.3,0,0.5-0.3,0.5-0.5c0-0.5-0.4-0.5-0.7-0.5v-0.8c0.3,0,0.6,0,0.6-0.5c0-0.3-0.2-0.4-0.4-0.4c-0.3,0-0.4,0.2-0.5,0.5h-1
					c0-1,0.7-1.5,1.5-1.5c0.9,0,1.4,0.5,1.4,1.3c0,0.4-0.1,0.7-0.4,0.9c0.3,0.2,0.5,0.5,0.5,0.9c0,1-0.6,1.6-1.6,1.6
					c-0.8,0-1.5-0.5-1.5-1.7H235.9z"/>
				<path id="path241" inkscape:connector-curvature="0" class="st21" d="M238.4,271.9v-4.6h1.6c1.2,0,1.9,0.7,1.9,2.2
					c0,1.7-0.8,2.4-2,2.4H238.4z M239.6,270.8h0.3c0.6,0,0.9-0.4,0.9-1.2c0-1-0.3-1.2-0.9-1.2h-0.2v2.4L239.6,270.8z"/>
				<path id="path243" inkscape:connector-curvature="0" class="st21" d="M246.1,269.6c0,1.6-0.8,2.4-1.9,2.4
					c-1.2,0-1.9-0.9-1.9-2.5c0-1.4,0.8-2.4,1.9-2.4C245.5,267.2,246.1,268.4,246.1,269.6z M243.5,269.6c0,0.6,0.1,1.3,0.7,1.3
					c0.5,0,0.7-0.6,0.7-1.3c0-0.6-0.2-1.3-0.7-1.3C243.6,268.3,243.5,269,243.5,269.6z"/>
				<path id="path245" inkscape:connector-curvature="0" class="st21" d="M250.7,269.1c0-0.5-0.3-0.8-0.7-0.8s-0.7,0.5-0.7,1.3
					c0,0.6,0.1,1.3,0.7,1.3c0.4,0,0.6-0.3,0.6-0.8h1.2c-0.1,1.2-0.8,1.9-1.8,1.9c-1.2,0-2-0.9-2-2.4s0.8-2.4,1.8-2.4
					c1.1,0,1.8,0.7,1.9,1.9H250.7z"/>
				<path id="path247" inkscape:connector-curvature="0" class="st21" d="M253.7,268.5c0.9,0,1.5,0.7,1.5,1.7c0,1.2-0.7,1.8-1.5,1.8
					s-1.5-0.6-1.5-1.7C252.2,269.1,252.8,268.5,253.7,268.5z M253.2,270.2c0,0.6,0.2,0.9,0.5,0.9s0.5-0.3,0.5-0.9
					c0-0.5-0.2-0.9-0.4-0.8C253.3,269.4,253.2,269.8,253.2,270.2z"/>
				<path id="path249" inkscape:connector-curvature="0" class="st21" d="M255.6,268.6h1v0.5c0.1-0.3,0.5-0.6,0.8-0.6
					c0.5,0,0.7,0.3,0.9,0.6c0.2-0.4,0.5-0.6,0.9-0.6c0.8,0,1,0.5,1,1.5v2h-1.1v-1.7c0-0.5-0.1-0.7-0.4-0.7s-0.4,0.3-0.4,0.7v1.7
					h-1.1v-1.7c0-0.5-0.1-0.7-0.4-0.7s-0.4,0.3-0.4,0.7v1.7h-1.1v-3.4H255.6z"/>
				<path id="path251" inkscape:connector-curvature="0" class="st21" d="M261.7,268.6v0.5l0,0c0.1-0.4,0.5-0.6,0.8-0.6
					c0.8,0,1.2,0.8,1.2,1.7c0,1.3-0.7,1.8-1.3,1.8c-0.3,0-0.5-0.1-0.7-0.4v1.5h-1.1v-4.5H261.7z M262.7,270.2c0-0.5-0.2-0.8-0.5-0.8
					s-0.4,0.3-0.4,0.8s0.2,0.8,0.4,0.8C262.5,271,262.7,270.7,262.7,270.2z"/>
				<path id="path253" inkscape:connector-curvature="0" class="st21" d="M266,271.9l-0.1-0.4c-0.3,0.4-0.6,0.5-1,0.5
					c-0.5,0-1-0.3-1-1c0-1.5,1.9-0.8,1.9-1.5c0-0.2-0.2-0.3-0.3-0.3c-0.1,0-0.3,0-0.4,0.3h-1c0-0.7,0.4-1.1,1.5-1.1
					c1.3,0,1.3,0.6,1.3,1.4v1.6c0,0.2,0,0.3,0.1,0.4v0.1H266z M265.9,270.4c-0.3,0.2-0.8,0.1-0.8,0.5c0,0.2,0.1,0.3,0.3,0.3
					C265.8,271.3,266,270.9,265.9,270.4z"/>
				<path id="path255" inkscape:connector-curvature="0" class="st21" d="M269.3,271.9c-1.4,0.1-1.6,0-1.6-1.2v-1.4h-0.4v-0.8h0.4
					v-1h1v1h0.5v0.8h-0.5v1.2c0,0.3,0,0.4,0.3,0.4h0.2v1H269.3z"/>
				<path id="path257" inkscape:connector-curvature="0" class="st21" d="M269.9,267.2h1.1v0.9h-1.1V267.2z M269.9,271.9v-3.4h1.1
					v3.4H269.9z"/>
				<path id="path259" inkscape:connector-curvature="0" class="st21" d="M272.6,268.9c0.2-0.3,0.5-0.4,0.8-0.4
					c0.7,0,1.2,0.7,1.2,1.8c0,1-0.3,1.8-1.2,1.8c-0.4,0-0.7-0.2-0.8-0.6l0,0v0.5h-1v-4.6h1.1v1.5L272.6,268.9z M273.5,270.3
					c0-0.4-0.1-0.8-0.5-0.8c-0.3,0-0.4,0.4-0.4,0.7c0,0.4,0.1,0.8,0.4,0.8C273.4,271,273.5,270.6,273.5,270.3z"/>
				<path id="path261" inkscape:connector-curvature="0" class="st21" d="M275,267.2h1.1v0.9H275V267.2z M275,271.9v-3.4h1.1v3.4
					H275z"/>
				<path id="path263" inkscape:connector-curvature="0" class="st21" d="M276.7,271.9v-4.6h1.1v4.6H276.7z"/>
				<path id="path265" inkscape:connector-curvature="0" class="st21" d="M278.4,267.2h1.1v0.9h-1.1V267.2z M278.4,271.9v-3.4h1.1
					v3.4H278.4z"/>
				<path id="path267" inkscape:connector-curvature="0" class="st21" d="M281.8,271.9c-1.4,0.1-1.6,0-1.6-1.2v-1.4h-0.4v-0.8h0.4
					v-1h1v1h0.5v0.8h-0.5v1.2c0,0.3,0,0.4,0.3,0.4h0.2v1H281.8z"/>
				<path id="path269" inkscape:connector-curvature="0" class="st21" d="M283.6,270.6l0.5-2.1h1l-0.9,3.1c-0.3,1-0.4,1.4-1.3,1.4
					c-0.2,0-0.4,0-0.5,0v-0.9c0.1,0,0.1,0,0.2,0c0.3,0,0.4-0.1,0.3-0.5l-0.9-3h1.1L283.6,270.6z"/>
				<path id="path271" inkscape:connector-curvature="0" class="st21" d="M212.8,276.3c0-0.2-0.1-0.3-0.2-0.3
					c-0.1,0-0.2-0.1-0.3-0.1c-0.3,0-0.4,0.1-0.4,0.3c0,0.7,2.1,0.3,2.1,1.9c0,1.1-0.7,1.6-1.7,1.6s-1.6-0.7-1.6-1.5h1.2
					c0,0.2,0.1,0.3,0.2,0.4c0.1,0.1,0.2,0.1,0.3,0.1c0.3,0,0.5-0.1,0.5-0.3c0-0.7-2.1-0.2-2.1-2c0-1,0.7-1.5,1.6-1.5
					c1,0,1.5,0.7,1.6,1.5h-1.2L212.8,276.3z"/>
				<path id="path273" inkscape:connector-curvature="0" class="st21" d="M215.8,278.3l0.5-2.1h1l-0.9,3.1c-0.3,1-0.4,1.4-1.3,1.4
					c-0.2,0-0.4,0-0.5,0v-0.9c0.1,0,0.1,0,0.2,0c0.3,0,0.4-0.1,0.3-0.5l-0.9-3h1.1L215.8,278.3z"/>
				<path id="path275" inkscape:connector-curvature="0" class="st21" d="M217.6,276.2h1v0.5c0.1-0.3,0.5-0.6,0.8-0.6
					c0.5,0,0.7,0.3,0.9,0.6c0.2-0.4,0.5-0.6,0.9-0.6c0.8,0,1,0.5,1,1.5v2h-1.1v-1.7c0-0.5-0.1-0.7-0.4-0.7c-0.3,0-0.4,0.3-0.4,0.7
					v1.7h-1.1v-1.7c0-0.5-0.1-0.7-0.4-0.7c-0.3,0-0.4,0.3-0.4,0.7v1.7h-1.1v-3.4H217.6z"/>
				<path id="path277" inkscape:connector-curvature="0" class="st21" d="M223.8,276.6c0.2-0.3,0.5-0.4,0.8-0.4
					c0.7,0,1.2,0.7,1.2,1.8c0,1-0.3,1.8-1.2,1.8c-0.4,0-0.7-0.2-0.8-0.6l0,0v0.5h-1V275h1.1v1.6H223.8z M224.6,277.9
					c0-0.4-0.1-0.8-0.5-0.8c-0.3,0-0.4,0.4-0.4,0.7c0,0.4,0.1,0.8,0.4,0.8C224.5,278.7,224.6,278.3,224.6,277.9z"/>
				<path id="path279" inkscape:connector-curvature="0" class="st21" d="M227.6,276.1c0.9,0,1.5,0.7,1.5,1.7c0,1.2-0.7,1.8-1.5,1.8
					s-1.5-0.6-1.5-1.7C226,276.8,226.7,276.1,227.6,276.1z M227.1,277.9c0,0.6,0.2,0.9,0.5,0.9s0.5-0.3,0.5-0.9
					c0-0.5-0.2-0.9-0.4-0.8C227.2,277,227.1,277.5,227.1,277.9z"/>
				<path id="path281" inkscape:connector-curvature="0" class="st21" d="M229.6,279.6V275h1.1v4.6H229.6z"/>
				<path id="path283" inkscape:connector-curvature="0" class="st21" d="M234.8,279.6l-0.1-0.4c-0.3,0.4-0.6,0.5-1,0.5
					c-0.5,0-1-0.3-1-1c0-1.5,1.9-0.8,1.9-1.5c0-0.2-0.2-0.3-0.3-0.3s-0.3,0-0.4,0.3h-1c0-0.7,0.4-1.1,1.5-1.1c1.3,0,1.3,0.6,1.3,1.4
					v1.6c0,0.2,0,0.3,0.1,0.4v0.1H234.8z M234.7,278.1c-0.3,0.2-0.8,0.1-0.8,0.5c0,0.2,0.1,0.3,0.3,0.3
					C234.6,278.9,234.7,278.6,234.7,278.1z"/>
				<path id="path285" inkscape:connector-curvature="0" class="st21" d="M236.4,276.2h1v0.7l0,0c0.1-0.5,0.4-0.8,0.8-0.8h0.1v1.3
					c-0.1,0-0.1,0-0.2,0c-0.4,0-0.7,0.3-0.7,1v1.2h-1.1L236.4,276.2L236.4,276.2z"/>
				<path id="path287" inkscape:connector-curvature="0" class="st21" d="M239.5,278.2c0,0.4,0.2,0.7,0.5,0.7c0.2,0,0.3-0.1,0.4-0.3
					h1c-0.2,0.8-0.9,1.1-1.5,1.1c-0.9,0-1.5-0.6-1.5-1.7s0.7-1.8,1.5-1.8c1,0,1.6,0.9,1.6,2.1h-2V278.2z M240.4,277.5
					c0-0.3-0.2-0.6-0.5-0.6s-0.5,0.2-0.5,0.6H240.4z"/>
				<path id="path289" inkscape:connector-curvature="0" class="st21" d="M245.4,279.6c-1.4,0.1-1.6,0-1.6-1.2V277h-0.4v-0.8h0.4v-1
					h1v1h0.5v0.8h-0.5v1.2c0,0.3,0,0.4,0.3,0.4h0.2v1H245.4z"/>
				<path id="path291" inkscape:connector-curvature="0" class="st21" d="M245.9,276.2h1v0.7l0,0c0.1-0.5,0.4-0.8,0.8-0.8h0.1v1.3
					c-0.1,0-0.1,0-0.2,0c-0.4,0-0.7,0.3-0.7,1v1.2h-1.1L245.9,276.2L245.9,276.2z"/>
				<path id="path293" inkscape:connector-curvature="0" class="st21" d="M250,279.6l-0.1-0.4c-0.3,0.4-0.6,0.5-1,0.5
					c-0.5,0-1-0.3-1-1c0-1.5,1.9-0.8,1.9-1.5c0-0.2-0.2-0.3-0.3-0.3s-0.3,0-0.4,0.3h-1c0-0.7,0.4-1.1,1.5-1.1c1.3,0,1.3,0.6,1.3,1.4
					v1.6c0,0.2,0,0.3,0.1,0.4v0.1H250z M249.9,278.1c-0.3,0.2-0.8,0.1-0.8,0.5c0,0.2,0.1,0.3,0.3,0.3
					C249.8,278.9,250,278.6,249.9,278.1z"/>
				<path id="path295" inkscape:connector-curvature="0" class="st21" d="M253.5,279.6v-0.4c-0.3,0.4-0.5,0.5-0.8,0.5
					c-0.8,0-1.2-0.8-1.2-1.7c0-1.1,0.5-1.8,1.1-1.8c0.3,0,0.6,0.1,0.8,0.4V275h1.1v4.6H253.5z M253.4,277.9c0-0.4-0.1-0.8-0.5-0.8
					s-0.5,0.4-0.5,0.8s0.1,0.8,0.4,0.8C253.3,278.7,253.4,278.3,253.4,277.9z"/>
				<path id="path297" inkscape:connector-curvature="0" class="st21" d="M255.9,278.2c0,0.4,0.2,0.7,0.5,0.7c0.2,0,0.3-0.1,0.4-0.3
					h1c-0.2,0.8-0.9,1.1-1.5,1.1c-0.9,0-1.5-0.6-1.5-1.7s0.7-1.8,1.5-1.8c1,0,1.6,0.9,1.6,2.1h-2V278.2z M256.9,277.5
					c0-0.3-0.2-0.6-0.5-0.6s-0.5,0.2-0.5,0.6H256.9z"/>
				<path id="path299" inkscape:connector-curvature="0" class="st21" d="M258.4,276.2h1v0.5c0.1-0.3,0.5-0.6,0.8-0.6
					c0.5,0,0.7,0.3,0.9,0.6c0.2-0.4,0.5-0.6,0.9-0.6c0.8,0,1,0.5,1,1.5v2h-1.1v-1.7c0-0.5-0.1-0.7-0.4-0.7s-0.4,0.3-0.4,0.7v1.7H260
					v-1.7c0-0.5-0.1-0.7-0.4-0.7s-0.4,0.3-0.4,0.7v1.7h-1.1v-3.4H258.4z"/>
				<path id="path301" inkscape:connector-curvature="0" class="st21" d="M265.4,279.6l-0.1-0.4c-0.3,0.4-0.6,0.5-1,0.5
					c-0.5,0-1-0.3-1-1c0-1.5,1.9-0.8,1.9-1.5c0-0.2-0.2-0.3-0.3-0.3c-0.1,0-0.3,0-0.4,0.3h-1c0-0.7,0.4-1.1,1.5-1.1
					c1.3,0,1.3,0.6,1.3,1.4v1.6c0,0.2,0,0.3,0.1,0.4v0.1H265.4z M265.3,278.1c-0.3,0.2-0.8,0.1-0.8,0.5c0,0.2,0.1,0.3,0.3,0.3
					C265.2,278.9,265.3,278.6,265.3,278.1z"/>
				<path id="path303" inkscape:connector-curvature="0" class="st21" d="M266.9,276.2h1v0.7l0,0c0.1-0.5,0.4-0.8,0.8-0.8h0.1v1.3
					c-0.1,0-0.1,0-0.2,0c-0.4,0-0.7,0.3-0.7,1v1.2h-1.1v-3.4L266.9,276.2z"/>
				<path id="path305" inkscape:connector-curvature="0" class="st21" d="M270.2,278.6v0.9h-1.1V275h1.1v2.3l0.7-1h1.2l-1,1.3
					l1.1,2.1H271l-0.6-1.2L270.2,278.6z"/>
				<path id="path307" inkscape:connector-curvature="0" class="st21" d="M273.5,278.5c0,0.1,0,0.2,0.1,0.3c0.1,0.1,0.2,0.1,0.3,0.1
					c0.2,0,0.3-0.1,0.3-0.3c0-0.5-1.6-0.1-1.6-1.4c0-0.9,0.7-1.1,1.3-1.1c0.6,0,1.3,0.2,1.3,1.1h-1c0-0.1,0-0.2-0.1-0.2
					c-0.1-0.1-0.1-0.1-0.2-0.1c-0.2,0-0.3,0.1-0.3,0.2c0,0.5,1.7,0.2,1.7,1.4c0,0.7-0.5,1.2-1.4,1.2c-0.6,0-1.3-0.2-1.3-1.1h0.9
					L273.5,278.5z"/>
				<path id="path309" inkscape:connector-curvature="0" class="st21" d="M278.8,276.1c0.9,0,1.5,0.7,1.5,1.7c0,1.2-0.7,1.8-1.5,1.8
					s-1.5-0.6-1.5-1.7S277.9,276.1,278.8,276.1z M278.4,277.9c0,0.6,0.2,0.9,0.5,0.9s0.5-0.3,0.5-0.9c0-0.5-0.2-0.9-0.4-0.8
					C278.5,277,278.4,277.5,278.4,277.9z"/>
				<path id="path311" inkscape:connector-curvature="0" class="st21" d="M282.5,276.2v0.8H282v2.6h-1.1V277h-0.4v-0.8h0.4
					c0-1.2,0.4-1.4,1-1.4h0.5v0.8c-0.3,0-0.5,0-0.4,0.5h0.5V276.2z"/>
				<path id="path313" inkscape:connector-curvature="0" class="st21" d="M210.7,282.6h3.4v1.2H213v3.4h-1.2v-3.4h-1.1V282.6z"/>
				<path id="path315" inkscape:connector-curvature="0" class="st21" d="M214.5,282.6h1.1v1.7c0.2-0.3,0.5-0.5,0.8-0.5
					c0.7,0,1,0.5,1,1.4v2h-1.1v-1.8c0-0.3-0.1-0.6-0.4-0.6c-0.3,0-0.4,0.3-0.4,0.7v1.7h-1.1L214.5,282.6L214.5,282.6z"/>
				<path id="path317" inkscape:connector-curvature="0" class="st21" d="M218.9,285.9c0,0.4,0.2,0.7,0.5,0.7c0.2,0,0.3-0.1,0.4-0.3
					h1c-0.2,0.8-0.9,1.1-1.5,1.1c-0.9,0-1.5-0.6-1.5-1.7s0.7-1.8,1.5-1.8c1,0,1.6,0.9,1.6,2.1h-2V285.9z M219.8,285.2
					c0-0.3-0.2-0.6-0.5-0.6s-0.5,0.2-0.5,0.6H219.8z"/>
				<path id="path319" inkscape:connector-curvature="0" class="st21" d="M223.9,285.7c0,0.2,0,0.4,0.1,0.5s0.2,0.2,0.4,0.2
					c0.3,0,0.5-0.3,0.5-0.5c0-0.5-0.4-0.5-0.7-0.5v-0.8c0.3,0,0.6,0,0.6-0.5c0-0.3-0.2-0.4-0.4-0.4c-0.3,0-0.4,0.2-0.5,0.5h-1
					c0-1,0.7-1.5,1.5-1.5c0.9,0,1.4,0.5,1.4,1.3c0,0.4-0.1,0.7-0.4,0.9c0.3,0.2,0.5,0.5,0.5,0.9c0,1-0.6,1.6-1.6,1.6
					c-0.8,0-1.5-0.5-1.5-1.7H223.9z"/>
				<path id="path321" inkscape:connector-curvature="0" class="st21" d="M226.5,287.2v-4.6h1.6c1.2,0,1.9,0.7,1.9,2.2
					c0,1.7-0.8,2.4-2,2.4H226.5z M227.7,286.2h0.3c0.6,0,0.9-0.4,0.9-1.2c0-1-0.3-1.2-0.9-1.2h-0.2v2.4L227.7,286.2z"/>
				<path id="path323" inkscape:connector-curvature="0" class="st21" d="M234.2,284.9c0,1.6-0.8,2.4-1.9,2.4
					c-1.2,0-1.9-0.9-1.9-2.5c0-1.4,0.8-2.4,1.9-2.4C233.6,282.5,234.2,283.7,234.2,284.9z M231.5,284.9c0,0.6,0.1,1.3,0.7,1.3
					c0.5,0,0.7-0.6,0.7-1.3c0-0.6-0.2-1.3-0.7-1.3S231.5,284.3,231.5,284.9z"/>
				<path id="path325" inkscape:connector-curvature="0" class="st21" d="M238.7,284.4c0-0.5-0.3-0.8-0.7-0.8s-0.7,0.5-0.7,1.3
					c0,0.6,0.1,1.3,0.7,1.3c0.4,0,0.6-0.3,0.6-0.8h1.2c-0.1,1.2-0.8,1.9-1.8,1.9c-1.2,0-2-0.9-2-2.4s0.8-2.4,1.8-2.4
					c1.1,0,1.8,0.7,1.9,1.9H238.7z"/>
				<path id="path327" inkscape:connector-curvature="0" class="st21" d="M241.8,283.8c0.9,0,1.5,0.7,1.5,1.7c0,1.2-0.7,1.8-1.5,1.8
					s-1.5-0.6-1.5-1.7C240.2,284.4,240.9,283.8,241.8,283.8z M241.3,285.5c0,0.6,0.2,0.9,0.5,0.9s0.5-0.3,0.5-0.9
					c0-0.5-0.2-0.9-0.4-0.8C241.4,284.7,241.3,285.2,241.3,285.5z"/>
				<path id="path329" inkscape:connector-curvature="0" class="st21" d="M243.7,283.9h1v0.5c0.1-0.3,0.5-0.6,0.8-0.6
					c0.5,0,0.7,0.3,0.9,0.6c0.2-0.4,0.5-0.6,0.9-0.6c0.8,0,1,0.5,1,1.5v2h-1.1v-1.7c0-0.5-0.1-0.7-0.4-0.7c-0.3,0-0.4,0.3-0.4,0.7
					v1.7h-1.1v-1.7c0-0.5-0.1-0.7-0.4-0.7c-0.3,0-0.4,0.3-0.4,0.7v1.7h-1.1v-3.4H243.7z"/>
				<path id="path331" inkscape:connector-curvature="0" class="st21" d="M249.8,283.9v0.5l0,0c0.1-0.4,0.5-0.6,0.8-0.6
					c0.8,0,1.2,0.8,1.2,1.7c0,1.3-0.7,1.8-1.3,1.8c-0.3,0-0.5-0.1-0.7-0.4v1.5h-1.1v-4.5H249.8z M250.7,285.6c0-0.5-0.2-0.8-0.5-0.8
					s-0.4,0.3-0.4,0.8s0.2,0.8,0.4,0.8C250.6,286.3,250.7,286,250.7,285.6z"/>
				<path id="path333" inkscape:connector-curvature="0" class="st21" d="M254.1,287.2l-0.1-0.4c-0.3,0.4-0.6,0.5-1,0.5
					c-0.5,0-1-0.3-1-1c0-1.5,1.9-0.8,1.9-1.5c0-0.2-0.2-0.3-0.3-0.3s-0.3,0-0.4,0.3h-1c0-0.7,0.4-1.1,1.5-1.1c1.3,0,1.3,0.6,1.3,1.4
					v1.6c0,0.2,0,0.3,0.1,0.4v0.1H254.1z M254,285.8c-0.3,0.2-0.8,0.1-0.8,0.5c0,0.2,0.1,0.3,0.3,0.3
					C253.9,286.6,254,286.2,254,285.8z"/>
				<path id="path335" inkscape:connector-curvature="0" class="st21" d="M255.6,283.9h1v0.5c0.2-0.4,0.5-0.6,0.9-0.6
					c0.7,0,1,0.5,1,1.4v2h-1.1v-1.8c0-0.3-0.1-0.6-0.4-0.6s-0.4,0.3-0.4,0.7v1.7h-1.1v-3.3L255.6,283.9z"/>
				<path id="path337" inkscape:connector-curvature="0" class="st21" d="M260.4,286l0.5-2.1h1L261,287c-0.3,1-0.4,1.4-1.3,1.4
					c-0.2,0-0.4,0-0.5,0v-0.9c0.1,0,0.1,0,0.2,0c0.3,0,0.4-0.1,0.3-0.5l-0.9-3h1.1L260.4,286z"/>
				<path id="path339" inkscape:connector-curvature="0" class="st21" d="M261.8,287.2v-1.3h1.1v1.3H261.8z"/>
				<path id="path341" inkscape:connector-curvature="0" class="st21" d="M210.6,294.9l1.3-4.6h1.2l1.3,4.6h-1.2l-0.1-0.6h-1.2
					l-0.1,0.6H210.6z M212.5,291.7l-0.4,1.6h0.8L212.5,291.7z"/>
				<path id="path343" inkscape:connector-curvature="0" class="st21" d="M214.8,294.9v-4.6h1.1v4.6H214.8z"/>
				<path id="path345" inkscape:connector-curvature="0" class="st21" d="M216.5,294.9v-4.6h1.1v4.6H216.5z"/>
				<path id="path347" inkscape:connector-curvature="0" class="st21" d="M219.9,291.6h1v0.7l0,0c0.1-0.5,0.4-0.8,0.8-0.8h0.1v1.3
					c-0.1,0-0.1,0-0.2,0c-0.4,0-0.7,0.3-0.7,1v1.2h-1.1L219.9,291.6L219.9,291.6z"/>
				<path id="path349" inkscape:connector-curvature="0" class="st21" d="M222.2,290.2h1.1v0.9h-1.1V290.2z M222.2,294.9v-3.4h1.1
					v3.4H222.2z"/>
				<path id="path351" inkscape:connector-curvature="0" class="st21" d="M225,295.1c0,0,0,0.1,0.1,0.1c0,0.1,0.1,0.1,0.2,0.1
					c0.3,0,0.4-0.2,0.4-0.7v-0.3c-0.2,0.2-0.4,0.4-0.8,0.4c-0.7,0-1.2-0.7-1.2-1.6c0-0.8,0.3-1.7,1.2-1.7c0.3,0,0.6,0.2,0.8,0.5
					v-0.4h0.9v2.7c0,1-0.1,1.8-1.4,1.8c-0.9,0-1.3-0.5-1.4-1h1.2V295.1z M224.8,293.2c0,0.3,0.1,0.6,0.4,0.7c0.3,0,0.5-0.3,0.5-0.7
					c0-0.4-0.1-0.7-0.5-0.7C224.9,292.4,224.8,292.7,224.8,293.2z"/>
				<path id="path353" inkscape:connector-curvature="0" class="st21" d="M227.2,290.3h1.1v1.7c0.2-0.3,0.5-0.5,0.8-0.5
					c0.7,0,1,0.5,1,1.4v2H229v-1.8c0-0.3-0.1-0.6-0.4-0.6c-0.3,0-0.4,0.3-0.4,0.7v1.7h-1.1L227.2,290.3L227.2,290.3z"/>
				<path id="path355" inkscape:connector-curvature="0" class="st21" d="M232.4,294.9c-1.4,0.1-1.6,0-1.6-1.2v-1.4h-0.4v-0.8h0.4
					v-1h1v1h0.5v0.8h-0.5v1.2c0,0.3,0,0.4,0.3,0.4h0.2v1H232.4z"/>
				<path id="path357" inkscape:connector-curvature="0" class="st21" d="M233.9,293.9c0,0.1,0,0.2,0.1,0.3c0.1,0.1,0.2,0.1,0.3,0.1
					c0.2,0,0.3-0.1,0.3-0.3c0-0.5-1.6-0.1-1.6-1.4c0-0.9,0.7-1.1,1.3-1.1s1.3,0.2,1.3,1.1h-1c0-0.1,0-0.2-0.1-0.2
					c-0.1-0.1-0.1-0.1-0.2-0.1c-0.2,0-0.3,0.1-0.3,0.2c0,0.5,1.7,0.2,1.7,1.4c0,0.7-0.5,1.2-1.4,1.2c-0.6,0-1.3-0.2-1.3-1.1h0.9
					V293.9z"/>
				<path id="path359" inkscape:connector-curvature="0" class="st21" d="M237.8,291.6h1v0.7l0,0c0.1-0.5,0.4-0.8,0.8-0.8h0.1v1.3
					c-0.1,0-0.1,0-0.2,0c-0.4,0-0.7,0.3-0.7,1v1.2h-1.1L237.8,291.6L237.8,291.6z"/>
				<path id="path361" inkscape:connector-curvature="0" class="st21" d="M240.9,293.5c0,0.4,0.2,0.7,0.5,0.7c0.2,0,0.3-0.1,0.4-0.3
					h1c-0.2,0.8-0.9,1.1-1.5,1.1c-0.9,0-1.5-0.6-1.5-1.7s0.7-1.8,1.5-1.8c1,0,1.6,0.9,1.6,2.1h-2V293.5z M241.9,292.9
					c0-0.3-0.2-0.6-0.5-0.6s-0.5,0.2-0.5,0.6H241.9z"/>
				<path id="path363" inkscape:connector-curvature="0" class="st21" d="M244.3,293.9c0,0.1,0,0.2,0.1,0.3c0.1,0.1,0.2,0.1,0.3,0.1
					c0.2,0,0.3-0.1,0.3-0.3c0-0.5-1.6-0.1-1.6-1.4c0-0.9,0.7-1.1,1.3-1.1s1.3,0.2,1.3,1.1h-1c0-0.1,0-0.2-0.1-0.2
					c-0.1-0.1-0.1-0.1-0.2-0.1c-0.2,0-0.3,0.1-0.3,0.2c0,0.5,1.7,0.2,1.7,1.4c0,0.7-0.5,1.2-1.4,1.2c-0.6,0-1.3-0.2-1.3-1.1h0.9
					V293.9z"/>
				<path id="path365" inkscape:connector-curvature="0" class="st21" d="M247.4,293.5c0,0.4,0.2,0.7,0.5,0.7c0.2,0,0.3-0.1,0.4-0.3
					h1c-0.2,0.8-0.9,1.1-1.5,1.1c-0.9,0-1.5-0.6-1.5-1.7s0.7-1.8,1.5-1.8c1,0,1.6,0.9,1.6,2.1h-2V293.5z M248.4,292.9
					c0-0.3-0.2-0.6-0.5-0.6s-0.5,0.2-0.5,0.6H248.4z"/>
				<path id="path367" inkscape:connector-curvature="0" class="st21" d="M249.9,291.6h1v0.7l0,0c0.1-0.5,0.4-0.8,0.8-0.8h0.1v1.3
					c-0.1,0-0.1,0-0.2,0c-0.4,0-0.7,0.3-0.7,1v1.2h-1.1L249.9,291.6L249.9,291.6z"/>
				<path id="path369" inkscape:connector-curvature="0" class="st21" d="M252,291.6h1.1l0.5,2.1l0.5-2.1h1l-0.9,3.4H253L252,291.6z
					"/>
				<path id="path371" inkscape:connector-curvature="0" class="st21" d="M256.3,293.5c0,0.4,0.2,0.7,0.5,0.7c0.2,0,0.3-0.1,0.4-0.3
					h1c-0.2,0.8-0.9,1.1-1.5,1.1c-0.9,0-1.5-0.6-1.5-1.7s0.7-1.8,1.5-1.8c1,0,1.6,0.9,1.6,2.1h-2V293.5z M257.3,292.9
					c0-0.3-0.2-0.6-0.5-0.6s-0.5,0.2-0.5,0.6H257.3z"/>
				<path id="path373" inkscape:connector-curvature="0" class="st21" d="M260.7,294.9v-0.4c-0.3,0.4-0.5,0.5-0.8,0.5
					c-0.8,0-1.2-0.8-1.2-1.7c0-1.1,0.5-1.8,1.1-1.8c0.3,0,0.6,0.1,0.8,0.4v-1.6h1.1v4.6H260.7z M260.6,293.3c0-0.4-0.1-0.8-0.5-0.8
					s-0.5,0.4-0.5,0.8s0.1,0.8,0.4,0.8C260.5,294,260.6,293.7,260.6,293.3z"/>
				<path id="path375" inkscape:connector-curvature="0" class="st21" d="M262.2,294.9v-1.3h1.1v1.3H262.2z"/>
			</g>
			<g id="g501">
				<path id="path379" inkscape:connector-curvature="0" class="st21" d="M55.8,264.3v-4.9h1.4l0.6,3.1l0.6-3.1h1.4v4.9h-1v-1.5V262
					l0.1-0.9l0,0l-0.6,3.1h-0.8l-0.6-3.1l0,0v0.7v0.8v1.7L55.8,264.3z"/>
				<path id="path381" inkscape:connector-curvature="0" class="st21" d="M62.1,264.3v-0.4c-0.3,0.4-0.6,0.5-1,0.5
					c-0.5,0-0.9-0.3-0.9-1.1c0-1.6,1.8-0.9,1.8-1.6c0-0.3-0.2-0.3-0.3-0.3s-0.3,0-0.4,0.3h-1c0-0.8,0.4-1.2,1.4-1.2
					c1.2,0,1.3,0.6,1.3,1.5v1.7c0,0.2,0,0.3,0.1,0.5v0.1H62.1z M62,262.7c-0.3,0.2-0.8,0.1-0.8,0.6c0,0.2,0.1,0.3,0.3,0.3
					C61.9,263.6,62,263.2,62,262.7z"/>
				<path id="path383" inkscape:connector-curvature="0" class="st21" d="M65.2,264.3c-1.3,0.1-1.5,0-1.5-1.3v-1.5h-0.4v-0.8h0.4
					v-1.1h1v1.1h0.5v0.8h-0.5v1.3c0,0.3,0,0.4,0.3,0.4h0.2V264.3z"/>
				<path id="path385" inkscape:connector-curvature="0" class="st21" d="M66.6,263.2c0,0.1,0,0.3,0.1,0.3c0.1,0.1,0.1,0.1,0.2,0.1
					c0.2,0,0.3-0.1,0.3-0.3c0-0.6-1.5-0.1-1.5-1.5c0-0.9,0.7-1.2,1.2-1.2s1.2,0.2,1.3,1.1h-0.9c0-0.1,0-0.2-0.1-0.3
					c-0.1-0.1-0.1-0.1-0.2-0.1c-0.2,0-0.3,0.1-0.3,0.3c0,0.5,1.6,0.2,1.6,1.5c0,0.7-0.4,1.2-1.4,1.2c-0.6,0-1.2-0.3-1.3-1.2h1
					L66.6,263.2z"/>
				<path id="path387" inkscape:connector-curvature="0" class="st21" d="M71.4,264.3h-0.9v-0.5c-0.3,0.5-0.5,0.6-0.9,0.6
					c-0.5,0-0.9-0.5-0.9-1.5v-2.2h1v1.9c0,0.5,0.1,0.6,0.4,0.6s0.4-0.3,0.4-0.9v-1.7h1L71.4,264.3L71.4,264.3z"/>
				<path id="path389" inkscape:connector-curvature="0" class="st21" d="M72.7,263.2c0,0.1,0,0.3,0.1,0.3c0.1,0.1,0.1,0.1,0.2,0.1
					c0.2,0,0.3-0.1,0.3-0.3c0-0.6-1.5-0.1-1.5-1.5c0-0.9,0.7-1.2,1.2-1.2s1.2,0.2,1.3,1.1h-0.9c0-0.1,0-0.2-0.1-0.3
					c-0.1-0.1-0.1-0.1-0.2-0.1c-0.2,0-0.3,0.1-0.3,0.3c0,0.5,1.6,0.2,1.6,1.5c0,0.7-0.4,1.2-1.4,1.2c-0.6,0-1.2-0.3-1.3-1.2h1
					L72.7,263.2z"/>
				<path id="path391" inkscape:connector-curvature="0" class="st21" d="M74.8,259.4h1v1.8c0.2-0.4,0.4-0.6,0.8-0.6
					c0.7,0,1,0.6,1,1.5v2.1h-1v-1.9c0-0.4-0.1-0.7-0.4-0.7s-0.4,0.3-0.4,0.7v1.8h-1V259.4z"/>
				<path id="path393" inkscape:connector-curvature="0" class="st21" d="M78.1,259.2h1v1h-1V259.2z M78.1,264.3v-3.6h1v3.6H78.1z"
					/>
				<path id="path395" inkscape:connector-curvature="0" class="st21" d="M81.3,264.3c-1.3,0.1-1.5,0-1.5-1.3v-1.5h-0.4v-0.8h0.4
					v-1.1h1v1.1h0.5v0.8h-0.5v1.3c0,0.3,0,0.4,0.3,0.4h0.2V264.3z"/>
				<path id="path397" inkscape:connector-curvature="0" class="st21" d="M83.5,264.3v-0.4c-0.3,0.4-0.6,0.5-0.9,0.5
					c-0.5,0-0.9-0.3-0.9-1.1c0-1.6,1.8-0.9,1.8-1.6c0-0.3-0.2-0.3-0.3-0.3c-0.1,0-0.3,0-0.4,0.3h-1c0-0.8,0.4-1.2,1.4-1.2
					c1.2,0,1.3,0.6,1.3,1.5v1.7c0,0.2,0,0.3,0.1,0.5v0.1H83.5z M83.4,262.7c-0.3,0.2-0.8,0.1-0.8,0.6c0,0.2,0.1,0.3,0.3,0.3
					C83.4,263.6,83.5,263.2,83.4,262.7z"/>
				<path id="path399" inkscape:connector-curvature="0" class="st21" d="M86.7,264.3v-4.9h2.8v1.1h-1.7v0.7h1.4v1.1h-1.4v0.8h1.8
					v1.1L86.7,264.3L86.7,264.3z"/>
				<path id="path401" inkscape:connector-curvature="0" class="st21" d="M90.1,264.3v-4.9h1v4.9H90.1z"/>
				<path id="path403" inkscape:connector-curvature="0" class="st21" d="M92.6,262.8c0,0.4,0.2,0.7,0.5,0.7c0.2,0,0.3-0.1,0.4-0.3
					h1c-0.2,0.9-0.8,1.2-1.4,1.2c-0.8,0-1.4-0.7-1.4-1.9c0-1.2,0.6-1.9,1.4-1.9c0.9,0,1.5,0.9,1.5,2.2L92.6,262.8z M93.5,262.1
					c0-0.3-0.2-0.6-0.4-0.6c-0.3,0-0.5,0.2-0.5,0.6H93.5z"/>
				<path id="path405" inkscape:connector-curvature="0" class="st21" d="M96.6,262.1c0-0.2,0-0.3-0.1-0.4s-0.1-0.1-0.3-0.1
					c-0.4,0-0.4,0.6-0.4,1c0,0.5,0.1,0.9,0.4,0.9s0.4-0.3,0.4-0.5h1c0,0.5-0.2,0.9-0.5,1.2c-0.3,0.2-0.6,0.3-0.9,0.3
					c-0.8,0-1.4-0.6-1.4-1.9c0-1.2,0.6-1.9,1.4-1.9c0.7,0,1.3,0.4,1.4,1.5h-1V262.1z"/>
				<path id="path407" inkscape:connector-curvature="0" class="st21" d="M99.8,264.3c-1.3,0.1-1.5,0-1.5-1.3v-1.5h-0.4v-0.8h0.4
					v-1.1h1v1.1h0.5v0.8h-0.5v1.3c0,0.3,0,0.4,0.3,0.4h0.2V264.3z"/>
				<path id="path409" inkscape:connector-curvature="0" class="st21" d="M100.3,260.7h0.9v0.7l0,0c0.1-0.6,0.4-0.8,0.8-0.8h0.1v1.4
					c-0.1,0-0.1,0-0.2,0c-0.4,0-0.6,0.3-0.6,1v1.2h-1L100.3,260.7z"/>
				<path id="path411" inkscape:connector-curvature="0" class="st21" d="M102.5,259.2h1v1h-1V259.2z M102.5,264.3v-3.6h1v3.6H102.5
					z"/>
				<path id="path413" inkscape:connector-curvature="0" class="st21" d="M105.7,262.1c0-0.2,0-0.3-0.1-0.4s-0.1-0.1-0.3-0.1
					c-0.4,0-0.4,0.6-0.4,1c0,0.5,0.1,0.9,0.4,0.9s0.4-0.3,0.4-0.5h1c0,0.5-0.2,0.9-0.5,1.2c-0.3,0.2-0.6,0.3-0.9,0.3
					c-0.8,0-1.4-0.6-1.4-1.9c0-1.2,0.6-1.9,1.4-1.9c0.7,0,1.3,0.4,1.4,1.5h-1V262.1z"/>
				<path id="path415" inkscape:connector-curvature="0" class="st21" d="M109,264.3v-4.9h1.1v4.9H109z"/>
				<path id="path417" inkscape:connector-curvature="0" class="st21" d="M110.7,260.7h0.9v0.6c0.2-0.4,0.5-0.7,0.9-0.7
					c0.7,0,1,0.6,1,1.5v2.1h-1v-1.9c0-0.4-0.1-0.7-0.4-0.7s-0.4,0.3-0.4,0.7v1.8h-1V260.7z"/>
				<path id="path419" inkscape:connector-curvature="0" class="st21" d="M115.8,264.3v-0.5c-0.2,0.4-0.5,0.6-0.8,0.6
					c-0.8,0-1.1-0.8-1.1-1.8c0-1.2,0.5-2,1.1-2c0.3,0,0.5,0.1,0.8,0.5v-1.7h1v4.9H115.8z M115.7,262.5c0-0.4-0.1-0.8-0.4-0.8
					s-0.4,0.4-0.4,0.8s0.1,0.8,0.4,0.8S115.7,262.9,115.7,262.5z"/>
				<path id="path421" inkscape:connector-curvature="0" class="st21" d="M119.9,264.3H119v-0.5c-0.3,0.5-0.5,0.6-0.9,0.6
					c-0.5,0-0.9-0.5-0.9-1.5v-2.2h1v1.9c0,0.5,0.1,0.6,0.4,0.6s0.4-0.3,0.4-0.9v-1.7h1L119.9,264.3L119.9,264.3z"/>
				<path id="path423" inkscape:connector-curvature="0" class="st21" d="M121.2,263.2c0,0.1,0,0.3,0.1,0.3c0.1,0.1,0.1,0.1,0.2,0.1
					c0.2,0,0.3-0.1,0.3-0.3c0-0.6-1.5-0.1-1.5-1.5c0-0.9,0.7-1.2,1.2-1.2s1.2,0.2,1.3,1.1h-0.9c0-0.1,0-0.2-0.1-0.3
					c-0.1-0.1-0.1-0.1-0.2-0.1c-0.2,0-0.3,0.1-0.3,0.3c0,0.5,1.6,0.2,1.6,1.5c0,0.7-0.4,1.2-1.4,1.2c-0.6,0-1.2-0.3-1.3-1.2h1
					L121.2,263.2z"/>
				<path id="path425" inkscape:connector-curvature="0" class="st21" d="M125,264.3c-1.3,0.1-1.5,0-1.5-1.3v-1.5h-0.4v-0.8h0.4
					v-1.1h1v1.1h0.5v0.8h-0.5v1.3c0,0.3,0,0.4,0.3,0.4h0.2V264.3z"/>
				<path id="path427" inkscape:connector-curvature="0" class="st21" d="M125.5,260.7h0.9v0.7l0,0c0.1-0.6,0.4-0.8,0.8-0.8h0.1v1.4
					c-0.1,0-0.1,0-0.2,0c-0.4,0-0.6,0.3-0.6,1v1.2h-1L125.5,260.7z"/>
				<path id="path429" inkscape:connector-curvature="0" class="st21" d="M127.7,259.2h1v1h-1V259.2z M127.7,264.3v-3.6h1v3.6H127.7
					z"/>
				<path id="path431" inkscape:connector-curvature="0" class="st21" d="M131,264.3v-0.4c-0.3,0.4-0.6,0.5-1,0.5
					c-0.5,0-0.9-0.3-0.9-1.1c0-1.6,1.8-0.9,1.8-1.6c0-0.3-0.2-0.3-0.3-0.3s-0.3,0-0.4,0.3h-1c0-0.8,0.4-1.2,1.4-1.2
					c1.2,0,1.3,0.6,1.3,1.5v1.7c0,0.2,0,0.3,0.1,0.5v0.1H131z M130.9,262.7c-0.3,0.2-0.8,0.1-0.8,0.6c0,0.2,0.1,0.3,0.3,0.3
					C130.8,263.6,130.9,263.2,130.9,262.7z"/>
				<path id="path433" inkscape:connector-curvature="0" class="st21" d="M132.5,264.3v-4.9h1v4.9H132.5z"/>
				<path id="path435" inkscape:connector-curvature="0" class="st21" d="M98.2,269.4c0-0.5-0.3-0.8-0.6-0.8c-0.4,0-0.6,0.5-0.6,1.4
					c0,0.7,0.1,1.3,0.7,1.3c0.4,0,0.5-0.4,0.6-0.8h1.1c-0.1,1.3-0.7,2-1.7,2c-1.1,0-1.8-1-1.8-2.6s0.8-2.6,1.7-2.6
					c1.1,0,1.7,0.7,1.7,2h-1.1L98.2,269.4z"/>
				<path id="path437" inkscape:connector-curvature="0" class="st21" d="M101.1,268.8c0.9,0,1.4,0.7,1.4,1.9c0,1.3-0.6,1.9-1.4,1.9
					s-1.4-0.6-1.4-1.8C99.7,269.5,100.2,268.8,101.1,268.8z M100.7,270.6c0,0.7,0.2,1,0.4,1c0.3,0,0.4-0.3,0.4-1
					c0-0.5-0.2-0.9-0.4-0.9C100.8,269.7,100.7,270.2,100.7,270.6z"/>
				<path id="path439" inkscape:connector-curvature="0" class="st21" d="M103,272.4V271h1v1.4H103z"/>
				<path id="path441" inkscape:connector-curvature="0" class="st21" d="M104.6,273c0.1,0,0.3-0.1,0.3-0.2c0.1-0.1,0.1-0.2,0.1-0.4
					h-0.5V271h1v1.2c0,0.9-0.4,1.4-1,1.4L104.6,273L104.6,273z"/>
				<path id="path443" inkscape:connector-curvature="0" class="st21" d="M107.9,272.4v-4.9h1.1v3.8h1.6v1.1H107.9z"/>
				<path id="path445" inkscape:connector-curvature="0" class="st21" d="M112.6,272.4c-1.3,0.1-1.5,0-1.5-1.3v-1.5h-0.4v-0.8h0.4
					v-1.1h1v1.1h0.5v0.8h-0.5v1.3c0,0.3,0,0.4,0.3,0.4h0.2V272.4z"/>
				<path id="path447" inkscape:connector-curvature="0" class="st21" d="M115,272.4V272c-0.2,0.4-0.5,0.6-0.8,0.6
					c-0.8,0-1.1-0.8-1.1-1.8c0-1.2,0.5-2,1.1-2c0.3,0,0.5,0.1,0.8,0.5v-1.7h1v4.9h-1V272.4z M114.9,270.7c0-0.4-0.1-0.8-0.4-0.8
					s-0.4,0.4-0.4,0.8s0.1,0.8,0.4,0.8S114.9,271.1,114.9,270.7z"/>
				<path id="path449" inkscape:connector-curvature="0" class="st21" d="M116.4,272.4V271h1v1.4H116.4z"/>
				<path id="path451" inkscape:connector-curvature="0" class="st21" d="M121.6,272.4h-1v-2.8h-0.8v-1c0.5,0,0.9-0.3,1-1.1h0.8
					V272.4z"/>
				<path id="path453" inkscape:connector-curvature="0" class="st21" d="M123.7,271.2c0.1,0.3,0.2,0.4,0.4,0.4
					c0.4,0,0.5-0.5,0.5-1.1c-0.3,0.3-0.5,0.3-0.8,0.3c-0.8,0-1.1-0.9-1.1-1.6c0-1.2,0.6-1.7,1.4-1.7c1,0,1.6,0.8,1.6,2.5
					c0,1.5-0.5,2.5-1.5,2.5c-0.6,0-1.2-0.3-1.4-1.3L123.7,271.2z M124.6,269.2c0-0.3-0.2-0.6-0.5-0.6s-0.4,0.3-0.4,0.7
					c0,0.4,0.2,0.6,0.4,0.6C124.4,269.9,124.6,269.6,124.6,269.2z"/>
				<path id="path455" inkscape:connector-curvature="0" class="st21" d="M126.9,271.2c0.1,0.3,0.2,0.4,0.4,0.4
					c0.4,0,0.5-0.5,0.5-1.1c-0.3,0.3-0.5,0.3-0.8,0.3c-0.8,0-1.1-0.9-1.1-1.6c0-1.2,0.6-1.7,1.4-1.7c1,0,1.6,0.8,1.6,2.5
					c0,1.5-0.5,2.5-1.5,2.5c-0.6,0-1.2-0.3-1.4-1.3L126.9,271.2z M127.8,269.2c0-0.3-0.2-0.6-0.5-0.6s-0.4,0.3-0.4,0.7
					c0,0.4,0.2,0.6,0.4,0.6C127.6,269.9,127.8,269.6,127.8,269.2z"/>
				<path id="path457" inkscape:connector-curvature="0" class="st21" d="M130.1,270.8c0,0.2,0,0.4,0.1,0.5s0.2,0.2,0.4,0.2
					c0.3,0,0.4-0.3,0.4-0.6c0-0.6-0.4-0.5-0.6-0.5v-0.8c0.2,0,0.6,0,0.6-0.5c0-0.3-0.2-0.4-0.4-0.4s-0.4,0.2-0.4,0.5h-0.9
					c0-1.1,0.7-1.6,1.4-1.6c0.8,0,1.3,0.5,1.3,1.3c0,0.4-0.1,0.8-0.4,0.9c0.3,0.2,0.5,0.5,0.5,1c0,1.1-0.6,1.7-1.5,1.7
					c-0.8,0-1.4-0.6-1.4-1.8L130.1,270.8L130.1,270.8z"/>
				<path id="path459" inkscape:connector-curvature="0" class="st21" d="M132.5,272.4V271h1v1.4H132.5z"/>
				<path id="path461" inkscape:connector-curvature="0" class="st21" d="M83.7,280.6l1.2-4.9h1.2l1.2,4.9h-1.1l-0.1-0.6H85
					l-0.1,0.6H83.7z M85.5,277.2l-0.4,1.8h0.7L85.5,277.2z"/>
				<path id="path463" inkscape:connector-curvature="0" class="st21" d="M87.7,280.6v-4.9h1v4.9H87.7z"/>
				<path id="path465" inkscape:connector-curvature="0" class="st21" d="M89.3,280.6v-4.9h1v4.9H89.3z"/>
				<path id="path467" inkscape:connector-curvature="0" class="st21" d="M92.5,277h0.9v0.7l0,0c0.1-0.6,0.4-0.8,0.8-0.8h0.1v1.4
					c-0.1,0-0.1,0-0.2,0c-0.4,0-0.6,0.3-0.6,1v1.2h-1L92.5,277z"/>
				<path id="path469" inkscape:connector-curvature="0" class="st21" d="M94.7,275.6h1v1h-1V275.6z M94.7,280.6V277h1v3.6H94.7z"/>
				<path id="path471" inkscape:connector-curvature="0" class="st21" d="M97.3,280.8c0,0,0,0.1,0.1,0.2c0,0.1,0.1,0.1,0.2,0.1
					c0.3,0,0.4-0.2,0.4-0.7V280c-0.1,0.2-0.4,0.4-0.7,0.4c-0.7,0-1.1-0.8-1.1-1.7c0-0.9,0.3-1.8,1.1-1.8c0.3,0,0.6,0.2,0.8,0.6V277
					H99v2.9c0,1.1-0.1,1.9-1.3,1.9c-0.9,0-1.3-0.5-1.3-1H97.3z M97.2,278.8c0,0.4,0.1,0.7,0.4,0.7s0.4-0.4,0.4-0.7
					c0-0.4-0.1-0.8-0.4-0.8C97.3,277.9,97.2,278.3,97.2,278.8z"/>
				<path id="path473" inkscape:connector-curvature="0" class="st21" d="M99.4,275.7h1v1.8c0.2-0.4,0.4-0.6,0.8-0.6
					c0.7,0,1,0.6,1,1.5v2.1h-1v-1.9c0-0.4-0.1-0.7-0.4-0.7s-0.4,0.3-0.4,0.7v1.8h-1V275.7z"/>
				<path id="path475" inkscape:connector-curvature="0" class="st21" d="M104.3,280.6c-1.3,0.1-1.5,0-1.5-1.3v-1.5h-0.4V277h0.4
					v-1.1h1v1.1h0.5v0.8h-0.5v1.3c0,0.3,0,0.4,0.3,0.4h0.2V280.6z"/>
				<path id="path477" inkscape:connector-curvature="0" class="st21" d="M105.7,279.5c0,0.1,0,0.3,0.1,0.3c0.1,0.1,0.1,0.1,0.2,0.1
					c0.2,0,0.3-0.1,0.3-0.3c0-0.6-1.5-0.1-1.5-1.5c0-0.9,0.7-1.2,1.2-1.2s1.2,0.2,1.3,1.1h-0.9c0-0.1,0-0.2-0.1-0.3
					c-0.1-0.1-0.1-0.1-0.2-0.1c-0.2,0-0.3,0.1-0.3,0.3c0,0.5,1.6,0.2,1.6,1.5c0,0.7-0.4,1.2-1.4,1.2c-0.6,0-1.2-0.3-1.3-1.2h1
					L105.7,279.5z"/>
				<path id="path479" inkscape:connector-curvature="0" class="st21" d="M109.4,277h0.9v0.7l0,0c0.1-0.6,0.4-0.8,0.8-0.8h0.1v1.4
					c-0.1,0-0.1,0-0.2,0c-0.4,0-0.6,0.3-0.6,1v1.2h-1L109.4,277z"/>
				<path id="path481" inkscape:connector-curvature="0" class="st21" d="M112.3,279.1c0,0.4,0.2,0.7,0.5,0.7c0.2,0,0.3-0.1,0.4-0.3
					h1c-0.2,0.9-0.8,1.2-1.4,1.2c-0.8,0-1.4-0.7-1.4-1.9c0-1.2,0.6-1.9,1.4-1.9c0.9,0,1.5,0.9,1.5,2.2L112.3,279.1z M113.3,278.4
					c0-0.3-0.2-0.6-0.4-0.6c-0.3,0-0.5,0.2-0.5,0.6H113.3z"/>
				<path id="path483" inkscape:connector-curvature="0" class="st21" d="M115.5,279.5c0,0.1,0,0.3,0.1,0.3c0.1,0.1,0.1,0.1,0.2,0.1
					c0.2,0,0.3-0.1,0.3-0.3c0-0.6-1.5-0.1-1.5-1.5c0-0.9,0.7-1.2,1.2-1.2s1.2,0.2,1.3,1.1h-0.9c0-0.1,0-0.2-0.1-0.3
					c-0.1-0.1-0.1-0.1-0.2-0.1c-0.2,0-0.3,0.1-0.3,0.3c0,0.5,1.6,0.2,1.6,1.5c0,0.7-0.4,1.2-1.4,1.2c-0.6,0-1.2-0.3-1.3-1.2h1
					L115.5,279.5z"/>
				<path id="path485" inkscape:connector-curvature="0" class="st21" d="M118.5,279.1c0,0.4,0.2,0.7,0.5,0.7c0.2,0,0.3-0.1,0.4-0.3
					h1c-0.2,0.9-0.8,1.2-1.4,1.2c-0.8,0-1.4-0.7-1.4-1.9c0-1.2,0.6-1.9,1.4-1.9c0.9,0,1.5,0.9,1.5,2.2L118.5,279.1z M119.4,278.4
					c0-0.3-0.2-0.6-0.4-0.6c-0.3,0-0.5,0.2-0.5,0.6H119.4z"/>
				<path id="path487" inkscape:connector-curvature="0" class="st21" d="M120.8,277h0.9v0.7l0,0c0.1-0.6,0.4-0.8,0.8-0.8h0.1v1.4
					c-0.1,0-0.1,0-0.2,0c-0.4,0-0.6,0.3-0.6,1v1.2h-1L120.8,277z"/>
				<path id="path489" inkscape:connector-curvature="0" class="st21" d="M122.9,277h1l0.4,2.3l0.4-2.3h1l-0.9,3.6h-1.1L122.9,277z"
					/>
				<path id="path491" inkscape:connector-curvature="0" class="st21" d="M126.9,279.1c0,0.4,0.2,0.7,0.5,0.7c0.2,0,0.3-0.1,0.4-0.3
					h1c-0.2,0.9-0.8,1.2-1.4,1.2c-0.8,0-1.4-0.7-1.4-1.9c0-1.2,0.6-1.9,1.4-1.9c0.9,0,1.5,0.9,1.5,2.2L126.9,279.1z M127.8,278.4
					c0-0.3-0.2-0.6-0.4-0.6c-0.3,0-0.5,0.2-0.5,0.6H127.8z"/>
				<path id="path493" inkscape:connector-curvature="0" class="st21" d="M131.1,280.6v-0.5c-0.2,0.4-0.5,0.6-0.8,0.6
					c-0.8,0-1.1-0.8-1.1-1.8c0-1.2,0.5-2,1.1-2c0.3,0,0.5,0.1,0.8,0.5v-1.7h1v4.9H131.1z M131,278.9c0-0.4-0.1-0.8-0.4-0.8
					c-0.3,0-0.4,0.4-0.4,0.8s0.1,0.8,0.4,0.8C130.9,279.7,131,279.3,131,278.9z"/>
				<path id="path495" inkscape:connector-curvature="0" class="st21" d="M132.5,280.6v-1.4h1v1.4H132.5z"/>
				<g id="g499">
					<path id="path497" inkscape:connector-curvature="0" class="st21" d="M48.6,261.5c0-1.7,1.3-3,3-3s3,1.4,3,3c0,1.7-1.4,3-3,3
						C49.9,264.5,48.6,263.2,48.6,261.5z M53.8,261.5c0-1.4-0.9-2.3-2.2-2.3s-2.2,1-2.2,2.3c0,1.4,0.9,2.3,2.2,2.3
						S53.8,262.8,53.8,261.5z M52.4,260.9c-0.1-0.4-0.4-0.6-0.8-0.6c-0.6,0-0.9,0.5-0.9,1.1s0.3,1.2,0.9,1.2c0.4,0,0.7-0.2,0.7-0.6
						H53c-0.1,0.7-0.7,1.2-1.4,1.2c-1,0-1.7-0.8-1.7-1.7c0-1,0.6-1.8,1.7-1.8c0.7,0,1.3,0.4,1.4,1.1L52.4,260.9L52.4,260.9z"/>
				</g>
			</g>
			<g id="g529">
				<g id="g527">
					<path id="path503" inkscape:connector-curvature="0" class="st22" d="M256.5,209.9c0,0,3,0,3.2,0c0.4,0,0.4-0.2,0.4-0.6
						c0-1,0-2.8,0-3.2s0.5-0.7,0.7-0.7c0.4,0,2.4,0,2.7,0c0.4,0,0.8,0.2,0.8,0.8c0,0.7,0,15.2,0,15.6c0,0.4-0.3,0.7-0.7,0.7
						c-0.4,0-6.3,0-7.2,0c-0.9,0-1.9-1-1.9-2.1s0-7.2,0-8.4C254.4,210.8,255.4,209.9,256.5,209.9z M255.1,211.9c0,0.7,0,7.7,0,8.5
						s0.8,1.3,1.3,1.3c0.6,0,6.4,0,6.6,0s0.4-0.1,0.4-0.4c0-0.4,0-14.6,0-14.8c0-0.3-0.1-0.4-0.4-0.4c-0.2,0-1.6,0-1.9,0
						s-0.4,0.2-0.4,0.4c0,0.3,0,2.8,0,3.2c0,0.5-0.2,0.8-0.7,0.8c-0.4,0-3.5,0-3.5,0C255.8,210.6,255.1,211.2,255.1,211.9z"/>
					<path id="path505" inkscape:connector-curvature="0" class="st22" d="M259.2,220.7c-0.4,0-0.8-0.2-1.1-0.5
						c-0.3-0.3-0.5-0.7-0.5-1.1v-5.8c0-0.4,0.2-0.8,0.5-1.1s0.7-0.5,1.1-0.5s0.8,0.2,1.1,0.5c0.3,0.3,0.5,0.7,0.5,1.1v5.8
						C260.8,220,260.1,220.7,259.2,220.7z M259.2,220c0.5,0,0.8-0.4,0.8-0.8v-5.8c0-0.5-0.4-0.8-0.8-0.8s-0.8,0.4-0.8,0.8v5.8
						C258.4,219.6,258.7,220,259.2,220z"/>
					<path id="path507" inkscape:connector-curvature="0" class="st22" d="M266,222.5c-0.4,0-0.7-0.3-0.7-0.7v-11.2
						c0-0.4,0.3-0.7,0.7-0.7h2.7c0.4,0,0.7,0.3,0.7,0.7v11.2c0,0.4-0.3,0.7-0.7,0.7H266z M268.3,221.8c0.2,0,0.3-0.1,0.3-0.3v-10.6
						c0-0.2-0.1-0.3-0.3-0.3h-2.1c-0.2,0-0.3,0.1-0.3,0.3v10.6c0,0.2,0.1,0.3,0.3,0.3H268.3z"/>
					<path id="path509" inkscape:connector-curvature="0" class="st22" d="M278.6,209.9c0.5,0,0.8,0.2,0.8,0.7s0,1.3,0,2
						s-0.3,0.9-0.7,0.9c-0.5,0-3,0-4,0c-0.6,0-0.7,1,0,1s1.6,0,3,0s2.3,1,2.3,2.2s0,2.8,0,3.8c0,0.9-0.6,2.2-2,2.2s-6,0-6.5,0
						s-0.8-0.2-0.8-0.7s0-1.4,0-2s0.3-0.8,0.8-0.8s3.5,0,4.3,0s0.7-1,0-1c-0.5,0-1.7,0-2.9,0c-1.2,0-2.2-1.1-2.2-2.3
						c0-1.3,0-2.2,0-3.5c0-1.2,0.8-2.3,2.2-2.3h5.7L278.6,209.9z M278.6,212.3c0-0.4,0-1.2,0-1.4s-0.1-0.4-0.4-0.4s-4.9,0-5.6,0
						s-1.4,0.7-1.4,1.5s0,2.9,0,3.7s0.6,1.5,1.5,1.5c1,0,2.3,0,2.8,0c1.7,0,1.6,2.4,0.1,2.4c-1.8,0-3.8,0-4.1,0
						c-0.3,0-0.3,0.2-0.3,0.4s0,1.2,0,1.4s0.1,0.3,0.4,0.3s5.3,0,6,0c0.8,0,1.3-0.7,1.3-1.5s0-3,0-3.9s-0.9-1.3-1.3-1.3s-2.5,0-3,0
						c-1.8,0-1.7-2.5,0-2.5c0.6,0,3.5,0,3.7,0C278.5,212.7,278.6,212.5,278.6,212.3z"/>
					<path id="path511" inkscape:connector-curvature="0" class="st22" d="M289.9,217.8v2.9c0,1.1-0.9,1.9-1.9,1.9h-5.2
						c-1.1,0-1.9-0.9-1.9-1.9v-8.8c0-1.1,0.9-1.9,1.9-1.9h5.2c1.1,0,1.9,0.9,1.9,1.9v2.7c0,0.8-0.1,1-0.7,1s-2,0-2.4,0
						c-0.5,0-0.7-0.3-0.7-0.7c0-0.5,0-1,0-1.7c0-0.8-1.3-0.8-1.3,0s0,5.6,0,6.2c0,0.8,1.3,0.9,1.3,0c0-0.8,0-1.3,0-1.6
						s0.3-0.7,0.6-0.7c0.3,0,2.1,0,2.5,0C289.7,217,289.9,217.2,289.9,217.8z M287.2,214.7c0.3,0,1.4,0,1.7,0c0.3,0,0.3-0.2,0.3-0.6
						c0-0.3,0-1.5,0-2.2c0-0.8-0.6-1.4-1.6-1.4c-1.1,0-3.7,0-4.6,0s-1.4,0.8-1.4,1.5s0,7.1,0,8s0.4,1.7,1.5,1.7s3.6,0,4.6,0
						s1.6-0.5,1.6-1.7c0-1.1,0-1.8,0-2.1s-0.3-0.3-0.5-0.3s-1.3,0-1.6,0c-0.3,0-0.3,0.1-0.3,0.5c0,0.6,0-0.3,0,1.1
						c0,1.9-2.8,1.8-2.8-0.1c0-1.8,0-4.7,0-6.1c0-1.8,2.8-1.8,2.8,0c0,0.6,0,1,0,1.2S287,214.7,287.2,214.7z"/>
					<path id="path513" inkscape:connector-curvature="0" class="st22" d="M265.3,207.2c0-0.7,0-1.1,0.1-1.3
						c0.1-0.3,0.4-0.6,1.5-0.6s1.4,0.2,1.5,0.5s0.1,0.9,0.1,0.9h-0.9v-0.3c0-0.2-0.1-0.2-0.7-0.2c-0.5,0-0.6,0.1-0.6,0.3
						s0,1.3,0,1.4c0,0.2,0.1,0.3,0.6,0.3c0.6,0,0.7,0,0.7-0.3c0-0.2,0-0.3,0-0.3h0.9c0,0,0,0.4,0,0.6c0,0.3,0,0.7-1.6,0.7
						c-1.5,0-1.5-0.4-1.5-0.6C265.3,208.2,265.3,207.2,265.3,207.2L265.3,207.2z"/>
					<path id="path515" inkscape:connector-curvature="0" class="st22" d="M284.1,207.2c0-0.7,0-1.1,0.1-1.3
						c0.1-0.3,0.4-0.6,1.5-0.6s1.4,0.2,1.5,0.5s0.1,0.9,0.1,0.9h-0.9v-0.3c0-0.2-0.1-0.2-0.7-0.2c-0.5,0-0.6,0.1-0.6,0.3
						s0,1.3,0,1.4c0,0.2,0.1,0.3,0.6,0.3c0.6,0,0.7,0,0.7-0.3c0-0.2,0-0.3,0-0.3h0.9c0,0,0,0.4,0,0.6c0,0.3,0,0.7-1.6,0.7
						c-1.5,0-1.5-0.4-1.5-0.6C284.1,208.2,284.1,207.2,284.1,207.2L284.1,207.2z"/>
					<path id="path517" inkscape:connector-curvature="0" class="st22" d="M270.5,208.9c1.5,0,1.5-0.4,1.5-0.6
						c0-0.2,0.1-1.1,0.1-1.1c0-0.7,0-1.1-0.1-1.3c-0.1-0.3-0.4-0.5-1.5-0.5s-1.5,0.3-1.5,0.6c0,0.2-0.1,0.6-0.1,1.3
						c0,0,0,0.9,0.1,1.1C269,208.6,269,208.9,270.5,208.9z M270.5,208.2c-0.6,0-0.6-0.1-0.6-0.3s0-1.2,0-1.4s0.1-0.3,0.6-0.3
						s0.7,0.1,0.7,0.2c0,0.1,0,0.3,0,0.3l0,0v1.1v0.1C271.2,208.1,271,208.2,270.5,208.2z"/>
					<polygon id="polygon519" class="st22" points="275.3,208.9 274.4,208.9 273.5,206.4 273.5,208.9 272.6,208.9 272.6,205.4 
						273.9,205.4 274.8,208 275.7,205.4 277,205.4 277,208.9 276.1,208.9 276.1,206.4 					"/>
					<polygon id="polygon521" class="st22" points="290,205.4 287.5,205.4 287.5,206.3 288.3,206.3 288.3,208.9 289.2,208.9 
						289.2,206.3 290,206.3 					"/>
					<path id="path523" inkscape:connector-curvature="0" class="st22" d="M283.1,208.9h0.9l-1-3.5h-1.3l-1,3.5h0.9l0.2-0.7h1.1
						L283.1,208.9z M282,207.6l0.4-1.4l0.4,1.4H282z"/>
					<path id="path525" inkscape:connector-curvature="0" class="st22" d="M280.7,207.3c-0.1,0.4-0.3,0.6-0.7,0.7
						c-0.4,0.1-1.3,0.1-1.3,0.1v0.8h-0.9v-3.5h0.9c0,0,0.5,0,0.8,0s0.7,0,0.9,0.2c0.3,0.2,0.4,0.6,0.4,0.8
						C280.7,206.5,280.7,207.3,280.7,207.3L280.7,207.3z M279.5,207.3c0.3,0,0.3-0.2,0.3-0.3s0-0.2,0-0.4c0-0.3-0.2-0.3-0.4-0.3
						c-0.2,0-0.8,0-0.8,0v1C278.7,207.3,279.2,207.3,279.5,207.3z"/>
				</g>
			</g>
		</g>
	</g>
</g>
</svg>
