<?xml version="1.0" encoding="UTF-8" standalone="no"?>
<!-- Created with Inkscape (http://www.inkscape.org/) -->

<svg
   version="1.1"
   id="svg2"
   width="51.413033"
   height="9.4666433"
   viewBox="0 0 51.413034 9.4666433"
   sodipodi:docname="atomiswave.svg"
   inkscape:version="1.1 (c68e22c387, 2021-05-23)"
   inkscape:export-filename="C:\Users\BUCH\Desktop\Retrogaming\Recalbox\travail thèmes\Thème vignette !!!!!!!\Maquette 2 !!!!\image1250.png"
   inkscape:export-xdpi="96.460785"
   inkscape:export-ydpi="96.460785"
   xmlns:inkscape="http://www.inkscape.org/namespaces/inkscape"
   xmlns:sodipodi="http://sodipodi.sourceforge.net/DTD/sodipodi-0.dtd"
   xmlns="http://www.w3.org/2000/svg"
   xmlns:svg="http://www.w3.org/2000/svg">
  <defs
     id="defs6">
    <clipPath
       clipPathUnits="userSpaceOnUse"
       id="clipPath3185">
      <path
         id="path3187"
         style="fill:#ffffff;fill-rule:evenodd;stroke:#ffffff;stroke-width:5.15903;stroke-linecap:round;stroke-linejoin:round;paint-order:stroke fill markers"
         d="m 1157.5591,335.78677 h 462.4206 L 1362.3723,1410.6277 H 899.95176 Z"
         sodipodi:nodetypes="ccccc"
         inkscape:export-filename="C:\Users\BUCH\Desktop\Retrogaming\Recalbox\travail thèmes\Thème vignette !!!!!!!\Maquette 2 !!!!\rect849.png"
         inkscape:export-xdpi="247.96268"
         inkscape:export-ydpi="247.96268" />
    </clipPath>
  </defs>
  <sodipodi:namedview
     id="namedview4"
     pagecolor="#ffffff"
     bordercolor="#666666"
     borderopacity="1.0"
     inkscape:pageshadow="2"
     inkscape:pageopacity="0.0"
     inkscape:pagecheckerboard="true"
     showgrid="false"
     inkscape:showpageshadow="false"
     inkscape:zoom="12.479331"
     inkscape:cx="19.512264"
     inkscape:cy="3.84636"
     inkscape:window-width="1920"
     inkscape:window-height="1138"
     inkscape:window-x="-8"
     inkscape:window-y="-8"
     inkscape:window-maximized="1"
     inkscape:current-layer="svg2"
     fit-margin-top="0"
     fit-margin-left="0"
     fit-margin-right="0"
     fit-margin-bottom="0" />
  <g
     aria-label="atomiswave"
     id="text12574"
     style="font-weight:300;font-size:13.3333px;line-height:1.25;font-family:'Bebas Neue';-inkscape-font-specification:'Bebas Neue, Light'"
     transform="translate(-8.0257871,-16.162291)">
    <path
       d="m 12.15911,23.362273 0.546665,2.199994 h 0.293333 L 10.692447,16.215624 H 10.279115 L 8.0257871,25.562267 H 8.292453 l 0.5466653,-2.199994 z m -1.679996,-6.799983 1.626663,6.533317 H 8.8924515 Z"
       style="fill:#ffffff"
       id="path15527" />
    <path
       d="m 15.559081,25.562267 v -9.05331 h 2.039995 v -0.279999 h -4.359989 v 0.279999 h 2.026662 v 9.05331 z"
       style="fill:#ffffff"
       id="path15529" />
    <path
       d="m 18.399057,23.26894 c 0,1.306663 0.559999,2.359994 1.973328,2.359994 1.439997,0 1.999995,-1.053331 1.999995,-2.359994 v -4.746655 c 0,-1.306663 -0.559998,-2.359994 -1.999995,-2.359994 -1.413329,0 -1.973328,1.053331 -1.973328,2.359994 z m 0.293333,-4.759988 c 0,-1.146664 0.439999,-2.079995 1.679995,-2.079995 1.253331,0 1.706663,0.933331 1.706663,2.079995 v 4.773321 c 0,1.146664 -0.453332,2.079995 -1.706663,2.079995 -1.239996,0 -1.679995,-0.933331 -1.679995,-2.079995 z"
       style="fill:#ffffff"
       id="path15531" />
    <path
       d="m 28.62569,16.668956 v 8.893311 h 0.293333 v -9.333309 h -0.453332 l -2.293328,8.853311 -2.293327,-8.853311 h -0.453332 v 9.333309 h 0.266666 v -8.893311 l 2.30666,8.866645 h 0.333333 z"
       style="fill:#ffffff"
       id="path15533" />
    <path
       d="m 29.985669,16.228958 v 9.333309 h 0.293332 v -9.333309 z"
       style="fill:#ffffff"
       id="path15535" />
    <path
       d="m 33.278984,16.162291 c -1.346663,0.01333 -1.919995,0.946664 -1.919995,2.306661 0,2.573327 3.573325,2.493327 3.573325,4.853321 0,1.13333 -0.439999,2.026662 -1.666663,2.026662 -1.226663,0 -1.666662,-0.893332 -1.666662,-2.026662 v -0.466666 h -0.28 v 0.453333 c 0,1.29333 0.533332,2.319994 1.946662,2.319994 1.426663,0 1.959995,-1.026664 1.959995,-2.319994 0,-2.533327 -3.573324,-2.466661 -3.573324,-4.853321 0,-1.106664 0.413332,-2.026662 1.639996,-2.026662 1.21333,0 1.626662,0.933331 1.626662,2.039995 v 0.186666 h 0.293333 v -0.173333 c 0,-1.279997 -0.519999,-2.319994 -1.933329,-2.319994 z"
       style="fill:#ffffff"
       id="path15537" />
    <path
       d="m 39.932294,16.922289 1.506663,8.639978 h 0.386666 l 1.653329,-9.333309 h -0.266666 l -1.573329,8.879977 -1.519996,-8.826644 h -0.359999 l -1.61333,8.879977 -1.626662,-8.93331 h -0.293333 l 1.679996,9.333309 h 0.426665 z"
       style="fill:#ffffff"
       id="path15539" />
    <path
       d="m 48.398898,23.362273 0.546665,2.199994 h 0.293333 l -2.306661,-9.346643 h -0.413332 l -2.253328,9.346643 h 0.266666 l 0.546665,-2.199994 z m -1.679996,-6.799983 1.626663,6.533317 H 45.13224 Z"
       style="fill:#ffffff"
       id="path15541" />
    <path
       d="m 49.892189,16.228958 2.279994,9.333309 h 0.439999 l 2.239994,-9.333309 h -0.279999 l -2.186661,8.999977 -2.186661,-8.999977 z"
       style="fill:#ffffff"
       id="path15543" />
    <path
       d="m 56.172161,20.695613 v -4.186656 h 3.266659 v -0.279999 h -3.559991 v 9.333309 h 3.559991 v -0.279999 h -3.266659 v -4.319989 h 2.74666 v -0.266666 z"
       style="fill:#ffffff"
       id="path15545" />
  </g>
</svg>
