<?xml version="1.0" encoding="UTF-8" standalone="no"?>
<!-- Created with Inkscape (http://www.inkscape.org/) -->

<svg
   version="1.1"
   id="svg2"
   width="50.266342"
   height="9.4133101"
   viewBox="0 0 50.266344 9.41331"
   sodipodi:docname="auto-multiplayer.svg"
   inkscape:version="1.1 (c68e22c387, 2021-05-23)"
   inkscape:export-filename="C:\Users\BUCH\Desktop\Retrogaming\Recalbox\travail thèmes\Thème vignette !!!!!!!\Maquette 2 !!!!\image1250.png"
   inkscape:export-xdpi="96.460785"
   inkscape:export-ydpi="96.460785"
   xmlns:inkscape="http://www.inkscape.org/namespaces/inkscape"
   xmlns:sodipodi="http://sodipodi.sourceforge.net/DTD/sodipodi-0.dtd"
   xmlns="http://www.w3.org/2000/svg"
   xmlns:svg="http://www.w3.org/2000/svg">
  <defs
     id="defs6">
    <clipPath
       clipPathUnits="userSpaceOnUse"
       id="clipPath3185">
      <path
         id="path3187"
         style="fill:#ffffff;fill-rule:evenodd;stroke:#ffffff;stroke-width:5.15903;stroke-linecap:round;stroke-linejoin:round;paint-order:stroke fill markers"
         d="m 1157.5591,335.78677 h 462.4206 L 1362.3723,1410.6277 H 899.95176 Z"
         sodipodi:nodetypes="ccccc"
         inkscape:export-filename="C:\Users\BUCH\Desktop\Retrogaming\Recalbox\travail thèmes\Thème vignette !!!!!!!\Maquette 2 !!!!\rect849.png"
         inkscape:export-xdpi="247.96268"
         inkscape:export-ydpi="247.96268" />
    </clipPath>
  </defs>
  <sodipodi:namedview
     id="namedview4"
     pagecolor="#ffffff"
     bordercolor="#666666"
     borderopacity="1.0"
     inkscape:pageshadow="2"
     inkscape:pageopacity="0.0"
     inkscape:pagecheckerboard="true"
     showgrid="false"
     inkscape:showpageshadow="false"
     inkscape:zoom="12.479331"
     inkscape:cx="33.455319"
     inkscape:cy="7.9331176"
     inkscape:window-width="1920"
     inkscape:window-height="1138"
     inkscape:window-x="-8"
     inkscape:window-y="-8"
     inkscape:window-maximized="1"
     inkscape:current-layer="svg2"
     fit-margin-top="0"
     fit-margin-left="0"
     fit-margin-right="0"
     fit-margin-bottom="0" />
  <g
     aria-label="multiplayer"
     id="text2234"
     style="font-weight:300;font-size:13.3333px;line-height:1.25;font-family:'Bebas Neue';-inkscape-font-specification:'Bebas Neue, Light';fill:#ffffff"
     transform="translate(3.313028,-14.853371)">
    <path
       d="m 1.8869589,15.306703 v 8.893311 h 0.2933326 v -9.33331 H 1.7269593 L -0.56636826,23.720015 -2.8596958,14.866704 H -3.313028 v 9.33331 h 0.266666 v -8.893311 l 2.30666085,8.866645 h 0.33333249 z"
       id="path2463" />
    <path
       d="M 3.5269369,14.866704 H 3.2336043 v 7.026649 c 0,1.279997 0.5066654,2.373328 1.9333285,2.373328 1.4133297,0 1.9199951,-1.093331 1.9199951,-2.373328 V 14.866704 H 6.8069286 v 7.039983 c 0,1.119997 -0.399999,2.093328 -1.6399958,2.093328 -1.2399969,0 -1.6399959,-0.973331 -1.6399959,-2.093328 z"
       id="path2465" />
    <path
       d="M 11.566899,24.200014 V 23.920015 H 8.4335736 V 14.866704 H 8.140241 v 9.33331 z"
       id="path2467" />
    <path
       d="m 13.953522,24.200014 v -9.05331 h 2.039995 v -0.28 h -4.359989 v 0.28 h 2.026661 v 9.05331 z"
       id="path2469" />
    <path
       d="m 16.80683,14.866704 v 9.33331 h 0.293332 v -9.33331 z"
       id="path2471" />
    <path
       d="m 18.166817,14.866704 v 9.33331 h 0.293333 v -3.95999 h 1.33333 c 1.479996,0 2.146661,-0.706665 2.146661,-2.186661 v -0.933331 c 0,-1.306663 -0.493332,-2.253328 -1.933329,-2.253328 z m 0.293333,5.093321 v -4.813321 h 1.546662 c 1.253331,0 1.639996,0.813331 1.639996,1.959995 v 0.959997 c 0,1.319997 -0.546665,1.893329 -1.853328,1.893329 z"
       id="path2473" />
    <path
       d="m 26.380119,24.200014 v -0.279999 h -3.133325 v -9.053311 h -0.293333 v 9.33331 z"
       id="path2475" />
    <path
       d="m 31.48675,22.00002 0.546666,2.199994 h 0.293332 l -2.306661,-9.346643 h -0.413332 l -2.253328,9.346643 h 0.266666 l 0.546666,-2.199994 z m -1.679996,-6.799983 1.626663,6.533317 h -3.213325 z"
       id="path2477" />
    <path
       d="m 34.820036,24.200014 h 0.293332 V 20.42669 l 2.213328,-5.559986 H 37.02003 l -2.039995,5.159987 -2.039994,-5.159987 h -0.293333 l 2.173328,5.559986 z"
       id="path2479" />
    <path
       d="m 38.62001,19.33336 v -4.186656 h 3.266659 v -0.28 h -3.559991 v 9.33331 h 3.559991 V 23.920015 H 38.62001 v -4.319989 h 2.74666 V 19.33336 Z"
       id="path2481" />
    <path
       d="m 42.926657,14.866704 v 9.33331 h 0.293333 v -4.306656 h 1.146663 c 1.213331,0 2.039995,0.359999 2.039995,1.733329 v 1.466663 c 0,0.399999 0.04,0.813332 0.226666,1.106664 h 0.32 C 46.739981,23.906682 46.699981,23.453349 46.699981,23.09335 v -1.466663 c 0,-1.026664 -0.439999,-1.706662 -1.479996,-1.866662 1.026664,-0.186666 1.479996,-0.813331 1.479996,-1.959995 v -0.839998 c 0,-1.279996 -0.533332,-2.093328 -1.919995,-2.093328 z m 0.293333,4.746655 v -4.466655 h 1.546662 c 1.199997,0 1.639996,0.706665 1.639996,1.839995 v 0.853331 c 0,1.439997 -0.746664,1.773329 -2.039995,1.773329 z"
       id="path2483" />
  </g>
</svg>
