<?xml version="1.0" encoding="UTF-8" standalone="no"?>
<!-- Created with Inkscape (http://www.inkscape.org/) -->

<svg
   height="11.56575"
   width="24.073935"
   version="1.1"
   id="svg30"
   sodipodi:docname="logo3.svg"
   inkscape:export-filename="C:\Users\BUCH\Desktop\Retrogaming\Recalbox\travail thèmes\Metal Slide\auto-arcade-dataeast\Data_East_Logo.png"
   inkscape:export-xdpi="2044.543"
   inkscape:export-ydpi="2044.543"
   inkscape:version="1.1 (c68e22c387, 2021-05-23)"
   xmlns:inkscape="http://www.inkscape.org/namespaces/inkscape"
   xmlns:sodipodi="http://sodipodi.sourceforge.net/DTD/sodipodi-0.dtd"
   xmlns="http://www.w3.org/2000/svg"
   xmlns:svg="http://www.w3.org/2000/svg">
  <defs
     id="defs34" />
  <sodipodi:namedview
     id="namedview32"
     pagecolor="#ffffff"
     bordercolor="#666666"
     borderopacity="1.0"
     inkscape:pageshadow="2"
     inkscape:pageopacity="0.0"
     inkscape:pagecheckerboard="true"
     showgrid="false"
     fit-margin-top="0"
     fit-margin-left="0"
     fit-margin-right="0"
     fit-margin-bottom="0"
     inkscape:showpageshadow="false"
     inkscape:zoom="22.627417"
     inkscape:cx="12.750019"
     inkscape:cy="4.8171649"
     inkscape:window-width="1920"
     inkscape:window-height="1138"
     inkscape:window-x="-8"
     inkscape:window-y="-8"
     inkscape:window-maximized="1"
     inkscape:current-layer="svg30"
     inkscape:snap-global="true" />
  <g
     id="g1575">
    <ellipse
       style="fill:#ffffff;fill-rule:evenodd;stroke:none;stroke-width:2.37447;stroke-linecap:round;stroke-linejoin:round;stroke-miterlimit:4;stroke-dasharray:none;paint-order:stroke fill markers"
       id="path1337"
       cx="15.577071"
       cy="8.2177448"
       rx="1.15625"
       ry="1.125" />
    <rect
       style="fill:#ffffff;fill-rule:evenodd;stroke-width:1.80478;stroke-linecap:round;stroke-linejoin:round;paint-order:stroke fill markers"
       id="rect985"
       width="16.771688"
       height="2.80633"
       x="3.6298001"
       y="8.4691114"
       ry="0.93202931" />
    <rect
       style="fill:#ffffff;fill-rule:evenodd;stroke:none;stroke-width:1.47476;stroke-linecap:round;stroke-linejoin:round;stroke-miterlimit:4;stroke-dasharray:none;paint-order:stroke fill markers"
       id="rect1161"
       width="11.954524"
       height="3.1377864"
       x="10.789256"
       y="4.8009963" />
    <rect
       style="fill:#ffffff;fill-rule:evenodd;stroke:none;stroke-width:1.79116;stroke-linecap:round;stroke-linejoin:round;stroke-miterlimit:4;stroke-dasharray:none;paint-order:stroke fill markers"
       id="rect1035"
       width="11.357903"
       height="3.1377864"
       x="11.341683"
       y="0.75722897" />
    <g
       aria-label="CLASSICS"
       id="g1224"
       style="font-size:25.4px;line-height:1.25;font-family:'Patrick Hand SC';-inkscape-font-specification:'Patrick Hand SC, Normal';stroke:#ffffff;stroke-width:7.95541;stroke-linecap:round;stroke-linejoin:round;stroke-miterlimit:4;stroke-dasharray:none;paint-order:stroke fill markers"
       transform="matrix(0.12570066,0,0,0.12570066,0.17145056,-6.2869509)">
      <path
         d="m 30.901226,138.04781 v -2.1084 h -2.108398 v -14.8208 h 2.108398 v -2.1208 h 8.470801 v 2.1208 h 2.1208 v 4.2292 h -4.241601 v -4.2292 h -4.229199 v 14.8208 h 4.229199 v -4.2416 h 4.241601 v 4.2416 h -2.1208 v 2.1084 z"
         style="font-family:'BIG SHOT';-inkscape-font-specification:'BIG SHOT, Normal';stroke:#ffffff;stroke-width:7.95541;stroke-linecap:round;stroke-linejoin:round;stroke-miterlimit:4;stroke-dasharray:none;paint-order:stroke fill markers"
         id="path1208" />
      <path
         d="m 45.722027,138.04781 v -19.05 h 4.229199 v 16.9416 h 8.470801 v 2.1084 z"
         style="font-family:'BIG SHOT';-inkscape-font-specification:'BIG SHOT, Normal';stroke:#ffffff;stroke-width:7.95541;stroke-linecap:round;stroke-linejoin:round;stroke-miterlimit:4;stroke-dasharray:none;paint-order:stroke fill markers"
         id="path1210" />
      <path
         d="m 71.109624,129.58941 v -8.4708 h -4.229199 v 8.4708 z m -8.458398,8.4584 v -16.9292 h 2.108398 v -2.1208 h 8.470801 v 2.1208 h 2.120801 v 16.9292 h -4.241602 v -6.35 h -4.229199 v 6.35 z"
         style="font-family:'BIG SHOT';-inkscape-font-specification:'BIG SHOT, Normal';stroke:#ffffff;stroke-width:7.95541;stroke-linecap:round;stroke-linejoin:round;stroke-miterlimit:4;stroke-dasharray:none;paint-order:stroke fill markers"
         id="path1212" />
      <path
         d="m 81.688824,138.04781 v -2.1084 h -2.108399 v -4.2416 h 4.229199 v 4.2416 h 4.2292 v -6.35 h -6.35 v -2.1208 h -2.108399 v -6.35 h 2.108399 v -2.1208 h 8.4708 v 2.1208 h 2.120801 v 4.2292 h -4.241601 v -4.2292 h -4.2292 v 6.35 h 6.35 v 2.1208 h 2.120801 v 6.35 h -2.120801 v 2.1084 z"
         style="font-family:'BIG SHOT';-inkscape-font-specification:'BIG SHOT, Normal';stroke:#ffffff;stroke-width:7.95541;stroke-linecap:round;stroke-linejoin:round;stroke-miterlimit:4;stroke-dasharray:none;paint-order:stroke fill markers"
         id="path1214" />
      <path
         d="m 98.618023,138.04781 v -2.1084 h -2.108399 v -4.2416 h 4.229196 v 4.2416 h 4.2292 v -6.35 h -6.349997 v -2.1208 h -2.108399 v -6.35 h 2.108399 v -2.1208 h 8.470797 v 2.1208 h 2.1208 v 4.2292 h -4.2416 v -4.2292 h -4.2292 v 6.35 h 6.35 v 2.1208 h 2.1208 v 6.35 h -2.1208 v 2.1084 z"
         style="font-family:'BIG SHOT';-inkscape-font-specification:'BIG SHOT, Normal';stroke:#ffffff;stroke-width:7.95541;stroke-linecap:round;stroke-linejoin:round;stroke-miterlimit:4;stroke-dasharray:none;paint-order:stroke fill markers"
         id="path1216" />
      <path
         d="m 113.43882,138.04781 v -2.1084 h 4.2292 v -14.8208 h -4.2292 v -2.1208 h 12.7 v 2.1208 h -4.2416 v 14.8208 h 4.2416 v 2.1084 z"
         style="font-family:'BIG SHOT';-inkscape-font-specification:'BIG SHOT, Normal';stroke:#ffffff;stroke-width:7.95541;stroke-linecap:round;stroke-linejoin:round;stroke-miterlimit:4;stroke-dasharray:none;paint-order:stroke fill markers"
         id="path1218" />
      <path
         d="m 132.47642,138.04781 v -2.1084 h -2.1084 v -14.8208 h 2.1084 v -2.1208 h 8.4708 v 2.1208 h 2.1208 v 4.2292 h -4.2416 v -4.2292 h -4.2292 v 14.8208 h 4.2292 v -4.2416 h 4.2416 v 4.2416 h -2.1208 v 2.1084 z"
         style="font-family:'BIG SHOT';-inkscape-font-specification:'BIG SHOT, Normal';stroke:#ffffff;stroke-width:7.95541;stroke-linecap:round;stroke-linejoin:round;stroke-miterlimit:4;stroke-dasharray:none;paint-order:stroke fill markers"
         id="path1220" />
      <path
         d="m 149.40562,138.04781 v -2.1084 h -2.1084 v -4.2416 h 4.2292 v 4.2416 h 4.2292 v -6.35 h -6.35 v -2.1208 h -2.1084 v -6.35 h 2.1084 v -2.1208 h 8.4708 v 2.1208 h 2.1208 v 4.2292 h -4.2416 v -4.2292 h -4.2292 v 6.35 h 6.35 v 2.1208 h 2.1208 v 6.35 h -2.1208 v 2.1084 z"
         style="font-family:'BIG SHOT';-inkscape-font-specification:'BIG SHOT, Normal';stroke:#ffffff;stroke-width:7.95541;stroke-linecap:round;stroke-linejoin:round;stroke-miterlimit:4;stroke-dasharray:none;paint-order:stroke fill markers"
         id="path1222" />
    </g>
    <g
       transform="matrix(0.13230255,0,0,-0.13230255,-27.50841,59.970043)"
       fill="#f91b20"
       id="g28"
       style="stroke:#ffffff;stroke-width:7.55843;stroke-linecap:round;stroke-linejoin:round;stroke-miterlimit:4;stroke-dasharray:none;paint-order:stroke fill markers">
      <path
         d="m 363.4922,416.1914 h 22.6103 v -5.5547 h -7.58 v -16.9101 h -7.4493 v 16.9101 h -7.581 z"
         id="path2"
         style="stroke:#ffffff;stroke-width:7.55843;stroke-linecap:round;stroke-linejoin:round;stroke-miterlimit:4;stroke-dasharray:none;paint-order:stroke fill markers" />
      <path
         d="m 339.5391,401.1582 7.0996,0.4111 c 0.1533,-1.0673 0.4687,-1.8818 0.9424,-2.4404 0.7695,-0.9062 1.8701,-1.3584 3.3027,-1.3584 1.0674,0 1.8896,0.2324 2.4668,0.6973 0.5781,0.4638 0.8682,1.0029 0.8682,1.6152 0,0.582 -0.2764,1.1025 -0.8301,1.5625 -0.5528,0.46 -1.8291,0.8936 -3.8252,1.3018 -3.2705,0.6816 -5.6035,1.5908 -6.9961,2.7216 -1.4053,1.1329 -2.1084,2.5752 -2.1084,4.3291 0,1.1514 0.3594,2.2383 1.0791,3.2647 0.7187,1.0244 1.8008,1.8311 3.2441,2.418 1.4424,0.5839 3.4199,0.8779 5.9346,0.8779 3.084,0 5.4365,-0.5332 7.0547,-1.5977 1.6181,-1.0673 2.582,-2.7597 2.8896,-5.0859 l -7.0107,-0.3828 c -0.1895,1.0117 -0.584,1.749 -1.1856,2.2109 -0.6015,0.46 -1.4316,0.6895 -2.4921,0.6895 -0.8721,0 -1.5293,-0.1709 -1.9698,-0.5137 -0.4424,-0.3418 -0.6631,-0.7578 -0.6631,-1.248 0,-0.3575 0.1836,-0.6788 0.5528,-0.9649 0.3564,-0.2959 1.1933,-0.5713 2.5097,-0.8271 3.2598,-0.6534 5.5948,-1.3116 7.0049,-1.9805 1.4102,-0.6689 2.4366,-1.499 3.0782,-2.4893 0.6435,-0.9902 0.9638,-2.0986 0.9638,-3.3232 0,-1.4404 -0.4287,-2.7646 -1.2842,-3.9795 -0.8574,-1.2158 -2.0537,-2.1367 -3.5918,-2.7646 -1.538,-0.628 -3.4765,-0.9424 -5.8164,-0.9424 -4.1074,0 -6.9502,0.7353 -8.5332,2.2002 -1.58,1.4707 -2.4756,3.334 -2.6845,5.5986 z"
         id="path4"
         style="stroke:#ffffff;stroke-width:7.55843;stroke-linecap:round;stroke-linejoin:round;stroke-miterlimit:4;stroke-dasharray:none;paint-order:stroke fill markers" />
      <path
         d="m 329.5127,397.4434 h -8.4297 l -1.2148,-3.7168 h -7.6006 l 9.0293,22.4648 h 8.1699 l 9.0478,-22.4648 h -7.7939 l -1.208,3.7168 m -1.5772,4.8603 -2.6308,8.0693 -2.6358,-8.0693 z"
         id="path6"
         style="stroke:#ffffff;stroke-width:7.55843;stroke-linecap:round;stroke-linejoin:round;stroke-miterlimit:4;stroke-dasharray:none;paint-order:stroke fill markers" />
      <path
         d="m 290.375,416.1914 h 19.9814 v -4.7793 h -12.5322 v -3.5937 h 11.6123 v -4.5752 h -11.6123 v -4.4112 h 12.8828 v -5.1054 h -20.332 z"
         id="path8"
         style="stroke:#ffffff;stroke-width:7.55843;stroke-linecap:round;stroke-linejoin:round;stroke-miterlimit:4;stroke-dasharray:none;paint-order:stroke fill markers" />
      <path
         d="m 375.8193,428.8467 h -8.4306 l -1.2158,-3.7168 h -7.5987 l 9.0293,22.4639 h 8.169 l 9.0488,-22.4639 h -7.794 l -1.208,3.7168 m -1.5791,4.8603 -2.6308,8.0694 -2.6348,-8.0694 z"
         id="path10"
         style="stroke:#ffffff;stroke-width:7.55843;stroke-linecap:round;stroke-linejoin:round;stroke-miterlimit:4;stroke-dasharray:none;paint-order:stroke fill markers" />
      <path
         d="m 337.2998,447.5938 h 22.6104 v -5.5547 h -7.5801 v -16.9092 h -7.4492 v 16.9092 h -7.5811 z"
         id="path12"
         style="stroke:#ffffff;stroke-width:7.55843;stroke-linecap:round;stroke-linejoin:round;stroke-miterlimit:4;stroke-dasharray:none;paint-order:stroke fill markers" />
      <path
         d="m 329.9404,428.8467 h -8.4306 l -1.2149,-3.7168 h -7.5996 l 9.0293,22.4639 h 8.1699 l 9.0479,-22.4639 h -7.794 l -1.208,3.7168 m -1.5781,4.8603 -2.6318,8.0694 -2.6338,-8.0694 z"
         id="path14"
         style="stroke:#ffffff;stroke-width:7.55843;stroke-linecap:round;stroke-linejoin:round;stroke-miterlimit:4;stroke-dasharray:none;paint-order:stroke fill markers" />
      <path
         d="m 290.5063,447.5938 h 11.0396 c 2.1758,0 3.9346,-0.2754 5.2744,-0.8272 1.3399,-0.5518 2.4473,-1.3447 3.3203,-2.376 0.876,-1.0322 1.5098,-2.2314 1.9033,-3.6025 0.3936,-1.3682 0.5909,-2.8184 0.5909,-4.3496 0,-2.3994 -0.293,-4.2627 -0.878,-5.585 -0.5849,-1.3232 -1.3974,-2.4336 -2.4355,-3.3262 -1.0391,-0.8935 -2.1563,-1.4882 -3.3467,-1.7851 -1.6299,-0.4082 -3.1055,-0.6123 -4.4287,-0.6123 h -11.0396 v 22.4639 m 7.4493,-5.1055 v -12.2529 h 1.809 c 1.543,0 2.6397,0.1611 3.292,0.4824 0.6514,0.3193 1.1631,0.8808 1.5313,1.6826 0.3691,0.7988 0.5537,2.0976 0.5537,3.8926 0,2.3769 -0.4131,4.0029 -1.2373,4.8779 -0.8272,0.8779 -2.1973,1.3174 -4.1084,1.3174 z"
         id="path16"
         style="stroke:#ffffff;stroke-width:7.55843;stroke-linecap:round;stroke-linejoin:round;stroke-miterlimit:4;stroke-dasharray:none;paint-order:stroke fill markers" />
      <path
         d="m 216.375,449.5 c -0.0845,0 -0.166,-0.01 -0.2505,-0.0103 h -4.4248 v -7.9554 l 3.4321,0.007 c 11.5518,0 20.917,-9.3652 20.917,-20.917 0,-11.522 -9.3178,-20.8657 -20.8286,-20.9136 l -3.5205,-0.004 v -7.9592 h 4.7969 v 0.005 c 15.8906,0.0664 28.7534,12.9659 28.7534,28.8721 0,15.9468 -12.9282,28.875 -28.875,28.875 z"
         id="path18"
         style="stroke:#ffffff;stroke-width:7.55843;stroke-linecap:round;stroke-linejoin:round;stroke-miterlimit:4;stroke-dasharray:none;paint-order:stroke fill markers" />
      <path
         d="m 232.5947,420.6245 c 0,9.9263 -8.0473,17.9736 -17.9736,17.9736 -0.0532,0 -2.9107,-0.006 -2.9107,-0.006 v -35.9414 l 2.9864,0.003 c 9.8916,0.042 17.8979,8.0703 17.8979,17.9712 z"
         id="path20"
         style="stroke:#ffffff;stroke-width:7.55843;stroke-linecap:round;stroke-linejoin:round;stroke-miterlimit:4;stroke-dasharray:none;paint-order:stroke fill markers" />
      <path
         d="m 257.418,419.3828 c 0.6386,-9.3193 8.3628,-16.6894 17.8354,-16.7295 l 2.9863,-0.003 v 16.7324 H 257.418 Z"
         id="path22"
         style="stroke:#ffffff;stroke-width:7.55843;stroke-linecap:round;stroke-linejoin:round;stroke-miterlimit:4;stroke-dasharray:none;paint-order:stroke fill markers" />
      <path
         d="m 278.2397,421.8828 v 16.709 c 0,0 -2.8574,0.006 -2.9106,0.006 -9.5015,0 -17.2617,-7.3784 -17.9102,-16.7153 h 20.8208 z"
         id="path24"
         style="stroke:#ffffff;stroke-width:7.55843;stroke-linecap:round;stroke-linejoin:round;stroke-miterlimit:4;stroke-dasharray:none;paint-order:stroke fill markers" />
      <path
         d="m 273.5752,449.5 c 0.0845,0 0.166,-0.01 0.2505,-0.0103 h 4.4248 v -7.9554 l -3.4321,0.007 c -11.5518,0 -20.917,-9.3652 -20.917,-20.917 0,-11.522 9.3178,-20.8657 20.8286,-20.9136 l 3.5205,-0.004 v -7.9592 h -4.7969 v 0.005 c -15.8906,0.0664 -28.7534,12.9659 -28.7534,28.8721 0,15.9468 12.9282,28.875 28.875,28.875 z"
         id="path26"
         style="stroke:#ffffff;stroke-width:7.55843;stroke-linecap:round;stroke-linejoin:round;stroke-miterlimit:4;stroke-dasharray:none;paint-order:stroke fill markers" />
    </g>
    <g
       transform="matrix(0.13230255,0,0,-0.13230255,-27.50841,59.970096)"
       fill="#f91b20"
       id="g877">
      <path
         d="m 363.4922,416.1914 h 22.6103 v -5.5547 h -7.58 v -16.9101 h -7.4493 v 16.9101 h -7.581 z"
         id="path851" />
      <path
         d="m 339.5391,401.1582 7.0996,0.4111 c 0.1533,-1.0673 0.4687,-1.8818 0.9424,-2.4404 0.7695,-0.9062 1.8701,-1.3584 3.3027,-1.3584 1.0674,0 1.8896,0.2324 2.4668,0.6973 0.5781,0.4638 0.8682,1.0029 0.8682,1.6152 0,0.582 -0.2764,1.1025 -0.8301,1.5625 -0.5528,0.46 -1.8291,0.8936 -3.8252,1.3018 -3.2705,0.6816 -5.6035,1.5908 -6.9961,2.7216 -1.4053,1.1329 -2.1084,2.5752 -2.1084,4.3291 0,1.1514 0.3594,2.2383 1.0791,3.2647 0.7187,1.0244 1.8008,1.8311 3.2441,2.418 1.4424,0.5839 3.4199,0.8779 5.9346,0.8779 3.084,0 5.4365,-0.5332 7.0547,-1.5977 1.6181,-1.0673 2.582,-2.7597 2.8896,-5.0859 l -7.0107,-0.3828 c -0.1895,1.0117 -0.584,1.749 -1.1856,2.2109 -0.6015,0.46 -1.4316,0.6895 -2.4921,0.6895 -0.8721,0 -1.5293,-0.1709 -1.9698,-0.5137 -0.4424,-0.3418 -0.6631,-0.7578 -0.6631,-1.248 0,-0.3575 0.1836,-0.6788 0.5528,-0.9649 0.3564,-0.2959 1.1933,-0.5713 2.5097,-0.8271 3.2598,-0.6534 5.5948,-1.3116 7.0049,-1.9805 1.4102,-0.6689 2.4366,-1.499 3.0782,-2.4893 0.6435,-0.9902 0.9638,-2.0986 0.9638,-3.3232 0,-1.4404 -0.4287,-2.7646 -1.2842,-3.9795 -0.8574,-1.2158 -2.0537,-2.1367 -3.5918,-2.7646 -1.538,-0.628 -3.4765,-0.9424 -5.8164,-0.9424 -4.1074,0 -6.9502,0.7353 -8.5332,2.2002 -1.58,1.4707 -2.4756,3.334 -2.6845,5.5986 z"
         id="path853" />
      <path
         d="m 329.5127,397.4434 h -8.4297 l -1.2148,-3.7168 h -7.6006 l 9.0293,22.4648 h 8.1699 l 9.0478,-22.4648 h -7.7939 l -1.208,3.7168 m -1.5772,4.8603 -2.6308,8.0693 -2.6358,-8.0693 z"
         id="path855" />
      <path
         d="m 290.375,416.1914 h 19.9814 v -4.7793 h -12.5322 v -3.5937 h 11.6123 v -4.5752 h -11.6123 v -4.4112 h 12.8828 v -5.1054 h -20.332 z"
         id="path857" />
      <path
         d="m 375.8193,428.8467 h -8.4306 l -1.2158,-3.7168 h -7.5987 l 9.0293,22.4639 h 8.169 l 9.0488,-22.4639 h -7.794 l -1.208,3.7168 m -1.5791,4.8603 -2.6308,8.0694 -2.6348,-8.0694 z"
         id="path859" />
      <path
         d="m 337.2998,447.5938 h 22.6104 v -5.5547 h -7.5801 v -16.9092 h -7.4492 v 16.9092 h -7.5811 z"
         id="path861" />
      <path
         d="m 329.9404,428.8467 h -8.4306 l -1.2149,-3.7168 h -7.5996 l 9.0293,22.4639 h 8.1699 l 9.0479,-22.4639 h -7.794 l -1.208,3.7168 m -1.5781,4.8603 -2.6318,8.0694 -2.6338,-8.0694 z"
         id="path863" />
      <path
         d="m 290.5063,447.5938 h 11.0396 c 2.1758,0 3.9346,-0.2754 5.2744,-0.8272 1.3399,-0.5518 2.4473,-1.3447 3.3203,-2.376 0.876,-1.0322 1.5098,-2.2314 1.9033,-3.6025 0.3936,-1.3682 0.5909,-2.8184 0.5909,-4.3496 0,-2.3994 -0.293,-4.2627 -0.878,-5.585 -0.5849,-1.3232 -1.3974,-2.4336 -2.4355,-3.3262 -1.0391,-0.8935 -2.1563,-1.4882 -3.3467,-1.7851 -1.6299,-0.4082 -3.1055,-0.6123 -4.4287,-0.6123 h -11.0396 v 22.4639 m 7.4493,-5.1055 v -12.2529 h 1.809 c 1.543,0 2.6397,0.1611 3.292,0.4824 0.6514,0.3193 1.1631,0.8808 1.5313,1.6826 0.3691,0.7988 0.5537,2.0976 0.5537,3.8926 0,2.3769 -0.4131,4.0029 -1.2373,4.8779 -0.8272,0.8779 -2.1973,1.3174 -4.1084,1.3174 z"
         id="path865" />
      <path
         d="m 216.375,449.5 c -0.0845,0 -0.166,-0.01 -0.2505,-0.0103 h -4.4248 v -7.9554 l 3.4321,0.007 c 11.5518,0 20.917,-9.3652 20.917,-20.917 0,-11.522 -9.3178,-20.8657 -20.8286,-20.9136 l -3.5205,-0.004 v -7.9592 h 4.7969 v 0.005 c 15.8906,0.0664 28.7534,12.9659 28.7534,28.8721 0,15.9468 -12.9282,28.875 -28.875,28.875 z"
         id="path867" />
      <path
         d="m 232.5947,420.6245 c 0,9.9263 -8.0473,17.9736 -17.9736,17.9736 -0.0532,0 -2.9107,-0.006 -2.9107,-0.006 v -35.9414 l 2.9864,0.003 c 9.8916,0.042 17.8979,8.0703 17.8979,17.9712 z"
         id="path869" />
      <path
         d="m 257.418,419.3828 c 0.6386,-9.3193 8.3628,-16.6894 17.8354,-16.7295 l 2.9863,-0.003 v 16.7324 H 257.418 Z"
         id="path871" />
      <path
         d="m 278.2397,421.8828 v 16.709 c 0,0 -2.8574,0.006 -2.9106,0.006 -9.5015,0 -17.2617,-7.3784 -17.9102,-16.7153 h 20.8208 z"
         id="path873" />
      <path
         d="m 273.5752,449.5 c 0.0845,0 0.166,-0.01 0.2505,-0.0103 h 4.4248 v -7.9554 l -3.4321,0.007 c -11.5518,0 -20.917,-9.3652 -20.917,-20.917 0,-11.522 9.3178,-20.8657 20.8286,-20.9136 l 3.5205,-0.004 v -7.9592 h -4.7969 v 0.005 c -15.8906,0.0664 -28.7534,12.9659 -28.7534,28.8721 0,15.9468 12.9282,28.875 28.875,28.875 z"
         id="path875" />
    </g>
    <g
       aria-label="CLASSICS"
       id="g1259"
       style="font-size:25.4px;line-height:1.25;font-family:'Patrick Hand SC';-inkscape-font-specification:'Patrick Hand SC, Normal';stroke:#ffffff;stroke-width:0.264583;stroke-linecap:round;stroke-linejoin:round"
       transform="matrix(0.12570066,0,0,0.12570066,0.17145056,-6.2869509)">
      <path
         d="m 30.901226,138.04781 v -2.1084 h -2.108398 v -14.8208 h 2.108398 v -2.1208 h 8.470801 v 2.1208 h 2.1208 v 4.2292 h -4.241601 v -4.2292 h -4.229199 v 14.8208 h 4.229199 v -4.2416 h 4.241601 v 4.2416 h -2.1208 v 2.1084 z"
         style="font-family:'BIG SHOT';-inkscape-font-specification:'BIG SHOT, Normal';stroke:#ffffff;stroke-linecap:round;stroke-linejoin:round"
         id="path1243" />
      <path
         d="m 45.722027,138.04781 v -19.05 h 4.229199 v 16.9416 h 8.470801 v 2.1084 z"
         style="font-family:'BIG SHOT';-inkscape-font-specification:'BIG SHOT, Normal';stroke:#ffffff;stroke-linecap:round;stroke-linejoin:round"
         id="path1245" />
      <path
         d="m 71.109624,129.58941 v -8.4708 h -4.229199 v 8.4708 z m -8.458398,8.4584 v -16.9292 h 2.108398 v -2.1208 h 8.470801 v 2.1208 h 2.120801 v 16.9292 h -4.241602 v -6.35 h -4.229199 v 6.35 z"
         style="font-family:'BIG SHOT';-inkscape-font-specification:'BIG SHOT, Normal';stroke:#ffffff;stroke-linecap:round;stroke-linejoin:round"
         id="path1247" />
      <path
         d="m 81.688824,138.04781 v -2.1084 h -2.108399 v -4.2416 h 4.229199 v 4.2416 h 4.2292 v -6.35 h -6.35 v -2.1208 h -2.108399 v -6.35 h 2.108399 v -2.1208 h 8.4708 v 2.1208 h 2.120801 v 4.2292 h -4.241601 v -4.2292 h -4.2292 v 6.35 h 6.35 v 2.1208 h 2.120801 v 6.35 h -2.120801 v 2.1084 z"
         style="font-family:'BIG SHOT';-inkscape-font-specification:'BIG SHOT, Normal';stroke:#ffffff;stroke-linecap:round;stroke-linejoin:round"
         id="path1249" />
      <path
         d="m 98.618023,138.04781 v -2.1084 h -2.108399 v -4.2416 h 4.229196 v 4.2416 h 4.2292 v -6.35 h -6.349997 v -2.1208 h -2.108399 v -6.35 h 2.108399 v -2.1208 h 8.470797 v 2.1208 h 2.1208 v 4.2292 h -4.2416 v -4.2292 h -4.2292 v 6.35 h 6.35 v 2.1208 h 2.1208 v 6.35 h -2.1208 v 2.1084 z"
         style="font-family:'BIG SHOT';-inkscape-font-specification:'BIG SHOT, Normal';stroke:#ffffff;stroke-linecap:round;stroke-linejoin:round"
         id="path1251" />
      <path
         d="m 113.43882,138.04781 v -2.1084 h 4.2292 v -14.8208 h -4.2292 v -2.1208 h 12.7 v 2.1208 h -4.2416 v 14.8208 h 4.2416 v 2.1084 z"
         style="font-family:'BIG SHOT';-inkscape-font-specification:'BIG SHOT, Normal';stroke:#ffffff;stroke-linecap:round;stroke-linejoin:round"
         id="path1253" />
      <path
         d="m 132.47642,138.04781 v -2.1084 h -2.1084 v -14.8208 h 2.1084 v -2.1208 h 8.4708 v 2.1208 h 2.1208 v 4.2292 h -4.2416 v -4.2292 h -4.2292 v 14.8208 h 4.2292 v -4.2416 h 4.2416 v 4.2416 h -2.1208 v 2.1084 z"
         style="font-family:'BIG SHOT';-inkscape-font-specification:'BIG SHOT, Normal';stroke:#ffffff;stroke-linecap:round;stroke-linejoin:round"
         id="path1255" />
      <path
         d="m 149.40562,138.04781 v -2.1084 h -2.1084 v -4.2416 h 4.2292 v 4.2416 h 4.2292 v -6.35 h -6.35 v -2.1208 h -2.1084 v -6.35 h 2.1084 v -2.1208 h 8.4708 v 2.1208 h 2.1208 v 4.2292 h -4.2416 v -4.2292 h -4.2292 v 6.35 h 6.35 v 2.1208 h 2.1208 v 6.35 h -2.1208 v 2.1084 z"
         style="font-family:'BIG SHOT';-inkscape-font-specification:'BIG SHOT, Normal';stroke:#ffffff;stroke-linecap:round;stroke-linejoin:round"
         id="path1257" />
    </g>
  </g>
</svg>
