<?xml version="1.0" encoding="UTF-8" standalone="no"?>
<!-- Created with Inkscape (http://www.inkscape.org/) -->

<svg
   version="1.1"
   id="svg2"
   width="39.840588"
   height="11.200696"
   viewBox="0 0 39.840588 11.200696"
   sodipodi:docname="auto-arcade-atlus.svg"
   inkscape:version="1.1 (c68e22c387, 2021-05-23)"
   xmlns:inkscape="http://www.inkscape.org/namespaces/inkscape"
   xmlns:sodipodi="http://sodipodi.sourceforge.net/DTD/sodipodi-0.dtd"
   xmlns="http://www.w3.org/2000/svg"
   xmlns:svg="http://www.w3.org/2000/svg">
  <defs
     id="defs6" />
  <sodipodi:namedview
     id="namedview4"
     pagecolor="#ffffff"
     bordercolor="#666666"
     borderopacity="1.0"
     inkscape:pageshadow="2"
     inkscape:pageopacity="0.0"
     inkscape:pagecheckerboard="true"
     showgrid="false"
     inkscape:snap-global="true"
     inkscape:zoom="17.84"
     inkscape:cx="19.142377"
     inkscape:cy="2.5784753"
     inkscape:window-width="1920"
     inkscape:window-height="1138"
     inkscape:window-x="-8"
     inkscape:window-y="-8"
     inkscape:window-maximized="1"
     inkscape:current-layer="g8"
     fit-margin-top="0"
     fit-margin-left="0"
     fit-margin-right="0"
     fit-margin-bottom="0" />
  <g
     inkscape:groupmode="layer"
     inkscape:label="Image"
     id="g8"
     transform="translate(-388.88441,-115.43987)">
    <g
       id="g9555">
      <g
         id="g9353"
         transform="matrix(0.0389296,0,0,0.0389296,385.38487,144.31111)"
         style="stroke:#ffffff;stroke-width:25.6874;stroke-linecap:round;stroke-linejoin:round;stroke-miterlimit:4;stroke-dasharray:none">
        <path
           style="fill:#3163b7;fill-opacity:1;stroke:#ffffff;stroke-width:25.6874;stroke-linecap:round;stroke-linejoin:round;stroke-miterlimit:4;stroke-dasharray:none"
           d="m 109.05401,-476.51855 c 3.47458,-5.37056 41.10331,-63.53966 83.6194,-129.26466 42.51609,-65.725 77.69543,-119.9275 78.17631,-120.45 0.49975,-0.543 0.87433,32.76689 0.87433,77.75 v 78.7 h -21.32459 -21.32458 l -14.63025,22.75 c -8.04663,12.5125 -22.9051,35.575 -33.0188,51.25001 l -18.38856,28.5 -30.15034,0.26465 -30.15034,0.26466 z m 172.67004,-121.26466 v -131 h 25 25 v 131 131.00001 h -25 -25 z m 282,0 v -131 h 26.5 26.5 v 103.5 103.5 h 35.5 35.5 v 27.50001 27.5 h -62 -62 z m 212.07519,129.97274 c -33.81299,-7.09239 -61.53639,-35.36797 -72.35617,-73.79731 -2.12959,-7.5638 -2.16573,-8.98079 -2.48483,-97.42543 l -0.3238,-89.75 h 24.99767 24.99767 l 0.35138,84.75 c 0.37916,91.44946 0.19898,88.2978 5.69759,99.65642 4.52417,9.34568 14.11931,17.5864 24.5453,21.08054 6.56276,2.19942 18.54235,2.22076 26.07494,0.0464 6.2891,-1.81538 10.58734,-4.08304 16.67506,-8.79743 l 3.75,-2.90403 v 30.60878 30.60879 l -2.70607,1.02885 c -10.15788,3.86202 -17.37602,5.14583 -30.79393,5.47698 -7.7,0.19003 -15.99117,-0.0721 -18.42481,-0.5826 z m 60.92481,-129.97274 v -131 h 26.5 26.5 v 131 131.00001 h -26.5 -26.5 z m 69,103.54411 v -27.45591 l 59.75,-0.2941 59.74995,-0.2941 5,-2.30361 c 10.0275,-4.61987 15.4805,-12.96698 15.4805,-23.69639 0,-11.39939 -6.4323,-20.27611 -17.768,-24.5203 -4.5753,-1.71303 -7.8081,-1.98049 -24,-1.9856 -11.12225,-0.004 -22.56753,-0.58704 -28.21658,-1.43864 -35.86711,-5.40696 -58.98286,-27.29524 -65.53545,-62.05546 -2.15551,-11.43455 -1.56163,-28.16707 1.32029,-37.19932 1.10694,-3.46926 8.07689,-16.57058 15.82712,-29.75 l 13.8491,-23.55068 h 30.77153 c 16.92435,0 30.77149,0.19942 30.77149,0.44314 0,0.24373 -8.25975,14.55191 -18.35506,31.79596 -10.09531,17.24405 -18.92885,33.09129 -19.6301,35.21609 -3.1631,9.58429 -0.46499,20.22569 6.78365,26.75486 6.22246,5.60483 11.13748,6.55395 39.70151,7.66655 19.6603,0.76579 26.7088,1.41569 33,3.04275 24.8205,6.41908 43.2068,23.42784 51.5615,47.69825 3.328,9.66791 3.4008,10.22967 3.3544,25.8824 -0.044,14.76438 -0.2638,16.65642 -2.8483,24.5 -1.5404,4.675 -3.9356,10.75 -5.3226,13.5 -8.9822,17.80879 -24.9246,32.37613 -43.1005,39.38302 -15.2376,5.87416 -18.5426,6.11699 -83.25492,6.11699 h -58.88953 z m 82.03038,-187.28329 c 6.38286,-11.37173 26.28647,-44.78656 27.41307,-46.02183 0.8979,-0.98455 10.3727,-1.20379 43.2173,-1 l 42.0673,0.26101 -15.2754,26 -15.2754,26 -42.6902,0.26082 -42.69017,0.26081 z"
           id="path9349"
           sodipodi:nodetypes="sssscccsscccsccccccccccccccccccccccssscccssssscccsssscccccccccccccssscsssscsssssssssssssccssscccccs" />
        <path
           style="fill:#ed1c24;fill-opacity:1;stroke:#ffffff;stroke-width:25.6874;stroke-linecap:round;stroke-linejoin:round;stroke-miterlimit:4;stroke-dasharray:none"
           d="m 423.72405,-565.63063 v -98.84742 l 31.25,-32.14553 31.25,-32.14552 31.25,-0.007 31.25,-0.007 v 26.5 26.5 h -35 -35 v 104.5 104.50001 h -27.5 -27.5 z m -76,-136.65258 v -26.5 h 62.74292 62.74293 l -26.48585,26.5 -26.48585,26.5 h -36.25707 -36.25708 z"
           id="path9351"
           sodipodi:nodetypes="cccccccccccccccccccccccc" />
      </g>
      <g
         id="g9493"
         transform="matrix(0.0389296,0,0,0.0389296,385.38487,144.31111)">
        <path
           style="fill:#3163b7;fill-opacity:1"
           d="m 109.05401,-476.51855 c 3.47458,-5.37056 41.10331,-63.53966 83.6194,-129.26466 42.51609,-65.725 77.69543,-119.9275 78.17631,-120.45 0.49975,-0.543 0.87433,32.76689 0.87433,77.75 v 78.7 h -21.32459 -21.32458 l -14.63025,22.75 c -8.04663,12.5125 -22.9051,35.575 -33.0188,51.25001 l -18.38856,28.5 -30.15034,0.26465 -30.15034,0.26466 z m 172.67004,-121.26466 v -131 h 25 25 v 131 131.00001 h -25 -25 z m 282,0 v -131 h 26.5 26.5 v 103.5 103.5 h 35.5 35.5 v 27.50001 27.5 h -62 -62 z m 212.07519,129.97274 c -33.81299,-7.09239 -61.53639,-35.36797 -72.35617,-73.79731 -2.12959,-7.5638 -2.16573,-8.98079 -2.48483,-97.42543 l -0.3238,-89.75 h 24.99767 24.99767 l 0.35138,84.75 c 0.37916,91.44946 0.19898,88.2978 5.69759,99.65642 4.52417,9.34568 14.11931,17.5864 24.5453,21.08054 6.56276,2.19942 18.54235,2.22076 26.07494,0.0464 6.2891,-1.81538 10.58734,-4.08304 16.67506,-8.79743 l 3.75,-2.90403 v 30.60878 30.60879 l -2.70607,1.02885 c -10.15788,3.86202 -17.37602,5.14583 -30.79393,5.47698 -7.7,0.19003 -15.99117,-0.0721 -18.42481,-0.5826 z m 60.92481,-129.97274 v -131 h 26.5 26.5 v 131 131.00001 h -26.5 -26.5 z m 69,103.54411 v -27.45591 l 59.75,-0.2941 59.74995,-0.2941 5,-2.30361 c 10.0275,-4.61987 15.4805,-12.96698 15.4805,-23.69639 0,-11.39939 -6.4323,-20.27611 -17.768,-24.5203 -4.5753,-1.71303 -7.8081,-1.98049 -24,-1.9856 -11.12225,-0.004 -22.56753,-0.58704 -28.21658,-1.43864 -35.86711,-5.40696 -58.98286,-27.29524 -65.53545,-62.05546 -2.15551,-11.43455 -1.56163,-28.16707 1.32029,-37.19932 1.10694,-3.46926 8.07689,-16.57058 15.82712,-29.75 l 13.8491,-23.55068 h 30.77153 c 16.92435,0 30.77149,0.19942 30.77149,0.44314 0,0.24373 -8.25975,14.55191 -18.35506,31.79596 -10.09531,17.24405 -18.92885,33.09129 -19.6301,35.21609 -3.1631,9.58429 -0.46499,20.22569 6.78365,26.75486 6.22246,5.60483 11.13748,6.55395 39.70151,7.66655 19.6603,0.76579 26.7088,1.41569 33,3.04275 24.8205,6.41908 43.2068,23.42784 51.5615,47.69825 3.328,9.66791 3.4008,10.22967 3.3544,25.8824 -0.044,14.76438 -0.2638,16.65642 -2.8483,24.5 -1.5404,4.675 -3.9356,10.75 -5.3226,13.5 -8.9822,17.80879 -24.9246,32.37613 -43.1005,39.38302 -15.2376,5.87416 -18.5426,6.11699 -83.25492,6.11699 h -58.88953 z m 82.03038,-187.28329 c 6.38286,-11.37173 26.28647,-44.78656 27.41307,-46.02183 0.8979,-0.98455 10.3727,-1.20379 43.2173,-1 l 42.0673,0.26101 -15.2754,26 -15.2754,26 -42.6902,0.26082 -42.69017,0.26081 z"
           id="path9489"
           sodipodi:nodetypes="sssscccsscccsccccccccccccccccccccccssscccssssscccsssscccccccccccccssscsssscsssssssssssssccssscccccs" />
        <path
           style="fill:#ed1c24;fill-opacity:1"
           d="m 423.72405,-565.63063 v -98.84742 l 31.25,-32.14553 31.25,-32.14552 31.25,-0.007 31.25,-0.007 v 26.5 26.5 h -35 -35 v 104.5 104.50001 h -27.5 -27.5 z m -76,-136.65258 v -26.5 h 62.74292 62.74293 l -26.48585,26.5 -26.48585,26.5 h -36.25707 -36.25708 z"
           id="path9491"
           sodipodi:nodetypes="cccccccccccccccccccccccc" />
      </g>
    </g>
  </g>
</svg>
