<?xml version="1.0" encoding="UTF-8" standalone="no"?>
<!-- Created with Inkscape (http://www.inkscape.org/) -->

<svg
   version="1.1"
   id="svg2"
   width="14.359935"
   height="9.4666462"
   viewBox="0 0 14.359935 9.4666462"
   sodipodi:docname="c64.svg"
   inkscape:version="1.1 (c68e22c387, 2021-05-23)"
   inkscape:export-filename="C:\Users\BUCH\Desktop\Retrogaming\Recalbox\travail thèmes\Thème vignette !!!!!!!\Maquette 2 !!!!\image1250.png"
   inkscape:export-xdpi="96.460785"
   inkscape:export-ydpi="96.460785"
   xmlns:inkscape="http://www.inkscape.org/namespaces/inkscape"
   xmlns:sodipodi="http://sodipodi.sourceforge.net/DTD/sodipodi-0.dtd"
   xmlns="http://www.w3.org/2000/svg"
   xmlns:svg="http://www.w3.org/2000/svg">
  <defs
     id="defs6">
    <clipPath
       clipPathUnits="userSpaceOnUse"
       id="clipPath3185">
      <path
         id="path3187"
         style="fill:#ffffff;fill-rule:evenodd;stroke:#ffffff;stroke-width:5.15903;stroke-linecap:round;stroke-linejoin:round;paint-order:stroke fill markers"
         d="m 1157.5591,335.78677 h 462.4206 L 1362.3723,1410.6277 H 899.95176 Z"
         sodipodi:nodetypes="ccccc"
         inkscape:export-filename="C:\Users\BUCH\Desktop\Retrogaming\Recalbox\travail thèmes\Thème vignette !!!!!!!\Maquette 2 !!!!\rect849.png"
         inkscape:export-xdpi="247.96268"
         inkscape:export-ydpi="247.96268" />
    </clipPath>
  </defs>
  <sodipodi:namedview
     id="namedview4"
     pagecolor="#ffffff"
     bordercolor="#666666"
     borderopacity="1.0"
     inkscape:pageshadow="2"
     inkscape:pageopacity="0.0"
     inkscape:pagecheckerboard="true"
     showgrid="false"
     inkscape:showpageshadow="false"
     inkscape:zoom="12.479331"
     inkscape:cx="19.351999"
     inkscape:cy="20.033125"
     inkscape:window-width="1920"
     inkscape:window-height="1138"
     inkscape:window-x="-8"
     inkscape:window-y="-8"
     inkscape:window-maximized="1"
     inkscape:current-layer="svg2"
     fit-margin-top="0"
     fit-margin-left="0"
     fit-margin-right="0"
     fit-margin-bottom="0" />
  <g
     aria-label="c64"
     id="text6335"
     style="font-weight:300;font-size:13.3333px;line-height:1.25;font-family:'Bebas Neue';-inkscape-font-specification:'Bebas Neue, Light';fill:#ffffff"
     transform="translate(-13.902126,17.252965)">
    <path
       d="m 15.848788,-17.252961 c -1.41333,0 -1.946662,1.066664 -1.946662,2.359994 v 4.746655 c 0,1.2933296 0.533332,2.3599936 1.946662,2.3599936 1.426663,0 1.959995,-1.066664 1.959995,-2.3599936 v -1.013331 h -0.293332 v 1.026664 c 0,1.1333303 -0.426666,2.0666613 -1.65333,2.0666613 -1.239996,0 -1.666662,-0.933331 -1.666662,-2.0666613 V -14.9063 c 0,-1.133331 0.426666,-2.079995 1.666662,-2.079995 1.226664,0 1.65333,0.946664 1.65333,2.079995 v 0.733331 h 0.293332 v -0.719998 c 0,-1.29333 -0.533332,-2.359994 -1.959995,-2.359994 z"
       id="path6850" />
    <path
       d="m 20.835428,-17.252961 c -1.439996,0 -1.999995,1.039997 -1.999995,2.359994 v 4.746655 c 0,1.3066629 0.559999,2.3599936 1.999995,2.3599936 1.426663,0 1.986662,-1.0533307 1.986662,-2.3599936 v -0.933331 c 0,-1.29333 -0.533332,-2.333328 -1.919995,-2.333328 -0.906665,0 -1.399997,0.319999 -1.773329,1.106664 v -2.573327 c 0,-1.17333 0.453332,-2.106661 1.706662,-2.106661 1.239997,0 1.666663,0.893331 1.666663,2.026661 v 0.08 h 0.279999 v -0.06667 c 0,-1.306664 -0.533332,-2.306661 -1.946662,-2.306661 z m 0,4.119989 c 1.239997,0 1.693329,0.933331 1.693329,2.066662 v 0.919998 c 0,1.1599966 -0.453332,2.0799943 -1.693329,2.0799943 -1.25333,0 -1.706662,-0.9199977 -1.706662,-2.0799943 v -0.919998 c 0,-1.093331 0.453332,-2.066662 1.706662,-2.066662 z"
       id="path6852" />
    <path
       d="m 28.262061,-10.052979 v -0.28 H 27.44873 v -6.866649 h -0.359999 l -3.253325,6.853316 v 0.293333 h 3.319991 v 2.1999941 h 0.293333 v -2.1999941 z m -1.106664,-6.62665 v 6.34665 h -3.039992 z"
       id="path6854" />
  </g>
</svg>
