<?xml version="1.0" encoding="UTF-8" standalone="no"?>
<!-- Created with Inkscape (http://www.inkscape.org/) -->

<svg
   version="1.1"
   id="svg2"
   width="54.999702"
   height="9.4666433"
   viewBox="0 0 54.999704 9.4666433"
   sodipodi:docname="auto-arcade-irem.svg"
   inkscape:version="1.1 (c68e22c387, 2021-05-23)"
   inkscape:export-filename="C:\Users\BUCH\Desktop\Retrogaming\Recalbox\travail thèmes\Thème vignette !!!!!!!\Maquette 2 !!!!\image1250.png"
   inkscape:export-xdpi="96.460785"
   inkscape:export-ydpi="96.460785"
   xmlns:inkscape="http://www.inkscape.org/namespaces/inkscape"
   xmlns:sodipodi="http://sodipodi.sourceforge.net/DTD/sodipodi-0.dtd"
   xmlns="http://www.w3.org/2000/svg"
   xmlns:svg="http://www.w3.org/2000/svg">
  <defs
     id="defs6">
    <clipPath
       clipPathUnits="userSpaceOnUse"
       id="clipPath3185">
      <path
         id="path3187"
         style="fill:#ffffff;fill-rule:evenodd;stroke:#ffffff;stroke-width:5.15903;stroke-linecap:round;stroke-linejoin:round;paint-order:stroke fill markers"
         d="m 1157.5591,335.78677 h 462.4206 L 1362.3723,1410.6277 H 899.95176 Z"
         sodipodi:nodetypes="ccccc"
         inkscape:export-filename="C:\Users\BUCH\Desktop\Retrogaming\Recalbox\travail thèmes\Thème vignette !!!!!!!\Maquette 2 !!!!\rect849.png"
         inkscape:export-xdpi="247.96268"
         inkscape:export-ydpi="247.96268" />
    </clipPath>
  </defs>
  <sodipodi:namedview
     id="namedview4"
     pagecolor="#ffffff"
     bordercolor="#666666"
     borderopacity="1.0"
     inkscape:pageshadow="2"
     inkscape:pageopacity="0.0"
     inkscape:pagecheckerboard="true"
     showgrid="false"
     inkscape:showpageshadow="false"
     inkscape:zoom="12.479331"
     inkscape:cx="31.612272"
     inkscape:cy="19.472198"
     inkscape:window-width="1920"
     inkscape:window-height="1138"
     inkscape:window-x="-8"
     inkscape:window-y="-8"
     inkscape:window-maximized="1"
     inkscape:current-layer="svg2"
     fit-margin-top="0"
     fit-margin-left="0"
     fit-margin-right="0"
     fit-margin-bottom="0" />
  <g
     aria-label="irem classics"
     id="text3997"
     style="font-weight:300;font-size:13.3333px;line-height:1.25;font-family:'Bebas Neue';-inkscape-font-specification:'Bebas Neue, Light';fill:#ffffff"
     transform="translate(5.3964733,18.615214)">
    <path
       d="m -5.3964733,-18.548547 v 9.3333094 h 0.2933326 v -9.3333094 z"
       id="path4182" />
    <path
       d="m -4.0364863,-18.548547 v 9.3333094 h 0.2933326 v -4.3066554 h 1.1466638 c 1.2133303,0 2.03999483,0.359999 2.03999483,1.733329 v 1.466663 c 0,0.3999985 0.0399999,0.8133308 0.2266661,1.1066634 h 0.31999919 c -0.2133328,-0.2933326 -0.2533327,-0.7466648 -0.2533327,-1.1066634 v -1.466663 c 0,-1.026665 -0.43999888,-1.706663 -1.47999622,-1.866662 1.02666404,-0.186667 1.47999622,-0.813332 1.47999622,-1.959995 v -0.839998 c 0,-1.279997 -0.53333198,-2.093328 -1.91999512,-2.093328 z m 0.2933326,4.746654 v -4.466655 h 1.5466628 c 1.19999694,0 1.63999583,0.706665 1.63999583,1.839995 v 0.853331 c 0,1.439997 -0.74666473,1.773329 -2.03999483,1.773329 z"
       id="path4184" />
    <path
       d="m 1.3234893,-14.081892 v -4.186656 h 3.2666584 v -0.279999 h -3.559991 v 9.3333094 h 3.559991 V -9.4952369 H 1.3234893 V -13.815226 H 4.070149 v -0.266666 z"
       id="path4186" />
    <path
       d="m 10.830123,-18.108548 v 8.8933104 h 0.293333 V -18.548547 H 10.670123 L 8.3767959,-9.6952364 6.0834683,-18.548547 H 5.6301361 v 9.3333094 h 0.266666 v -8.8933104 l 2.3066609,8.8666438 h 0.3333324 z"
       id="path4188" />
    <path
       d="m 16.190074,-18.615214 c -1.413329,0 -1.946661,1.066664 -1.946661,2.359994 v 4.746655 c 0,1.29333 0.533332,2.3599939 1.946661,2.3599939 1.426663,0 1.959995,-1.0666639 1.959995,-2.3599939 v -1.013331 h -0.293332 v 1.026664 c 0,1.133331 -0.426666,2.0666616 -1.653329,2.0666616 -1.239997,0 -1.666663,-0.9333306 -1.666663,-2.0666616 v -4.773321 c 0,-1.133331 0.426666,-2.079995 1.666663,-2.079995 1.226663,0 1.653329,0.946664 1.653329,2.079995 v 0.733331 h 0.293332 v -0.719998 c 0,-1.29333 -0.533332,-2.359994 -1.959995,-2.359994 z"
       id="path4190" />
    <path
       d="m 22.616712,-9.2152376 v -0.2799993 h -3.133326 v -9.0533101 h -0.293332 v 9.3333094 z"
       id="path4192" />
    <path
       d="m 27.723343,-11.415232 0.546665,2.1999944 h 0.293333 L 26.25668,-18.561881 h -0.413332 l -2.253328,9.3466434 h 0.266666 l 0.546665,-2.1999944 z m -1.679996,-6.799983 1.626663,6.533317 h -3.213326 z"
       id="path4194" />
    <path
       d="m 31.523313,-18.615214 c -1.346663,0.01333 -1.919995,0.946664 -1.919995,2.306661 0,2.573327 3.573324,2.493327 3.573324,4.853321 0,1.133331 -0.439999,2.0266616 -1.666662,2.0266616 -1.226664,0 -1.666663,-0.8933306 -1.666663,-2.0266616 v -0.466665 h -0.279999 v 0.453332 c 0,1.29333 0.533332,2.3199939 1.946662,2.3199939 1.426663,0 1.959995,-1.0266639 1.959995,-2.3199939 0,-2.533327 -3.573325,-2.466661 -3.573325,-4.853321 0,-1.106664 0.413333,-2.026662 1.639996,-2.026662 1.213331,0 1.626663,0.933331 1.626663,2.039995 v 0.186666 h 0.293332 v -0.173333 c 0,-1.279996 -0.519998,-2.319994 -1.933328,-2.319994 z"
       id="path4196" />
    <path
       d="m 36.443296,-18.615214 c -1.346663,0.01333 -1.919995,0.946664 -1.919995,2.306661 0,2.573327 3.573324,2.493327 3.573324,4.853321 0,1.133331 -0.439999,2.0266616 -1.666662,2.0266616 -1.226664,0 -1.666663,-0.8933306 -1.666663,-2.0266616 v -0.466665 h -0.279999 v 0.453332 c 0,1.29333 0.533332,2.3199939 1.946662,2.3199939 1.426663,0 1.959995,-1.0266639 1.959995,-2.3199939 0,-2.533327 -3.573325,-2.466661 -3.573325,-4.853321 0,-1.106664 0.413333,-2.026662 1.639996,-2.026662 1.21333,0 1.626663,0.933331 1.626663,2.039995 v 0.186666 h 0.293332 v -0.173333 c 0,-1.279996 -0.519998,-2.319994 -1.933328,-2.319994 z"
       id="path4198" />
    <path
       d="m 39.429947,-18.548547 v 9.3333094 h 0.293332 v -9.3333094 z"
       id="path4200" />
    <path
       d="m 42.72326,-18.615214 c -1.413329,0 -1.946661,1.066664 -1.946661,2.359994 v 4.746655 c 0,1.29333 0.533332,2.3599939 1.946661,2.3599939 1.426663,0 1.959995,-1.0666639 1.959995,-2.3599939 v -1.013331 h -0.293332 v 1.026664 c 0,1.133331 -0.426666,2.0666616 -1.653329,2.0666616 -1.239997,0 -1.666663,-0.9333306 -1.666663,-2.0666616 v -4.773321 c 0,-1.133331 0.426666,-2.079995 1.666663,-2.079995 1.226663,0 1.653329,0.946664 1.653329,2.079995 v 0.733331 h 0.293332 v -0.719998 c 0,-1.29333 -0.533332,-2.359994 -1.959995,-2.359994 z"
       id="path4202" />
    <path
       d="m 47.656568,-18.615214 c -1.346663,0.01333 -1.919995,0.946664 -1.919995,2.306661 0,2.573327 3.573324,2.493327 3.573324,4.853321 0,1.133331 -0.439999,2.0266616 -1.666662,2.0266616 -1.226664,0 -1.666663,-0.8933306 -1.666663,-2.0266616 v -0.466665 h -0.279999 v 0.453332 c 0,1.29333 0.533332,2.3199939 1.946662,2.3199939 1.426663,0 1.959995,-1.0266639 1.959995,-2.3199939 0,-2.533327 -3.573325,-2.466661 -3.573325,-4.853321 0,-1.106664 0.413333,-2.026662 1.639996,-2.026662 1.213331,0 1.626663,0.933331 1.626663,2.039995 v 0.186666 h 0.293332 v -0.173333 c 0,-1.279996 -0.519998,-2.319994 -1.933328,-2.319994 z"
       id="path4204" />
  </g>
</svg>
