<?xml version="1.0" encoding="UTF-8" standalone="no"?>
<!-- Created with Inkscape (http://www.inkscape.org/) -->

<svg
   version="1.1"
   id="svg2"
   width="21.159904"
   height="9.4666424"
   viewBox="0 0 21.159906 9.4666423"
   sodipodi:docname="auto-arcade-visco.svg"
   inkscape:version="1.1 (c68e22c387, 2021-05-23)"
   inkscape:export-filename="C:\Users\BUCH\Desktop\Retrogaming\Recalbox\travail thèmes\Thème vignette !!!!!!!\Maquette 2 !!!!\image1250.png"
   inkscape:export-xdpi="96.460785"
   inkscape:export-ydpi="96.460785"
   xmlns:inkscape="http://www.inkscape.org/namespaces/inkscape"
   xmlns:sodipodi="http://sodipodi.sourceforge.net/DTD/sodipodi-0.dtd"
   xmlns="http://www.w3.org/2000/svg"
   xmlns:svg="http://www.w3.org/2000/svg">
  <defs
     id="defs6">
    <clipPath
       clipPathUnits="userSpaceOnUse"
       id="clipPath3185">
      <path
         id="path3187"
         style="fill:#ffffff;fill-rule:evenodd;stroke:#ffffff;stroke-width:5.15903;stroke-linecap:round;stroke-linejoin:round;paint-order:stroke fill markers"
         d="m 1157.5591,335.78677 h 462.4206 L 1362.3723,1410.6277 H 899.95176 Z"
         sodipodi:nodetypes="ccccc"
         inkscape:export-filename="C:\Users\BUCH\Desktop\Retrogaming\Recalbox\travail thèmes\Thème vignette !!!!!!!\Maquette 2 !!!!\rect849.png"
         inkscape:export-xdpi="247.96268"
         inkscape:export-ydpi="247.96268" />
    </clipPath>
  </defs>
  <sodipodi:namedview
     id="namedview4"
     pagecolor="#ffffff"
     bordercolor="#666666"
     borderopacity="1.0"
     inkscape:pageshadow="2"
     inkscape:pageopacity="0.0"
     inkscape:pagecheckerboard="true"
     showgrid="false"
     inkscape:showpageshadow="false"
     inkscape:zoom="12.479331"
     inkscape:cx="26.483791"
     inkscape:cy="24.520545"
     inkscape:window-width="1920"
     inkscape:window-height="1138"
     inkscape:window-x="-8"
     inkscape:window-y="-8"
     inkscape:window-maximized="1"
     inkscape:current-layer="svg2"
     fit-margin-top="0"
     fit-margin-left="0"
     fit-margin-right="0"
     fit-margin-bottom="0" />
  <g
     aria-label="visco"
     id="text1077"
     style="font-weight:300;font-size:13.3333px;line-height:1.25;font-family:'Bebas Neue';-inkscape-font-specification:'Bebas Neue, Light';fill:#ffffff"
     transform="translate(-6.9039323,18.214551)">
    <path
       d="m 6.9039323,-18.147885 2.2799942,9.3333098 H 9.6239254 L 11.86392,-18.147885 h -0.28 L 9.3972593,-9.1479077 7.2105982,-18.147885 Z"
       id="path1306" />
    <path
       d="m 12.890572,-18.147885 v 9.3333098 h 0.293333 v -9.3333098 z"
       id="path1308" />
    <path
       d="m 16.183888,-18.214551 c -1.346663,0.01333 -1.919995,0.946664 -1.919995,2.30666 0,2.573327 3.573324,2.493327 3.573324,4.853321 0,1.1333309 -0.439999,2.026662 -1.666662,2.026662 -1.226664,0 -1.666663,-0.8933311 -1.666663,-2.026662 v -0.466665 h -0.279999 v 0.453332 c 0,1.2933302 0.533332,2.3199943 1.946662,2.3199943 1.426663,0 1.959995,-1.0266641 1.959995,-2.3199943 0,-2.533327 -3.573325,-2.46666 -3.573325,-4.853321 0,-1.106664 0.413333,-2.026661 1.639996,-2.026661 1.21333,0 1.626663,0.933331 1.626663,2.039994 v 0.186667 h 0.293332 v -0.173333 c 0,-1.279997 -0.519998,-2.319994 -1.933328,-2.319994 z"
       id="path1310" />
    <path
       d="m 21.103868,-18.214551 c -1.41333,0 -1.946662,1.066664 -1.946662,2.359994 v 4.746654 c 0,1.2933303 0.533332,2.3599943 1.946662,2.3599943 1.426663,0 1.959995,-1.066664 1.959995,-2.3599943 v -1.013331 H 22.77053 v 1.026665 c 0,1.13333 -0.426665,2.066661 -1.653329,2.066661 -1.239997,0 -1.666662,-0.933331 -1.666662,-2.066661 v -4.773322 c 0,-1.13333 0.426665,-2.079994 1.666662,-2.079994 1.226664,0 1.653329,0.946664 1.653329,2.079994 v 0.733332 h 0.293333 v -0.719998 c 0,-1.29333 -0.533332,-2.359994 -1.959995,-2.359994 z"
       id="path1312" />
    <path
       d="m 24.090513,-11.107903 c 0,1.3066636 0.559998,2.3599943 1.973328,2.3599943 1.439997,0 1.999995,-1.0533307 1.999995,-2.3599943 v -4.746654 c 0,-1.306664 -0.559998,-2.359994 -1.999995,-2.359994 -1.41333,0 -1.973328,1.05333 -1.973328,2.359994 z m 0.293332,-4.759988 c 0,-1.146663 0.439999,-2.079994 1.679996,-2.079994 1.25333,0 1.706663,0.933331 1.706663,2.079994 v 4.773322 c 0,1.1466633 -0.453333,2.0799943 -1.706663,2.0799943 -1.239997,0 -1.679996,-0.933331 -1.679996,-2.0799943 z"
       id="path1314" />
  </g>
</svg>
