<?xml version="1.0" encoding="UTF-8" standalone="no"?>
<!-- Created with Inkscape (http://www.inkscape.org/) -->

<svg
   version="1.1"
   id="svg2"
   width="53.519695"
   height="9.4666424"
   viewBox="0 0 53.519697 9.4666423"
   sodipodi:docname="satellaview.svg"
   inkscape:version="1.1 (c68e22c387, 2021-05-23)"
   inkscape:export-filename="C:\Users\BUCH\Desktop\Retrogaming\Recalbox\travail thèmes\Thème vignette !!!!!!!\Maquette 2 !!!!\image1250.png"
   inkscape:export-xdpi="96.460785"
   inkscape:export-ydpi="96.460785"
   xmlns:inkscape="http://www.inkscape.org/namespaces/inkscape"
   xmlns:sodipodi="http://sodipodi.sourceforge.net/DTD/sodipodi-0.dtd"
   xmlns="http://www.w3.org/2000/svg"
   xmlns:svg="http://www.w3.org/2000/svg">
  <defs
     id="defs6">
    <clipPath
       clipPathUnits="userSpaceOnUse"
       id="clipPath3185">
      <path
         id="path3187"
         style="fill:#ffffff;fill-rule:evenodd;stroke:#ffffff;stroke-width:5.15903;stroke-linecap:round;stroke-linejoin:round;paint-order:stroke fill markers"
         d="m 1157.5591,335.78677 h 462.4206 L 1362.3723,1410.6277 H 899.95176 Z"
         sodipodi:nodetypes="ccccc"
         inkscape:export-filename="C:\Users\BUCH\Desktop\Retrogaming\Recalbox\travail thèmes\Thème vignette !!!!!!!\Maquette 2 !!!!\rect849.png"
         inkscape:export-xdpi="247.96268"
         inkscape:export-ydpi="247.96268" />
    </clipPath>
  </defs>
  <sodipodi:namedview
     id="namedview4"
     pagecolor="#ffffff"
     bordercolor="#666666"
     borderopacity="1.0"
     inkscape:pageshadow="2"
     inkscape:pageopacity="0.0"
     inkscape:pagecheckerboard="true"
     showgrid="false"
     inkscape:showpageshadow="false"
     inkscape:zoom="12.479331"
     inkscape:cx="25.842731"
     inkscape:cy="22.4371"
     inkscape:window-width="1920"
     inkscape:window-height="1138"
     inkscape:window-x="-8"
     inkscape:window-y="-8"
     inkscape:window-maximized="1"
     inkscape:current-layer="svg2"
     fit-margin-top="0"
     fit-margin-left="0"
     fit-margin-right="0"
     fit-margin-bottom="0" />
  <g
     aria-label="satellaview"
     id="text2864"
     style="font-weight:300;font-size:13.3333px;line-height:1.25;font-family:'Bebas Neue';-inkscape-font-specification:'Bebas Neue, Light';fill:#ffffff"
     transform="translate(-2.1093154,15.970841)">
    <path
       d="m 4.0693105,-15.970841 c -1.3466633,0.01333 -1.9199952,0.946664 -1.9199952,2.30666 0,2.573327 3.5733243,2.493327 3.5733243,4.8533215 0,1.1333305 -0.4399989,2.0266616 -1.6666624,2.0266616 -1.2266636,0 -1.6666625,-0.8933311 -1.6666625,-2.0266616 V -9.277525 H 2.1093154 v 0.4533322 c 0,1.2933301 0.533332,2.3199941 1.9466618,2.3199941 1.426663,0 1.959995,-1.026664 1.959995,-2.3199941 0,-2.5333272 -3.5733243,-2.4666602 -3.5733243,-4.8533212 0,-1.106664 0.4133323,-2.026661 1.6399959,-2.026661 1.2133302,0 1.6266625,0.933331 1.6266625,2.039994 v 0.186667 h 0.2933326 v -0.173333 c 0,-1.279997 -0.5199987,-2.319994 -1.9333284,-2.319994 z"
       id="path4413" />
    <path
       d="m 11.149286,-8.7708596 0.546665,2.1999944 h 0.293332 L 9.6826226,-15.917508 H 9.2692903 l -2.2533276,9.3466428 h 0.266666 L 7.8292939,-8.7708596 Z M 9.4692898,-15.570842 11.095952,-9.0375256 H 7.8826271 Z"
       id="path4415" />
    <path
       d="m 14.549256,-6.5708652 v -9.0533108 h 2.039995 v -0.279999 h -4.359989 v 0.279999 h 2.026662 v 9.0533108 z"
       id="path4417" />
    <path
       d="m 17.695898,-11.43752 v -4.186656 h 3.266658 v -0.279999 h -3.559991 v 9.3333098 h 3.559991 v -0.2799992 h -3.266658 v -4.3199896 h 2.74666 v -0.266666 z"
       id="path4419" />
    <path
       d="m 25.429202,-6.5708652 v -0.2799992 h -3.133325 v -9.0533106 h -0.293333 v 9.3333098 z"
       id="path4421" />
    <path
       d="M 29.869168,-6.5708652 V -6.8508644 H 26.735843 V -15.904175 H 26.44251 v 9.3333098 z"
       id="path4423" />
    <path
       d="m 34.975799,-8.7708596 0.546666,2.1999944 h 0.293332 l -2.306661,-9.3466428 h -0.413332 l -2.253328,9.3466428 h 0.266666 l 0.546666,-2.1999944 z m -1.679995,-6.7999824 1.626662,6.5333164 h -3.213325 z"
       id="path4425" />
    <path
       d="m 36.46909,-15.904175 2.279994,9.3333098 h 0.439999 l 2.239995,-9.3333098 h -0.28 l -2.186661,8.9999774 -2.186661,-8.9999774 z"
       id="path4427" />
    <path
       d="m 42.45573,-15.904175 v 9.3333098 h 0.293333 v -9.3333098 z"
       id="path4429" />
    <path
       d="m 44.109048,-11.43752 v -4.186656 h 3.266658 v -0.279999 h -3.559991 v 9.3333098 h 3.559991 v -0.2799992 h -3.266658 v -4.3199896 h 2.74666 v -0.266666 z"
       id="path4431" />
    <path
       d="m 52.082352,-15.210843 1.506663,8.6399778 h 0.386666 l 1.653329,-9.3333098 h -0.266666 l -1.57333,8.8799777 -1.519996,-8.8266447 h -0.359999 l -1.613329,8.8799779 -1.626663,-8.9333109 h -0.293332 l 1.679996,9.3333098 h 0.426665 z"
       id="path4433" />
  </g>
</svg>
