<?xml version="1.0" encoding="UTF-8" standalone="no"?>
<!-- Created with Inkscape (http://www.inkscape.org/) -->

<svg
   version="1.1"
   id="svg2"
   width="39.759022"
   height="18.127752"
   viewBox="0 0 39.759022 18.127754"
   sodipodi:docname="auto-arcade-technos.svg"
   inkscape:version="1.1 (c68e22c387, 2021-05-23)"
   xmlns:inkscape="http://www.inkscape.org/namespaces/inkscape"
   xmlns:sodipodi="http://sodipodi.sourceforge.net/DTD/sodipodi-0.dtd"
   xmlns="http://www.w3.org/2000/svg"
   xmlns:svg="http://www.w3.org/2000/svg">
  <defs
     id="defs6" />
  <sodipodi:namedview
     id="namedview4"
     pagecolor="#ffffff"
     bordercolor="#666666"
     borderopacity="1.0"
     inkscape:pageshadow="2"
     inkscape:pageopacity="0.0"
     inkscape:pagecheckerboard="true"
     showgrid="false"
     inkscape:showpageshadow="false"
     fit-margin-top="0"
     fit-margin-left="0"
     fit-margin-right="0"
     fit-margin-bottom="0"
     inkscape:zoom="17.857858"
     inkscape:cx="20.803167"
     inkscape:cy="14.22343"
     inkscape:window-width="1920"
     inkscape:window-height="1138"
     inkscape:window-x="-8"
     inkscape:window-y="-8"
     inkscape:window-maximized="1"
     inkscape:current-layer="g8"
     inkscape:snap-global="true" />
  <g
     inkscape:groupmode="layer"
     inkscape:label="Image"
     id="g8"
     transform="translate(-507.21784,139.43962)">
    <g
       id="g1252">
      <rect
         style="fill:#ffffff;fill-rule:evenodd;stroke:none;stroke-width:1.97444;stroke-linecap:round;stroke-linejoin:round;stroke-miterlimit:4;stroke-dasharray:none;paint-order:stroke fill markers"
         id="rect1121"
         width="19.823206"
         height="3.3878641"
         x="517.24139"
         y="-125.07619" />
      <g
         aria-label="CLASSICS"
         id="g1396"
         style="font-size:25.4px;line-height:1.25;font-family:'Patrick Hand SC';-inkscape-font-specification:'Patrick Hand SC, Normal';stroke:#ffffff;stroke-width:7.9256;stroke-linecap:round;stroke-linejoin:round;stroke-miterlimit:4;stroke-dasharray:none;paint-order:stroke fill markers"
         transform="matrix(0.15140804,0,0,0.15140804,512.80519,-142.81342)">
        <path
           d="m 30.901226,138.04781 v -2.1084 h -2.108398 v -14.8208 h 2.108398 v -2.1208 h 8.470801 v 2.1208 h 2.1208 v 4.2292 h -4.241601 v -4.2292 h -4.229199 v 14.8208 h 4.229199 v -4.2416 h 4.241601 v 4.2416 h -2.1208 v 2.1084 z"
           style="font-family:'BIG SHOT';-inkscape-font-specification:'BIG SHOT, Normal';stroke:#ffffff;stroke-width:7.9256;stroke-linecap:round;stroke-linejoin:round;stroke-miterlimit:4;stroke-dasharray:none;paint-order:stroke fill markers"
           id="path1380" />
        <path
           d="m 45.722027,138.04781 v -19.05 h 4.229199 v 16.9416 h 8.470801 v 2.1084 z"
           style="font-family:'BIG SHOT';-inkscape-font-specification:'BIG SHOT, Normal';stroke:#ffffff;stroke-width:7.9256;stroke-linecap:round;stroke-linejoin:round;stroke-miterlimit:4;stroke-dasharray:none;paint-order:stroke fill markers"
           id="path1382" />
        <path
           d="m 71.109624,129.58941 v -8.4708 h -4.229199 v 8.4708 z m -8.458398,8.4584 v -16.9292 h 2.108398 v -2.1208 h 8.470801 v 2.1208 h 2.120801 v 16.9292 h -4.241602 v -6.35 h -4.229199 v 6.35 z"
           style="font-family:'BIG SHOT';-inkscape-font-specification:'BIG SHOT, Normal';stroke:#ffffff;stroke-width:7.9256;stroke-linecap:round;stroke-linejoin:round;stroke-miterlimit:4;stroke-dasharray:none;paint-order:stroke fill markers"
           id="path1384" />
        <path
           d="m 81.688824,138.04781 v -2.1084 h -2.108399 v -4.2416 h 4.229199 v 4.2416 h 4.2292 v -6.35 h -6.35 v -2.1208 h -2.108399 v -6.35 h 2.108399 v -2.1208 h 8.4708 v 2.1208 h 2.120801 v 4.2292 h -4.241601 v -4.2292 h -4.2292 v 6.35 h 6.35 v 2.1208 h 2.120801 v 6.35 h -2.120801 v 2.1084 z"
           style="font-family:'BIG SHOT';-inkscape-font-specification:'BIG SHOT, Normal';stroke:#ffffff;stroke-width:7.9256;stroke-linecap:round;stroke-linejoin:round;stroke-miterlimit:4;stroke-dasharray:none;paint-order:stroke fill markers"
           id="path1386" />
        <path
           d="m 98.618023,138.04781 v -2.1084 h -2.108399 v -4.2416 h 4.229196 v 4.2416 h 4.2292 v -6.35 h -6.349997 v -2.1208 h -2.108399 v -6.35 h 2.108399 v -2.1208 h 8.470797 v 2.1208 h 2.1208 v 4.2292 h -4.2416 v -4.2292 h -4.2292 v 6.35 h 6.35 v 2.1208 h 2.1208 v 6.35 h -2.1208 v 2.1084 z"
           style="font-family:'BIG SHOT';-inkscape-font-specification:'BIG SHOT, Normal';stroke:#ffffff;stroke-width:7.9256;stroke-linecap:round;stroke-linejoin:round;stroke-miterlimit:4;stroke-dasharray:none;paint-order:stroke fill markers"
           id="path1388" />
        <path
           d="m 113.43882,138.04781 v -2.1084 h 4.2292 v -14.8208 h -4.2292 v -2.1208 h 12.7 v 2.1208 h -4.2416 v 14.8208 h 4.2416 v 2.1084 z"
           style="font-family:'BIG SHOT';-inkscape-font-specification:'BIG SHOT, Normal';stroke:#ffffff;stroke-width:7.9256;stroke-linecap:round;stroke-linejoin:round;stroke-miterlimit:4;stroke-dasharray:none;paint-order:stroke fill markers"
           id="path1390" />
        <path
           d="m 132.47642,138.04781 v -2.1084 h -2.1084 v -14.8208 h 2.1084 v -2.1208 h 8.4708 v 2.1208 h 2.1208 v 4.2292 h -4.2416 v -4.2292 h -4.2292 v 14.8208 h 4.2292 v -4.2416 h 4.2416 v 4.2416 h -2.1208 v 2.1084 z"
           style="font-family:'BIG SHOT';-inkscape-font-specification:'BIG SHOT, Normal';stroke:#ffffff;stroke-width:7.9256;stroke-linecap:round;stroke-linejoin:round;stroke-miterlimit:4;stroke-dasharray:none;paint-order:stroke fill markers"
           id="path1392" />
        <path
           d="m 149.40562,138.04781 v -2.1084 h -2.1084 v -4.2416 h 4.2292 v 4.2416 h 4.2292 v -6.35 h -6.35 v -2.1208 h -2.1084 v -6.35 h 2.1084 v -2.1208 h 8.4708 v 2.1208 h 2.1208 v 4.2292 h -4.2416 v -4.2292 h -4.2292 v 6.35 h 6.35 v 2.1208 h 2.1208 v 6.35 h -2.1208 v 2.1084 z"
           style="font-family:'BIG SHOT';-inkscape-font-specification:'BIG SHOT, Normal';stroke:#ffffff;stroke-width:7.9256;stroke-linecap:round;stroke-linejoin:round;stroke-miterlimit:4;stroke-dasharray:none;paint-order:stroke fill markers"
           id="path1394" />
      </g>
      <g
         id="g963">
        <ellipse
           style="fill:#ffffff;fill-rule:evenodd;stroke-width:0.903251;stroke-linecap:round;stroke-linejoin:round;stroke-miterlimit:4;stroke-dasharray:none;paint-order:stroke fill markers"
           id="path874"
           cx="533.15479"
           cy="-127.22138"
           rx="1.1094732"
           ry="1.0616763" />
        <g
           id="g4635"
           transform="matrix(0.03864124,0,0,0.03864124,508.44941,-131.06572)"
           style="stroke:#ffffff;stroke-width:31.0549;stroke-linecap:round;stroke-linejoin:round;stroke-miterlimit:4;stroke-dasharray:none;paint-order:stroke fill markers">
          <path
             style="display:inline;fill:#000000;stroke:#ffffff;stroke-width:31.0549;stroke-linecap:round;stroke-linejoin:round;stroke-miterlimit:4;stroke-dasharray:none;paint-order:stroke fill markers"
             d="M 381.5279,107.07111 V 87.608596 l -9.25,-0.28752 -9.25,-0.28753 -0.30226,-5.25 -0.30226,-5.25 h 14.05226 14.05226 v 25.000004 25 h -4.5 -4.5 z m 16.76578,16.54635 -3.26578,-2.91611 -0.30413,-22.083895 -0.30412,-22.083879 h 15.05412 15.05413 v 5.5 5.5 h -10.5 -10.5 v 4.5 4.499999 h 10 10 v 4.963795 4.96379 l -9.75,0.28621 -9.75,0.28621 -0.31823,3.31532 c -0.52089,5.42662 0.8814,6.18468 11.44067,6.18468 h 9.37756 v 5 5 h -11.48422 c -11.27357,0 -11.54413,-0.0535 -14.75,-2.91612 z m 37.65424,-0.33388 c -7.26842,-4.91517 -9.42002,-9.81208 -9.42002,-21.4394 0,-11.330374 1.18306,-14.541294 7.36155,-19.979814 5.21912,-4.59406 7.74318,-5.33079 18.26345,-5.33079 h 7.375 v 5.5 5.5 h -9.07692 c -8.69906,0 -9.19861,0.12169 -12,2.92308 -2.75413,2.75413 -2.92308,3.39568 -2.92308,11.100004 0,7.96591 0.0877,8.26466 3.4,11.57692 3.33953,3.33953 3.55294,3.4 12,3.4 h 8.6 v 5 5 h -9.38699 c -8.93793,0 -9.61689,-0.15547 -14.19299,-3.25 z m 27.57998,-21.75 V 76.533546 h 4.5 4.5 v 10 9.999999 h 10 10 v -9.999999 -10 h 4.5 4.5 v 25.000004 25 h -4.5 -4.5 v -10.03621 -10.03621 l -9.75,0.28621 -9.75,0.28621 -0.28621,9.75 -0.28621,9.75 h -4.46379 -4.46379 z m 42,0 V 76.533546 h 10.34272 c 12.68843,0 17.36727,1.96698 22.40728,9.42002 l 3.25,4.80601 v 17.886984 17.88699 h -4.5 -4.5 V 109.95663 93.379696 l -2.92308,-2.92307 c -2.58942,-2.58942 -3.61673,-2.92308 -9,-2.92308 h -6.07692 v 19.500004 19.5 h -4.5 -4.5 z m 50.5,22.71174 c -2.2,-1.24046 -5.49864,-4.48802 -7.33032,-7.21682 l -3.33031,-4.96145 0.33031,-11.09443 c 0.29416,-9.879894 0.604,-11.498224 2.83032,-14.782964 5.43433,-8.01789 16.25366,-11.70765 25.43998,-8.67589 5.00042,1.65029 10.46725,6.60734 12.69504,11.51123 2.54766,5.607999 2.52831,19.484274 -0.0349,25.008584 -2.16966,4.67617 -7.41218,9.92945 -11.41525,11.43867 -5.04098,1.90052 -14.73809,1.28036 -19.1849,-1.22693 z m 17.52002,-9.22209 c 4.20281,-2.17336 4.97998,-4.32503 4.97998,-13.78754 0,-7.774284 -0.20489,-8.634274 -2.63636,-11.065754 -2.3027,-2.3027 -3.45149,-2.63636 -9.07693,-2.63636 -5.78518,0 -6.738,0.29745 -9.36363,2.92308 -2.75413,2.75413 -2.92308,3.39568 -2.92308,11.100004 0,7.96591 0.0877,8.26466 3.4,11.57692 2.89168,2.89168 4.09514,3.4 8.04966,3.4 2.55731,0 5.96397,-0.67966 7.57036,-1.51035 z m 17.97998,6.51035 v -5 h 7.41821 c 13.33702,0 13.64386,-1.50409 2.55482,-12.52346 -9.08838,-9.031275 -10.78836,-12.734914 -8.96075,-19.522154 1.71656,-6.37483 5.22201,-7.94609 17.73772,-7.95065 l 10.25,-0.004 v 5.5 5.5 h -8.39301 c -11.89778,0 -11.948,0.98853 -0.63624,12.523324 8.77696,8.95001 9.02925,9.33817 9.02925,13.89164 0,5.23338 -2.04006,10.00093 -4.94461,11.5554 -1.05815,0.5663 -6.90349,1.02964 -12.98965,1.02964 H 591.5279 Z m 48,0.1093 v -5.1093 h 5.6 c 5.03529,0 5.94286,-0.34286 9,-3.4 l 3.4,-3.4 v -16.600004 -16.6 h 4.5 4.5 v 17.342719 c 0,16.145305 -0.15804,17.641585 -2.28903,21.671335 -1.25896,2.38074 -3.99199,5.70694 -6.07339,7.39156 -3.31298,2.68142 -4.70942,3.10965 -11.21097,3.43796 l -7.42661,0.37503 z m 37.46908,2.61776 c -3.28406,-2.82482 -4.7733,-9.77528 -3.52556,-16.45412 1.35588,-7.25768 4.32554,-9.272945 13.6645,-9.272945 h 7.4965 l -0.30226,-5.249999 -0.30226,-5.25 -10.5,-0.5 -10.5,-0.5 v -5 -5 h 12.22873 c 12.02904,0 12.27397,0.0452 15,2.77065 l 2.77127,2.77065 0.30413,21.979354 0.30412,21.97935 h -11.99836 c -11.03691,0 -12.21011,-0.18213 -14.64081,-2.27294 z m 17.53092,-11.77696 v -4.04991 l -5.75,0.29991 c -5.15052,0.26863 -5.78431,0.54206 -6.07908,2.62263 -0.61487,4.3399 0.40372,5.17727 6.2977,5.17727 h 5.53138 z m 15,-11.03385 V 76.366046 l 11.98002,0.33375 c 11.53579,0.32137 12.08201,0.43585 14.73074,3.08722 2.41284,2.41525 2.78857,3.6436 3.05884,10 0.19474,4.580099 -0.17125,8.166429 -0.99465,9.746529 -1.91567,3.676135 -7.34123,5.996645 -14.02495,5.998455 l -5.75,0.002 v 10.5 10.5 h -4.5 -4.5 z m 20.5,-10.416254 c 0,-2.95074 -0.0944,-3.00492 -5.75,-3.2999 l -5.75,-0.29991 v 3.59981 3.599809 l 5.75,-0.29991 c 5.65558,-0.29498 5.75,-0.34916 5.75,-3.299899 z m 19.86455,34.330624 c -3.47644,-1.68335 -4.86455,-5.55554 -4.86455,-13.56991 0,-7.12206 0.13327,-7.54415 3.26578,-10.34289 2.94756,-2.633525 3.9463,-2.917825 10.25,-2.917825 h 6.98422 v -5.499999 -5.5 h -10.5 -10.5 v -5.5 -5.5 l 10.75,0.002 c 12.94458,0.002 17.07841,1.52906 18.94356,6.99845 0.75741,2.22106 1.21418,10.716889 1.25,23.250004 l 0.0564,19.74955 -11.75,-0.0677 c -6.4625,-0.0372 -12.71095,-0.53299 -13.88545,-1.1017 z m 15.63545,-12.83062 v -4 h -5.43261 c -4.55436,0 -5.53524,0.32333 -6.06739,2 -0.34913,1.1 -0.34913,2.9 0,4 0.53215,1.67667 1.51303,2 6.06739,2 h 5.43261 z m 16,-11 V 76.533546 h 10.03212 c 11.04163,0 15.51677,1.27652 20.34398,5.80305 5.70976,5.35411 6.5777,8.9625 6.60194,27.446954 l 0.022,16.75 h -4.5 -4.5 v -15.54966 c 0,-21.218044 -1.23125,-23.450344 -12.93426,-23.450344 h -6.06574 v 19.500004 19.5 h -4.5 -4.5 z m 59.5,22.71174 c -2.2,-1.24046 -5.4625,-4.43391 -7.25,-7.09657 -3.12285,-4.6518 -3.25,-5.22925 -3.25,-14.7603 0,-11.512014 1.06826,-14.773704 6.59109,-20.124394 4.70341,-4.55681 8.48666,-5.71758 18.65891,-5.7249 l 7.75,-0.006 v 5.5 5.5 h -9.07692 c -8.69906,0 -9.19861,0.12169 -12,2.92308 -2.75413,2.75413 -2.92308,3.39568 -2.92308,11.100004 0,7.96591 0.0877,8.26466 3.4,11.57692 3.33953,3.33953 3.55294,3.4 12,3.4 h 8.6 v 5 5 l -9.25,-0.0165 c -7.7307,-0.0137 -9.907,-0.38689 -13.25,-2.27181 z m 38,0.86698 c -4.00372,-1.79232 -9.03959,-7.21788 -10.94932,-11.7966 -2.24495,-5.38245 -2.04982,-19.109165 0.34518,-24.282124 6.33057,-13.67338 24.41241,-16.92609 34.82373,-6.26438 5.50442,5.6368 6.28041,8.07292 6.28041,19.716474 0,9.42136 -0.13253,10.0193 -3.25,14.66308 -4.51348,6.72329 -9.52624,9.35795 -17.75,9.32924 -3.575,-0.0125 -7.85,-0.62704 -9.5,-1.36569 z m 18.1,-11.97872 c 3.31226,-3.31226 3.4,-3.61101 3.4,-11.57692 0,-7.704324 -0.16895,-8.345874 -2.92308,-11.100004 -2.62472,-2.62472 -3.57947,-2.92308 -9.35397,-2.92308 -5.44023,0 -6.83852,0.37777 -9.07693,2.45225 -2.46676,2.28612 -2.64602,3.03577 -2.64602,11.065744 0,4.73742 0.46131,9.47547 1.02514,10.52899 1.5826,2.95711 5.98953,4.86894 11.32486,4.91298 4.20884,0.0347 5.29947,-0.40943 8.25,-3.35996 z m 17.4,-11.68375 V 76.366046 l 12.0844,0.33375 12.0844,0.33375 2.80725,3.14452 2.80726,3.14451 0.0867,21.605494 0.0867,21.60548 h -4.44338 -4.44337 l -0.28499,-10.25 -0.28498,-10.25 -5.25,-0.30226 -5.25,-0.30226 v 10.55226 10.55226 h -5 -5 V 101.4498 Z m 20.5,-10.416254 c 0,-2.914 -0.1505,-3.00866 -5.25,-3.30226 l -5.25,-0.30226 v 3.60452 3.604519 l 5.25,-0.30226 c 5.0995,-0.2936 5.25,-0.38826 5.25,-3.302259 z m 14.73253,10.750004 0.26747,-24.750004 9.5,-0.3112 c 16.58192,-0.54318 20,1.88613 20,14.21449 0,11.061124 -2.33653,13.601634 -13.22614,14.380784 l -6.77386,0.48466 v 10.36564 10.36563 h -5.01747 -5.01747 z M 970.5279,91.033546 v -3.5 h -5.5 -5.5 v 3.5 3.499999 h 5.5 5.5 z m -415,-20.5 v -3 h 11 11 v 3 3 h -11 -11 z m -172,-66.4999995 V -45.466454 h -23.5 -23.5 v -13 -13 h 35 35 V -8.9664535 53.533546 h -11.5 -11.5 z m 53.89734,48.5747995 c -5.01054,-0.99033 -12.366,-5.50003 -15.2454,-9.3471 -6.48834,-8.66883 -6.12347,-5.13117 -6.44381,-62.4777 l -0.29186,-52.25 h 38.07174 38.07174 l -0.27987,12.75 -0.27988,12.75 -26.28159,0.26667 -26.28159,0.26666 0.28159,11.73334 0.28159,11.73333 24.25,0.26778 24.25,0.26778 v 12.4644405 12.46444 l -24.25,0.26778 -24.25,0.26778 v 9.7168195 c 0,14.07786 -1.77703,13.21775 28.06339,13.58305 l 24.49562,0.29988 -0.27951,12.70012 -0.2795,12.70013 -25,0.14343 c -13.75,0.0789 -26.6212,-0.177 -28.60266,-0.56863 z m 95.10266,-0.67795 c -11.02776,-2.95049 -22.53626,-11.97028 -29.99266,-23.50679 -6.6237,-10.24815 -7.18913,-13.53599 -6.82504,-39.6857 l 0.3177,-22.81805 3.90529,-7.89683 c 5.10595,-10.32468 15.17886,-20.56093 25.09471,-25.50163 l 7,-3.48785 23.25,-0.31649 23.25,-0.3165 v 13.0665 13.06649 h -20.53212 c -22.9557,0 -24.496,0.32517 -31.51374,6.65283 -7.19405,6.48663 -7.90693,9.16313 -7.93218,29.7814505 -0.0249,20.2945795 0.83706,23.6007195 7.7306,29.6533195 7.24684,6.36281 9.58411,6.86613 31.99744,6.89044 l 20.25,0.022 v 13 13 l -20.25,-0.0658 c -14.48563,-0.0471 -21.81563,-0.4847 -25.75,-1.53734 z m 56,-60.8640995 V -71.466454 h 11.5 11.5 v 25 25 h 24.5 24.5 v -25 -25 h 11.5 11.5 V -8.9664535 53.533546 h -11.5 -11.5 v -25 -24.9999995 h -24.48253 -24.48253 l -0.26747,24.7499995 -0.26747,24.75 -11.25,0.28275 -11.25,0.28275 z m 104,-0.0915 V -71.583984 l 27.25,0.30878 27.25,0.30878 6.87907,3.25786 c 9.51159,4.50459 21.35848,16.35148 25.86307,25.86307 l 3.25786,6.87904 0.28001,44.2830305 0.28,44.2830295 -11.28,-0.28303 -11.28001,-0.28303 -0.5,-41.65292 -0.5,-41.65292 -3.11191,-4.34708 c -1.71154,-2.39089 -5.51664,-5.80958 -8.45576,-7.59708 l -5.34386,-3.25 H 729.32214 715.5279 V 4.0335465 53.533546 h -11.5 -11.5 V -9.0252335 Z m 138,61.1987495 c -8.23751,-2.24256 -14.41792,-6.06768 -22.03864,-13.64 -8.54308,-8.48881 -13.18318,-16.41415 -14.96618,-25.56236 -0.76444,-3.9221895 -1.03881,-13.10084953 -0.77719,-26 0.36122,-17.81063 0.64453,-20.52978 2.65562,-25.48815 4.91448,-12.11665 16.24962,-23.84447 28.66507,-29.65807 5.77042,-2.70203 6.49037,-2.79142 22.48235,-2.79142 h 16.52102 l 6.97898,3.41392 c 9.54212,4.66773 20.89732,16.02293 25.56505,25.56505 l 3.41392,6.97898 V -8.9874835 17.033546 l -3.98977,7.5 c -7.31388,13.74871 -21.38442,25.18712 -34.30945,27.8913 -6.93087,1.45007 -24.48765,1.30397 -30.20078,-0.25133 z m 30.56538,-26.53038 c 5.49359,-2.49518 11.13908,-7.60997 13.49353,-12.22507 1.71593,-3.3635 1.94109,-5.9668495 1.94109,-22.4435495 0,-20.8154105 -0.38645,-22.4579905 -6.81633,-28.9723905 -6.14581,-6.2266 -9.95324,-7.4215 -23.72791,-7.44662 -11.82697,-0.0216 -12.14265,0.0368 -17.5,3.23437 -3.43034,2.04744 -6.6623,5.05935 -8.70576,8.11302 l -3.25,4.85668 v 19.9366405 c 0,22.7133295 0.0829,23.0292495 7.88098,30.0404195 6.32991,5.69113 9.25883,6.57472 22.11902,6.67286 8.20092,0.0626 11.39015,-0.32418 14.56538,-1.76636 z m 47.43462,14.96295 v -13.07257 h 18.53212 c 20.66057,0 24.8988,-0.88442 26.0407,-5.4341 0.3542,-1.41125 0.38658,-3.59154 0.072,-4.8451 -0.31462,-1.25357 -9.20843,-10.8160695 -19.76403,-21.2499995 -22.8064,-22.5435605 -23.85609,-24.2172505 -23.87097,-38.0610805 -0.009,-8.16581 0.30397,-9.71813 3.07526,-15.26396 1.69676,-3.39552 4.53348,-7.27848 6.30382,-8.62878 6.89538,-5.2594 8.60321,-5.51698 36.57898,-5.51698 h 26.03212 v 12.94281 12.94281 l -20.59019,0.30719 c -20.25952,0.30226 -20.62086,0.3451 -22.5,2.66797 -4.09161,5.05779 -3.29804,6.27104 18.05576,27.60483 23.51382,23.4917705 24.45098,24.9873505 24.45976,39.03439 0.005,7.77858 -0.35126,9.68501 -2.62407,14.04748 -1.44633,2.77611 -4.1308,6.54225 -5.96548,8.36921 -6.32296,6.29635 -7.57285,6.52875 -37.08578,6.89578 l -26.75,0.33267 z m -89,-127.57257 v -8.5 h 26.5 26.5 v 8.5 8.5 h -26.5 -26.5 z"
             id="path845"
             sodipodi:nodetypes="cccccccccccccscccccccccccccccccsscccsssssscccssssscccsscccccccccccccccccccccccccccsscccccccssccccccsscsssssssssssssssssccsssccccsssssccccsscccccssssccssscccccccsscccssccsssccccsssscccccccsscccssssssccccccccsscsssccssssccccssscccsscccccccsssccccssssscccsccsssssssssssssssssccccccccccccccccccccsscccssccssscccccccccccccccccccccccccccccccccccccssscccccccccccccccsscccssssscsscccccssssscccssscccccccccccccccccccccccccccccsscccccccsscccccccccssssssscsscccssssssssssscssssccsssscssscccsssssssccccccccccc" />
          <path
             d="m 42.38396,154.0519 c -2.84781,-1.58452 -4.85606,-6.03416 -4.85606,-10.75949 0,-2.34751 10.10636,-35.30225 11.63308,-37.93305 0.21518,-0.3708 2.62941,0.83198 5.36494,2.67286 9.92141,6.67662 23.05772,9.95315 37.50194,9.35395 4.67518,-0.19394 8.50026,-0.28255 8.50018,-0.1969 -6e-4,0.64607 -43.16418,34.41609 -45.5347,35.62512 -4.75073,2.42299 -9.61988,2.90085 -12.60938,1.23751 z m 214.14394,-0.0444 c -3.0418,-0.96557 -10.43264,-6.14445 -22.80811,-15.98199 l -18.30811,-14.55352 5.92428,-4.45336 c 10.45614,-7.86002 17.55949,-19.176265 23.57137,-37.551145 l 3.18801,-9.74393 11.22479,33.655025 c 12.34443,37.01202 13.25615,41.75102 8.95777,46.56159 -2.91358,3.26076 -6.17999,3.83548 -11.75,2.06733 z M 129.98245,121.079 c -5.11043,-5.11042 -2.52181,-9.94628 7.54545,-14.09584 21.29115,-8.775875 45.23799,-26.759595 59.89693,-44.9817 5.31512,-6.60708 6.1002,-8.12761 6.08083,-11.77724 -0.0342,-6.44275 -4.42233,-10.69067 -11.0436,-10.69067 -2.46508,0 -4.1405,0.98727 -7.31574,4.31096 -16.73356,17.51585 -21.02815,21.63474 -28.00107,26.855465 -21.7926,16.31647 -40.84104,23.61445 -64.17281,24.5864 -9.36749,0.39022 -13.31034,0.13739 -17.68356,-1.13394 -5.89264,-1.71303 -12.72146,-6.29173 -16.01619,-10.73879 L 57.33166,80.793745 61.55651,68.68583 65.78136,56.57791 55.6478,45.96415 C 42.97001,32.6856 32.5279,17.43079 32.5279,12.18846 c 0,-4.97094 2.80829,-7.65491 8.0095,-7.65491 3.56047,0 4.31642,0.45043 6.75,4.02191 12.96637,19.02925 25.04641,32.30046 39.28789,43.16192 17.12923,13.06385 23.78597,15.3516 29.84188,10.25589 3.79033,-3.18935 4.8828,-8.04601 2.7414,-12.18704 -0.94031,-1.81834 -5.38402,-5.55103 -11.3385,-9.52425 C 90.63271,28.79344 75.52789,13.17198 65.51156,-3.49363 52.86332,-24.53834 47.48665,-50.65959 53.01268,-64.21645 l 1.73238,-4.25 h 5.3323 5.3323 l 6.51665,-13.55164 c 6.83006,-14.20338 13.56611,-25.14772 19.0695,-30.98301 6.01768,-6.3806 14.57463,-3.85134 14.49572,4.28465 -0.0284,2.92751 -1.12665,5.17565 -5.00729,10.25 -10.71364,14.00923 -23.00022,42.81661 -26.01821,61.00287 -1.08874,6.56075 -1.04299,7.89367 0.36434,10.61515 2.26988,4.38947 7.75541,6.84801 12.08856,5.41794 5.17371,-1.70747 7.09412,-4.73297 9.54398,-15.03596 8.99531,-37.83023 31.51903,-69.03107 60.2589,-83.47326 9.49545,-4.7716 16.73749,-6.25128 23.77967,-4.85863 4.94818,0.97855 5.12393,1.2205 8.22607,11.32402 l 2.30035,7.49213 10.5,1.20525 c 14.22153,1.63242 28.17112,4.95122 32.18749,7.65786 2.90067,1.95476 3.31251,2.7734 3.31251,6.58454 0,3.5844 -0.48558,4.71479 -2.75234,6.40717 -2.45548,1.83328 -3.26442,1.93647 -7.5,0.95674 -19.34072,-4.47373 -25.14321,-5.40074 -37.31869,-5.96211 -14.6482,-0.67538 -31.43301,0.84159 -36.11827,3.26427 -5.56601,2.87811 -7.65137,10.32908 -4.25,15.18523 3.19138,4.55633 6.50361,5.37336 16.6811,4.11473 18.38314,-2.2734 44.923,0.61323 61.99187,6.74258 15.71894,5.6446 30.03563,14.61422 39.5225,24.76145 5.0466,5.39788 10.30391,13.99254 9.1503,14.95892 -0.22356,0.18728 -4.15421,2.72362 -8.73478,5.63633 -7.07247,4.49726 -8.23478,5.61302 -7.70799,7.39931 2.15808,7.31785 5.62811,24.46535 6.49657,32.10347 2.44906,21.53926 0.59445,28.38693 -7.71027,28.4682 -3.63316,0.0356 -6.93522,-2.63184 -7.66626,-6.19276 -0.25693,-1.25149 -0.69563,-7.90044 -0.97489,-14.77544 -0.79437,-19.55623 -6.57283,-41.0094 -16.22102,-60.22232 -3.27824,-6.52814 -5.17469,-9.13322 -7.53875,-10.35572 -6.25868,-3.23649 -14.16939,0.43807 -15.43197,7.1682 -0.48414,2.5807 0.35151,5.37559 3.96291,13.25415 14.27186,31.1352 17.92955,61.98052 10.55979,89.050715 -4.4814,16.46087 -12.46078,28.825945 -21.27131,32.962655 -7.65179,3.59267 -7.96943,3.56243 -13.97556,-1.33012 -3.05692,-2.49016 -5.81361,-4.527565 -6.12597,-4.527565 -0.31235,0 -4.7302,2.879695 -9.81744,6.399315 -9.21201,6.37335 -24.24644,14.45344 -31.9513,17.17188 -5.94722,2.0983 -9.51623,1.80172 -12.34368,-1.02574 z M 13.0279,-32.17187 c -23.19505,-14.85412 -24.84672,-16.14116 -27.59732,-21.50474 -2.47052,-4.81742 -2.40133,-6.04379 0.53809,-9.53708 3.5764,-4.25032 8.51523,-5.26517 28.15035,-5.78448 l 17.64169,-0.46658 -0.62259,2.24915 c -3.0893,11.16013 -2.62141,24.56557 1.40718,40.31721 1.09193,4.2694 1.87221,7.85533 1.73396,7.96874 -0.13825,0.11341 -9.70136,-5.84559 -21.25136,-13.24222 z m 278.94762,-6.38081 c -4.69715,-7.73233 -14.90294,-17.9677 -24.34324,-24.41377 l -7.32253,-5 24.35908,-0.29688 c 29.73553,-0.3624 32.18735,-0.0748 36.54879,4.2866 3.60685,3.60685 4.07457,6.15073 1.8956,10.30994 -2.51816,4.80666 -11.17833,11.57667 -26.25661,20.5259 -0.73587,0.43675 -2.55042,-1.57509 -4.88109,-5.41179 z M 123.5302,-126.18221 c 0.50718,-1.53133 5.00887,-16.73424 10.00376,-33.78424 9.55163,-32.6044 11.62863,-37.40442 17.36982,-40.1422 3.01384,-1.4372 3.57539,-1.43436 6.41193,0.0325 5.78038,2.98915 7.83889,7.20076 14.67556,30.02548 3.59514,12.00267 6.53663,22.15588 6.53663,22.56268 0,0.40681 -3.71988,0.97173 -8.26641,1.25538 -12.08816,0.75415 -25.64255,6.62816 -39.73359,17.21918 -8.05581,6.05486 -8.06683,6.05931 -6.9977,2.83125 z"
             style="display:inline;fill:#0168a4;fill-opacity:1;stroke:#ffffff;stroke-width:31.0549;stroke-linecap:round;stroke-linejoin:round;stroke-miterlimit:4;stroke-dasharray:none;paint-order:stroke fill markers"
             id="path890" />
        </g>
        <g
           id="g4727"
           transform="matrix(0.03864124,0,0,0.03864124,508.44941,-131.06572)">
          <path
             style="display:inline;fill:#000000"
             d="M 381.5279,107.07111 V 87.608596 l -9.25,-0.28752 -9.25,-0.28753 -0.30226,-5.25 -0.30226,-5.25 h 14.05226 14.05226 v 25.000004 25 h -4.5 -4.5 z m 16.76578,16.54635 -3.26578,-2.91611 -0.30413,-22.083895 -0.30412,-22.083879 h 15.05412 15.05413 v 5.5 5.5 h -10.5 -10.5 v 4.5 4.499999 h 10 10 v 4.963795 4.96379 l -9.75,0.28621 -9.75,0.28621 -0.31823,3.31532 c -0.52089,5.42662 0.8814,6.18468 11.44067,6.18468 h 9.37756 v 5 5 h -11.48422 c -11.27357,0 -11.54413,-0.0535 -14.75,-2.91612 z m 37.65424,-0.33388 c -7.26842,-4.91517 -9.42002,-9.81208 -9.42002,-21.4394 0,-11.330374 1.18306,-14.541294 7.36155,-19.979814 5.21912,-4.59406 7.74318,-5.33079 18.26345,-5.33079 h 7.375 v 5.5 5.5 h -9.07692 c -8.69906,0 -9.19861,0.12169 -12,2.92308 -2.75413,2.75413 -2.92308,3.39568 -2.92308,11.100004 0,7.96591 0.0877,8.26466 3.4,11.57692 3.33953,3.33953 3.55294,3.4 12,3.4 h 8.6 v 5 5 h -9.38699 c -8.93793,0 -9.61689,-0.15547 -14.19299,-3.25 z m 27.57998,-21.75 V 76.533546 h 4.5 4.5 v 10 9.999999 h 10 10 v -9.999999 -10 h 4.5 4.5 v 25.000004 25 h -4.5 -4.5 v -10.03621 -10.03621 l -9.75,0.28621 -9.75,0.28621 -0.28621,9.75 -0.28621,9.75 h -4.46379 -4.46379 z m 42,0 V 76.533546 h 10.34272 c 12.68843,0 17.36727,1.96698 22.40728,9.42002 l 3.25,4.80601 v 17.886984 17.88699 h -4.5 -4.5 V 109.95663 93.379696 l -2.92308,-2.92307 c -2.58942,-2.58942 -3.61673,-2.92308 -9,-2.92308 h -6.07692 v 19.500004 19.5 h -4.5 -4.5 z m 50.5,22.71174 c -2.2,-1.24046 -5.49864,-4.48802 -7.33032,-7.21682 l -3.33031,-4.96145 0.33031,-11.09443 c 0.29416,-9.879894 0.604,-11.498224 2.83032,-14.782964 5.43433,-8.01789 16.25366,-11.70765 25.43998,-8.67589 5.00042,1.65029 10.46725,6.60734 12.69504,11.51123 2.54766,5.607999 2.52831,19.484274 -0.0349,25.008584 -2.16966,4.67617 -7.41218,9.92945 -11.41525,11.43867 -5.04098,1.90052 -14.73809,1.28036 -19.1849,-1.22693 z m 17.52002,-9.22209 c 4.20281,-2.17336 4.97998,-4.32503 4.97998,-13.78754 0,-7.774284 -0.20489,-8.634274 -2.63636,-11.065754 -2.3027,-2.3027 -3.45149,-2.63636 -9.07693,-2.63636 -5.78518,0 -6.738,0.29745 -9.36363,2.92308 -2.75413,2.75413 -2.92308,3.39568 -2.92308,11.100004 0,7.96591 0.0877,8.26466 3.4,11.57692 2.89168,2.89168 4.09514,3.4 8.04966,3.4 2.55731,0 5.96397,-0.67966 7.57036,-1.51035 z m 17.97998,6.51035 v -5 h 7.41821 c 13.33702,0 13.64386,-1.50409 2.55482,-12.52346 -9.08838,-9.031275 -10.78836,-12.734914 -8.96075,-19.522154 1.71656,-6.37483 5.22201,-7.94609 17.73772,-7.95065 l 10.25,-0.004 v 5.5 5.5 h -8.39301 c -11.89778,0 -11.948,0.98853 -0.63624,12.523324 8.77696,8.95001 9.02925,9.33817 9.02925,13.89164 0,5.23338 -2.04006,10.00093 -4.94461,11.5554 -1.05815,0.5663 -6.90349,1.02964 -12.98965,1.02964 H 591.5279 Z m 48,0.1093 v -5.1093 h 5.6 c 5.03529,0 5.94286,-0.34286 9,-3.4 l 3.4,-3.4 v -16.600004 -16.6 h 4.5 4.5 v 17.342719 c 0,16.145305 -0.15804,17.641585 -2.28903,21.671335 -1.25896,2.38074 -3.99199,5.70694 -6.07339,7.39156 -3.31298,2.68142 -4.70942,3.10965 -11.21097,3.43796 l -7.42661,0.37503 z m 37.46908,2.61776 c -3.28406,-2.82482 -4.7733,-9.77528 -3.52556,-16.45412 1.35588,-7.25768 4.32554,-9.272945 13.6645,-9.272945 h 7.4965 l -0.30226,-5.249999 -0.30226,-5.25 -10.5,-0.5 -10.5,-0.5 v -5 -5 h 12.22873 c 12.02904,0 12.27397,0.0452 15,2.77065 l 2.77127,2.77065 0.30413,21.979354 0.30412,21.97935 h -11.99836 c -11.03691,0 -12.21011,-0.18213 -14.64081,-2.27294 z m 17.53092,-11.77696 v -4.04991 l -5.75,0.29991 c -5.15052,0.26863 -5.78431,0.54206 -6.07908,2.62263 -0.61487,4.3399 0.40372,5.17727 6.2977,5.17727 h 5.53138 z m 15,-11.03385 V 76.366046 l 11.98002,0.33375 c 11.53579,0.32137 12.08201,0.43585 14.73074,3.08722 2.41284,2.41525 2.78857,3.6436 3.05884,10 0.19474,4.580099 -0.17125,8.166429 -0.99465,9.746529 -1.91567,3.676135 -7.34123,5.996645 -14.02495,5.998455 l -5.75,0.002 v 10.5 10.5 h -4.5 -4.5 z m 20.5,-10.416254 c 0,-2.95074 -0.0944,-3.00492 -5.75,-3.2999 l -5.75,-0.29991 v 3.59981 3.599809 l 5.75,-0.29991 c 5.65558,-0.29498 5.75,-0.34916 5.75,-3.299899 z m 19.86455,34.330624 c -3.47644,-1.68335 -4.86455,-5.55554 -4.86455,-13.56991 0,-7.12206 0.13327,-7.54415 3.26578,-10.34289 2.94756,-2.633525 3.9463,-2.917825 10.25,-2.917825 h 6.98422 v -5.499999 -5.5 h -10.5 -10.5 v -5.5 -5.5 l 10.75,0.002 c 12.94458,0.002 17.07841,1.52906 18.94356,6.99845 0.75741,2.22106 1.21418,10.716889 1.25,23.250004 l 0.0564,19.74955 -11.75,-0.0677 c -6.4625,-0.0372 -12.71095,-0.53299 -13.88545,-1.1017 z m 15.63545,-12.83062 v -4 h -5.43261 c -4.55436,0 -5.53524,0.32333 -6.06739,2 -0.34913,1.1 -0.34913,2.9 0,4 0.53215,1.67667 1.51303,2 6.06739,2 h 5.43261 z m 16,-11 V 76.533546 h 10.03212 c 11.04163,0 15.51677,1.27652 20.34398,5.80305 5.70976,5.35411 6.5777,8.9625 6.60194,27.446954 l 0.022,16.75 h -4.5 -4.5 v -15.54966 c 0,-21.218044 -1.23125,-23.450344 -12.93426,-23.450344 h -6.06574 v 19.500004 19.5 h -4.5 -4.5 z m 59.5,22.71174 c -2.2,-1.24046 -5.4625,-4.43391 -7.25,-7.09657 -3.12285,-4.6518 -3.25,-5.22925 -3.25,-14.7603 0,-11.512014 1.06826,-14.773704 6.59109,-20.124394 4.70341,-4.55681 8.48666,-5.71758 18.65891,-5.7249 l 7.75,-0.006 v 5.5 5.5 h -9.07692 c -8.69906,0 -9.19861,0.12169 -12,2.92308 -2.75413,2.75413 -2.92308,3.39568 -2.92308,11.100004 0,7.96591 0.0877,8.26466 3.4,11.57692 3.33953,3.33953 3.55294,3.4 12,3.4 h 8.6 v 5 5 l -9.25,-0.0165 c -7.7307,-0.0137 -9.907,-0.38689 -13.25,-2.27181 z m 38,0.86698 c -4.00372,-1.79232 -9.03959,-7.21788 -10.94932,-11.7966 -2.24495,-5.38245 -2.04982,-19.109165 0.34518,-24.282124 6.33057,-13.67338 24.41241,-16.92609 34.82373,-6.26438 5.50442,5.6368 6.28041,8.07292 6.28041,19.716474 0,9.42136 -0.13253,10.0193 -3.25,14.66308 -4.51348,6.72329 -9.52624,9.35795 -17.75,9.32924 -3.575,-0.0125 -7.85,-0.62704 -9.5,-1.36569 z m 18.1,-11.97872 c 3.31226,-3.31226 3.4,-3.61101 3.4,-11.57692 0,-7.704324 -0.16895,-8.345874 -2.92308,-11.100004 -2.62472,-2.62472 -3.57947,-2.92308 -9.35397,-2.92308 -5.44023,0 -6.83852,0.37777 -9.07693,2.45225 -2.46676,2.28612 -2.64602,3.03577 -2.64602,11.065744 0,4.73742 0.46131,9.47547 1.02514,10.52899 1.5826,2.95711 5.98953,4.86894 11.32486,4.91298 4.20884,0.0347 5.29947,-0.40943 8.25,-3.35996 z m 17.4,-11.68375 V 76.366046 l 12.0844,0.33375 12.0844,0.33375 2.80725,3.14452 2.80726,3.14451 0.0867,21.605494 0.0867,21.60548 h -4.44338 -4.44337 l -0.28499,-10.25 -0.28498,-10.25 -5.25,-0.30226 -5.25,-0.30226 v 10.55226 10.55226 h -5 -5 V 101.4498 Z m 20.5,-10.416254 c 0,-2.914 -0.1505,-3.00866 -5.25,-3.30226 l -5.25,-0.30226 v 3.60452 3.604519 l 5.25,-0.30226 c 5.0995,-0.2936 5.25,-0.38826 5.25,-3.302259 z m 14.73253,10.750004 0.26747,-24.750004 9.5,-0.3112 c 16.58192,-0.54318 20,1.88613 20,14.21449 0,11.061124 -2.33653,13.601634 -13.22614,14.380784 l -6.77386,0.48466 v 10.36564 10.36563 h -5.01747 -5.01747 z M 970.5279,91.033546 v -3.5 h -5.5 -5.5 v 3.5 3.499999 h 5.5 5.5 z m -415,-20.5 v -3 h 11 11 v 3 3 h -11 -11 z m -172,-66.4999995 V -45.466454 h -23.5 -23.5 v -13 -13 h 35 35 V -8.9664535 53.533546 h -11.5 -11.5 z m 53.89734,48.5747995 c -5.01054,-0.99033 -12.366,-5.50003 -15.2454,-9.3471 -6.48834,-8.66883 -6.12347,-5.13117 -6.44381,-62.4777 l -0.29186,-52.25 h 38.07174 38.07174 l -0.27987,12.75 -0.27988,12.75 -26.28159,0.26667 -26.28159,0.26666 0.28159,11.73334 0.28159,11.73333 24.25,0.26778 24.25,0.26778 v 12.4644405 12.46444 l -24.25,0.26778 -24.25,0.26778 v 9.7168195 c 0,14.07786 -1.77703,13.21775 28.06339,13.58305 l 24.49562,0.29988 -0.27951,12.70012 -0.2795,12.70013 -25,0.14343 c -13.75,0.0789 -26.6212,-0.177 -28.60266,-0.56863 z m 95.10266,-0.67795 c -11.02776,-2.95049 -22.53626,-11.97028 -29.99266,-23.50679 -6.6237,-10.24815 -7.18913,-13.53599 -6.82504,-39.6857 l 0.3177,-22.81805 3.90529,-7.89683 c 5.10595,-10.32468 15.17886,-20.56093 25.09471,-25.50163 l 7,-3.48785 23.25,-0.31649 23.25,-0.3165 v 13.0665 13.06649 h -20.53212 c -22.9557,0 -24.496,0.32517 -31.51374,6.65283 -7.19405,6.48663 -7.90693,9.16313 -7.93218,29.7814505 -0.0249,20.2945795 0.83706,23.6007195 7.7306,29.6533195 7.24684,6.36281 9.58411,6.86613 31.99744,6.89044 l 20.25,0.022 v 13 13 l -20.25,-0.0658 c -14.48563,-0.0471 -21.81563,-0.4847 -25.75,-1.53734 z m 56,-60.8640995 V -71.466454 h 11.5 11.5 v 25 25 h 24.5 24.5 v -25 -25 h 11.5 11.5 V -8.9664535 53.533546 h -11.5 -11.5 v -25 -24.9999995 h -24.48253 -24.48253 l -0.26747,24.7499995 -0.26747,24.75 -11.25,0.28275 -11.25,0.28275 z m 104,-0.0915 V -71.583984 l 27.25,0.30878 27.25,0.30878 6.87907,3.25786 c 9.51159,4.50459 21.35848,16.35148 25.86307,25.86307 l 3.25786,6.87904 0.28001,44.2830305 0.28,44.2830295 -11.28,-0.28303 -11.28001,-0.28303 -0.5,-41.65292 -0.5,-41.65292 -3.11191,-4.34708 c -1.71154,-2.39089 -5.51664,-5.80958 -8.45576,-7.59708 l -5.34386,-3.25 H 729.32214 715.5279 V 4.0335465 53.533546 h -11.5 -11.5 V -9.0252335 Z m 138,61.1987495 c -8.23751,-2.24256 -14.41792,-6.06768 -22.03864,-13.64 -8.54308,-8.48881 -13.18318,-16.41415 -14.96618,-25.56236 -0.76444,-3.9221895 -1.03881,-13.10084953 -0.77719,-26 0.36122,-17.81063 0.64453,-20.52978 2.65562,-25.48815 4.91448,-12.11665 16.24962,-23.84447 28.66507,-29.65807 5.77042,-2.70203 6.49037,-2.79142 22.48235,-2.79142 h 16.52102 l 6.97898,3.41392 c 9.54212,4.66773 20.89732,16.02293 25.56505,25.56505 l 3.41392,6.97898 V -8.9874835 17.033546 l -3.98977,7.5 c -7.31388,13.74871 -21.38442,25.18712 -34.30945,27.8913 -6.93087,1.45007 -24.48765,1.30397 -30.20078,-0.25133 z m 30.56538,-26.53038 c 5.49359,-2.49518 11.13908,-7.60997 13.49353,-12.22507 1.71593,-3.3635 1.94109,-5.9668495 1.94109,-22.4435495 0,-20.8154105 -0.38645,-22.4579905 -6.81633,-28.9723905 -6.14581,-6.2266 -9.95324,-7.4215 -23.72791,-7.44662 -11.82697,-0.0216 -12.14265,0.0368 -17.5,3.23437 -3.43034,2.04744 -6.6623,5.05935 -8.70576,8.11302 l -3.25,4.85668 v 19.9366405 c 0,22.7133295 0.0829,23.0292495 7.88098,30.0404195 6.32991,5.69113 9.25883,6.57472 22.11902,6.67286 8.20092,0.0626 11.39015,-0.32418 14.56538,-1.76636 z m 47.43462,14.96295 v -13.07257 h 18.53212 c 20.66057,0 24.8988,-0.88442 26.0407,-5.4341 0.3542,-1.41125 0.38658,-3.59154 0.072,-4.8451 -0.31462,-1.25357 -9.20843,-10.8160695 -19.76403,-21.2499995 -22.8064,-22.5435605 -23.85609,-24.2172505 -23.87097,-38.0610805 -0.009,-8.16581 0.30397,-9.71813 3.07526,-15.26396 1.69676,-3.39552 4.53348,-7.27848 6.30382,-8.62878 6.89538,-5.2594 8.60321,-5.51698 36.57898,-5.51698 h 26.03212 v 12.94281 12.94281 l -20.59019,0.30719 c -20.25952,0.30226 -20.62086,0.3451 -22.5,2.66797 -4.09161,5.05779 -3.29804,6.27104 18.05576,27.60483 23.51382,23.4917705 24.45098,24.9873505 24.45976,39.03439 0.005,7.77858 -0.35126,9.68501 -2.62407,14.04748 -1.44633,2.77611 -4.1308,6.54225 -5.96548,8.36921 -6.32296,6.29635 -7.57285,6.52875 -37.08578,6.89578 l -26.75,0.33267 z m -89,-127.57257 v -8.5 h 26.5 26.5 v 8.5 8.5 h -26.5 -26.5 z"
             id="path4723"
             sodipodi:nodetypes="cccccccccccccscccccccccccccccccsscccsssssscccssssscccsscccccccccccccccccccccccccccsscccccccssccccccsscsssssssssssssssssccsssccccsssssccccsscccccssssccssscccccccsscccssccsssccccsssscccccccsscccssssssccccccccsscsssccssssccccssscccsscccccccsssccccssssscccsccsssssssssssssssssccccccccccccccccccccsscccssccssscccccccccccccccccccccccccccccccccccccssscccccccccccccccsscccssssscsscccccssssscccssscccccccccccccccccccccccccccccsscccccccsscccccccccssssssscsscccssssssssssscssssccsssscssscccsssssssccccccccccc" />
          <path
             d="m 42.38396,154.0519 c -2.84781,-1.58452 -4.85606,-6.03416 -4.85606,-10.75949 0,-2.34751 10.10636,-35.30225 11.63308,-37.93305 0.21518,-0.3708 2.62941,0.83198 5.36494,2.67286 9.92141,6.67662 23.05772,9.95315 37.50194,9.35395 4.67518,-0.19394 8.50026,-0.28255 8.50018,-0.1969 -6e-4,0.64607 -43.16418,34.41609 -45.5347,35.62512 -4.75073,2.42299 -9.61988,2.90085 -12.60938,1.23751 z m 214.14394,-0.0444 c -3.0418,-0.96557 -10.43264,-6.14445 -22.80811,-15.98199 l -18.30811,-14.55352 5.92428,-4.45336 c 10.45614,-7.86002 17.55949,-19.176265 23.57137,-37.551145 l 3.18801,-9.74393 11.22479,33.655025 c 12.34443,37.01202 13.25615,41.75102 8.95777,46.56159 -2.91358,3.26076 -6.17999,3.83548 -11.75,2.06733 z M 129.98245,121.079 c -5.11043,-5.11042 -2.52181,-9.94628 7.54545,-14.09584 21.29115,-8.775875 45.23799,-26.759595 59.89693,-44.9817 5.31512,-6.60708 6.1002,-8.12761 6.08083,-11.77724 -0.0342,-6.44275 -4.42233,-10.69067 -11.0436,-10.69067 -2.46508,0 -4.1405,0.98727 -7.31574,4.31096 -16.73356,17.51585 -21.02815,21.63474 -28.00107,26.855465 -21.7926,16.31647 -40.84104,23.61445 -64.17281,24.5864 -9.36749,0.39022 -13.31034,0.13739 -17.68356,-1.13394 -5.89264,-1.71303 -12.72146,-6.29173 -16.01619,-10.73879 L 57.33166,80.793745 61.55651,68.68583 65.78136,56.57791 55.6478,45.96415 C 42.97001,32.6856 32.5279,17.43079 32.5279,12.18846 c 0,-4.97094 2.80829,-7.65491 8.0095,-7.65491 3.56047,0 4.31642,0.45043 6.75,4.02191 12.96637,19.02925 25.04641,32.30046 39.28789,43.16192 17.12923,13.06385 23.78597,15.3516 29.84188,10.25589 3.79033,-3.18935 4.8828,-8.04601 2.7414,-12.18704 -0.94031,-1.81834 -5.38402,-5.55103 -11.3385,-9.52425 C 90.63271,28.79344 75.52789,13.17198 65.51156,-3.49363 52.86332,-24.53834 47.48665,-50.65959 53.01268,-64.21645 l 1.73238,-4.25 h 5.3323 5.3323 l 6.51665,-13.55164 c 6.83006,-14.20338 13.56611,-25.14772 19.0695,-30.98301 6.01768,-6.3806 14.57463,-3.85134 14.49572,4.28465 -0.0284,2.92751 -1.12665,5.17565 -5.00729,10.25 -10.71364,14.00923 -23.00022,42.81661 -26.01821,61.00287 -1.08874,6.56075 -1.04299,7.89367 0.36434,10.61515 2.26988,4.38947 7.75541,6.84801 12.08856,5.41794 5.17371,-1.70747 7.09412,-4.73297 9.54398,-15.03596 8.99531,-37.83023 31.51903,-69.03107 60.2589,-83.47326 9.49545,-4.7716 16.73749,-6.25128 23.77967,-4.85863 4.94818,0.97855 5.12393,1.2205 8.22607,11.32402 l 2.30035,7.49213 10.5,1.20525 c 14.22153,1.63242 28.17112,4.95122 32.18749,7.65786 2.90067,1.95476 3.31251,2.7734 3.31251,6.58454 0,3.5844 -0.48558,4.71479 -2.75234,6.40717 -2.45548,1.83328 -3.26442,1.93647 -7.5,0.95674 -19.34072,-4.47373 -25.14321,-5.40074 -37.31869,-5.96211 -14.6482,-0.67538 -31.43301,0.84159 -36.11827,3.26427 -5.56601,2.87811 -7.65137,10.32908 -4.25,15.18523 3.19138,4.55633 6.50361,5.37336 16.6811,4.11473 18.38314,-2.2734 44.923,0.61323 61.99187,6.74258 15.71894,5.6446 30.03563,14.61422 39.5225,24.76145 5.0466,5.39788 10.30391,13.99254 9.1503,14.95892 -0.22356,0.18728 -4.15421,2.72362 -8.73478,5.63633 -7.07247,4.49726 -8.23478,5.61302 -7.70799,7.39931 2.15808,7.31785 5.62811,24.46535 6.49657,32.10347 2.44906,21.53926 0.59445,28.38693 -7.71027,28.4682 -3.63316,0.0356 -6.93522,-2.63184 -7.66626,-6.19276 -0.25693,-1.25149 -0.69563,-7.90044 -0.97489,-14.77544 -0.79437,-19.55623 -6.57283,-41.0094 -16.22102,-60.22232 -3.27824,-6.52814 -5.17469,-9.13322 -7.53875,-10.35572 -6.25868,-3.23649 -14.16939,0.43807 -15.43197,7.1682 -0.48414,2.5807 0.35151,5.37559 3.96291,13.25415 14.27186,31.1352 17.92955,61.98052 10.55979,89.050715 -4.4814,16.46087 -12.46078,28.825945 -21.27131,32.962655 -7.65179,3.59267 -7.96943,3.56243 -13.97556,-1.33012 -3.05692,-2.49016 -5.81361,-4.527565 -6.12597,-4.527565 -0.31235,0 -4.7302,2.879695 -9.81744,6.399315 -9.21201,6.37335 -24.24644,14.45344 -31.9513,17.17188 -5.94722,2.0983 -9.51623,1.80172 -12.34368,-1.02574 z M 13.0279,-32.17187 c -23.19505,-14.85412 -24.84672,-16.14116 -27.59732,-21.50474 -2.47052,-4.81742 -2.40133,-6.04379 0.53809,-9.53708 3.5764,-4.25032 8.51523,-5.26517 28.15035,-5.78448 l 17.64169,-0.46658 -0.62259,2.24915 c -3.0893,11.16013 -2.62141,24.56557 1.40718,40.31721 1.09193,4.2694 1.87221,7.85533 1.73396,7.96874 -0.13825,0.11341 -9.70136,-5.84559 -21.25136,-13.24222 z m 278.94762,-6.38081 c -4.69715,-7.73233 -14.90294,-17.9677 -24.34324,-24.41377 l -7.32253,-5 24.35908,-0.29688 c 29.73553,-0.3624 32.18735,-0.0748 36.54879,4.2866 3.60685,3.60685 4.07457,6.15073 1.8956,10.30994 -2.51816,4.80666 -11.17833,11.57667 -26.25661,20.5259 -0.73587,0.43675 -2.55042,-1.57509 -4.88109,-5.41179 z M 123.5302,-126.18221 c 0.50718,-1.53133 5.00887,-16.73424 10.00376,-33.78424 9.55163,-32.6044 11.62863,-37.40442 17.36982,-40.1422 3.01384,-1.4372 3.57539,-1.43436 6.41193,0.0325 5.78038,2.98915 7.83889,7.20076 14.67556,30.02548 3.59514,12.00267 6.53663,22.15588 6.53663,22.56268 0,0.40681 -3.71988,0.97173 -8.26641,1.25538 -12.08816,0.75415 -25.64255,6.62816 -39.73359,17.21918 -8.05581,6.05486 -8.06683,6.05931 -6.9977,2.83125 z"
             style="display:inline;fill:#0168a4;fill-opacity:1"
             id="path4725" />
        </g>
      </g>
      <g
         aria-label="CLASSICS"
         id="g1025"
         style="font-size:25.4px;line-height:1.25;font-family:'Patrick Hand SC';-inkscape-font-specification:'Patrick Hand SC, Normal';stroke-width:0.264583"
         transform="matrix(0.15140804,0,0,0.15140804,512.80519,-142.81342)">
        <path
           d="m 30.901226,138.04781 v -2.1084 h -2.108398 v -14.8208 h 2.108398 v -2.1208 h 8.470801 v 2.1208 h 2.1208 v 4.2292 h -4.241601 v -4.2292 h -4.229199 v 14.8208 h 4.229199 v -4.2416 h 4.241601 v 4.2416 h -2.1208 v 2.1084 z"
           style="font-family:'BIG SHOT';-inkscape-font-specification:'BIG SHOT, Normal'"
           id="path1009" />
        <path
           d="m 45.722027,138.04781 v -19.05 h 4.229199 v 16.9416 h 8.470801 v 2.1084 z"
           style="font-family:'BIG SHOT';-inkscape-font-specification:'BIG SHOT, Normal'"
           id="path1011" />
        <path
           d="m 71.109624,129.58941 v -8.4708 h -4.229199 v 8.4708 z m -8.458398,8.4584 v -16.9292 h 2.108398 v -2.1208 h 8.470801 v 2.1208 h 2.120801 v 16.9292 h -4.241602 v -6.35 h -4.229199 v 6.35 z"
           style="font-family:'BIG SHOT';-inkscape-font-specification:'BIG SHOT, Normal'"
           id="path1013" />
        <path
           d="m 81.688824,138.04781 v -2.1084 h -2.108399 v -4.2416 h 4.229199 v 4.2416 h 4.2292 v -6.35 h -6.35 v -2.1208 h -2.108399 v -6.35 h 2.108399 v -2.1208 h 8.4708 v 2.1208 h 2.120801 v 4.2292 h -4.241601 v -4.2292 h -4.2292 v 6.35 h 6.35 v 2.1208 h 2.120801 v 6.35 h -2.120801 v 2.1084 z"
           style="font-family:'BIG SHOT';-inkscape-font-specification:'BIG SHOT, Normal'"
           id="path1015" />
        <path
           d="m 98.618023,138.04781 v -2.1084 h -2.108399 v -4.2416 h 4.229196 v 4.2416 h 4.2292 v -6.35 h -6.349997 v -2.1208 h -2.108399 v -6.35 h 2.108399 v -2.1208 h 8.470797 v 2.1208 h 2.1208 v 4.2292 h -4.2416 v -4.2292 h -4.2292 v 6.35 h 6.35 v 2.1208 h 2.1208 v 6.35 h -2.1208 v 2.1084 z"
           style="font-family:'BIG SHOT';-inkscape-font-specification:'BIG SHOT, Normal'"
           id="path1017" />
        <path
           d="m 113.43882,138.04781 v -2.1084 h 4.2292 v -14.8208 h -4.2292 v -2.1208 h 12.7 v 2.1208 h -4.2416 v 14.8208 h 4.2416 v 2.1084 z"
           style="font-family:'BIG SHOT';-inkscape-font-specification:'BIG SHOT, Normal'"
           id="path1019" />
        <path
           d="m 132.47642,138.04781 v -2.1084 h -2.1084 v -14.8208 h 2.1084 v -2.1208 h 8.4708 v 2.1208 h 2.1208 v 4.2292 h -4.2416 v -4.2292 h -4.2292 v 14.8208 h 4.2292 v -4.2416 h 4.2416 v 4.2416 h -2.1208 v 2.1084 z"
           style="font-family:'BIG SHOT';-inkscape-font-specification:'BIG SHOT, Normal'"
           id="path1021" />
        <path
           d="m 149.40562,138.04781 v -2.1084 h -2.1084 v -4.2416 h 4.2292 v 4.2416 h 4.2292 v -6.35 h -6.35 v -2.1208 h -2.1084 v -6.35 h 2.1084 v -2.1208 h 8.4708 v 2.1208 h 2.1208 v 4.2292 h -4.2416 v -4.2292 h -4.2292 v 6.35 h 6.35 v 2.1208 h 2.1208 v 6.35 h -2.1208 v 2.1084 z"
           style="font-family:'BIG SHOT';-inkscape-font-specification:'BIG SHOT, Normal'"
           id="path1023" />
      </g>
    </g>
  </g>
</svg>
