<?xml version="1.0" encoding="UTF-8" standalone="no"?>
<!-- Created with Inkscape (http://www.inkscape.org/) -->

<svg
   version="1.1"
   id="svg2"
   width="40.531979"
   height="375.84714"
   viewBox="0 0 40.531979 375.84713"
   sodipodi:docname="bande icon 3.svg"
   inkscape:version="1.1 (c68e22c387, 2021-05-23)"
   xmlns:inkscape="http://www.inkscape.org/namespaces/inkscape"
   xmlns:sodipodi="http://sodipodi.sourceforge.net/DTD/sodipodi-0.dtd"
   xmlns="http://www.w3.org/2000/svg"
   xmlns:svg="http://www.w3.org/2000/svg">
  <defs
     id="defs6" />
  <sodipodi:namedview
     id="namedview4"
     pagecolor="#ffffff"
     bordercolor="#666666"
     borderopacity="1.0"
     inkscape:pageshadow="2"
     inkscape:pageopacity="0.0"
     inkscape:pagecheckerboard="true"
     showgrid="false"
     inkscape:showpageshadow="false"
     inkscape:snap-global="false"
     inkscape:zoom="1"
     inkscape:cx="22.5"
     inkscape:cy="358"
     inkscape:window-width="1920"
     inkscape:window-height="1138"
     inkscape:window-x="-8"
     inkscape:window-y="-8"
     inkscape:window-maximized="1"
     inkscape:current-layer="g8"
     fit-margin-top="0"
     fit-margin-left="0"
     fit-margin-right="0"
     fit-margin-bottom="0" />
  <g
     inkscape:groupmode="layer"
     inkscape:label="Image"
     id="g8"
     style="display:inline"
     transform="translate(0.66989908,0.97450994)">
    <g
       id="g4006">
      <g
         id="g835"
         transform="matrix(0.33632083,0,0,0.33632083,-0.43500028,-0.97288914)">
        <path
           d="m 3.728,34.07791 a 22.221,22.221 0 0 1 7.723,-7.39923 2.33318,2.33318 0 0 1 -2.28626,-2.53345 c 0.064,-1.322 0.00879,-2.6496 0.01416,-3.97473 a 2.20394,2.20394 0 0 1 2.39441,-2.38135 c 1.97229,-0.0063 3.94446,-0.0016 5.91687,-0.0017 l 0.57446,6e-5 v -0.51745 c 0,-2.00305 -0.0032,-4.00617 0.0012,-6.00922 a 2.19248,2.19248 0 0 1 2.327,-2.3565 q 2.126,-0.0218 4.25269,8.5e-4 a 2.20035,2.20035 0 0 1 2.30151,2.3418 c 0.0044,2.15625 0.0011,4.3125 0.0011,6.54046 H 27.458 q 2.95826,9e-5 5.91675,0.001 a 2.22973,2.22973 0 0 1 2.45925,2.45982 q 0.0026,1.73319 -0.001,3.46637 7.0829,-9e-5 14.16578,0.0015 7.22167,0 14.44335,0.005 a 4.53246,4.53246 0 0 1 -0.28491,-1.43781 4.44534,4.44534 0 1 1 8.89026,-0.08642 4.27006,4.27006 0 0 1 -0.27222,1.51581 c 1.422,-0.0021 2.84388,-1.9e-4 4.26575,-0.0043 a 24.43076,24.43076 0 0 1 5.43457,0.58307 4.43215,4.43215 0 1 1 8.35279,-2.0484 4.463,4.463 0 0 1 -2.83155,4.11347 c 0.551,0.30023 1.09571,0.62066 1.63013,0.97619 A 22.57279,22.57279 0 0 1 96.28917,34.024 21.28491,21.28491 0 0 0 99.4254,18.74411 21.6454,21.6454 0 0 0 89.62694,3.62442 22.05435,22.05435 0 0 0 77.041,9e-5 c -9.01391,0.02618 -18.02807,0.00769 -27.04223,0.00769 -9.01416,0 -18.02808,0.00397 -27.04224,-0.00287 A 23.76151,23.76151 0 0 0 16.697,0.77579 22.15935,22.15935 0 0 0 3.728,34.07791 Z m 73.77478,-25.17 a 4.43918,4.43918 0 1 1 -4.44738,4.40728 4.43945,4.43945 0 0 1 4.44739,-4.40726 z"
           fill="#ffffff"
           opacity="0.5"
           id="path4" />
        <path
           d="m 3.75414,61.8887 a 22.21753,22.21753 0 0 1 7.82959,-7.43433 2.3456,2.3456 0 0 1 -2.41895,-2.54095 c 0.064,-1.322 0.00879,-2.6496 0.01416,-3.97467 a 2.204,2.204 0 0 1 2.39441,-2.38141 c 1.97229,-0.0064 3.94446,-0.0017 5.91687,-0.0017 h 0.57446 V 45.0383 c 0,-2.00311 -0.0032,-4.00617 0.0012,-6.00928 a 2.19252,2.19252 0 0 1 2.327,-2.35651 q 2.126,-0.02169 4.25269,9.2e-4 a 2.2003,2.2003 0 0 1 2.30151,2.34174 c 0.0044,2.15625 0.0011,4.3125 0.0011,6.54052 h 0.5098 q 2.95826,0 5.91675,0.001 a 2.22973,2.22973 0 0 1 2.45925,2.45982 q 0.0027,1.77383 -10e-4,3.54773 7.0829,-9e-5 14.16578,0.0015 7.23522,0 14.47021,0.005 a 4.53476,4.53476 0 0 1 -0.31177,-1.51911 4.44534,4.44534 0 1 1 8.89026,-0.08642 4.28035,4.28035 0 0 1 -0.29675,1.59717 c 1.43017,-0.0021 2.86023,-1.9e-4 4.29028,-0.0043 a 24.40109,24.40109 0 0 1 5.48548,0.59534 4.43211,4.43211 0 1 1 8.30188,-2.14209 4.45839,4.45839 0 0 1 -2.93079,4.14453 c 0.58472,0.31464 1.16321,0.64984 1.72937,1.02655 A 22.59223,22.59223 0 0 1 96.26415,61.83 21.28643,21.28643 0 0 0 99.4254,46.51236 21.64528,21.64528 0 0 0 89.62694,31.39267 22.05328,22.05328 0 0 0 77.041,27.76834 c -9.01391,0.02612 -18.02807,0.0077 -27.04223,0.0077 -9.01416,0 -18.02808,0.004 -27.04224,-0.0029 A 23.759,23.759 0 0 0 16.697,28.544 22.16152,22.16152 0 0 0 3.75414,61.8887 Z M 77.50279,36.67618 a 4.43918,4.43918 0 1 1 -4.44738,4.40728 4.43937,4.43937 0 0 1 4.44738,-4.40728 z"
           fill="#ffffff"
           opacity="0.75"
           id="path6" />
        <path
           d="M 89.62695,59.16088 A 22.05365,22.05365 0 0 0 77.041,55.53656 c -9.014,0.02615 -18.02813,0.0077 -27.0423,0.0077 -9.01417,0 -18.02813,0.0039 -27.04223,-0.0029 a 23.76183,23.76183 0 0 0 -6.25946,0.77087 22.22481,22.22481 0 0 0 9.07757,43.436 21.87438,21.87438 0 0 0 14.2429,-8.31442 0.78189,0.78189 0 0 1 0.68518,-0.34752 q 9.29148,0.01446 18.58287,0.0014 a 0.756,0.756 0 0 1 0.66182,0.30681 c 5.31461,6.48709 12.15124,9.37977 20.4822,8.36769 A 22.189,22.189 0 0 0 99.42542,74.28059 21.64555,21.64555 0 0 0 89.62695,59.16088 Z M 35.8329,79.85253 a 2.2179,2.2179 0 0 1 -2.3789,2.35784 q -2.98134,0.0033 -5.963,5.5e-4 h -0.54262 v 0.53765 q 0,2.95839 -5.1e-4,5.91679 a 2.22967,2.22967 0 0 1 -2.44728,2.42786 c -1.38674,0.0011 -2.77348,0.0052 -4.16022,-0.0013 a 2.18873,2.18873 0 0 1 -2.273,-2.271 c -0.0089,-2.01843 -0.0025,-4.03693 -0.0027,-6.05543 v -0.55452 c -2.16593,0 -4.26225,-0.0527 -6.35441,0.01881 a 2.36184,2.36184 0 0 1 -2.54545,-2.548 c 0.064,-1.322 0.00876,-2.64961 0.01417,-3.9747 a 2.204,2.204 0 0 1 2.3944,-2.3814 c 1.97223,-0.0064 3.94453,-0.0016 5.91683,-0.0017 h 0.57446 v -0.51742 c 7e-5,-2.00309 -0.0031,-4.00618 0.0012,-6.00927 A 2.19254,2.19254 0 0 1 20.393,64.44077 q 2.12613,-0.02175 4.25269,8.8e-4 a 2.20031,2.20031 0 0 1 2.30149,2.34177 c 0.0044,2.15626 0.0012,4.31251 0.0012,6.54049 h 0.5096 q 2.95845,6e-5 5.91676,0.001 a 2.22961,2.22961 0 0 1 2.45926,2.45984 c 0.002,1.35591 0.005,2.71186 -0.0011,4.06778 z m 32.90253,2.35634 a 4.44108,4.44108 0 1 1 4.31207,-4.47546 4.45264,4.45264 0 0 1 -4.31207,4.47546 z m 8.76876,8.88384 a 4.43919,4.43919 0 1 1 4.43426,-4.44238 4.42636,4.42636 0 0 1 -4.43426,4.44238 z M 77.45393,73.32256 a 4.4392,4.4392 0 1 1 4.48481,-4.4442 4.44512,4.44512 0 0 1 -4.48481,4.4442 z m 8.92543,8.88788 a 4.44076,4.44076 0 1 1 4.449,-4.43094 4.44253,4.44253 0 0 1 -4.449,4.43094 z"
           fill="#ffffff"
           id="path8" />
      </g>
      <g
         id="g835-2"
         transform="matrix(0.35228389,0,0,0.35228389,-1.5507826,94.122932)">
        <path
           d="M 100,88.66989 V 51.086 A 14.16765,14.16765 0 0 0 85.83231,36.91869 L 69.91709,55.41957 v 4.15611 l -0.84673,-0.0029 -35.7683,0.01952 a 6.2255,6.2255 0 1 0 3.5e-4,12.451 h 35.58872 c 0,0 1.39927,-0.05587 1.46033,-0.0582 a 5.423,5.423 0 0 0 3.83973,-1.7289 L 86.40151,56.92789 A 1.04291,1.04291 0 0 1 87.93937,58.337 L 75.72923,71.66514 a 7.27648,7.27648 0 0 1 -5.36094,2.35827 c -0.01773,0 -0.45067,0.0032 -0.45067,0.0032 v 14.64326"
           fill="#ffffff"
           id="path4-8" />
        <circle
           cx="67.488274"
           cy="26.934681"
           r="15.60833"
           fill="#ffffff"
           id="circle6" />
        <path
           d="m 3.8281,45.153 11.20353,32.70531 a 2.67545,2.67545 0 0 0 2.43454,1.77869 h 39.87014 a 2.51136,2.51136 0 1 0 0,-5.02271 h -38.106 L 8.58081,43.526 A 2.51175,2.51175 0 0 0 3.8281,45.153 Z"
           fill="#ffffff"
           id="path8-2" />
      </g>
      <g
         id="g835-7"
         transform="matrix(0.35526992,0,0,0.35526992,-0.6555603,46.510816)">
        <path
           d="M 9.13477,48.861 A 6.66955,6.66955 0 0 1 7.99962,47.59742 C 6.14321,44.006 4.251,40.42868 2.54414,36.76576 1.44114,34.39866 2.28705,32.25276 3.93904,30.40012 5.39292,28.76959 5.4099,28.78473 4.53055,26.42035 2.97739,26.91735 1.33804,27.582 0.02773,25.42994 A 13.59476,13.59476 0 0 1 2.0004,24.36946 c 1.58708,-0.5507 2.30454,-1.41409 1.94092,-3.23058 A 12.71934,12.71934 0 0 1 4.05913,17.48451 9.58239,9.58239 0 0 1 9.46205,9.59977 C 15.24376,6.64834 21.10983,3.84234 27.05665,1.24066 31.5519,-0.726 35.64387,0.76952 38.97661,3.964 c 1.62441,1.557 2.88938,1.7846 4.64231,0.59992 a 8.72643,8.72643 0 0 1 1.63891,-0.67067 c 0.8516,2.2524 -0.65152,3.21758 -2.14306,4.18279 0.72633,1.59442 1.64644,2.33376 3.51279,2.1241 3.0947,-0.34762 5.03995,0.92606 6.33943,3.802 q 2.72043,6.02073 5.321,12.09535 c 1.24991,2.92657 1.0095,3.48213 -1.82626,4.849 -1.9514,0.94064 -3.91567,1.85474 -5.8793,2.76974 a 4.579,4.579 0 0 1 -0.78705,0.18133 c -0.66257,-0.852 -1.35771,-1.74575 -2.131,-2.74014 L 19.55981,44.52635 c 0.25349,1.0659 0.51268,2.15586 0.86236,3.62624 -2.13472,0.9 -4.29336,1.8102 -6.452,2.72034 Q 11.55246,49.867 9.13477,48.861 Z M 39.43713,9.71788 C 38.14866,8.35816 36.94006,6.94529 35.58765,5.687 A 6.50906,6.50906 0 0 0 28.1447,4.35342 Q 19.54931,8.19957 11.13278,12.44057 A 5.92914,5.92914 0 0 0 7.55371,17.75594 C 7.54776,20.01922 7.88512,22.2834 8.07447,24.58644 12.99789,23.59013 35.23056,13.02658 39.43713,9.71788 Z M 41.97475,24.15852 17.6381,35.73506 c 1.40855,2.36678 3.24806,2.97477 5.88822,1.81333 2.83558,-1.24739 5.60715,-2.64052 8.40468,-3.97409 2.66749,-1.27154 5.35923,-2.49583 7.99074,-3.83805 2.46226,-1.25585 3.10671,-3.07487 2.05301,-5.57773 z m 4.14109,-5.78209 a 2.20508,2.20508 0 0 0 1.71727,-2.528 2.60568,2.60568 0 0 0 -2.21269,-2.31552 2.19515,2.19515 0 0 0 -2.78631,1.44562 7.813,7.813 0 0 1 -3.18177,3.977 c -0.35332,0.26689 -0.56523,1.409 -0.35907,1.58578 a 2.11046,2.11046 0 0 0 1.78582,0.46883 c 1.7305,-0.76049 3.36574,-1.73784 5.03675,-2.63371 z M 10.58727,35.26148 c 1.81111,-0.76175 3.65618,-1.45574 5.40835,-2.33485 a 1.758,1.758 0 0 0 0.68357,-1.55792 1.67962,1.67962 0 0 0 -1.46937,-0.74488 8.465,8.465 0 0 1 -5.1167,-0.06433 2.12514,2.12514 0 0 0 -2.76628,1.09376 2.56767,2.56767 0 0 0 0.21779,3.20851 2.18682,2.18682 0 0 0 3.04264,0.39971 z M 49.811,21.80008 a 2.61674,2.61674 0 0 0 -1.316,3.43834 2.78361,2.78361 0 0 0 3.3295,1.23582 2.55343,2.55343 0 0 0 1.24871,-3.43481 A 2.52448,2.52448 0 0 0 49.811,21.80008 Z M 11.12164,40.19561 a 2.49826,2.49826 0 0 0 -1.16392,3.4632 2.51626,2.51626 0 1 0 4.46177,-2.32555 2.44189,2.44189 0 0 0 -3.29785,-1.13765 z"
           fill="#ffffff"
           id="path4-5" />
        <path
           d="M 76.55424,33.0853 A 23.44593,23.44593 0 1 0 100,56.532 23.4722,23.4722 0 0 0 76.55424,33.0853 Z M 61.49857,72.26917 A 21.72886,21.72886 0 0 1 54.758,56.532 c 0,-0.13051 0.0073,-0.25776 0.0097,-0.38578 l 6.071,2.09041 4.24786,10.95014 z M 66.46885,40.10726 77.4921,36.14126 85.38332,43.5028 78.899,52.7866 66.83613,50.49412 Z M 91.11211,72.73554 Q 90.4282,73.35179 89.6945,73.9083 l -9.062,3.87141 -5.9358,-6.18644 7.7047,-8.6712 10.29275,1.26626 z m 2.903,-29.23677 A 21.68091,21.68091 0 0 1 98.352,56.53185 c 0,0.13051 -0.0081,0.26025 -0.01042,0.38983 l -1.22829,-0.31081 -3.707,-10.45437 z"
           fill="#ffffff"
           id="path6-7" />
        <path
           d="m 30.96223,97.42013 2.39689,-3.5759 c 1.54219,-2.30077 3.31712,-3.81261 3.96623,-3.37752 0.64753,0.434 1.02734,1.85681 1.55569,2.98732 a 4.134,4.134 0 0 0 1.45172,1.69275 4.21875,4.21875 0 1 0 4.69785,-7.00867 4.12877,4.12877 0 0 0 -2.11752,-0.69945 C 41.6664,87.37983 40.20797,87.56999 39.55871,87.13479 38.9096,86.6997 39.6338,84.48311 41.17578,82.18265 L 44.22267,77.637 a 5.01423,5.01423 0 0 0 -1.37334,-6.95659 l -4.06068,-2.72183 c -2.29967,-1.54145 -3.86431,-3.24 -3.49366,-3.793 0.37065,-0.553 1.74066,-0.85407 2.87133,-1.38231 A 4.128,4.128 0 0 0 39.85907,61.33155 4.219221,4.219221 0 0 0 32.84961,56.63317 4.1299,4.1299 0 0 0 32.15,58.75066 c -0.05914,1.24648 0.184,2.62862 -0.18678,3.18174 -0.37078,0.55312 -2.53648,-0.249 -4.836,-1.79035 L 23.06639,57.42011 A 5.01442,5.01442 0 0 0 16.11,58.79355 l -2.722,4.06084 c -1.54219,2.30077 -2.25031,4.52768 -1.582,4.97562 0.6678,0.44762 2.14289,0.26794 3.38811,0.32624 a 4.13355,4.13355 0 0 1 2.11883,0.70056 4.21875,4.21875 0 0 1 -4.69785,7.00867 4.143,4.143 0 0 1 -1.45314,-1.6937 c -0.52725,-1.12977 -0.92219,-2.56291 -1.5892,-3.01 -0.66827,-0.44794 -2.45907,1.05326 -4.00126,3.354 L 2.84963,78.5765 a 5.0138,5.0138 0 0 0 1.37318,6.9565 l 4.06084,2.72195 c 2.29951,1.54134 4.47572,2.32749 4.85932,1.7552 0.38307,-0.5715 0.15127,-1.96882 0.20878,-3.21457 a 4.136,4.136 0 0 1 0.70056,-2.11883 4.219221,4.219221 0 0 1 7.00946,4.69838 4.13948,4.13948 0 0 1 -1.6937,1.45313 c -1.12966,0.52709 -2.51115,0.84328 -2.89412,1.41462 -0.38412,0.57307 1.1702,2.28633 3.47034,3.82809 l 4.06071,2.72181 a 5.01413,5.01413 0 0 0 6.95723,-1.37265 z"
           fill="#ffffff"
           id="path8-0" />
      </g>
      <g
         id="g832"
         transform="matrix(0.36128758,0,0,0.36128758,-1.7804477,144.14364)">
        <path
           d="m 17,38 h 6 v -6 h -6 z m 24,-6 h 6 v -6 h -6 z m 12,0 h 6 v -6 h -6 z m 12,0 h 6 V 26 H 65 Z M 41,20 h 6 v -6 h -6 z m 12,0 h 6 v -6 h -6 z m 12,0 h 6 V 14 H 65 Z M 41,56 h 6 v -6 h -6 z m 12,0 h 6 v -6 h -6 z m 12,0 h 6 V 50 H 65 Z M 41,68 h 6 v -6 h -6 z m 24,0 h 6 V 62 H 65 Z M 41,80 h 6 v -6 h -6 z m 24,0 h 6 v -6 h -6 z m 18,-6 h 6 v -6 h -6 z m 0,-18 v 6 h 6 v -6 z m 0,30 h 6 V 80 H 83 Z M 41,44 h 6 v -6 h -6 z m 12,0 h 6 v -6 h -6 z m 12,0 h 6 v -6 h -6 z m -48,6 h 6 v -6 h -6 z m 0,12 h 6 v -6 h -6 z m 0,12 h 6 v -6 h -6 z m 0,12 h 6 V 80 H 17 Z M 53,68 h 6 v -6 h -6 z"
           fill="#ffffff"
           id="path4-59" />
        <path
           d="m 95,92 a 5.99643,5.99643 0 0 1 -6,6 H 11 A 5.99643,5.99643 0 0 1 5,92 V 26 a 5.99643,5.99643 0 0 1 6,-6 H 29 V 8 a 5.99643,5.99643 0 0 1 6,-6 h 42 a 5.99643,5.99643 0 0 1 6,6 v 36 h 6 a 5.99643,5.99643 0 0 1 6,6 z M 29,26 H 11 V 92 H 29 Z M 77,8 H 35 V 92 H 53 V 74 h 6 v 18 h 18 z m 12,42 h -6 v 42 h 6 z"
           fill="#ffffff"
           fill-rule="evenodd"
           id="path6-8" />
      </g>
      <g
         id="g862"
         transform="matrix(0.37892451,0,0,0.37892451,-0.83797249,191.55912)">
        <path
           d="M 96.65359,19.52046 A 5.80569,5.80569 0 0 0 91.12526,15.361 h -5.87492 v 9.11794 a 8.81257,8.81257 0 0 1 -17.62513,0 V 15.361 H 32.34557 v 9.11794 a 8.81256,8.81256 0 1 1 -17.62512,0 V 15.361 H 8.87492 A 5.80022,5.80022 0 0 0 3.34659,19.52051 H 3 V 91.12508 A 5.8771,5.8771 0 0 0 8.87492,97 H 91.12508 A 5.8771,5.8771 0 0 0 97,91.12508 V 19.52046 Z M 91.12508,91.12508 H 8.87492 V 44.125 h 82.25016 z"
           fill="#ffffff"
           id="path4-1" />
        <path
           d="m 23.5332,27.41653 a 2.93849,2.93849 0 0 0 2.93745,-2.93746 V 5.93746 a 2.93746,2.93746 0 1 0 -5.87491,0 v 18.54161 a 2.93849,2.93849 0 0 0 2.93746,2.93746 z"
           fill="#ffffff"
           id="path6-6" />
        <path
           d="m 76.4376,27.41653 a 2.94229,2.94229 0 0 0 2.93746,-2.93746 V 5.93746 a 2.93746,2.93746 0 1 0 -5.87492,0 v 18.54161 a 2.94229,2.94229 0 0 0 2.93746,2.93746 z"
           fill="#ffffff"
           id="path8-26" />
        <polygon
           points="34.692,52.968 34.692,59.154 21.97,59.154 21.97,52.968 "
           fill="#ffffff"
           id="polygon10" />
        <polygon
           points="56.809,52.968 56.809,59.154 44.204,59.154 44.204,52.968 "
           fill="#ffffff"
           id="polygon12" />
        <polygon
           points="78.808,52.968 78.808,59.154 66.321,59.154 66.321,52.968 "
           fill="#ffffff"
           id="polygon14" />
        <polygon
           points="34.692,65.69 34.692,71.767 21.97,71.767 21.97,65.69 "
           fill="#ffffff"
           id="polygon16" />
        <polygon
           points="56.809,65.69 56.809,71.767 44.204,71.767 44.204,65.69 "
           fill="#ffffff"
           id="polygon18" />
        <polygon
           points="78.808,65.69 78.808,71.767 66.321,71.767 66.321,65.69 "
           fill="#ffffff"
           id="polygon20" />
        <polygon
           points="34.692,78.061 34.692,84.48 21.97,84.48 21.97,78.061 "
           fill="#ffffff"
           id="polygon22" />
        <polygon
           points="56.809,78.061 56.809,84.48 44.204,84.48 44.204,78.061 "
           fill="#ffffff"
           id="polygon24" />
        <polygon
           points="78.808,78.061 78.808,84.48 66.321,84.48 66.321,78.061 "
           fill="#ffffff"
           id="polygon26" />
      </g>
      <g
         id="g835-4"
         transform="matrix(0.3997662,0,0,0.3997662,-0.1145418,239.91195)">
        <path
           d="m 3.58311,49.66427 h 2.688 v 2.68692 L 2.68747,60.8625 H 0 v -2.688 z M 6.71894,60.8625 V 49.66427 l 2.68747,-2.688 0.89564,0.89564 V 61.75814 L 9.40641,62.65378 H 8.51077 Z m 0,15.67753 V 65.3418 l 1.79183,-1.79238 h 0.89564 l 0.89564,0.98532 v 13.79657 l -0.89564,0.89564 z"
           fill="#ffffff"
           id="path4-2" />
        <path
           d="M 24.81281,77.21149 V 56.38321 l 1.344,-1.344 h 1.34346 l 2.68747,2.68692 v 16.79734 l -4.03093,4.032 z m 3.35947,-49.048 h 24.8603 l 1.34346,1.344 -4.03148,4.03093 H 30.85975 L 26.82828,29.50749 Z M 30.85975,75.196 h 19.48481 l 4.03144,4.031 -1.34346,1.344 H 28.17228 l -1.344,-1.344 z M 30.59128,51.67971 h 9.00342 l 0.67145,2.68692 -0.67145,2.688 h -8.735 l -2.68747,-2.688 z m 11.01888,0 h 8.7344 l 2.688,2.68692 -2.688,2.688 h -8.7344 l -0.672,-2.688 z m 9.40641,-0.67255 V 34.20984 l 4.03143,-4.03093 1.344,1.344 v 20.82828 l -1.344,1.344 h -1.344 z"
           fill="#ffffff"
           id="path6-9" />
        <path
           d="m 67.0773,19.429 h 29.00332 l 1.56764,1.5671 -4.70293,4.70348 H 70.21259 L 65.50966,20.9961 Z m 3.13529,54.87134 h 22.73274 l 4.70293,4.70239 -1.56764,1.56827 H 67.0773 L 65.50966,79.00281 Z M 69.89928,46.86467 H 80.40309 L 81.18719,50 80.40309,53.13529 H 70.21259 L 67.0773,50 Z m 12.85555,0 h 10.1905 L 96.08062,50 92.94533,53.13529 H 82.75483 L 81.97074,50 Z M 93.72888,46.08058 V 26.48371 L 98.43236,21.78023 100,23.34842 v 24.29929 l -1.56764,1.56819 h -1.56765 z m 0,27.43567 V 53.91938 l 3.13583,-3.13528 h 1.56765 L 100,52.50867 v 24.14291 l -1.56764,1.56819 z"
           fill="#ffffff"
           id="path8-6" />
      </g>
      <g
         id="g20"
         style="fill:#ffffff"
         transform="matrix(0.64578439,0,0,0.64578439,-12.006644,278.88515)">
        <path
           d="m 45.2,18.577 c -15.243,0 -27.645,12.404 -27.645,27.646 0,15.244 12.401,27.646 27.645,27.646 15.244,0 27.645,-12.402 27.645,-27.646 0,-15.242 -12.401,-27.646 -27.645,-27.646 z m 0,51.893 c -13.368,0 -24.244,-10.875 -24.244,-24.246 0,-13.369 10.876,-24.246 24.244,-24.246 13.369,0 24.245,10.877 24.245,24.246 0,13.371 -10.876,24.246 -24.245,24.246 z"
           id="path2"
           style="fill:#ffffff" />
        <polygon
           points="46.985,44.524 46.985,26.272 43.585,26.272 43.585,47.925 54.485,47.925 54.485,44.524 "
           id="polygon4"
           style="fill:#ffffff" />
        <rect
           height="4.4239998"
           width="3.4000001"
           x="43.584999"
           y="61.720001"
           id="rect6"
           style="fill:#ffffff" />
        <rect
           height="3.4000001"
           width="4.3600001"
           x="25.229"
           y="44.523998"
           id="rect8"
           style="fill:#ffffff" />
        <rect
           height="3.4000001"
           width="4.3600001"
           x="60.813"
           y="44.523998"
           id="rect10"
           style="fill:#ffffff" />
        <rect
           height="3.402"
           transform="matrix(0.7378,0.6751,-0.6751,0.7378,31.4782,-12.701)"
           width="4.3600001"
           x="29.907"
           y="32.465"
           id="rect12"
           style="fill:#ffffff" />
        <rect
           height="3.401"
           transform="rotate(-137.56135,58.352125,58.17456)"
           width="4.3559999"
           x="56.174"
           y="56.473999"
           id="rect14"
           style="fill:#ffffff" />
        <rect
           height="4.3610001"
           transform="matrix(-0.7377,-0.6751,0.6751,-0.7377,17.6811,125.4726)"
           width="3.3989999"
           x="31.514"
           y="57.120998"
           id="rect16"
           style="fill:#ffffff" />
        <rect
           height="4.3600001"
           transform="matrix(0.7377,0.6751,-0.6751,0.7377,37.3121,-29.9663)"
           width="3.3989999"
           x="55.522999"
           y="30.858"
           id="rect18"
           style="fill:#ffffff" />
      </g>
      <path
         id="path1033"
         style="display:inline;fill:#f9f9f9;fill-opacity:1;fill-rule:evenodd;stroke:#ffffff;stroke-width:0.0419986;stroke-linecap:round;stroke-linejoin:round;paint-order:stroke fill markers"
         inkscape:transform-center-x="-0.015759552"
         inkscape:transform-center-y="-1.9211643"
         d="m 30.495264,374.85164 -12.176341,-8.36913 -11.6592515,8.30917 4.1968285,-14.1666 -11.50540383,-8.52092 14.77012483,-0.38631 4.54852,-13.57538 4.931609,13.92783 14.316544,0.13087 -11.722214,8.99419 z"
         inkscape:export-filename="C:\Users\BUCH\Desktop\Retrogaming\Recalbox\travail thèmes\Thème vignette !!!!!!!\favorites\path1033.png"
         inkscape:export-xdpi="297.57767"
         inkscape:export-ydpi="297.57767" />
    </g>
  </g>
</svg>
