<?xml version="1.0" encoding="UTF-8" standalone="no"?>
<svg
   id="Calque_1"
   data-name="Calque 1"
   width="81.453629"
   height="24.074287"
   viewBox="0 0 81.453632 24.074287"
   version="1.1"
   sodipodi:docname="zmachine.svg"
   inkscape:version="1.1 (c68e22c387, 2021-05-23)"
   xmlns:inkscape="http://www.inkscape.org/namespaces/inkscape"
   xmlns:sodipodi="http://sodipodi.sourceforge.net/DTD/sodipodi-0.dtd"
   xmlns="http://www.w3.org/2000/svg"
   xmlns:svg="http://www.w3.org/2000/svg">
  <defs
     id="defs34" />
  <sodipodi:namedview
     id="namedview32"
     pagecolor="#ffffff"
     bordercolor="#666666"
     borderopacity="1.0"
     inkscape:pageshadow="2"
     inkscape:pageopacity="0.0"
     inkscape:pagecheckerboard="true"
     showgrid="false"
     fit-margin-top="0"
     fit-margin-left="0"
     fit-margin-right="0"
     fit-margin-bottom="0"
     inkscape:zoom="8.9204137"
     inkscape:cx="30.435808"
     inkscape:cy="19.281617"
     inkscape:window-width="1920"
     inkscape:window-height="1138"
     inkscape:window-x="-8"
     inkscape:window-y="-8"
     inkscape:window-maximized="1"
     inkscape:current-layer="Calque_1"
     inkscape:snap-global="true" />
  <rect
     style="fill:#ffffff;fill-rule:evenodd;stroke:#ffffff;stroke-width:3.71105;stroke-linecap:round;stroke-linejoin:round;stroke-miterlimit:4;stroke-dasharray:none;paint-order:stroke fill markers"
     id="rect1054"
     width="38.336067"
     height="14.254464"
     x="35.922226"
     y="4.6762052"
     inkscape:export-filename="C:\Users\BUCH\Desktop\Retrogaming\Recalbox\travail thèmes\BlueBox\zmachine\rect1054.png"
     inkscape:export-xdpi="572.47418"
     inkscape:export-ydpi="572.47418" />
  <path
     id="path2"
     style="stroke:#ffffff;stroke-width:3.13841;stroke-linecap:round;stroke-linejoin:round;stroke-miterlimit:4;stroke-dasharray:none;paint-order:stroke fill markers"
     d="m 5.9282394,1.5691395 -4.0014755,5.649142 c 0,0 3.1823989,-1.6383983 3.8163581,-2.1122986 A 13.096594,13.096594 0 0 0 9.7286604,6.5053962 33.863468,33.863468 0 0 0 14.22603,7.0080324 L 10.470355,11.219757 H 5.8148398 c -0.3998965,0 -0.721467,0.321571 -0.721467,0.721467 v 0.577419 c 0,0.399896 0.3215705,0.72208 0.721467,0.72208 h 2.8533806 l -7.0994316,7.961882 c 0,0 1.5847019,-0.65865 7.6449759,-0.435822 5.5612663,0.203996 7.0491683,1.738385 7.0491683,1.738385 l 4.048674,-5.630139 c 0,0 -2.652302,1.311758 -3.96102,1.93944 a 15.892919,15.892919 0 0 0 -3.452253,-1.255364 c -1.939539,-0.527254 -4.9270617,-0.527156 -4.9270617,-0.527156 0,0 1.9926382,-2.236776 3.3786967,-3.791226 h 5.854487 c 0.399897,0 0.721467,-0.322184 0.721467,-0.72208 v -0.577419 c 0,-0.399896 -0.32157,-0.721467 -0.721467,-0.721467 H 13.151491 C 16.390481,7.5797494 19.847678,3.6789478 20.543923,2.8208265 18.601246,3.2194049 17.054009,3.3388607 12.540972,3.257262 8.0279351,3.1756633 5.9282394,1.5691395 5.9282394,1.5691395 Z m 29.4226126,1.358957 a 1.0168456,1.0168456 0 0 0 -0.941523,1.0696346 v 4.249729 a 1.0168456,1.0168456 0 0 0 0.941523,1.0702475 1.0168456,1.0168456 0 0 0 0.941524,-1.0702475 V 3.9977311 A 1.0168456,1.0168456 0 0 0 35.350852,2.9280965 Z m 2.281481,0 a 0.86620177,0.86620177 0 0 0 -0.562095,0.2065712 0.91641636,0.91641636 0 0 0 -0.414368,0.7533417 0.85992494,0.85992494 0 0 0 0.02514,0.2010545 v 4.1583962 a 0.96035413,0.96035413 0 1 0 1.905113,0 V 4.8454702 h 2.451273 v 3.4019899 a 0.96035413,0.96035413 0 1 0 1.905113,0 v -4.249729 a 1.0137071,1.0137071 0 0 0 -0.941524,-1.0696346 0.69672751,0.69672751 0 0 0 -0.116466,0 h -4.154724 a 0.4895923,0.4895923 0 0 0 -0.09746,0 z m 6.618862,0 a 1.0137071,1.0137071 0 0 0 -0.941524,1.0696346 v 4.249729 a 0.96035413,0.96035413 0 1 0 1.905113,0 V 7.2556729 h 3.273267 A 1.0168456,1.0168456 0 0 0 49.548492,6.3141492 1.0168456,1.0168456 0 0 0 48.478856,5.3726256 H 45.204977 V 4.8454702 h 3.273879 A 1.0168456,1.0168456 0 0 0 49.548492,3.8880094 1.0168456,1.0168456 0 0 0 48.478856,2.9464856 h -4.117939 z m 7.871163,0 a 2.3192866,2.3192866 0 0 0 -2.325614,2.3219348 v 1.654409 a 2.3192866,2.3192866 0 0 0 2.325614,2.3219348 h 1.691798 A 2.3192866,2.3192866 0 0 0 56.139158,6.9044403 V 5.2500313 A 2.3192866,2.3192866 0 0 0 53.814156,2.9280965 Z m 6.672189,0 a 2.3161482,2.3161482 0 0 0 -2.322548,2.3219348 v 1.654409 a 2.3192866,2.3192866 0 0 0 2.22815,2.3219348 h 2.95023 A 1.0168456,1.0168456 0 0 0 62.720628,8.2848515 1.0168456,1.0168456 0 0 0 61.650379,7.3433278 h -2.95023 A 0.62768244,0.62768244 0 0 1 58.336046,6.7818461 V 5.4510859 a 0.62768244,0.62768244 0 0 1 0.49957,-0.6056157 h 2.824571 A 1.0168456,1.0168456 0 0 0 62.729824,3.8880094 1.0168456,1.0168456 0 0 0 61.660187,2.9464856 h -2.231826 z m 6.436811,0 A 2.3161482,2.3161482 0 0 0 62.90881,5.2500313 v 1.654409 a 2.3161482,2.3161482 0 0 0 2.322548,2.3219348 h 1.694865 A 2.3161482,2.3161482 0 0 0 69.24877,6.9044403 V 5.2500313 A 2.3161482,2.3161482 0 0 0 66.926223,2.9280965 Z m 5.34143,0.00613 a 1.0168456,1.0168456 0 0 0 -1.070249,0.9415237 0.57432943,0.57432943 0 0 0 0,0.1035921 1.0670601,1.0670601 0 0 0 0,0.1409834 v 4.0768712 a 0.96035413,0.96035413 0 1 0 1.911246,0 V 4.8454702 h 0.470762 v 3.3517263 a 0.96035413,0.96035413 0 1 0 1.911855,0 V 4.8454702 h 0.22251 l 1.277431,3.8316828 a 0.96349255,0.96349255 0 1 0 1.813783,-0.6056157 l -1.289693,-3.866622 c -0.04394,-0.1223981 -0.066,-0.19772 -0.100527,-0.3138412 A 1.0984443,1.0984443 0 0 0 74.649661,2.9495505 Z M 52.241272,4.9018634 h 1.349765 A 0.62768244,0.62768244 0 0 1 54.21872,5.5295459 V 6.8511115 A 0.62768244,0.62768244 0 0 1 53.591037,7.4787939 H 52.241272 A 0.62768244,0.62768244 0 0 1 51.61359,6.8511115 V 5.5172863 a 0.62768244,0.62768244 0 0 1 0.627682,-0.6154229 z m 13.112678,0 h 1.336892 a 0.62768244,0.62768244 0 0 1 0.627682,0.6276825 V 6.8511115 A 0.62768244,0.62768244 0 0 1 66.690842,7.4787939 H 65.35395 A 0.62768244,0.62768244 0 0 1 64.726268,6.8511115 V 5.5172863 A 0.62768244,0.62768244 0 0 1 65.35395,4.9018634 Z M 47.314825,10.818261 c -1.700078,-0.01837 -3.270276,1.356063 -3.757514,3.226067 -0.872479,2.768079 0.01896,7.343369 3.499452,7.475183 1.785756,-0.03139 2.733754,-1.025893 3.339468,-2.839896 l -0.442567,-0.260512 c -0.389163,1.610005 -2.043031,2.949764 -3.612237,1.923503 -1.286749,-0.913278 -1.678928,-2.626581 -1.678928,-4.195787 0.0031,-1.242811 0.185189,-2.498372 0.731272,-3.496388 0.546087,-0.998015 1.816971,-1.613143 2.805571,-0.941523 0.872479,0.621405 1.195415,1.964719 1.399412,2.978426 h 0.483636 l -0.05333,-3.6435 H 49.5583 l -0.245189,0.489764 C 48.665224,11.04636 47.980074,10.825447 47.314825,10.818261 Z m -8.185616,0.08398 c -0.778327,2.441684 -1.942605,6.142142 -2.749177,8.593242 -0.191443,0.693589 -0.656051,1.20515 -1.381024,1.255365 v 0.0049 c -0.500181,-0.07193 -1.025897,-0.330521 -0.953782,-0.921295 v -7.369141 a 1.3306868,1.3306868 0 0 1 0.06865,-0.4395 c 0.128675,-0.386025 0.728159,-0.407675 1.070249,-0.457889 v -0.511831 h -2.73324 c -0.01569,0.797157 -2.077678,6.763719 -2.325612,7.670721 L 27.72733,11.056092 h -2.855833 v 0.508766 a 1.2553649,1.2553649 0 0 1 1.227168,0.863063 c 0.17889,0.313841 0.05313,5.473391 0.08766,5.962983 -0.0063,1.346379 0.04727,2.290894 -1.368151,2.359939 v 0.511831 h 3.379922 v -0.511831 c -0.599436,-0.09415 -1.283316,-0.31367 -1.346084,-1.079442 -0.185166,-0.815987 -0.05674,-6.471479 -0.0944,-7.450664 h 0.07846 l 2.720979,8.891146 h 0.294839 l 2.85951,-8.709094 h 0.08766 v 7.41879 a 0.98859984,0.98859984 0 0 1 -0.08766,0.446243 c -0.153782,0.439378 -0.822533,0.464191 -1.217973,0.483021 v 0.52409 h 3.700505 v -0.01226 h 2.943488 v -0.511831 c -0.586883,-0.03138 -1.415348,-0.219689 -1.179968,-0.941524 a 16.831305,16.831305 0 0 1 0.549223,-2.081037 h 2.940422 c 0.0408,0.194582 0.794432,2.473093 0.741079,2.614322 -0.100429,0.342087 -0.677944,0.354886 -1.070245,0.408239 v 0.52409 h 3.483515 v -0.52409 a 1.3306868,1.3306868 0 0 1 -1.004047,-0.577419 1.7732029,1.7732029 0 0 1 -0.201056,-0.454825 l -2.793309,-8.816363 z m 11.471141,0.153856 v 0.51183 c 0.530392,0.05335 1.186345,0.342038 1.123577,0.969721 v 7.366074 c 0.05021,0.743804 -0.546109,0.822019 -1.123577,0.847126 v 0.52409 h 3.477386 v -0.511831 c -0.332672,-0.02824 -0.91367,-0.147382 -1.029792,-0.502023 -0.134951,-0.116121 -0.04355,-3.734539 -0.06865,-3.982473 h 3.929144 c -0.03452,0.260488 0.08481,3.935569 -0.08153,4.079936 -0.141229,0.373471 -0.725143,0.351502 -1.038984,0.392301 v 0.52409 h 3.483515 l 0.53696,0.01287 v -0.01287 h 3.772224 0.226189 3.43325 v -0.511831 c -0.618267,-0.103567 -1.337259,-0.313473 -1.400027,-1.113768 -0.182028,-0.837956 -0.0562,-5.652477 -0.09072,-6.6348 l 5.074788,8.370121 H 71.339 c 0.02825,-0.903863 -0.07579,-8.078273 0.07172,-8.787554 0.02824,-0.784603 0.693542,-0.938165 1.283563,-1.029179 h 0.04413 c 0.367194,-0.0063 1.023489,0.163198 1.161579,0.549223 a 1.2553649,1.2553649 0 0 1 0.06559,0.420498 v 7.334199 c 0.06277,0.762634 -0.605958,0.835063 -1.192841,0.879001 v 0.52409 h 6.954768 L 79.88443,18.26525 h -0.420497 c -0.853648,2.488761 -0.944612,2.535788 -3.55891,2.382006 -0.681035,-0.09101 -0.681013,-0.677946 -0.681013,-1.305629 v -3.063016 c 1.616282,-0.05021 2.134243,-0.05938 2.322547,1.742064 h 0.442567 v -4.005154 h -0.442567 c -0.207135,1.748096 -0.753341,1.71681 -2.322547,1.669734 V 11.63719 a 21.997131,21.997131 0 0 1 2.331743,0.05639 c 0.561776,0.09729 1.151797,1.305383 1.255365,1.838913 h 0.442566 V 11.05609 h -6.477268 -0.038 -3.446124 v 0.511831 c 0.593159,0.103567 1.321393,0.260512 1.381023,1.045115 0.185167,0.841095 0.05987,5.253506 0.0944,6.232691 L 66.060097,11.05609 h -2.394875 -3.856817 -4.011283 v 0.511831 c 0.351502,0.05335 0.891334,0.178889 1.045116,0.549222 0.150644,0.172612 0.04715,3.238522 0.0754,3.517841 h -3.93834 c 0.02511,-0.27618 -0.0663,-3.430285 0.06865,-3.609174 0.122398,-0.373471 0.693982,-0.410813 1.029792,-0.457889 V 11.05609 Z m 9.208051,0.511217 c 0.426601,0.03332 1.036618,0.192822 1.19223,0.536963 a 1.1580741,1.1580741 0 0 1 0.0662,0.420498 v 7.391206 c 0.06905,0.778326 -0.674981,0.834867 -1.324629,0.834867 v 0.02513 H 59.27144 c -0.536672,-0.03766 -1.17698,-0.29501 -1.095381,-0.941523 v -7.36914 a 1.4154239,1.4154239 0 0 1 0.0662,-0.4395 c 0.122398,-0.376609 0.696505,-0.407675 1.02918,-0.457889 h 0.26051 0.27645 z m 3.772224,6.28e-4 h 0.05333 a 1.4373928,1.4373928 0 0 1 1.44661,1.08925 c 0.182028,0.229104 0.06301,5.290873 0.0944,5.695728 -0.02197,1.440531 0.07233,2.325759 -1.496875,2.397943 v 0.01226 h -0.09746 c -0.373471,-0.0408 -1.004436,-0.109329 -1.170772,-0.492215 a 0.99801508,0.99801508 0 0 1 -0.08459,-0.420512 V 12.45306 c -0.08787,-0.728111 0.706143,-0.856885 1.255365,-0.88513 z m -24.605274,1.563077 1.255365,3.966536 h -2.51073 z m -17.929405,3.665552 v 1.129706 h 3.517842 v -1.129706 z"
     inkscape:export-filename="C:\Users\BUCH\Desktop\Retrogaming\Recalbox\travail thèmes\BlueBox\zmachine\rect1054.png"
     inkscape:export-xdpi="572.47418"
     inkscape:export-ydpi="572.47418" />
  <path
     id="path825"
     style="stroke:none;stroke-width:3.13841;stroke-linecap:round;stroke-linejoin:round;stroke-miterlimit:4;stroke-dasharray:none;paint-order:stroke fill markers"
     d="m 5.928239,1.5691394 -4.0014755,5.649142 c 0,0 3.1823989,-1.638399 3.8163581,-2.112299 a 13.096594,13.096594 0 0 0 3.9855389,1.399413 33.863468,33.863468 0 0 0 4.4973695,0.502637 L 10.470355,11.219757 H 5.8148394 c -0.3998965,0 -0.721467,0.321571 -0.721467,0.721467 v 0.577419 c 0,0.399896 0.3215705,0.72208 0.721467,0.72208 H 8.66822 l -7.0994316,7.961881 c 0,0 1.5847019,-0.65865 7.6449759,-0.435822 5.5612667,0.203996 7.0491687,1.738385 7.0491687,1.738385 l 4.048674,-5.630139 c 0,0 -2.652302,1.311758 -3.96102,1.93944 A 15.892919,15.892919 0 0 0 12.898334,17.559104 C 10.958795,17.03185 7.9712719,17.031948 7.9712719,17.031948 c 0,0 1.9926386,-2.236775 3.3786971,-3.791225 h 5.854487 c 0.399897,0 0.721467,-0.322184 0.721467,-0.72208 v -0.577419 c 0,-0.399896 -0.32157,-0.721468 -0.721467,-0.721468 h -4.052965 c 3.23899,-3.6400066 6.696187,-7.5408086 7.392432,-8.3989296 -1.942677,0.398578 -3.489914,0.518034 -8.002951,0.436435 -4.5130373,-0.0816 -6.612733,-1.688122 -6.612733,-1.688122 z m 29.422613,1.358957 a 1.0168456,1.0168456 0 0 0 -0.941523,1.069634 v 4.249729 a 1.0168456,1.0168456 0 0 0 0.941523,1.070248 1.0168456,1.0168456 0 0 0 0.941524,-1.070248 v -4.249729 a 1.0168456,1.0168456 0 0 0 -0.941524,-1.069634 z m 2.281481,0 a 0.86620177,0.86620177 0 0 0 -0.562095,0.206571 0.91641636,0.91641636 0 0 0 -0.414368,0.753342 0.85992494,0.85992494 0 0 0 0.02514,0.201054 v 4.158396 a 0.96035413,0.96035413 0 1 0 1.905113,0 v -3.40199 h 2.451273 v 3.40199 a 0.96035413,0.96035413 0 1 0 1.905113,0 v -4.249729 a 1.0137071,1.0137071 0 0 0 -0.941524,-1.069634 0.69672751,0.69672751 0 0 0 -0.116466,0 h -4.154724 a 0.4895923,0.4895923 0 0 0 -0.09746,0 z m 6.618862,0 a 1.0137071,1.0137071 0 0 0 -0.941524,1.069634 v 4.249729 a 0.96035413,0.96035413 0 1 0 1.905113,0 v -0.991787 h 3.273267 a 1.0168456,1.0168456 0 0 0 1.060441,-0.941524 1.0168456,1.0168456 0 0 0 -1.069636,-0.941523 h -3.273879 v -0.527156 h 3.273879 a 1.0168456,1.0168456 0 0 0 1.069636,-0.95746 1.0168456,1.0168456 0 0 0 -1.069636,-0.941524 h -4.117939 z m 7.871163,0 a 2.3192866,2.3192866 0 0 0 -2.325614,2.321935 v 1.654409 a 2.3192866,2.3192866 0 0 0 2.325614,2.321934 h 1.691798 a 2.3192866,2.3192866 0 0 0 2.325002,-2.321934 v -1.654409 a 2.3192866,2.3192866 0 0 0 -2.325002,-2.321935 z m 6.672189,0 a 2.3161482,2.3161482 0 0 0 -2.322548,2.321935 v 1.654409 a 2.3192866,2.3192866 0 0 0 2.22815,2.321934 h 2.95023 a 1.0168456,1.0168456 0 0 0 1.070249,-0.941523 1.0168456,1.0168456 0 0 0 -1.070249,-0.941524 h -2.95023 a 0.62768244,0.62768244 0 0 1 -0.364103,-0.561482 v -1.33076 a 0.62768244,0.62768244 0 0 1 0.49957,-0.605616 h 2.824571 a 1.0168456,1.0168456 0 0 0 1.069637,-0.95746 1.0168456,1.0168456 0 0 0 -1.069637,-0.941524 h -2.231826 z m 6.436811,0 a 2.3161482,2.3161482 0 0 0 -2.322548,2.321935 v 1.654409 a 2.3161482,2.3161482 0 0 0 2.322548,2.321934 h 1.694865 a 2.3161482,2.3161482 0 0 0 2.322547,-2.321934 v -1.654409 a 2.3161482,2.3161482 0 0 0 -2.322547,-2.321935 z m 5.34143,0.0061 a 1.0168456,1.0168456 0 0 0 -1.070249,0.941523 0.57432943,0.57432943 0 0 0 0,0.103593 1.0670601,1.0670601 0 0 0 0,0.140983 v 4.076871 a 0.96035413,0.96035413 0 1 0 1.911246,0 v -3.351727 h 0.470762 v 3.351727 a 0.96035413,0.96035413 0 1 0 1.911855,0 v -3.351727 h 0.22251 l 1.277431,3.831683 a 0.96349255,0.96349255 0 1 0 1.813783,-0.605615 l -1.289693,-3.866622 c -0.04394,-0.122399 -0.066,-0.19772 -0.100527,-0.313842 a 1.0984443,1.0984443 0 0 0 -1.070245,-0.941523 z m -18.331516,1.967637 h 1.349765 a 0.62768244,0.62768244 0 0 1 0.627683,0.627682 v 1.321566 a 0.62768244,0.62768244 0 0 1 -0.627683,0.627682 H 52.241272 A 0.62768244,0.62768244 0 0 1 51.61359,6.8510814 v -1.333825 a 0.62768244,0.62768244 0 0 1 0.627682,-0.615423 z m 13.112678,0 h 1.336892 a 0.62768244,0.62768244 0 0 1 0.627682,0.627682 v 1.321566 a 0.62768244,0.62768244 0 0 1 -0.627682,0.627682 H 65.35395 A 0.62768244,0.62768244 0 0 1 64.726268,6.8510814 V 5.5172564 A 0.62768244,0.62768244 0 0 1 65.35395,4.9018334 Z M 47.314825,10.81823 c -1.700078,-0.01837 -3.270276,1.356064 -3.757514,3.226068 -0.872479,2.768078 0.01896,7.343368 3.499452,7.475182 1.785756,-0.03139 2.733754,-1.025893 3.339468,-2.839896 l -0.442567,-0.260512 c -0.389163,1.610005 -2.043031,2.949764 -3.612237,1.923503 -1.286749,-0.913278 -1.678928,-2.626581 -1.678928,-4.195787 0.0031,-1.24281 0.185189,-2.498371 0.731272,-3.496387 0.546087,-0.998016 1.816971,-1.613144 2.805571,-0.941523 0.872479,0.621404 1.195415,1.964719 1.399412,2.978425 h 0.483636 l -0.05333,-3.6435 H 49.5583 l -0.245189,0.489765 C 48.665224,11.046329 47.980074,10.825416 47.314825,10.81823 Z m -8.185616,0.08398 c -0.778327,2.441685 -1.942605,6.142143 -2.749177,8.593242 -0.191443,0.693589 -0.656051,1.20515 -1.381024,1.255365 v 0.0049 c -0.500181,-0.07193 -1.025897,-0.330521 -0.953782,-0.921294 v -7.369141 a 1.3306868,1.3306868 0 0 1 0.06865,-0.4395 c 0.128675,-0.386025 0.728159,-0.407675 1.070249,-0.457889 v -0.511832 h -2.73324 c -0.01569,0.797158 -2.077678,6.763719 -2.325612,7.670721 L 27.72733,11.056061 h -2.855833 v 0.508767 a 1.2553649,1.2553649 0 0 1 1.227168,0.863063 c 0.17889,0.313841 0.05313,5.473391 0.08766,5.962983 -0.0063,1.346379 0.04727,2.290893 -1.368151,2.359938 v 0.511831 h 3.379922 v -0.511831 c -0.599436,-0.09415 -1.283316,-0.31367 -1.346084,-1.079441 -0.185166,-0.815987 -0.05674,-6.471479 -0.0944,-7.450664 h 0.07846 l 2.720979,8.891145 h 0.294839 l 2.85951,-8.709093 h 0.08766 v 7.41879 a 0.98859984,0.98859984 0 0 1 -0.08766,0.446242 c -0.153782,0.439378 -0.822533,0.464191 -1.217973,0.483021 v 0.52409 h 3.700505 v -0.01226 h 2.943488 v -0.511831 c -0.586883,-0.03138 -1.415348,-0.219689 -1.179968,-0.941524 a 16.831305,16.831305 0 0 1 0.549223,-2.081036 h 2.940422 c 0.0408,0.194582 0.794432,2.473092 0.741079,2.614321 -0.100429,0.342087 -0.677944,0.354886 -1.070245,0.408239 v 0.52409 h 3.483515 v -0.52409 a 1.3306868,1.3306868 0 0 1 -1.004047,-0.577419 1.7732029,1.7732029 0 0 1 -0.201056,-0.454824 l -2.793309,-8.816364 z m 11.471141,0.153856 v 0.511831 c 0.530392,0.05335 1.186345,0.342038 1.123577,0.969721 v 7.366073 c 0.05021,0.743804 -0.546109,0.822019 -1.123577,0.847126 v 0.52409 h 3.477386 v -0.511831 c -0.332672,-0.02824 -0.91367,-0.147382 -1.029792,-0.502023 -0.134951,-0.116121 -0.04355,-3.734539 -0.06865,-3.982473 h 3.929144 c -0.03452,0.260488 0.08481,3.935569 -0.08153,4.079936 -0.141229,0.373471 -0.725143,0.351502 -1.038984,0.392301 v 0.52409 h 3.483515 l 0.53696,0.01287 v -0.01287 h 3.772224 0.226189 3.43325 v -0.511831 c -0.618267,-0.103567 -1.337259,-0.313473 -1.400027,-1.113768 -0.182028,-0.837956 -0.0562,-5.652477 -0.09072,-6.634799 l 5.074788,8.37012 H 71.339 c 0.02825,-0.903863 -0.07579,-8.078272 0.07172,-8.787554 0.02824,-0.784603 0.693542,-0.938165 1.283563,-1.029178 h 0.04413 c 0.367194,-0.0063 1.023489,0.163197 1.161579,0.549222 a 1.2553649,1.2553649 0 0 1 0.06559,0.420499 v 7.334199 c 0.06277,0.762633 -0.605958,0.835062 -1.192841,0.879 v 0.52409 h 6.954768 l 0.156921,-3.009688 h -0.420497 c -0.853648,2.488761 -0.944612,2.535788 -3.55891,2.382006 -0.681035,-0.09101 -0.681013,-0.677946 -0.681013,-1.305628 V 16.27858 c 1.616282,-0.05021 2.134243,-0.05938 2.322547,1.742064 h 0.442567 V 14.01549 h -0.442567 c -0.207135,1.748096 -0.753341,1.71681 -2.322547,1.669735 v -4.048066 a 21.997131,21.997131 0 0 1 2.331743,0.05639 c 0.561776,0.09729 1.151797,1.305382 1.255365,1.838912 h 0.442566 v -2.476403 h -6.477268 -0.038 -3.446124 v 0.511831 c 0.593159,0.103567 1.321393,0.260512 1.381023,1.045116 0.185167,0.841094 0.05987,5.253506 0.0944,6.23269 l -4.707618,-7.789607 h -2.394875 -3.856817 -4.011283 v 0.511832 c 0.351502,0.05335 0.891334,0.178888 1.045116,0.549222 0.150644,0.172612 0.04715,3.238522 0.0754,3.517841 h -3.93834 c 0.02511,-0.27618 -0.0663,-3.430285 0.06865,-3.609174 0.122398,-0.373471 0.693982,-0.410813 1.029792,-0.457889 v -0.511832 z m 9.208051,0.511218 c 0.426601,0.03332 1.036618,0.192822 1.19223,0.536963 a 1.1580741,1.1580741 0 0 1 0.0662,0.420498 v 7.391205 c 0.06905,0.778326 -0.674981,0.834867 -1.324629,0.834867 v 0.02513 H 59.27144 c -0.536672,-0.03766 -1.17698,-0.29501 -1.095381,-0.941523 v -7.369139 a 1.4154239,1.4154239 0 0 1 0.0662,-0.4395 c 0.122398,-0.376609 0.696505,-0.407675 1.02918,-0.457889 h 0.26051 0.27645 z m 3.772224,6.28e-4 h 0.05333 a 1.4373928,1.4373928 0 0 1 1.44661,1.08925 c 0.182028,0.229104 0.06301,5.290873 0.0944,5.695727 -0.02197,1.440531 0.07233,2.325759 -1.496875,2.397943 v 0.01226 h -0.09746 c -0.373471,-0.0408 -1.004436,-0.109329 -1.170772,-0.492215 a 0.99801508,0.99801508 0 0 1 -0.08459,-0.420511 V 12.45303 c -0.08787,-0.728112 0.706143,-0.856886 1.255365,-0.885131 z m -24.605274,1.563077 1.255365,3.966536 h -2.51073 z M 21.045946,16.79654 v 1.129707 h 3.517842 V 16.79654 Z"
     inkscape:export-filename="C:\Users\BUCH\Desktop\Retrogaming\Recalbox\travail thèmes\BlueBox\zmachine\rect1054.png"
     inkscape:export-xdpi="572.47418"
     inkscape:export-ydpi="572.47418" />
</svg>
