<?xml version="1.0" encoding="UTF-8" standalone="no"?>
<!-- Created with Inkscape (http://www.inkscape.org/) -->

<svg
   version="1.1"
   width="38.045071"
   height="17.248806"
   id="svg4426"
   sodipodi:docname="auto-arcade-taito.svg"
   inkscape:version="1.1 (c68e22c387, 2021-05-23)"
   inkscape:export-filename="C:\Users\BUCH\Desktop\Retrogaming\Recalbox\travail thèmes\Metal Slide\auto-arcade-taito\Taito_logo.png"
   inkscape:export-xdpi="1278.4634"
   inkscape:export-ydpi="1278.4634"
   xmlns:inkscape="http://www.inkscape.org/namespaces/inkscape"
   xmlns:sodipodi="http://sodipodi.sourceforge.net/DTD/sodipodi-0.dtd"
   xmlns="http://www.w3.org/2000/svg"
   xmlns:svg="http://www.w3.org/2000/svg"
   xmlns:rdf="http://www.w3.org/1999/02/22-rdf-syntax-ns#"
   xmlns:cc="http://creativecommons.org/ns#"
   xmlns:dc="http://purl.org/dc/elements/1.1/">
  <sodipodi:namedview
     id="namedview16"
     pagecolor="#ffffff"
     bordercolor="#666666"
     borderopacity="1.0"
     inkscape:pageshadow="2"
     inkscape:pageopacity="0.0"
     inkscape:pagecheckerboard="true"
     showgrid="false"
     fit-margin-top="0"
     fit-margin-left="0"
     fit-margin-right="0"
     fit-margin-bottom="0"
     inkscape:zoom="16.87038"
     inkscape:cx="18.286488"
     inkscape:cy="11.380894"
     inkscape:window-width="1920"
     inkscape:window-height="1138"
     inkscape:window-x="-8"
     inkscape:window-y="-8"
     inkscape:window-maximized="1"
     inkscape:current-layer="svg4426"
     inkscape:snap-global="false"
     inkscape:showpageshadow="false" />
  <defs
     id="defs4428" />
  <metadata
     id="metadata4431">
    <rdf:RDF>
      <cc:Work
         rdf:about="">
        <dc:format>image/svg+xml</dc:format>
        <dc:type
           rdf:resource="http://purl.org/dc/dcmitype/StillImage" />
      </cc:Work>
    </rdf:RDF>
  </metadata>
  <g
     id="g1170"
     transform="translate(0.24999948,0.25)">
    <ellipse
       style="fill:#ffffff;fill-rule:evenodd;stroke:#ffffff;stroke-width:1.99718;stroke-linecap:round;stroke-linejoin:round;stroke-miterlimit:4;stroke-dasharray:none;paint-order:fill markers stroke"
       id="ellipse1124"
       cx="10.862233"
       cy="8.9950542"
       rx="1.0999269"
       ry="1.7519573" />
    <ellipse
       style="fill:#ffffff;fill-rule:evenodd;stroke:#ffffff;stroke-width:1.58807;stroke-linecap:round;stroke-linejoin:round;stroke-miterlimit:4;stroke-dasharray:none;paint-order:fill markers stroke"
       id="path920"
       cx="3.600986"
       cy="13.514811"
       rx="1.3044835"
       ry="0.9340117" />
    <rect
       style="fill:#ffffff;fill-rule:evenodd;stroke:none;stroke-width:4.49786;stroke-linecap:round;stroke-linejoin:round;stroke-miterlimit:4;stroke-dasharray:none;paint-order:fill markers stroke"
       id="rect1024"
       width="13.040607"
       height="5.5126204"
       x="6.1942887"
       y="10.165746" />
    <rect
       style="fill:#ffffff;fill-rule:evenodd;stroke:none;stroke-width:3.99136;stroke-linecap:round;stroke-linejoin:round;stroke-miterlimit:4;stroke-dasharray:none;paint-order:fill markers stroke"
       id="rect1126"
       width="13.840827"
       height="4.0900087"
       x="22.643236"
       y="11.529081" />
    <g
       id="g1360"
       transform="translate(-1.1247653,-2.9667204)"
       style="stroke:#ffffff;stroke-width:1.5;stroke-linecap:round;stroke-linejoin:round;stroke-miterlimit:4;stroke-dasharray:none">
      <g
         id="g1340"
         style="stroke:#ffffff;stroke-width:1.5;stroke-linecap:round;stroke-linejoin:round;stroke-miterlimit:4;stroke-dasharray:none">
        <path
           d="M 10.068081,5.1711389 H 2.2174574 v 1.5310709 h 2.983237 V 13.021763 H 7.0848441 V 6.7022098 h 2.9832369 z"
           id="path971"
           style="fill:#4f4c4d;fill-opacity:1;fill-rule:nonzero;stroke:#ffffff;stroke-width:1.5;stroke-linecap:round;stroke-linejoin:round;stroke-miterlimit:4;stroke-dasharray:none" />
        <path
           d="m 28.156673,5.1711389 h -7.851022 v 1.5310709 h 2.983237 v 6.3195532 h 1.884548 V 6.7022098 h 2.983237 z"
           id="path973"
           style="fill:#4f4c4d;fill-opacity:1;fill-rule:nonzero;stroke:#ffffff;stroke-width:1.5;stroke-linecap:round;stroke-linejoin:round;stroke-miterlimit:4;stroke-dasharray:none" />
        <path
           d="M 17.825811,13.021922 H 19.70996 V 5.1712983 h -1.884149 z"
           id="path975"
           style="fill:#4f4c4d;fill-opacity:1;fill-rule:nonzero;stroke:#ffffff;stroke-width:1.5;stroke-linecap:round;stroke-linejoin:round;stroke-miterlimit:4;stroke-dasharray:none" />
        <path
           d="m 12.619494,13.021826 v 0 h 5.103702 L 14.325112,6.77002 c -1.264469,1.7446716 -1.924001,3.938463 -1.705618,6.251806"
           id="path977"
           style="fill:#127bca;fill-opacity:1;fill-rule:nonzero;stroke:#ffffff;stroke-width:1.5;stroke-linecap:round;stroke-linejoin:round;stroke-miterlimit:4;stroke-dasharray:none" />
        <path
           d="m 7.9093971,13.021826 h 2.6688139 c 0.28852,-2.746124 1.54462,-5.1511246 3.390513,-6.907353 L 12.816236,3.9936091 Z"
           id="path979"
           style="fill:#127bca;fill-opacity:1;fill-rule:nonzero;stroke:#ffffff;stroke-width:1.5;stroke-linecap:round;stroke-linejoin:round;stroke-miterlimit:4;stroke-dasharray:none" />
        <path
           d="m 18.767978,3.4667204 c -0.363878,0 -0.658844,0.294966 -0.658844,0.6586584 0,0.3636924 0.294966,0.6586585 0.658844,0.6586585 0.363693,0 0.658659,-0.2949661 0.658659,-0.6586585 0,-0.3636924 -0.294966,-0.6586584 -0.658659,-0.6586584"
           id="path981"
           style="fill:#127bca;fill-opacity:1;fill-rule:nonzero;stroke:#ffffff;stroke-width:1.5;stroke-linecap:round;stroke-linejoin:round;stroke-miterlimit:4;stroke-dasharray:none" />
        <path
           d="M 16.674241,4.5111127 16.549508,4.2827671 c -0.944067,0.4841882 -1.813215,1.1014784 -2.580743,1.8315465 l 0.356267,0.6559455 c 0.640005,-0.8822985 1.43503,-1.6498264 2.349209,-2.2591464"
           id="path983"
           style="fill:#127bca;fill-opacity:1;fill-rule:nonzero;stroke:#ffffff;stroke-width:1.5;stroke-linecap:round;stroke-linejoin:round;stroke-miterlimit:4;stroke-dasharray:none" />
        <path
           d="m 32.86677,11.799456 c -1.500385,0 -2.715439,-1.080357 -2.715439,-2.7142432 0,-1.6338862 1.215054,-2.713845 2.715439,-2.713845 1.500386,0 2.715439,1.0799588 2.715439,2.713845 0,1.6338862 -1.215053,2.7142432 -2.715439,2.7142432 m 0,-6.8798558 c -2.699498,0 -4.710374,1.6757295 -4.710374,4.1656126 0,2.4898832 2.010876,4.1656122 4.710374,4.1656122 2.699897,0 4.710374,-1.675729 4.710374,-4.1656122 0,-2.4898831 -2.010477,-4.1656126 -4.710374,-4.1656126"
           id="path985"
           style="fill:#4f4c4d;fill-opacity:1;fill-rule:nonzero;stroke:#ffffff;stroke-width:1.5;stroke-linecap:round;stroke-linejoin:round;stroke-miterlimit:4;stroke-dasharray:none" />
      </g>
      <g
         aria-label="CLASSICS"
         id="g1005"
         style="font-size:25.4px;line-height:1.25;font-family:'Patrick Hand SC';-inkscape-font-specification:'Patrick Hand SC, Normal';stroke:#ffffff;stroke-width:5.38531;stroke-linecap:round;stroke-linejoin:round;stroke-miterlimit:4;stroke-dasharray:none"
         transform="matrix(0.27853542,0,0,0.27853542,-6.3950568,-19.235678)">
        <path
           d="m 30.901226,138.04781 v -2.1084 h -2.108398 v -14.8208 h 2.108398 v -2.1208 h 8.470801 v 2.1208 h 2.1208 v 4.2292 h -4.241601 v -4.2292 h -4.229199 v 14.8208 h 4.229199 v -4.2416 h 4.241601 v 4.2416 h -2.1208 v 2.1084 z"
           style="font-family:'BIG SHOT';-inkscape-font-specification:'BIG SHOT, Normal';stroke:#ffffff;stroke-width:5.38531;stroke-linecap:round;stroke-linejoin:round;stroke-miterlimit:4;stroke-dasharray:none"
           id="path989" />
        <path
           d="m 45.722027,138.04781 v -19.05 h 4.229199 v 16.9416 h 8.470801 v 2.1084 z"
           style="font-family:'BIG SHOT';-inkscape-font-specification:'BIG SHOT, Normal';stroke:#ffffff;stroke-width:5.38531;stroke-linecap:round;stroke-linejoin:round;stroke-miterlimit:4;stroke-dasharray:none"
           id="path991" />
        <path
           d="m 71.109624,129.58941 v -8.4708 h -4.229199 v 8.4708 z m -8.458398,8.4584 v -16.9292 h 2.108398 v -2.1208 h 8.470801 v 2.1208 h 2.120801 v 16.9292 h -4.241602 v -6.35 h -4.229199 v 6.35 z"
           style="font-family:'BIG SHOT';-inkscape-font-specification:'BIG SHOT, Normal';stroke:#ffffff;stroke-width:5.38531;stroke-linecap:round;stroke-linejoin:round;stroke-miterlimit:4;stroke-dasharray:none"
           id="path993" />
        <path
           d="m 81.688824,138.04781 v -2.1084 h -2.108399 v -4.2416 h 4.229199 v 4.2416 h 4.2292 v -6.35 h -6.35 v -2.1208 h -2.108399 v -6.35 h 2.108399 v -2.1208 h 8.4708 v 2.1208 h 2.120801 v 4.2292 h -4.241601 v -4.2292 h -4.2292 v 6.35 h 6.35 v 2.1208 h 2.120801 v 6.35 h -2.120801 v 2.1084 z"
           style="font-family:'BIG SHOT';-inkscape-font-specification:'BIG SHOT, Normal';stroke:#ffffff;stroke-width:5.38531;stroke-linecap:round;stroke-linejoin:round;stroke-miterlimit:4;stroke-dasharray:none"
           id="path995" />
        <path
           d="m 98.618023,138.04781 v -2.1084 h -2.108399 v -4.2416 h 4.229196 v 4.2416 h 4.2292 v -6.35 h -6.349997 v -2.1208 h -2.108399 v -6.35 h 2.108399 v -2.1208 h 8.470797 v 2.1208 h 2.1208 v 4.2292 h -4.2416 v -4.2292 h -4.2292 v 6.35 h 6.35 v 2.1208 h 2.1208 v 6.35 h -2.1208 v 2.1084 z"
           style="font-family:'BIG SHOT';-inkscape-font-specification:'BIG SHOT, Normal';stroke:#ffffff;stroke-width:5.38531;stroke-linecap:round;stroke-linejoin:round;stroke-miterlimit:4;stroke-dasharray:none"
           id="path997" />
        <path
           d="m 113.43882,138.04781 v -2.1084 h 4.2292 v -14.8208 h -4.2292 v -2.1208 h 12.7 v 2.1208 h -4.2416 v 14.8208 h 4.2416 v 2.1084 z"
           style="font-family:'BIG SHOT';-inkscape-font-specification:'BIG SHOT, Normal';stroke:#ffffff;stroke-width:5.38531;stroke-linecap:round;stroke-linejoin:round;stroke-miterlimit:4;stroke-dasharray:none"
           id="path999" />
        <path
           d="m 132.47642,138.04781 v -2.1084 h -2.1084 v -14.8208 h 2.1084 v -2.1208 h 8.4708 v 2.1208 h 2.1208 v 4.2292 h -4.2416 v -4.2292 h -4.2292 v 14.8208 h 4.2292 v -4.2416 h 4.2416 v 4.2416 h -2.1208 v 2.1084 z"
           style="font-family:'BIG SHOT';-inkscape-font-specification:'BIG SHOT, Normal';stroke:#ffffff;stroke-width:5.38531;stroke-linecap:round;stroke-linejoin:round;stroke-miterlimit:4;stroke-dasharray:none"
           id="path1001" />
        <path
           d="m 149.40562,138.04781 v -2.1084 h -2.1084 v -4.2416 h 4.2292 v 4.2416 h 4.2292 v -6.35 h -6.35 v -2.1208 h -2.1084 v -6.35 h 2.1084 v -2.1208 h 8.4708 v 2.1208 h 2.1208 v 4.2292 h -4.2416 v -4.2292 h -4.2292 v 6.35 h 6.35 v 2.1208 h 2.1208 v 6.35 h -2.1208 v 2.1084 z"
           style="font-family:'BIG SHOT';-inkscape-font-specification:'BIG SHOT, Normal';stroke:#ffffff;stroke-width:5.38531;stroke-linecap:round;stroke-linejoin:round;stroke-miterlimit:4;stroke-dasharray:none"
           id="path1003" />
      </g>
    </g>
    <g
       id="g1398"
       transform="translate(-1.1247653,-2.9667204)">
      <g
         id="g1378">
        <path
           d="M 10.068081,5.1711389 H 2.2174574 v 1.5310709 h 2.983237 V 13.021763 H 7.0848441 V 6.7022098 h 2.9832369 z"
           id="path1362"
           style="fill:#4f4c4d;fill-opacity:1;fill-rule:nonzero;stroke:none;stroke-width:0.318807" />
        <path
           d="m 28.156673,5.1711389 h -7.851022 v 1.5310709 h 2.983237 v 6.3195532 h 1.884548 V 6.7022098 h 2.983237 z"
           id="path1364"
           style="fill:#4f4c4d;fill-opacity:1;fill-rule:nonzero;stroke:none;stroke-width:0.318807" />
        <path
           d="M 17.825811,13.021922 H 19.70996 V 5.1712983 h -1.884149 z"
           id="path1366"
           style="fill:#4f4c4d;fill-opacity:1;fill-rule:nonzero;stroke:none;stroke-width:0.318807" />
        <path
           d="m 12.619494,13.021826 v 0 h 5.103702 L 14.325112,6.77002 c -1.264469,1.7446716 -1.924001,3.938463 -1.705618,6.251806"
           id="path1368"
           style="fill:#127bca;fill-opacity:1;fill-rule:nonzero;stroke:none;stroke-width:0.318807" />
        <path
           d="m 7.9093971,13.021826 h 2.6688139 c 0.28852,-2.746124 1.54462,-5.1511246 3.390513,-6.907353 L 12.816236,3.9936091 Z"
           id="path1370"
           style="fill:#127bca;fill-opacity:1;fill-rule:nonzero;stroke:none;stroke-width:0.318807" />
        <path
           d="m 18.767978,3.4667204 c -0.363878,0 -0.658844,0.294966 -0.658844,0.6586584 0,0.3636924 0.294966,0.6586585 0.658844,0.6586585 0.363693,0 0.658659,-0.2949661 0.658659,-0.6586585 0,-0.3636924 -0.294966,-0.6586584 -0.658659,-0.6586584"
           id="path1372"
           style="fill:#127bca;fill-opacity:1;fill-rule:nonzero;stroke:none;stroke-width:0.148597" />
        <path
           d="M 16.674241,4.5111127 16.549508,4.2827671 c -0.944067,0.4841882 -1.813215,1.1014784 -2.580743,1.8315465 l 0.356267,0.6559455 c 0.640005,-0.8822985 1.43503,-1.6498264 2.349209,-2.2591464"
           id="path1374"
           style="fill:#127bca;fill-opacity:1;fill-rule:nonzero;stroke:none;stroke-width:0.318807" />
        <path
           d="m 32.86677,11.799456 c -1.500385,0 -2.715439,-1.080357 -2.715439,-2.7142432 0,-1.6338862 1.215054,-2.713845 2.715439,-2.713845 1.500386,0 2.715439,1.0799588 2.715439,2.713845 0,1.6338862 -1.215053,2.7142432 -2.715439,2.7142432 m 0,-6.8798558 c -2.699498,0 -4.710374,1.6757295 -4.710374,4.1656126 0,2.4898832 2.010876,4.1656122 4.710374,4.1656122 2.699897,0 4.710374,-1.675729 4.710374,-4.1656122 0,-2.4898831 -2.010477,-4.1656126 -4.710374,-4.1656126"
           id="path1376"
           style="fill:#4f4c4d;fill-opacity:1;fill-rule:nonzero;stroke:none;stroke-width:0.318807" />
      </g>
      <g
         aria-label="CLASSICS"
         id="g1396"
         style="font-size:25.4px;line-height:1.25;font-family:'Patrick Hand SC';-inkscape-font-specification:'Patrick Hand SC, Normal';stroke-width:0.264583"
         transform="matrix(0.27853542,0,0,0.27853542,-6.3950568,-19.235678)">
        <path
           d="m 30.901226,138.04781 v -2.1084 h -2.108398 v -14.8208 h 2.108398 v -2.1208 h 8.470801 v 2.1208 h 2.1208 v 4.2292 h -4.241601 v -4.2292 h -4.229199 v 14.8208 h 4.229199 v -4.2416 h 4.241601 v 4.2416 h -2.1208 v 2.1084 z"
           style="font-family:'BIG SHOT';-inkscape-font-specification:'BIG SHOT, Normal'"
           id="path1380" />
        <path
           d="m 45.722027,138.04781 v -19.05 h 4.229199 v 16.9416 h 8.470801 v 2.1084 z"
           style="font-family:'BIG SHOT';-inkscape-font-specification:'BIG SHOT, Normal'"
           id="path1382" />
        <path
           d="m 71.109624,129.58941 v -8.4708 h -4.229199 v 8.4708 z m -8.458398,8.4584 v -16.9292 h 2.108398 v -2.1208 h 8.470801 v 2.1208 h 2.120801 v 16.9292 h -4.241602 v -6.35 h -4.229199 v 6.35 z"
           style="font-family:'BIG SHOT';-inkscape-font-specification:'BIG SHOT, Normal'"
           id="path1384" />
        <path
           d="m 81.688824,138.04781 v -2.1084 h -2.108399 v -4.2416 h 4.229199 v 4.2416 h 4.2292 v -6.35 h -6.35 v -2.1208 h -2.108399 v -6.35 h 2.108399 v -2.1208 h 8.4708 v 2.1208 h 2.120801 v 4.2292 h -4.241601 v -4.2292 h -4.2292 v 6.35 h 6.35 v 2.1208 h 2.120801 v 6.35 h -2.120801 v 2.1084 z"
           style="font-family:'BIG SHOT';-inkscape-font-specification:'BIG SHOT, Normal'"
           id="path1386" />
        <path
           d="m 98.618023,138.04781 v -2.1084 h -2.108399 v -4.2416 h 4.229196 v 4.2416 h 4.2292 v -6.35 h -6.349997 v -2.1208 h -2.108399 v -6.35 h 2.108399 v -2.1208 h 8.470797 v 2.1208 h 2.1208 v 4.2292 h -4.2416 v -4.2292 h -4.2292 v 6.35 h 6.35 v 2.1208 h 2.1208 v 6.35 h -2.1208 v 2.1084 z"
           style="font-family:'BIG SHOT';-inkscape-font-specification:'BIG SHOT, Normal'"
           id="path1388" />
        <path
           d="m 113.43882,138.04781 v -2.1084 h 4.2292 v -14.8208 h -4.2292 v -2.1208 h 12.7 v 2.1208 h -4.2416 v 14.8208 h 4.2416 v 2.1084 z"
           style="font-family:'BIG SHOT';-inkscape-font-specification:'BIG SHOT, Normal'"
           id="path1390" />
        <path
           d="m 132.47642,138.04781 v -2.1084 h -2.1084 v -14.8208 h 2.1084 v -2.1208 h 8.4708 v 2.1208 h 2.1208 v 4.2292 h -4.2416 v -4.2292 h -4.2292 v 14.8208 h 4.2292 v -4.2416 h 4.2416 v 4.2416 h -2.1208 v 2.1084 z"
           style="font-family:'BIG SHOT';-inkscape-font-specification:'BIG SHOT, Normal'"
           id="path1392" />
        <path
           d="m 149.40562,138.04781 v -2.1084 h -2.1084 v -4.2416 h 4.2292 v 4.2416 h 4.2292 v -6.35 h -6.35 v -2.1208 h -2.1084 v -6.35 h 2.1084 v -2.1208 h 8.4708 v 2.1208 h 2.1208 v 4.2292 h -4.2416 v -4.2292 h -4.2292 v 6.35 h 6.35 v 2.1208 h 2.1208 v 6.35 h -2.1208 v 2.1084 z"
           style="font-family:'BIG SHOT';-inkscape-font-specification:'BIG SHOT, Normal'"
           id="path1394" />
      </g>
    </g>
  </g>
</svg>
