<?xml version="1.0" encoding="UTF-8" standalone="no"?>
<!-- Created with Inkscape (http://www.inkscape.org/) -->

<svg
   version="1.1"
   id="svg2"
   width="26.159847"
   height="9.4666424"
   viewBox="0 0 26.159848 9.4666423"
   sodipodi:docname="auto-action.svg"
   inkscape:version="1.1 (c68e22c387, 2021-05-23)"
   inkscape:export-filename="C:\Users\BUCH\Desktop\Retrogaming\Recalbox\travail thèmes\Thème vignette !!!!!!!\Maquette 2 !!!!\image1250.png"
   inkscape:export-xdpi="96.460785"
   inkscape:export-ydpi="96.460785"
   xmlns:inkscape="http://www.inkscape.org/namespaces/inkscape"
   xmlns:sodipodi="http://sodipodi.sourceforge.net/DTD/sodipodi-0.dtd"
   xmlns="http://www.w3.org/2000/svg"
   xmlns:svg="http://www.w3.org/2000/svg">
  <defs
     id="defs6">
    <clipPath
       clipPathUnits="userSpaceOnUse"
       id="clipPath3185">
      <path
         id="path3187"
         style="fill:#ffffff;fill-rule:evenodd;stroke:#ffffff;stroke-width:5.15903;stroke-linecap:round;stroke-linejoin:round;paint-order:stroke fill markers"
         d="m 1157.5591,335.78677 h 462.4206 L 1362.3723,1410.6277 H 899.95176 Z"
         sodipodi:nodetypes="ccccc"
         inkscape:export-filename="C:\Users\BUCH\Desktop\Retrogaming\Recalbox\travail thèmes\Thème vignette !!!!!!!\Maquette 2 !!!!\rect849.png"
         inkscape:export-xdpi="247.96268"
         inkscape:export-ydpi="247.96268" />
    </clipPath>
  </defs>
  <sodipodi:namedview
     id="namedview4"
     pagecolor="#ffffff"
     bordercolor="#666666"
     borderopacity="1.0"
     inkscape:pageshadow="2"
     inkscape:pageopacity="0.0"
     inkscape:pagecheckerboard="true"
     showgrid="false"
     inkscape:showpageshadow="false"
     inkscape:zoom="12.479331"
     inkscape:cx="21.755974"
     inkscape:cy="21.715908"
     inkscape:window-width="1920"
     inkscape:window-height="1138"
     inkscape:window-x="-8"
     inkscape:window-y="-8"
     inkscape:window-maximized="1"
     inkscape:current-layer="svg2"
     fit-margin-top="0"
     fit-margin-left="0"
     fit-margin-right="0"
     fit-margin-bottom="0" />
  <g
     aria-label="action"
     id="text1067"
     style="font-weight:300;font-size:13.3333px;line-height:1.25;font-family:'Bebas Neue';-inkscape-font-specification:'Bebas Neue, Light';fill:#ffffff"
     transform="translate(7.7603157,18.695346)">
    <path
       d="m -3.6269928,-11.495365 0.5466653,2.1999949 h 0.2933325 l -2.3066608,-9.3466429 h -0.4133323 l -2.2533276,9.3466429 h 0.266666 l 0.5466653,-2.1999949 z m -1.6799958,-6.799982 1.6266626,6.533316 h -3.2133252 z"
       id="path1384" />
    <path
       d="m 0.15962737,-18.695346 c -1.41332977,0 -1.94666177,1.066664 -1.94666177,2.359994 v 4.746654 c 0,1.29333 0.533332,2.3599944 1.94666177,2.3599944 1.42666303,0 1.95999503,-1.0666644 1.95999503,-2.3599944 v -1.01333 H 1.8262898 v 1.026664 c 0,1.13333 -0.4266656,2.0666611 -1.65332913,2.0666611 -1.23999687,0 -1.66666247,-0.9333311 -1.66666247,-2.0666611 v -4.773322 c 0,-1.13333 0.4266656,-2.079994 1.66666247,-2.079994 1.22666353,0 1.65332913,0.946664 1.65332913,2.079994 v 0.733332 h 0.2933326 v -0.719998 c 0,-1.29333 -0.533332,-2.359994 -1.95999503,-2.359994 z"
       id="path1386" />
    <path
       d="m 5.1996,-9.2953701 v -9.0533109 h 2.0399948 v -0.279999 h -4.359989 v 0.279999 h 2.0266616 v 9.0533109 z"
       id="path1388" />
    <path
       d="m 8.052909,-18.62868 v 9.3333099 H 8.3462416 V -18.62868 Z"
       id="path1390" />
    <path
       d="m 9.399562,-11.588698 c 0,1.306664 0.5599986,2.3599944 1.973328,2.3599944 1.439997,0 1.999995,-1.0533304 1.999995,-2.3599944 v -4.746654 c 0,-1.306664 -0.559998,-2.359994 -1.999995,-2.359994 -1.4133294,0 -1.973328,1.05333 -1.973328,2.359994 z m 0.2933326,-4.759988 c 0,-1.146663 0.4399984,-2.079994 1.6799954,-2.079994 1.253331,0 1.706663,0.933331 1.706663,2.079994 v 4.773322 c 0,1.146663 -0.453332,2.0799944 -1.706663,2.0799944 -1.239997,0 -1.6799954,-0.9333314 -1.6799954,-2.0799944 z"
       id="path1392" />
    <path
       d="m 14.706208,-18.202014 3.333325,8.9066439 h 0.359999 V -18.62868 h -0.279999 v 8.7333114 L 14.839541,-18.62868 h -0.413332 v 9.3333099 h 0.279999 z"
       id="path1394" />
  </g>
</svg>
