<?xml version="1.0" encoding="UTF-8" standalone="no"?>
<svg
   viewBox="0 0 462 460.79999"
   version="1.1"
   id="svg4"
   sodipodi:docname="auto-simulationbuildandmanagement.svg"
   width="462"
   height="460.79999"
   inkscape:version="1.1 (c68e22c387, 2021-05-23)"
   xmlns:inkscape="http://www.inkscape.org/namespaces/inkscape"
   xmlns:sodipodi="http://sodipodi.sourceforge.net/DTD/sodipodi-0.dtd"
   xmlns="http://www.w3.org/2000/svg"
   xmlns:svg="http://www.w3.org/2000/svg">
  <defs
     id="defs8" />
  <sodipodi:namedview
     id="namedview6"
     pagecolor="#ffffff"
     bordercolor="#666666"
     borderopacity="1.0"
     inkscape:pageshadow="2"
     inkscape:pageopacity="0.0"
     inkscape:pagecheckerboard="0"
     showgrid="false"
     fit-margin-top="0"
     fit-margin-left="0"
     fit-margin-right="0"
     fit-margin-bottom="0"
     inkscape:zoom="0.73535156"
     inkscape:cx="231.86189"
     inkscape:cy="229.82205"
     inkscape:window-width="1920"
     inkscape:window-height="1138"
     inkscape:window-x="-8"
     inkscape:window-y="-8"
     inkscape:window-maximized="1"
     inkscape:current-layer="svg4" />
  <path
     fill="#000000"
     d="M 231,0 27,108.8 h 170 v -56 h 68 v 55.094 c 2.53,0.258 5.04,0.567 7.54,0.906 H 435 Z m -16,70.8 v 57.38 l -6.248,2.005 c -14.24,4.573 -26.103,11.94 -36.07,22.322 -17.686,18.425 -26.735,43.597 -26.735,77.368 0,33.38 8.89,58.507 26.282,77.144 10.118,10.787 22.11,18.3 36.477,22.83 l 6.293,1.984 V 394.8 h 32 v -59.85 l 8.373,-0.587 c 9.6,-0.67 18.958,-2.145 28.092,-4.45 11.206,-2.827 22.043,-6.956 32.588,-12.26 V 226.51 h -61.035 v 19.974 h 30.955 v 49.576 l -5.403,2.356 c -4.373,1.906 -9.156,3.264 -14.322,4.152 l -0.08,0.014 -0.08,0.013 c -5.003,0.768 -10.33,1.133 -15.988,1.133 -21.365,0 -39.558,-7.483 -51.834,-22.228 -11.08,-13.308 -17.89,-27.01 -17.89,-51.625 0,-24.844 7.066,-38.687 18.532,-51.912 h 0.002 c 12.767,-14.722 31.483,-22.09 53.56,-22.09 11.836,0 23.63,1.875 35.264,5.574 7.058,2.227 14.08,5.21 21.075,8.764 v -32.35 a 138.957,138.957 0 0 0 -26.992,-9.155 h -0.006 l -0.008,-0.002 c -8.43,-1.94 -17.185,-3.16 -26.287,-3.65 l -8.517,-0.458 V 70.8 h -32 z m -192,54 v 18 h 25 v 206 H 23 v 18 h 96 v -18 H 94 v -206 h 25 v -18 z m 320,0 v 18 h 25 v 206 h -25 v 18 h 96 v -18 h -25 v -206 h 25 v -18 z m -327,258 v 30 h 181 v -30 z m 249,0 v 30 h 181 v -30 z m -265,48 v 30 h 462 v -30 z"
     id="path2"
     style="fill:#ffffff" />
</svg>
