<?xml version="1.0" encoding="UTF-8" standalone="no"?>
<svg
   enable-background="new 0 0 1875.1 378.093"
   viewBox="0 0 366.19129 356.28801"
   version="1.1"
   id="svg52"
   sodipodi:docname="easyrpg.svg"
   width="366.19128"
   height="356.28799"
   inkscape:version="1.1 (c68e22c387, 2021-05-23)"
   xmlns:inkscape="http://www.inkscape.org/namespaces/inkscape"
   xmlns:sodipodi="http://sodipodi.sourceforge.net/DTD/sodipodi-0.dtd"
   xmlns="http://www.w3.org/2000/svg"
   xmlns:svg="http://www.w3.org/2000/svg">
  <defs
     id="defs56" />
  <sodipodi:namedview
     id="namedview54"
     pagecolor="#ffffff"
     bordercolor="#666666"
     borderopacity="1.0"
     inkscape:pageshadow="2"
     inkscape:pageopacity="0.0"
     inkscape:pagecheckerboard="0"
     showgrid="false"
     fit-margin-top="0"
     fit-margin-left="0"
     fit-margin-right="0"
     fit-margin-bottom="0"
     inkscape:zoom="0.41971621"
     inkscape:cx="937.53826"
     inkscape:cy="188.22242"
     inkscape:window-width="1920"
     inkscape:window-height="1138"
     inkscape:window-x="-8"
     inkscape:window-y="-8"
     inkscape:window-maximized="1"
     inkscape:current-layer="svg52" />
  <radialGradient
     id="a"
     cx="-0.60350001"
     cy="-94.244102"
     gradientTransform="matrix(0.6042,0,0,-0.6042,181.1311,138.3947)"
     gradientUnits="userSpaceOnUse"
     r="226.5">
    <stop
       offset="0"
       stop-color="#d8edca"
       id="stop2" />
    <stop
       offset="1"
       stop-color="#9ebf88"
       id="stop4" />
  </radialGradient>
  <radialGradient
     id="b"
     cx="4.1227999"
     cy="-57.741798"
     gradientTransform="matrix(0.6042,0,0,-0.6042,181.1311,138.3947)"
     gradientUnits="userSpaceOnUse"
     r="270.06491">
    <stop
       offset="0"
       stop-color="#688c51"
       id="stop7" />
    <stop
       offset=".4749"
       stop-color="#587b42"
       id="stop9" />
    <stop
       offset="1"
       stop-color="#42632d"
       id="stop11" />
  </radialGradient>
  <text
     id="text22"
     x="164.2791"
     y="348.28922"><tspan
       fill="#f22222"
       font-family="MyriadPro-Regular"
       font-size="6px"
       x="164.2791"
       y="348.28922"
       id="tspan14">I h</tspan><tspan
       fill="#f22222"
       font-family="MyriadPro-Regular"
       font-size="6px"
       x="170.31509"
       y="348.28922"
       id="tspan16">a</tspan><tspan
       fill="#f22222"
       font-family="MyriadPro-Regular"
       font-size="6px"
       x="173.18309"
       y="348.28922"
       id="tspan18">t</tspan><tspan
       fill="#f22222"
       font-family="MyriadPro-Regular"
       font-size="6px"
       x="175.1331"
       y="348.28922"
       id="tspan20">e bugs!</tspan></text>
  <path
     d="m 348.0301,215.917 c -3.595,-13.389 -9.647,-25.068 -18.143,-35.047 -2.552,-50.357 -29.526,-94.266 -69.307,-120.138 0.005,-0.219 0.018,-0.434 0.018,-0.654 0,-6.056 -2.417,-11.632 -7.251,-16.721 C 234.9741,24.456 212.6171,15 186.2761,15 c -26.105,0 -48.038,8.894 -65.801,26.681 -2.873,2.876 -5.51,5.864 -7.919,8.958 -51.774002,24.399 -87.612002,77.05 -87.612002,138.08 0,3.276 0.115,6.524 0.318,9.748 -2.986,2.897 -5.179,6.697 -6.571,11.406 -7.183,25.362 -4.193,49.451 8.977,72.263 13.053,22.607 31.721,37.153 56.006,43.644 11.086,2.964 21.999002,3.883 32.741002,2.77 18.709,8.186 39.371,12.738 61.099,12.738 27.915,0 54.075,-7.503 76.584,-20.593 1.983,2.996 4.624,5.458 7.939,7.372 5.246,3.028 11.282,3.722 18.106,2.08 25.555,-6.46 44.923,-21.094 58.093,-43.906 13.052,-22.606 16.316,-46.046 9.794,-70.324 z"
     fill="#ffffff"
     stroke="#2e3d25"
     stroke-width="30"
     id="path24" />
  <circle
     cx="178.04709"
     cy="188.996"
     fill="#559338"
     r="152.57001"
     stroke="#88ba68"
     stroke-width="5"
     id="circle26" />
  <circle
     cx="180.7661"
     cy="195.341"
     fill="url(#a)"
     r="136.86"
     stroke="#b0d19b"
     stroke-width="5"
     id="circle28"
     style="fill:url(#a)" />
  <path
     d="m 348.5641,216.194 c -6.52,-24.282 -21.104,-42.954 -43.739,-56.023 -22.637,-13.069 -46.148,-16.39 -70.543,-9.957 -2.738,0.722 -5.402,1.551 -7.998,2.477 -2.228,-0.567 -4.629,-0.856 -7.21,-0.856 h -32.265 c -12.085,0 -22.357,-4.3 -30.816,-12.906 -8.459,-8.601 -12.689,-18.963 -12.689,-31.085 0,-12.113 4.225,-22.414 12.679,-30.897 8.45,-8.483 18.718,-12.727 30.797,-12.727 3.135,0 6.274,0.331 9.418,0.987 l -26.02,25.831 c -5.349,5.277 -8.02,10.91 -8.02,16.9 0,6.712 2.474,12.585 7.43,17.617 4.957,5.032 10.815,7.548 17.585,7.548 6.042,0 11.721,-2.436 17.041,-7.313 l 46.404,-45.441 c 7.006,-5.329 10.513,-11.995 10.513,-19.997 0,-6.056 -2.417,-11.632 -7.251,-16.721 -18.372,-18.901 -40.729,-28.357 -67.071,-28.357 -26.106,0 -48.037,8.894 -65.801,26.681 -17.768,17.788 -26.648002,39.752 -26.648002,65.89 0,26.138 8.879002,48.16 26.648002,66.07 2.138,2.156 4.339,4.18 6.598,6.076 0.623,2.056 1.527,4.122 2.725,6.197 l 16.133,27.943 c 6.042,10.465 7.454,21.512 4.231,33.14 -3.219,11.627 -10.078,20.471 -20.576,26.532 -10.49,6.056 -21.524,7.547 -33.097002,4.467 -11.571,-3.077 -20.38,-9.846 -26.42,-20.308 -1.567,-2.714 -2.851,-5.598 -3.854,-8.649 l 35.381002,9.62 c 7.245,1.992 13.458,1.491 18.646,-1.505 5.813,-3.357 9.662,-8.435 11.542,-15.243 1.88,-6.81 1.129,-13.141 -2.255,-19.003 -3.021,-5.233 -7.97,-8.934 -14.853,-11.103 L 52.654098,194.613 c -8.119,-3.402 -15.644,-3.106 -22.574,0.894 -5.245,3.028 -8.865,7.909 -10.855,14.64 -7.183,25.362 -4.193,49.451 8.977,72.263 13.053,22.607 31.721,37.153 56.007,43.644 24.289002,6.494 47.751002,3.202 70.387002,-9.867 22.635,-13.069 37.268,-31.77 43.894,-56.113 0.772,-2.835 1.404,-5.656 1.909,-8.467 1.458,-1.561 2.785,-3.367 3.975,-5.428 l 16.133,-27.942 c 6.042,-10.465 14.903,-17.211 26.585,-20.234 11.679,-3.025 22.767,-1.508 33.265,4.554 10.49,6.056 17.299,14.865 20.418,26.429 3.122,11.558 1.663,22.573 -4.377,33.034 -1.567,2.715 -3.424,5.268 -5.563,7.663 l -9.361,-35.449 c -1.896,-7.271 -5.437,-12.4 -10.625,-15.395 -5.813,-3.357 -12.136,-4.151 -18.972,-2.375 -6.836,1.777 -11.945,5.592 -15.329,11.455 -3.021,5.233 -3.752,11.368 -2.188,18.414 l 16.151,62.908 c 1.113,8.731 5.131,15.101 12.061,19.102 5.246,3.028 11.282,3.722 18.106,2.08 25.555,-6.46 44.923,-21.094 58.093,-43.906 13.051,-22.605 16.314,-46.045 9.793,-70.323 z"
     fill="url(#b)"
     stroke="#5b7749"
     stroke-width="5"
     id="path30"
     style="fill:url(#b)" />
</svg>
