<?xml version="1.0" encoding="UTF-8" standalone="no"?>
<!-- Created with Inkscape (http://www.inkscape.org/) -->

<svg
   version="1.1"
   id="svg2"
   width="80.65287"
   height="9.4666424"
   viewBox="0 0 80.652873 9.4666423"
   sodipodi:docname="auto-arcade-dataeast.svg"
   inkscape:version="1.1 (c68e22c387, 2021-05-23)"
   inkscape:export-filename="C:\Users\BUCH\Desktop\Retrogaming\Recalbox\travail thèmes\Thème vignette !!!!!!!\Maquette 2 !!!!\image1250.png"
   inkscape:export-xdpi="96.460785"
   inkscape:export-ydpi="96.460785"
   xmlns:inkscape="http://www.inkscape.org/namespaces/inkscape"
   xmlns:sodipodi="http://sodipodi.sourceforge.net/DTD/sodipodi-0.dtd"
   xmlns="http://www.w3.org/2000/svg"
   xmlns:svg="http://www.w3.org/2000/svg">
  <g
     aria-label="data east classics"
     id="text914"
     style="font-weight:300;font-size:13.3333px;line-height:1.25;font-family:'Bebas Neue';-inkscape-font-specification:'Bebas Neue, Light';fill:#ffffff"
     transform="translate(3.5534257,19.015876)">
    <path
       d="m -3.5534257,-18.94921 v 9.33331 h 1.9599951 c 1.41332973,0 2.01332822,-0.999998 2.01332822,-2.319994 v -4.679988 c 0,-1.33333 -0.59999849,-2.333328 -2.02666152,-2.333328 z m 0.2933326,9.0533107 V -18.66921 h 1.6533292 c 1.23999684,0 1.73332893,0.866664 1.73332893,2.039994 v 4.706655 c 0,1.159997 -0.47999879,2.0266617 -1.73332893,2.0266617 z"
       id="path2583" />
    <path
       d="M 5.5398592,-11.815894 6.0865245,-9.6159 H 6.379857 L 4.0731962,-18.962543 H 3.6598639 L 1.4065363,-9.6159 h 0.266666 l 0.5466653,-2.199994 z M 3.8598634,-18.615877 5.486526,-12.08256 H 2.2732008 Z"
       id="path2585" />
    <path
       d="m 8.9398305,-9.6159 v -9.05331 h 2.0399945 v -0.28 H 6.6198364 v 0.28 H 8.646498 v 9.05331 z"
       id="path2587" />
    <path
       d="M 15.379794,-11.815894 15.92646,-9.6159 h 0.293332 l -2.30666,-9.346643 H 13.499799 L 11.246472,-9.6159 h 0.266666 l 0.546665,-2.199994 z m -1.679995,-6.799983 1.626662,6.533317 h -3.213325 z"
       id="path2589" />
    <path
       d="m 19.606415,-14.482554 v -4.186656 h 3.266659 v -0.28 h -3.559991 v 9.33331 h 3.559991 v -0.2799993 h -3.266659 v -4.3199887 h 2.74666 v -0.266666 z"
       id="path2591" />
    <path
       d="M 28.006385,-11.815894 28.55305,-9.6159 h 0.293333 l -2.306661,-9.346643 H 26.12639 L 23.873062,-9.6159 h 0.266666 l 0.546666,-2.199994 z m -1.679996,-6.799983 1.626663,6.533317 h -3.213325 z"
       id="path2593" />
    <path
       d="m 31.806355,-19.015876 c -1.346663,0.01333 -1.919995,0.946664 -1.919995,2.306661 0,2.573326 3.573325,2.493327 3.573325,4.853321 0,1.13333 -0.439999,2.0266612 -1.666663,2.0266612 -1.226663,0 -1.666662,-0.8933312 -1.666662,-2.0266612 v -0.466666 h -0.28 v 0.453332 c 0,1.29333 0.533332,2.3199945 1.946662,2.3199945 1.426663,0 1.959995,-1.0266645 1.959995,-2.3199945 0,-2.533327 -3.573324,-2.46666 -3.573324,-4.853321 0,-1.106664 0.413332,-2.026661 1.639996,-2.026661 1.21333,0 1.626662,0.933331 1.626662,2.039995 v 0.186666 h 0.293333 v -0.173333 c 0,-1.279997 -0.519999,-2.319994 -1.933329,-2.319994 z"
       id="path2595" />
    <path
       d="m 36.833005,-9.6159 v -9.05331 H 38.873 v -0.28 h -4.359989 v 0.28 h 2.026661 v 9.05331 z"
       id="path2597" />
    <path
       d="m 43.686288,-19.015876 c -1.41333,0 -1.946662,1.066664 -1.946662,2.359994 v 4.746654 c 0,1.29333 0.533332,2.3599945 1.946662,2.3599945 1.426663,0 1.959995,-1.0666645 1.959995,-2.3599945 v -1.01333 H 45.35295 v 1.026664 c 0,1.13333 -0.426665,2.0666612 -1.653329,2.0666612 -1.239997,0 -1.666662,-0.9333312 -1.666662,-2.0666612 v -4.773322 c 0,-1.13333 0.426665,-2.079994 1.666662,-2.079994 1.226664,0 1.653329,0.946664 1.653329,2.079994 v 0.733332 h 0.293333 v -0.719998 c 0,-1.29333 -0.533332,-2.359994 -1.959995,-2.359994 z"
       id="path2599" />
    <path
       d="M 50.112921,-9.6159 V -9.8958993 H 46.979596 V -18.94921 h -0.293333 v 9.33331 z"
       id="path2601" />
    <path
       d="M 55.219554,-11.815894 55.76622,-9.6159 h 0.293332 l -2.306661,-9.346643 H 53.339559 L 51.086231,-9.6159 h 0.266666 l 0.546666,-2.199994 z m -1.679995,-6.799983 1.626662,6.533317 h -3.213325 z"
       id="path2603" />
    <path
       d="m 59.019525,-19.015876 c -1.346664,0.01333 -1.919996,0.946664 -1.919996,2.306661 0,2.573326 3.573325,2.493327 3.573325,4.853321 0,1.13333 -0.439999,2.0266612 -1.666663,2.0266612 -1.226663,0 -1.666662,-0.8933312 -1.666662,-2.0266612 v -0.466666 h -0.28 v 0.453332 c 0,1.29333 0.533332,2.3199945 1.946662,2.3199945 1.426663,0 1.959995,-1.0266645 1.959995,-2.3199945 0,-2.533327 -3.573324,-2.46666 -3.573324,-4.853321 0,-1.106664 0.413332,-2.026661 1.639996,-2.026661 1.21333,0 1.626662,0.933331 1.626662,2.039995 v 0.186666 h 0.293333 v -0.173333 c 0,-1.279997 -0.519999,-2.319994 -1.933328,-2.319994 z"
       id="path2605" />
    <path
       d="m 63.939504,-19.015876 c -1.346664,0.01333 -1.919996,0.946664 -1.919996,2.306661 0,2.573326 3.573325,2.493327 3.573325,4.853321 0,1.13333 -0.439999,2.0266612 -1.666663,2.0266612 -1.226663,0 -1.666662,-0.8933312 -1.666662,-2.0266612 v -0.466666 h -0.279999 v 0.453332 c 0,1.29333 0.533332,2.3199945 1.946661,2.3199945 1.426663,0 1.959995,-1.0266645 1.959995,-2.3199945 0,-2.533327 -3.573324,-2.46666 -3.573324,-4.853321 0,-1.106664 0.413332,-2.026661 1.639996,-2.026661 1.21333,0 1.626662,0.933331 1.626662,2.039995 v 0.186666 h 0.293333 v -0.173333 c 0,-1.279997 -0.519999,-2.319994 -1.933328,-2.319994 z"
       id="path2607" />
    <path
       d="m 66.926158,-18.94921 v 9.33331 h 0.293333 v -9.33331 z"
       id="path2609" />
    <path
       d="m 70.219472,-19.015876 c -1.41333,0 -1.946662,1.066664 -1.946662,2.359994 v 4.746654 c 0,1.29333 0.533332,2.3599945 1.946662,2.3599945 1.426663,0 1.959995,-1.0666645 1.959995,-2.3599945 v -1.01333 h -0.293333 v 1.026664 c 0,1.13333 -0.426665,2.0666612 -1.653329,2.0666612 -1.239997,0 -1.666662,-0.9333312 -1.666662,-2.0666612 v -4.773322 c 0,-1.13333 0.426665,-2.079994 1.666662,-2.079994 1.226664,0 1.653329,0.946664 1.653329,2.079994 v 0.733332 h 0.293333 v -0.719998 c 0,-1.29333 -0.533332,-2.359994 -1.959995,-2.359994 z"
       id="path2611" />
    <path
       d="m 75.152783,-19.015876 c -1.346663,0.01333 -1.919995,0.946664 -1.919995,2.306661 0,2.573326 3.573324,2.493327 3.573324,4.853321 0,1.13333 -0.439998,2.0266612 -1.666662,2.0266612 -1.226664,0 -1.666662,-0.8933312 -1.666662,-2.0266612 v -0.466666 h -0.28 v 0.453332 c 0,1.29333 0.533332,2.3199945 1.946662,2.3199945 1.426663,0 1.959995,-1.0266645 1.959995,-2.3199945 0,-2.533327 -3.573324,-2.46666 -3.573324,-4.853321 0,-1.106664 0.413332,-2.026661 1.639996,-2.026661 1.21333,0 1.626662,0.933331 1.626662,2.039995 v 0.186666 h 0.293333 v -0.173333 c 0,-1.279997 -0.519999,-2.319994 -1.933329,-2.319994 z"
       id="path2613" />
  </g>
  <defs
     id="defs6">
    <clipPath
       clipPathUnits="userSpaceOnUse"
       id="clipPath3185">
      <path
         id="path3187"
         style="fill:#ffffff;fill-rule:evenodd;stroke:#ffffff;stroke-width:5.15903;stroke-linecap:round;stroke-linejoin:round;paint-order:stroke fill markers"
         d="m 1157.5591,335.78677 h 462.4206 L 1362.3723,1410.6277 H 899.95176 Z"
         sodipodi:nodetypes="ccccc"
         inkscape:export-filename="C:\Users\BUCH\Desktop\Retrogaming\Recalbox\travail thèmes\Thème vignette !!!!!!!\Maquette 2 !!!!\rect849.png"
         inkscape:export-xdpi="247.96268"
         inkscape:export-ydpi="247.96268" />
    </clipPath>
  </defs>
  <sodipodi:namedview
     id="namedview4"
     pagecolor="#ffffff"
     bordercolor="#666666"
     borderopacity="1.0"
     inkscape:pageshadow="2"
     inkscape:pageopacity="0.0"
     inkscape:pagecheckerboard="true"
     showgrid="false"
     inkscape:showpageshadow="false"
     inkscape:zoom="8.8242196"
     inkscape:cx="36.660466"
     inkscape:cy="10.6525"
     inkscape:window-width="1920"
     inkscape:window-height="1138"
     inkscape:window-x="-8"
     inkscape:window-y="-8"
     inkscape:window-maximized="1"
     inkscape:current-layer="svg2"
     fit-margin-top="0"
     fit-margin-left="0"
     fit-margin-right="0"
     fit-margin-bottom="0" />
</svg>
