<?xml version="1.0" encoding="UTF-8" standalone="no"?>
<!-- Created with Inkscape (http://www.inkscape.org/) -->

<svg
   version="1.1"
   id="svg2"
   width="73.679573"
   height="9.4666433"
   viewBox="0 0 73.679576 9.4666433"
   sodipodi:docname="auto-rpgdungeoncrawler.svg"
   inkscape:version="1.1 (c68e22c387, 2021-05-23)"
   inkscape:export-filename="C:\Users\BUCH\Desktop\Retrogaming\Recalbox\travail thèmes\Thème vignette !!!!!!!\Maquette 2 !!!!\image1250.png"
   inkscape:export-xdpi="96.460785"
   inkscape:export-ydpi="96.460785"
   xmlns:inkscape="http://www.inkscape.org/namespaces/inkscape"
   xmlns:sodipodi="http://sodipodi.sourceforge.net/DTD/sodipodi-0.dtd"
   xmlns="http://www.w3.org/2000/svg"
   xmlns:svg="http://www.w3.org/2000/svg">
  <defs
     id="defs6">
    <clipPath
       clipPathUnits="userSpaceOnUse"
       id="clipPath3185">
      <path
         id="path3187"
         style="fill:#ffffff;fill-rule:evenodd;stroke:#ffffff;stroke-width:5.15903;stroke-linecap:round;stroke-linejoin:round;paint-order:stroke fill markers"
         d="m 1157.5591,335.78677 h 462.4206 L 1362.3723,1410.6277 H 899.95176 Z"
         sodipodi:nodetypes="ccccc"
         inkscape:export-filename="C:\Users\BUCH\Desktop\Retrogaming\Recalbox\travail thèmes\Thème vignette !!!!!!!\Maquette 2 !!!!\rect849.png"
         inkscape:export-xdpi="247.96268"
         inkscape:export-ydpi="247.96268" />
    </clipPath>
  </defs>
  <sodipodi:namedview
     id="namedview4"
     pagecolor="#ffffff"
     bordercolor="#666666"
     borderopacity="1.0"
     inkscape:pageshadow="2"
     inkscape:pageopacity="0.0"
     inkscape:pagecheckerboard="true"
     showgrid="false"
     inkscape:showpageshadow="false"
     inkscape:zoom="8.8242196"
     inkscape:cx="31.334216"
     inkscape:cy="1.3598936"
     inkscape:window-width="1920"
     inkscape:window-height="1138"
     inkscape:window-x="-8"
     inkscape:window-y="-8"
     inkscape:window-maximized="1"
     inkscape:current-layer="svg2"
     fit-margin-top="0"
     fit-margin-left="0"
     fit-margin-right="0"
     fit-margin-bottom="0" />
  <g
     aria-label="dungeon crawler"
     id="text2288"
     style="font-weight:300;font-size:13.3333px;line-height:1.25;font-family:'Bebas Neue';-inkscape-font-specification:'Bebas Neue, Light';fill:#ffffff"
     transform="translate(2.4315704,-18.566267)">
    <path
       d="m -2.4315704,18.632934 v 9.33331 h 1.95999503 c 1.41332976,0 2.01332827,-0.999998 2.01332827,-2.319994 v -4.679989 c 0,-1.33333 -0.59999851,-2.333327 -2.02666157,-2.333327 z m 0.2933326,9.05331 v -8.773311 h 1.65332913 c 1.23999687,0 1.73332897,0.866665 1.73332897,2.039995 v 4.706655 c 0,1.159997 -0.4799988,2.026661 -1.73332897,2.026661 z"
       id="path2715" />
    <path
       d="M 2.8617422,18.632934 H 2.5684096 v 7.026649 c 0,1.279997 0.5066654,2.373327 1.9333284,2.373327 1.4133298,0 1.9199952,-1.09333 1.9199952,-2.373327 V 18.632934 H 6.1417339 v 7.039982 c 0,1.119997 -0.399999,2.093328 -1.6399959,2.093328 -1.2399968,0 -1.6399958,-0.973331 -1.6399958,-2.093328 z"
       id="path2717" />
    <path
       d="m 7.7550451,19.0596 3.3333249,8.906644 h 0.359999 v -9.33331 H 11.16837 v 8.733311 L 7.8883781,18.632934 H 7.4750458 v 9.33331 h 0.2799993 z"
       id="path2719" />
    <path
       d="m 14.44834,18.566267 c -1.41333,0 -1.946662,1.066664 -1.946662,2.359995 v 4.746654 c 0,1.29333 0.533332,2.359994 1.946662,2.359994 1.426663,0 1.959995,-1.066664 1.959995,-2.359994 v -2.373327 h -1.746662 v 0.266666 h 1.453329 v 2.119995 c 0,1.13333 -0.426665,2.066661 -1.653329,2.066661 -1.239997,0 -1.666662,-0.933331 -1.666662,-2.066661 v -4.773322 c 0,-1.13333 0.426665,-2.079995 1.666662,-2.079995 1.226664,0 1.653329,0.946665 1.653329,2.079995 v 0.626665 h 0.293333 v -0.613331 c 0,-1.293331 -0.533332,-2.359995 -1.959995,-2.359995 z"
       id="path2721" />
    <path
       d="m 17.754977,23.099589 v -4.186656 h 3.266659 v -0.279999 h -3.559991 v 9.33331 h 3.559991 v -0.28 h -3.266659 v -4.319989 h 2.74666 v -0.266666 z"
       id="path2723" />
    <path
       d="m 22.048291,25.672916 c 0,1.306664 0.559998,2.359994 1.973328,2.359994 1.439997,0 1.999995,-1.05333 1.999995,-2.359994 v -4.746654 c 0,-1.306664 -0.559998,-2.359995 -1.999995,-2.359995 -1.41333,0 -1.973328,1.053331 -1.973328,2.359995 z m 0.293332,-4.759988 c 0,-1.146664 0.439999,-2.079995 1.679996,-2.079995 1.25333,0 1.706663,0.933331 1.706663,2.079995 v 4.773322 c 0,1.146663 -0.453333,2.079994 -1.706663,2.079994 -1.239997,0 -1.679996,-0.933331 -1.679996,-2.079994 z"
       id="path2725" />
    <path
       d="m 27.354937,19.0596 3.333325,8.906644 h 0.359999 v -9.33331 h -0.28 v 8.733311 L 27.48827,18.632934 h -0.413333 v 9.33331 h 0.28 z"
       id="path2727" />
    <path
       d="m 36.114875,18.566267 c -1.41333,0 -1.946661,1.066664 -1.946661,2.359995 v 4.746654 c 0,1.29333 0.533331,2.359994 1.946661,2.359994 1.426663,0 1.959995,-1.066664 1.959995,-2.359994 v -1.013331 h -0.293332 v 1.026665 c 0,1.13333 -0.426666,2.066661 -1.653329,2.066661 -1.239997,0 -1.666663,-0.933331 -1.666663,-2.066661 v -4.773322 c 0,-1.13333 0.426666,-2.079995 1.666663,-2.079995 1.226663,0 1.653329,0.946665 1.653329,2.079995 v 0.733332 h 0.293332 v -0.719998 c 0,-1.293331 -0.533332,-2.359995 -1.959995,-2.359995 z"
       id="path2729" />
    <path
       d="m 39.114854,18.632934 v 9.33331 h 0.293333 v -4.306656 h 1.146664 c 1.21333,0 2.039995,0.359999 2.039995,1.733329 v 1.466663 c 0,0.399999 0.04,0.813331 0.226666,1.106664 h 0.319999 C 42.928178,27.672911 42.888178,27.219579 42.888178,26.85958 v -1.466663 c 0,-1.026664 -0.439999,-1.706662 -1.479996,-1.866662 1.026664,-0.186666 1.479996,-0.813331 1.479996,-1.959995 v -0.839998 c 0,-1.279997 -0.533332,-2.093328 -1.919995,-2.093328 z m 0.293333,4.746655 v -4.466656 h 1.546663 c 1.199997,0 1.639996,0.706665 1.639996,1.839996 v 0.853331 c 0,1.439996 -0.746665,1.773329 -2.039995,1.773329 z"
       id="path2731" />
    <path
       d="m 48.27482,25.766249 0.546665,2.199995 h 0.293333 l -2.306661,-9.346643 h -0.413332 l -2.253328,9.346643 h 0.266666 l 0.546666,-2.199995 z m -1.679996,-6.799983 1.626663,6.533317 h -3.213325 z"
       id="path2733" />
    <path
       d="m 53.608103,19.326266 1.506663,8.639978 h 0.386666 l 1.653329,-9.33331 h -0.266666 l -1.573329,8.879978 -1.519996,-8.826645 h -0.36 l -1.613329,8.879978 -1.626662,-8.933311 h -0.293333 l 1.679996,9.33331 h 0.426665 z"
       id="path2735" />
    <path
       d="m 61.608056,27.966244 v -0.28 h -3.133325 v -9.05331 h -0.293333 v 9.33331 z"
       id="path2737" />
    <path
       d="m 62.914695,23.099589 v -4.186656 h 3.266658 v -0.279999 h -3.559991 v 9.33331 h 3.559991 v -0.28 h -3.266658 v -4.319989 h 2.74666 v -0.266666 z"
       id="path2739" />
    <path
       d="m 67.221346,18.632934 v 9.33331 h 0.293332 v -4.306656 h 1.146664 c 1.21333,0 2.039995,0.359999 2.039995,1.733329 v 1.466663 c 0,0.399999 0.04,0.813331 0.226666,1.106664 h 0.319999 C 71.034669,27.672911 70.994669,27.219579 70.994669,26.85958 v -1.466663 c 0,-1.026664 -0.439999,-1.706662 -1.479996,-1.866662 1.026664,-0.186666 1.479996,-0.813331 1.479996,-1.959995 v -0.839998 c 0,-1.279997 -0.533332,-2.093328 -1.919995,-2.093328 z m 0.293332,4.746655 v -4.466656 h 1.546663 c 1.199997,0 1.639996,0.706665 1.639996,1.839996 v 0.853331 c 0,1.439996 -0.746665,1.773329 -2.039995,1.773329 z"
       id="path2741" />
  </g>
</svg>
