<?xml version="1.0" encoding="UTF-8" standalone="no"?>
<!-- Created with Inkscape (http://www.inkscape.org/) -->

<svg
   version="1.1"
   id="svg2"
   width="13.74661"
   height="9.4666424"
   viewBox="0 0 13.74661 9.4666423"
   sodipodi:docname="auto-rpg.svg"
   inkscape:version="1.1 (c68e22c387, 2021-05-23)"
   inkscape:export-filename="C:\Users\BUCH\Desktop\Retrogaming\Recalbox\travail thèmes\Thème vignette !!!!!!!\Maquette 2 !!!!\image1250.png"
   inkscape:export-xdpi="96.460785"
   inkscape:export-ydpi="96.460785"
   xmlns:inkscape="http://www.inkscape.org/namespaces/inkscape"
   xmlns:sodipodi="http://sodipodi.sourceforge.net/DTD/sodipodi-0.dtd"
   xmlns="http://www.w3.org/2000/svg"
   xmlns:svg="http://www.w3.org/2000/svg">
  <defs
     id="defs6">
    <clipPath
       clipPathUnits="userSpaceOnUse"
       id="clipPath3185">
      <path
         id="path3187"
         style="fill:#ffffff;fill-rule:evenodd;stroke:#ffffff;stroke-width:5.15903;stroke-linecap:round;stroke-linejoin:round;paint-order:stroke fill markers"
         d="m 1157.5591,335.78677 h 462.4206 L 1362.3723,1410.6277 H 899.95176 Z"
         sodipodi:nodetypes="ccccc"
         inkscape:export-filename="C:\Users\BUCH\Desktop\Retrogaming\Recalbox\travail thèmes\Thème vignette !!!!!!!\Maquette 2 !!!!\rect849.png"
         inkscape:export-xdpi="247.96268"
         inkscape:export-ydpi="247.96268" />
    </clipPath>
  </defs>
  <sodipodi:namedview
     id="namedview4"
     pagecolor="#ffffff"
     bordercolor="#666666"
     borderopacity="1.0"
     inkscape:pageshadow="2"
     inkscape:pageopacity="0.0"
     inkscape:pagecheckerboard="true"
     showgrid="false"
     inkscape:showpageshadow="false"
     inkscape:zoom="12.479331"
     inkscape:cx="13.422194"
     inkscape:cy="13.382128"
     inkscape:window-width="1920"
     inkscape:window-height="1138"
     inkscape:window-x="-8"
     inkscape:window-y="-8"
     inkscape:window-maximized="1"
     inkscape:current-layer="svg2"
     fit-margin-top="0"
     fit-margin-left="0"
     fit-margin-right="0"
     fit-margin-bottom="0" />
  <g
     aria-label="rpg"
     id="text1003"
     style="font-weight:300;font-size:13.3333px;line-height:1.25;font-family:'Bebas Neue';-inkscape-font-specification:'Bebas Neue, Light';fill:#ffffff"
     transform="translate(-9.6684371,15.890709)">
    <path
       d="m 9.6684371,-15.824042 v 9.3333093 h 0.2933326 v -4.3066553 h 1.1466633 c 1.213331,0 2.039995,0.359999 2.039995,1.7333285 v 1.466663 c 0,0.3999989 0.04,0.8133312 0.226666,1.1066638 h 0.32 c -0.213333,-0.2933326 -0.253333,-0.7466647 -0.253333,-1.1066638 v -1.466663 c 0,-1.0266645 -0.439999,-1.7066625 -1.479996,-1.8666615 1.026664,-0.186667 1.479996,-0.813332 1.479996,-1.959995 v -0.839998 c 0,-1.279997 -0.533332,-2.093328 -1.919995,-2.093328 z m 0.2933326,4.746654 v -4.466655 h 1.5466623 c 1.199997,0 1.639996,0.706665 1.639996,1.839995 v 0.853331 c 0,1.439997 -0.746664,1.773329 -2.039995,1.773329 z"
       id="path1320" />
    <path
       d="m 14.73508,-15.824042 v 9.3333093 h 0.293332 v -3.9599903 h 1.33333 c 1.479997,0 2.146662,-0.706665 2.146662,-2.186661 v -0.933331 c 0,-1.306663 -0.493332,-2.253327 -1.933329,-2.253327 z m 0.293332,5.09332 v -4.813321 h 1.546663 c 1.25333,0 1.639996,0.813331 1.639996,1.959995 v 0.959997 c 0,1.319997 -0.546665,1.893329 -1.853329,1.893329 z"
       id="path1322" />
    <path
       d="m 21.455052,-15.890709 c -1.413329,0 -1.946661,1.066664 -1.946661,2.359994 v 4.7466548 c 0,1.2933301 0.533332,2.359994 1.946661,2.359994 1.426663,0 1.959995,-1.0666639 1.959995,-2.359994 v -2.3733278 h -1.746662 v 0.266666 h 1.45333 v 2.1199951 c 0,1.1333305 -0.426666,2.0666614 -1.653329,2.0666614 -1.239997,0 -1.666663,-0.9333309 -1.666663,-2.0666614 v -4.7733211 c 0,-1.133331 0.426666,-2.079995 1.666663,-2.079995 1.226663,0 1.653329,0.946664 1.653329,2.079995 v 0.626665 h 0.293332 v -0.613332 c 0,-1.29333 -0.533332,-2.359994 -1.959995,-2.359994 z"
       id="path1324" />
  </g>
</svg>
