<?xml version="1.0" encoding="UTF-8" standalone="no"?>
<!-- Created with Inkscape (http://www.inkscape.org/) -->

<svg
   version="1.1"
   id="svg2"
   width="13.498218"
   height="7.8281412"
   viewBox="0 0 13.498218 7.8281412"
   sodipodi:docname="auto-arcade-seibu.svg"
   inkscape:version="1.1 (c68e22c387, 2021-05-23)"
   xmlns:inkscape="http://www.inkscape.org/namespaces/inkscape"
   xmlns:sodipodi="http://sodipodi.sourceforge.net/DTD/sodipodi-0.dtd"
   xmlns="http://www.w3.org/2000/svg"
   xmlns:svg="http://www.w3.org/2000/svg">
  <defs
     id="defs6" />
  <sodipodi:namedview
     id="namedview4"
     pagecolor="#ffffff"
     bordercolor="#666666"
     borderopacity="1.0"
     inkscape:pageshadow="2"
     inkscape:pageopacity="0.0"
     inkscape:pagecheckerboard="true"
     showgrid="false"
     inkscape:zoom="35.68"
     inkscape:cx="7.1328476"
     inkscape:cy="4.1479821"
     inkscape:window-width="1920"
     inkscape:window-height="1138"
     inkscape:window-x="-8"
     inkscape:window-y="-8"
     inkscape:window-maximized="1"
     inkscape:current-layer="g8"
     inkscape:showpageshadow="false"
     fit-margin-top="0"
     fit-margin-left="0"
     fit-margin-right="0"
     fit-margin-bottom="0" />
  <g
     inkscape:groupmode="layer"
     inkscape:label="Image"
     id="g8"
     transform="translate(-3.3236298,173.67413)">
    <g
       id="g11617">
      <ellipse
         style="fill:#ffffff;fill-opacity:1;fill-rule:evenodd;stroke:none;stroke-width:0.709878;stroke-linecap:round;stroke-linejoin:round;stroke-miterlimit:4;stroke-dasharray:none;paint-order:fill markers stroke"
         id="path11469"
         cx="6.7529888"
         cy="-169.3598"
         rx="0.619313"
         ry="0.76794809" />
      <ellipse
         style="fill:#ffffff;fill-opacity:1;fill-rule:evenodd;stroke:none;stroke-width:0.891173;stroke-linecap:round;stroke-linejoin:round;stroke-miterlimit:4;stroke-dasharray:none;paint-order:fill markers stroke"
         id="ellipse11595"
         cx="4.6720972"
         cy="-168.38872"
         rx="0.97603726"
         ry="0.76794809" />
      <g
         id="g11369"
         transform="matrix(0.01299818,0,0,0.01299818,3.620298,-165.19686)"
         style="stroke:#ffffff;stroke-width:38.4669;stroke-linecap:round;stroke-linejoin:round;stroke-miterlimit:4;stroke-dasharray:none">
        <path
           style="display:inline;fill:#193591;fill-opacity:1;stroke:#ffffff;stroke-width:38.4669;stroke-linecap:round;stroke-linejoin:round;stroke-miterlimit:4;stroke-dasharray:none"
           d="M 24.948682,-71.301546 C 12.211333,-75.681332 2.7954088,-85.173552 -1.5205331,-97.985232 c -1.990823,-5.909668 -2.066911,-8.181448 -2.066911,-61.712528 v -55.577 l 2.4820525,-2.48205 2.4820523,-2.48205 49.1068503,0.2775 49.106845,0.27751 1.911104,2.36078 c 1.81495,2.24201 1.9111,4.51485 1.9111,45.17328 v 42.81249 l 2.56028,3.04272 c 3.22155,3.82859 8.04407,4.88381 12.28859,2.68888 1.70051,-0.87937 3.55518,-2.46461 4.12149,-3.52276 1.4137,-2.64153 1.42015,-124.45721 0.007,-127.09821 -2.31134,-4.31826 -3.48634,-4.43481 -49.977364,-4.95718 -43.731501,-0.49137 -44.599898,-0.54032 -50.28458,-2.83479 -6.661114,-2.68857 -16.3204357,-11.10498 -20.0365661,-17.45836 -5.856745,-10.01314 -5.678854,-6.6012 -5.678854,-108.9199 0,-92.21712 0.03596,-93.95679 2.066911,-99.98557 4.4858731,-13.31611 14.7739481,-23.36104 27.8645901,-27.20603 4.778279,-1.40348 15.318916,-1.59535 87.644673,-1.59535 79.41954,0 82.43344,0.068 88.69585,2.0023 8.43317,2.60474 16.82002,8.88583 21.77739,16.30955 7.10913,10.646 6.95059,8.87152 6.95059,77.79707 v 61.74592 l -2.63486,2.07258 c -2.58293,2.03174 -3.58578,2.07258 -50.88921,2.07258 -46.01237,0 -48.36405,-0.0888 -50.61515,-1.91071 l -2.36078,-1.91072 -0.5,-45.17863 -0.5,-45.17863 -2.37645,-1.92334 c -4.89733,-3.96357 -10.5874,-3.65855 -14.70878,0.7885 l -2.41477,2.60558 v 60.3382 60.3382 l 2.91672,3.26577 2.91671,3.26578 44.83329,0.5 c 42.92094,0.47867 45.0559,0.59138 50.05248,2.64222 7.86253,3.22718 14.71709,8.76143 19.23926,15.53342 7.46331,11.1764 7.11378,5.56283 6.81179,109.39993 l -0.27025,92.924428 -2.61444,5.5 c -5.3773,11.31223 -14.5895,19.592716 -25.57059,22.984436 -6.32336,1.95308 -9.0874,2.01452 -89.17031,1.98207 -80.674633,-0.0327 -82.786827,-0.0824 -88.608538,-2.0842 z m 253.463878,0.2428 c -13.1088,-4.212296 -23.53689,-14.888476 -27.40465,-28.056606 -1.42645,-4.856458 -1.59535,-20.011368 -1.59535,-143.144668 0,-134.54682 0.0456,-137.86094 1.98524,-144.14062 3.88333,-12.57277 12.63004,-22.99073 23.98434,-28.56709 l 5.53042,-2.71612 h 39.5 39.5 l 5.9824,3 c 11.62554,5.82987 21.67744,19.1273 24.41589,32.29922 1.44615,6.95598 1.56433,252.46786 0.12282,255.16134 -1.853,3.46236 -6.52033,4.03944 -32.67033,4.03944 h -25.35078 v 9 9 h 22.53212 c 24.79646,0 27.12723,0.42958 31.67864,5.838618 7.82984,9.30524 5.18499,22.88684 -5.4605,28.040226 -4.2776,2.07075 -5.48493,2.11987 -50.81598,2.06737 -41.56164,-0.0481 -47.01143,-0.23923 -51.93428,-1.82111 z m 46.58068,-123.266314 c 1.14438,-0.55854 2.83188,-2.28719 3.75,-3.84145 1.51805,-2.56984 1.66898,-9.42712 1.66558,-75.67163 -0.004,-70.43958 -0.0681,-72.95126 -1.95217,-76.04124 -3.99301,-6.54872 -14.33216,-6.37304 -18.71631,0.31803 -1.72833,2.63777 -1.82778,6.77336 -1.82778,76.01019 0,72.74686 0.0136,73.23892 2.09366,76.04398 3.49476,4.71272 9.31777,5.94909 14.98702,3.18212 z m 82.2801,123.229634 -2.36078,-1.91157 -0.28752,-167.838424 c -0.15813,-92.31114 -0.0205,-169.32603 0.30578,-171.14421 0.32631,-1.81817 1.46819,-4.18067 2.53752,-5.25 1.88159,-1.88159 3.84047,-1.94422 60.80936,-1.94422 58.03808,0 58.90216,0.0291 61.5,2.07258 l 2.63486,2.07258 v 170.92742 c 0,169.594084 -0.0156,170.943014 -2,172.927414 -1.9551,1.9551 -3.33333,2 -61.38922,2 -56.98341,0 -59.48485,-0.0774 -61.75,-1.91157 z m 146.04958,0.04007 -2.41036,-1.95179 V -244.18385 -415.36056 l 2.36078,-1.91164 c 2.22328,-1.8003 4.38655,-1.91165 37.13922,-1.91165 32.74741,0 34.9163,0.11159 37.13922,1.91087 l 2.36078,1.91087 0.28325,39.58913 0.28325,39.58913 h 12.28309 c 6.7557,0 14.93514,0.49026 18.17654,1.08946 16.3257,3.01797 28.77461,15.89389 31.50899,32.58977 1.38987,8.48644 1.27064,193.29579 -0.1296,200.88711 -2.33866,12.678828 -10.90136,23.730608 -22.65288,29.237764 l -5.75264,2.69589 -54.08964,0.29015 c -52.3842,0.281 -54.16563,0.2286 -56.5,-1.66165 z m 74.12237,-53.645424 c 6.25308,-3.23359 6.03174,-0.0868 5.73613,-81.55221 l -0.26886,-74.09551 -3.26578,-2.91767 c -4.41311,-3.94272 -9.05533,-3.94272 -13.46844,0 l -3.26578,2.91767 -0.26886,74.09551 c -0.2976,82.01428 -0.54293,78.72342 6.08357,81.60548 4.11,1.78756 5.17079,1.78108 8.71802,-0.0533 z m 109.45421,53.718154 c -11.90195,-4.115596 -18.637,-10.080696 -23.8843,-21.153856 l -3.10264,-6.54737 -0.25938,-206.740618 c -0.25832,-205.90242 -0.25122,-206.74878 1.75,-208.75 1.9583,-1.9583 3.26584,-2.00938 51.4368,-2.00938 h 49.42742 l 2.07258,2.63486 2.07258,2.63486 v 190.46514 190.46514 l 3.4,3.4 c 4.53226,4.53226 9.4501,4.70375 13.67692,0.47692 l 2.92308,-2.92307 v -190.94207 -190.94206 l 2.07258,-2.63486 2.07258,-2.63486 h 49.42742 c 48.09409,0 49.48137,0.054 51.42742,2 1.979,1.979 2,3.33333 2,129 v 127 h 23.86514 c 22.62953,0 24.00156,0.10731 26.5,2.07258 l 2.63486,2.07258 v 90.42742 c 0,89.094084 -0.0295,90.456904 -2,92.427414 -1.89831,1.89831 -3.33333,2 -28.22336,2 h -26.22336 l -5.52664,-5.798786 -5.52664,-5.79878 -5,3.81529 c -2.75,2.098396 -7.8599,4.707856 -11.35534,5.798776 -6.1247,1.91152 -9.33624,1.98232 -88.5,1.95085 -75.28818,-0.0299 -82.56309,-0.17733 -87.15772,-1.76612 z"
           id="path863"
           sodipodi:nodetypes="csscccccsscssscsssssssssscssscccsscccccsssscssscssssscccsssscccssssssscssscsscssssscssssscccssscccssssscsssscsscsssssscssscccccsscccccssscsscssscccssss" />
        <path
           d="m 457.66224,-436.18171 c -41.11118,-5.79475 -73.45064,-35.1373 -83.42629,-75.69516 -3.04791,-12.39182 -3.04791,-32.22215 0,-44.61398 12.07999,-49.1134 57.72389,-81.5229 106.78168,-75.8203 22.93281,2.6657 41.03038,11.1178 57.51449,26.8609 17.50599,16.7191 27.43537,36.8135 30.13692,60.98898 5.53671,49.54674 -28.56957,96.53581 -77.54706,106.83854 -8.91307,1.87493 -25.35704,2.58312 -33.45974,1.44102 z"
           style="display:inline;fill:#f03190;fill-opacity:1;stroke:#ffffff;stroke-width:38.4669;stroke-linecap:round;stroke-linejoin:round;stroke-miterlimit:4;stroke-dasharray:none"
           id="path8278" />
      </g>
      <g
         id="g11381"
         transform="matrix(0.01299818,0,0,0.01299818,3.620298,-165.19686)">
        <path
           style="display:inline;fill:#193591;fill-opacity:1"
           d="M 24.948682,-71.301546 C 12.211333,-75.681332 2.7954088,-85.173552 -1.5205331,-97.985232 c -1.990823,-5.909668 -2.066911,-8.181448 -2.066911,-61.712528 v -55.577 l 2.4820525,-2.48205 2.4820523,-2.48205 49.1068503,0.2775 49.106845,0.27751 1.911104,2.36078 c 1.81495,2.24201 1.9111,4.51485 1.9111,45.17328 v 42.81249 l 2.56028,3.04272 c 3.22155,3.82859 8.04407,4.88381 12.28859,2.68888 1.70051,-0.87937 3.55518,-2.46461 4.12149,-3.52276 1.4137,-2.64153 1.42015,-124.45721 0.007,-127.09821 -2.31134,-4.31826 -3.48634,-4.43481 -49.977364,-4.95718 -43.731501,-0.49137 -44.599898,-0.54032 -50.28458,-2.83479 -6.661114,-2.68857 -16.3204357,-11.10498 -20.0365661,-17.45836 -5.856745,-10.01314 -5.678854,-6.6012 -5.678854,-108.9199 0,-92.21712 0.03596,-93.95679 2.066911,-99.98557 4.4858731,-13.31611 14.7739481,-23.36104 27.8645901,-27.20603 4.778279,-1.40348 15.318916,-1.59535 87.644673,-1.59535 79.41954,0 82.43344,0.068 88.69585,2.0023 8.43317,2.60474 16.82002,8.88583 21.77739,16.30955 7.10913,10.646 6.95059,8.87152 6.95059,77.79707 v 61.74592 l -2.63486,2.07258 c -2.58293,2.03174 -3.58578,2.07258 -50.88921,2.07258 -46.01237,0 -48.36405,-0.0888 -50.61515,-1.91071 l -2.36078,-1.91072 -0.5,-45.17863 -0.5,-45.17863 -2.37645,-1.92334 c -4.89733,-3.96357 -10.5874,-3.65855 -14.70878,0.7885 l -2.41477,2.60558 v 60.3382 60.3382 l 2.91672,3.26577 2.91671,3.26578 44.83329,0.5 c 42.92094,0.47867 45.0559,0.59138 50.05248,2.64222 7.86253,3.22718 14.71709,8.76143 19.23926,15.53342 7.46331,11.1764 7.11378,5.56283 6.81179,109.39993 l -0.27025,92.924428 -2.61444,5.5 c -5.3773,11.31223 -14.5895,19.592716 -25.57059,22.984436 -6.32336,1.95308 -9.0874,2.01452 -89.17031,1.98207 -80.674633,-0.0327 -82.786827,-0.0824 -88.608538,-2.0842 z m 253.463878,0.2428 c -13.1088,-4.212296 -23.53689,-14.888476 -27.40465,-28.056606 -1.42645,-4.856458 -1.59535,-20.011368 -1.59535,-143.144668 0,-134.54682 0.0456,-137.86094 1.98524,-144.14062 3.88333,-12.57277 12.63004,-22.99073 23.98434,-28.56709 l 5.53042,-2.71612 h 39.5 39.5 l 5.9824,3 c 11.62554,5.82987 21.67744,19.1273 24.41589,32.29922 1.44615,6.95598 1.56433,252.46786 0.12282,255.16134 -1.853,3.46236 -6.52033,4.03944 -32.67033,4.03944 h -25.35078 v 9 9 h 22.53212 c 24.79646,0 27.12723,0.42958 31.67864,5.838618 7.82984,9.30524 5.18499,22.88684 -5.4605,28.040226 -4.2776,2.07075 -5.48493,2.11987 -50.81598,2.06737 -41.56164,-0.0481 -47.01143,-0.23923 -51.93428,-1.82111 z m 46.58068,-123.266314 c 1.14438,-0.55854 2.83188,-2.28719 3.75,-3.84145 1.51805,-2.56984 1.66898,-9.42712 1.66558,-75.67163 -0.004,-70.43958 -0.0681,-72.95126 -1.95217,-76.04124 -3.99301,-6.54872 -14.33216,-6.37304 -18.71631,0.31803 -1.72833,2.63777 -1.82778,6.77336 -1.82778,76.01019 0,72.74686 0.0136,73.23892 2.09366,76.04398 3.49476,4.71272 9.31777,5.94909 14.98702,3.18212 z m 82.2801,123.229634 -2.36078,-1.91157 -0.28752,-167.838424 c -0.15813,-92.31114 -0.0205,-169.32603 0.30578,-171.14421 0.32631,-1.81817 1.46819,-4.18067 2.53752,-5.25 1.88159,-1.88159 3.84047,-1.94422 60.80936,-1.94422 58.03808,0 58.90216,0.0291 61.5,2.07258 l 2.63486,2.07258 v 170.92742 c 0,169.594084 -0.0156,170.943014 -2,172.927414 -1.9551,1.9551 -3.33333,2 -61.38922,2 -56.98341,0 -59.48485,-0.0774 -61.75,-1.91157 z m 146.04958,0.04007 -2.41036,-1.95179 V -244.18385 -415.36056 l 2.36078,-1.91164 c 2.22328,-1.8003 4.38655,-1.91165 37.13922,-1.91165 32.74741,0 34.9163,0.11159 37.13922,1.91087 l 2.36078,1.91087 0.28325,39.58913 0.28325,39.58913 h 12.28309 c 6.7557,0 14.93514,0.49026 18.17654,1.08946 16.3257,3.01797 28.77461,15.89389 31.50899,32.58977 1.38987,8.48644 1.27064,193.29579 -0.1296,200.88711 -2.33866,12.678828 -10.90136,23.730608 -22.65288,29.237764 l -5.75264,2.69589 -54.08964,0.29015 c -52.3842,0.281 -54.16563,0.2286 -56.5,-1.66165 z m 74.12237,-53.645424 c 6.25308,-3.23359 6.03174,-0.0868 5.73613,-81.55221 l -0.26886,-74.09551 -3.26578,-2.91767 c -4.41311,-3.94272 -9.05533,-3.94272 -13.46844,0 l -3.26578,2.91767 -0.26886,74.09551 c -0.2976,82.01428 -0.54293,78.72342 6.08357,81.60548 4.11,1.78756 5.17079,1.78108 8.71802,-0.0533 z m 109.45421,53.718154 c -11.90195,-4.115596 -18.637,-10.080696 -23.8843,-21.153856 l -3.10264,-6.54737 -0.25938,-206.740618 c -0.25832,-205.90242 -0.25122,-206.74878 1.75,-208.75 1.9583,-1.9583 3.26584,-2.00938 51.4368,-2.00938 h 49.42742 l 2.07258,2.63486 2.07258,2.63486 v 190.46514 190.46514 l 3.4,3.4 c 4.53226,4.53226 9.4501,4.70375 13.67692,0.47692 l 2.92308,-2.92307 v -190.94207 -190.94206 l 2.07258,-2.63486 2.07258,-2.63486 h 49.42742 c 48.09409,0 49.48137,0.054 51.42742,2 1.979,1.979 2,3.33333 2,129 v 127 h 23.86514 c 22.62953,0 24.00156,0.10731 26.5,2.07258 l 2.63486,2.07258 v 90.42742 c 0,89.094084 -0.0295,90.456904 -2,92.427414 -1.89831,1.89831 -3.33333,2 -28.22336,2 h -26.22336 l -5.52664,-5.798786 -5.52664,-5.79878 -5,3.81529 c -2.75,2.098396 -7.8599,4.707856 -11.35534,5.798776 -6.1247,1.91152 -9.33624,1.98232 -88.5,1.95085 -75.28818,-0.0299 -82.56309,-0.17733 -87.15772,-1.76612 z"
           id="path11377"
           sodipodi:nodetypes="csscccccsscssscsssssssssscssscccsscccccsssscssscssssscccsssscccssssssscssscsscssssscssssscccssscccssssscsssscsscsssssscssscccccsscccccssscsscssscccssss" />
        <path
           d="m 457.66224,-436.18171 c -41.11118,-5.79475 -73.45064,-35.1373 -83.42629,-75.69516 -3.04791,-12.39182 -3.04791,-32.22215 0,-44.61398 12.07999,-49.1134 57.72389,-81.5229 106.78168,-75.8203 22.93281,2.6657 41.03038,11.1178 57.51449,26.8609 17.50599,16.7191 27.43537,36.8135 30.13692,60.98898 5.53671,49.54674 -28.56957,96.53581 -77.54706,106.83854 -8.91307,1.87493 -25.35704,2.58312 -33.45974,1.44102 z"
           style="display:inline;fill:#f03190;fill-opacity:1"
           id="path11379" />
      </g>
    </g>
  </g>
</svg>
