<?xml version="1.0" encoding="UTF-8" standalone="no"?>
<!-- Created with Inkscape (http://www.inkscape.org/) -->

<svg
   version="1.1"
   id="svg2"
   width="40.546425"
   height="9.4666424"
   viewBox="0 0 40.546426 9.4666423"
   sodipodi:docname="channelf.svg"
   inkscape:version="1.1 (c68e22c387, 2021-05-23)"
   inkscape:export-filename="C:\Users\BUCH\Desktop\Retrogaming\Recalbox\travail thèmes\Thème vignette !!!!!!!\Maquette 2 !!!!\image1250.png"
   inkscape:export-xdpi="96.460785"
   inkscape:export-ydpi="96.460785"
   xmlns:inkscape="http://www.inkscape.org/namespaces/inkscape"
   xmlns:sodipodi="http://sodipodi.sourceforge.net/DTD/sodipodi-0.dtd"
   xmlns="http://www.w3.org/2000/svg"
   xmlns:svg="http://www.w3.org/2000/svg">
  <defs
     id="defs6">
    <clipPath
       clipPathUnits="userSpaceOnUse"
       id="clipPath3185">
      <path
         id="path3187"
         style="fill:#ffffff;fill-rule:evenodd;stroke:#ffffff;stroke-width:5.15903;stroke-linecap:round;stroke-linejoin:round;paint-order:stroke fill markers"
         d="m 1157.5591,335.78677 h 462.4206 L 1362.3723,1410.6277 H 899.95176 Z"
         sodipodi:nodetypes="ccccc"
         inkscape:export-filename="C:\Users\BUCH\Desktop\Retrogaming\Recalbox\travail thèmes\Thème vignette !!!!!!!\Maquette 2 !!!!\rect849.png"
         inkscape:export-xdpi="247.96268"
         inkscape:export-ydpi="247.96268" />
    </clipPath>
  </defs>
  <sodipodi:namedview
     id="namedview4"
     pagecolor="#ffffff"
     bordercolor="#666666"
     borderopacity="1.0"
     inkscape:pageshadow="2"
     inkscape:pageopacity="0.0"
     inkscape:pagecheckerboard="true"
     showgrid="false"
     inkscape:showpageshadow="false"
     inkscape:zoom="12.479331"
     inkscape:cx="24.400346"
     inkscape:cy="22.4371"
     inkscape:window-width="1920"
     inkscape:window-height="1138"
     inkscape:window-x="-8"
     inkscape:window-y="-8"
     inkscape:window-maximized="1"
     inkscape:current-layer="svg2"
     fit-margin-top="0"
     fit-margin-left="0"
     fit-margin-right="0"
     fit-margin-bottom="0" />
  <g
     aria-label="channel f"
     id="text8695"
     style="font-weight:300;font-size:13.3333px;line-height:1.25;font-family:'Bebas Neue';-inkscape-font-specification:'Bebas Neue, Light';fill:#ffffff"
     transform="translate(-2.0425161,16.131106)">
    <path
       d="m 3.9891779,-16.131106 c -1.4133298,0 -1.9466618,1.066664 -1.9466618,2.359994 v 4.7466543 c 0,1.2933301 0.533332,2.3599941 1.9466618,2.3599941 1.426663,0 1.959995,-1.066664 1.959995,-2.3599941 V -10.037788 H 5.6558403 v 1.0266636 c 0,1.1333305 -0.4266656,2.0666615 -1.6533291,2.0666615 -1.2399969,0 -1.6666625,-0.933331 -1.6666625,-2.0666615 v -4.7733216 c 0,-1.13333 0.4266656,-2.079994 1.6666625,-2.079994 1.2266635,0 1.6533291,0.946664 1.6533291,2.079994 v 0.733332 h 0.2933326 v -0.719998 c 0,-1.29333 -0.533332,-2.359994 -1.959995,-2.359994 z"
       id="path9606" />
    <path
       d="m 10.655814,-11.264452 v 4.5333219 h 0.293332 V -16.06444 h -0.293332 v 4.533322 H 7.2824887 V -16.06444 H 6.9891561 v 9.3333099 h 0.2933326 v -4.5333219 z"
       id="path9608" />
    <path
       d="m 16.109118,-8.9311246 0.546665,2.1999945 h 0.293333 l -2.306661,-9.3466429 h -0.413332 l -2.253328,9.3466429 h 0.266666 l 0.546665,-2.1999945 z m -1.679996,-6.7999824 1.626663,6.5333164 H 12.84246 Z"
       id="path9610" />
    <path
       d="m 18.255761,-15.637774 3.333325,8.9066439 h 0.359999 V -16.06444 h -0.279999 v 8.7333114 L 18.389094,-16.06444 h -0.413332 v 9.3333099 h 0.279999 z"
       id="path9612" />
    <path
       d="m 23.295726,-15.637774 3.333325,8.9066439 H 26.98905 V -16.06444 h -0.28 v 8.7333114 L 23.429059,-16.06444 h -0.413333 v 9.3333099 h 0.28 z"
       id="path9614" />
    <path
       d="m 28.349026,-11.597784 v -4.186657 h 3.266658 v -0.279999 h -3.559991 v 9.3333099 h 3.559991 v -0.2799993 h -3.266658 v -4.3199886 h 2.746659 v -0.266666 z"
       id="path9616" />
    <path
       d="M 36.08233,-6.7311301 V -7.0111294 H 32.949005 V -16.06444 h -0.293333 v 9.3333099 z"
       id="path9618" />
    <path
       d="m 39.455616,-11.371118 v -4.413323 h 3.133325 v -0.279999 h -3.426658 v 9.3333099 h 0.293333 v -4.3599889 h 2.613327 v -0.279999 z"
       id="path9620" />
  </g>
</svg>
