<?xml version="1.0" encoding="UTF-8" standalone="no"?>
<!-- Created with Inkscape (http://www.inkscape.org/) -->

<svg
   version="1.1"
   id="svg2"
   width="36.826462"
   height="9.4666433"
   viewBox="0 0 36.826464 9.4666433"
   sodipodi:docname="easyrpg.svg"
   inkscape:version="1.1 (c68e22c387, 2021-05-23)"
   inkscape:export-filename="C:\Users\BUCH\Desktop\Retrogaming\Recalbox\travail thèmes\Thème vignette !!!!!!!\Maquette 2 !!!!\image1250.png"
   inkscape:export-xdpi="96.460785"
   inkscape:export-ydpi="96.460785"
   xmlns:inkscape="http://www.inkscape.org/namespaces/inkscape"
   xmlns:sodipodi="http://sodipodi.sourceforge.net/DTD/sodipodi-0.dtd"
   xmlns="http://www.w3.org/2000/svg"
   xmlns:svg="http://www.w3.org/2000/svg">
  <defs
     id="defs6">
    <clipPath
       clipPathUnits="userSpaceOnUse"
       id="clipPath3185">
      <path
         id="path3187"
         style="fill:#ffffff;fill-rule:evenodd;stroke:#ffffff;stroke-width:5.15903;stroke-linecap:round;stroke-linejoin:round;paint-order:stroke fill markers"
         d="m 1157.5591,335.78677 h 462.4206 L 1362.3723,1410.6277 H 899.95176 Z"
         sodipodi:nodetypes="ccccc"
         inkscape:export-filename="C:\Users\BUCH\Desktop\Retrogaming\Recalbox\travail thèmes\Thème vignette !!!!!!!\Maquette 2 !!!!\rect849.png"
         inkscape:export-xdpi="247.96268"
         inkscape:export-ydpi="247.96268" />
    </clipPath>
  </defs>
  <sodipodi:namedview
     id="namedview4"
     pagecolor="#ffffff"
     bordercolor="#666666"
     borderopacity="1.0"
     inkscape:pageshadow="2"
     inkscape:pageopacity="0.0"
     inkscape:pagecheckerboard="true"
     showgrid="false"
     inkscape:showpageshadow="false"
     inkscape:zoom="12.479331"
     inkscape:cx="18.069879"
     inkscape:cy="22.75763"
     inkscape:window-width="1920"
     inkscape:window-height="1138"
     inkscape:window-x="-8"
     inkscape:window-y="-8"
     inkscape:window-maximized="1"
     inkscape:current-layer="svg2"
     fit-margin-top="0"
     fit-margin-left="0"
     fit-margin-right="0"
     fit-margin-bottom="0" />
  <g
     aria-label="easy rpg"
     id="text991"
     style="font-weight:300;font-size:13.3333px;line-height:1.25;font-family:'Bebas Neue';-inkscape-font-specification:'Bebas Neue, Light';fill:#ffffff"
     transform="translate(1.870643,14.768854)">
    <path
       d="m -1.5773104,-10.235532 v -4.186656 H 1.689348 v -0.279999 h -3.559991 v 9.3333096 h 3.559991 v -0.2799993 h -3.2666584 v -4.3199891 h 2.7466597 v -0.2666662 z"
       id="path1176" />
    <path
       d="m 6.8226594,-7.5688719 0.5466652,2.1999945 H 7.6626572 L 5.3559964,-14.71552 H 4.9426641 l -2.2533276,9.3466426 h 0.266666 L 3.5026678,-7.5688719 Z M 5.1426636,-14.368855 6.7693262,-7.8355378 H 3.556001 Z"
       id="path1178" />
    <path
       d="m 10.622631,-14.768854 c -1.3466628,0.01333 -1.9199947,0.946665 -1.9199947,2.306661 0,2.573327 3.5733247,2.4933272 3.5733247,4.8533213 0,1.1333304 -0.439999,2.0266615 -1.666663,2.0266615 -1.2266634,0 -1.6666623,-0.8933311 -1.6666623,-2.0266615 V -8.0755372 H 8.6626364 v 0.4533322 c 0,1.29333 0.533332,2.3199941 1.9466616,2.3199941 1.426663,0 1.959995,-1.0266641 1.959995,-2.3199941 0,-2.533327 -3.5733241,-2.46666 -3.5733241,-4.853321 0,-1.106664 0.4133323,-2.026662 1.6399961,-2.026662 1.21333,0 1.626662,0.933331 1.626662,2.039995 v 0.186666 h 0.293333 v -0.173333 c 0,-1.279996 -0.519999,-2.319994 -1.933329,-2.319994 z"
       id="path1180" />
    <path
       d="m 15.63592,-5.3688774 h 0.293332 v -3.7733238 l 2.213328,-5.5599858 h -0.306666 l -2.039995,5.1599868 -2.039995,-5.1599868 h -0.293332 l 2.173328,5.5599858 z"
       id="path1182" />
    <path
       d="m 21.20921,-14.702187 v 9.3333096 h 0.293333 v -4.3066558 h 1.146663 c 1.213331,0 2.039995,0.3599991 2.039995,1.733329 v 1.4666629 c 0,0.399999 0.04,0.8133313 0.226666,1.1066639 h 0.32 C 25.022534,-5.66221 24.982534,-6.1155422 24.982534,-6.4755413 v -1.4666629 c 0,-1.0266641 -0.439999,-1.7066624 -1.479996,-1.866662 1.026664,-0.1866662 1.479996,-0.8133308 1.479996,-1.9599948 v -0.839998 c 0,-1.279997 -0.533332,-2.093328 -1.919995,-2.093328 z m 0.293333,4.7466545 v -4.4666555 h 1.546662 c 1.199997,0 1.639996,0.706665 1.639996,1.839995 v 0.853332 c 0,1.439996 -0.746665,1.7733285 -2.039995,1.7733285 z"
       id="path1184" />
    <path
       d="m 26.275853,-14.702187 v 9.3333096 h 0.293332 v -3.95999 h 1.33333 c 1.479997,0 2.146662,-0.7066646 2.146662,-2.1866616 v -0.933331 c 0,-1.306663 -0.493332,-2.253327 -1.933329,-2.253327 z m 0.293332,5.0933203 v -4.8133213 h 1.546663 c 1.25333,0 1.639996,0.813331 1.639996,1.959995 v 0.959998 c 0,1.319996 -0.546665,1.8933283 -1.853329,1.8933283 z"
       id="path1186" />
    <path
       d="m 32.995825,-14.768854 c -1.41333,0 -1.946662,1.066664 -1.946662,2.359994 v 4.7466551 c 0,1.29333 0.533332,2.359994 1.946662,2.359994 1.426663,0 1.959995,-1.066664 1.959995,-2.359994 v -2.3733271 h -1.746662 v 0.2666657 h 1.45333 v 2.1199947 c 0,1.1333304 -0.426666,2.0666614 -1.653329,2.0666614 -1.239997,0 -1.666663,-0.933331 -1.666663,-2.0666614 v -4.7733214 c 0,-1.13333 0.426666,-2.079995 1.666663,-2.079995 1.226663,0 1.653329,0.946665 1.653329,2.079995 v 0.626665 h 0.293332 v -0.613332 c 0,-1.29333 -0.533332,-2.359994 -1.959995,-2.359994 z"
       id="path1188" />
  </g>
</svg>
