<?xml version="1.0" encoding="UTF-8" standalone="no"?>
<!-- Created with Inkscape (http://www.inkscape.org/) -->

<svg
   version="1.1"
   id="svg2"
   width="44.999752"
   height="9.4133091"
   viewBox="0 0 44.999755 9.4133092"
   sodipodi:docname="auto-adventure.svg"
   inkscape:version="1.1 (c68e22c387, 2021-05-23)"
   inkscape:export-filename="C:\Users\BUCH\Desktop\Retrogaming\Recalbox\travail thèmes\Thème vignette !!!!!!!\Maquette 2 !!!!\image1250.png"
   inkscape:export-xdpi="96.460785"
   inkscape:export-ydpi="96.460785"
   xmlns:inkscape="http://www.inkscape.org/namespaces/inkscape"
   xmlns:sodipodi="http://sodipodi.sourceforge.net/DTD/sodipodi-0.dtd"
   xmlns="http://www.w3.org/2000/svg"
   xmlns:svg="http://www.w3.org/2000/svg">
  <defs
     id="defs6">
    <clipPath
       clipPathUnits="userSpaceOnUse"
       id="clipPath3185">
      <path
         id="path3187"
         style="fill:#ffffff;fill-rule:evenodd;stroke:#ffffff;stroke-width:5.15903;stroke-linecap:round;stroke-linejoin:round;paint-order:stroke fill markers"
         d="m 1157.5591,335.78677 h 462.4206 L 1362.3723,1410.6277 H 899.95176 Z"
         sodipodi:nodetypes="ccccc"
         inkscape:export-filename="C:\Users\BUCH\Desktop\Retrogaming\Recalbox\travail thèmes\Thème vignette !!!!!!!\Maquette 2 !!!!\rect849.png"
         inkscape:export-xdpi="247.96268"
         inkscape:export-ydpi="247.96268" />
    </clipPath>
  </defs>
  <sodipodi:namedview
     id="namedview4"
     pagecolor="#ffffff"
     bordercolor="#666666"
     borderopacity="1.0"
     inkscape:pageshadow="2"
     inkscape:pageopacity="0.0"
     inkscape:pagecheckerboard="true"
     showgrid="false"
     inkscape:showpageshadow="false"
     inkscape:zoom="8.8242196"
     inkscape:cx="18.528551"
     inkscape:cy="15.865426"
     inkscape:window-width="1920"
     inkscape:window-height="1138"
     inkscape:window-x="-8"
     inkscape:window-y="-8"
     inkscape:window-maximized="1"
     inkscape:current-layer="svg2"
     fit-margin-top="0"
     fit-margin-left="0"
     fit-margin-right="0"
     fit-margin-bottom="0" />
  <g
     aria-label="adventure"
     id="text9418"
     style="font-weight:300;font-size:13.3333px;line-height:1.25;font-family:'Bebas Neue';-inkscape-font-specification:'Bebas Neue, Light';fill:#ffffff"
     transform="translate(9.0259236,20.67909)">
    <path
       d="m -4.8926007,-13.532441 0.5466653,2.199994 h 0.2933326 l -2.3066608,-9.346643 h -0.4133323 l -2.2533277,9.346643 h 0.266666 l 0.5466653,-2.199994 z m -1.6799957,-6.799983 1.6266625,6.533317 h -3.2133252 z"
       id="path9735" />
    <path
       d="m -3.0259575,-20.665757 v 9.33331 h 1.9599951 c 1.41332974,0 2.01332822,-0.999998 2.01332822,-2.319994 v -4.679988 c 0,-1.33333 -0.59999848,-2.333328 -2.02666152,-2.333328 z m 0.2933326,9.053311 v -8.773312 h 1.6533292 c 1.23999684,0 1.73332893,0.866665 1.73332893,2.039995 v 4.706655 c 0,1.159997 -0.47999879,2.026662 -1.73332893,2.026662 z"
       id="path9737" />
    <path
       d="m 1.934005,-20.665757 2.2799942,9.33331 h 0.4399989 l 2.2399943,-9.33331 H 6.6139931 L 4.427332,-11.66578 2.2406709,-20.665757 Z"
       id="path9739" />
    <path
       d="m 8.2139775,-16.199101 v -4.186657 h 3.2666585 v -0.279999 H 7.9206449 v 9.33331 h 3.5599911 v -0.279999 H 8.2139775 v -4.319989 h 2.7466595 v -0.266666 z"
       id="path9741" />
    <path
       d="m 12.800624,-20.239091 3.333324,8.906644 h 0.36 v -9.33331 h -0.28 v 8.733311 l -3.279991,-8.733311 h -0.413333 v 9.33331 h 0.28 z"
       id="path9743" />
    <path
       d="m 19.600584,-11.332447 v -9.053311 h 2.039995 v -0.279999 H 17.28059 v 0.279999 h 2.026661 v 9.053311 z"
       id="path9745" />
    <path
       d="m 22.733891,-20.665757 h -0.293332 v 7.026649 c 0,1.279997 0.506665,2.373327 1.933328,2.373327 1.41333,0 1.919995,-1.09333 1.919995,-2.373327 v -7.026649 h -0.279999 v 7.039982 c 0,1.119998 -0.399999,2.093328 -1.639996,2.093328 -1.239997,0 -1.639996,-0.97333 -1.639996,-2.093328 z"
       id="path9747" />
    <path
       d="m 27.347195,-20.665757 v 9.33331 h 0.293332 v -4.306656 h 1.146664 c 1.21333,0 2.039995,0.359999 2.039995,1.733329 v 1.466663 c 0,0.399999 0.04,0.813331 0.226666,1.106664 h 0.319999 c -0.213333,-0.293333 -0.253332,-0.746665 -0.253332,-1.106664 v -1.466663 c 0,-1.026664 -0.439999,-1.706662 -1.479997,-1.866662 1.026664,-0.186666 1.479997,-0.813331 1.479997,-1.959995 v -0.839998 c 0,-1.279997 -0.533332,-2.093328 -1.919996,-2.093328 z m 0.293332,4.746655 v -4.466656 h 1.546663 c 1.199997,0 1.639996,0.706665 1.639996,1.839996 v 0.853331 c 0,1.439996 -0.746665,1.773329 -2.039995,1.773329 z"
       id="path9749" />
    <path
       d="m 32.70717,-16.199101 v -4.186657 h 3.266659 v -0.279999 h -3.559991 v 9.33331 h 3.559991 v -0.279999 H 32.70717 v -4.319989 h 2.74666 v -0.266666 z"
       id="path9751" />
  </g>
</svg>
