<?xml version="1.0" encoding="UTF-8" standalone="no"?>
<!-- Created with Inkscape (http://www.inkscape.org/) -->

<svg
   version="1.1"
   id="svg2"
   width="37.546448"
   height="9.4666433"
   viewBox="0 0 37.546449 9.4666433"
   sodipodi:docname="pico.svg"
   inkscape:version="1.1 (c68e22c387, 2021-05-23)"
   inkscape:export-filename="C:\Users\BUCH\Desktop\Retrogaming\Recalbox\travail thèmes\Thème vignette !!!!!!!\Maquette 2 !!!!\image1250.png"
   inkscape:export-xdpi="96.460785"
   inkscape:export-ydpi="96.460785"
   xmlns:inkscape="http://www.inkscape.org/namespaces/inkscape"
   xmlns:sodipodi="http://sodipodi.sourceforge.net/DTD/sodipodi-0.dtd"
   xmlns="http://www.w3.org/2000/svg"
   xmlns:svg="http://www.w3.org/2000/svg">
  <g
     aria-label="sega pico"
     id="text6459"
     style="font-weight:300;font-size:13.3333px;line-height:1.25;font-family:'Bebas Neue';-inkscape-font-specification:'Bebas Neue, Light';fill:#ffffff"
     transform="translate(5.022477,24.464886)">
    <path
       d="m -3.0624819,-24.464886 c -1.3466633,0.01333 -1.9199952,0.946664 -1.9199952,2.306661 0,2.573326 3.5733243,2.493327 3.5733243,4.853321 0,1.13333 -0.4399989,2.026661 -1.6666624,2.026661 -1.2266636,0 -1.6666625,-0.893331 -1.6666625,-2.026661 V -17.77157 H -5.022477 v 0.453332 c 0,1.29333 0.533332,2.319995 1.9466618,2.319995 1.426663,0 1.959995,-1.026665 1.959995,-2.319995 0,-2.533327 -3.5733243,-2.46666 -3.5733243,-4.853321 0,-1.106664 0.4133323,-2.026661 1.6399959,-2.026661 1.2133302,0 1.6266625,0.933331 1.6266625,2.039995 v 0.186666 h 0.2933326 v -0.173333 c 0,-1.279997 -0.5199987,-2.319994 -1.9333284,-2.319994 z"
       id="path7582" />
    <path
       d="M 0.21750272,-19.931564 V -24.11822 H 3.4841611 v -0.28 h -3.55999097 v 9.33331 H 3.4841611 v -0.279999 H 0.21750272 v -4.319989 H 2.9641624 v -0.266666 z"
       id="path7584" />
    <path
       d="m 6.4574785,-24.464886 c -1.4133298,0 -1.9466618,1.066664 -1.9466618,2.359994 v 4.746655 c 0,1.29333 0.533332,2.359994 1.9466618,2.359994 1.426663,0 1.959995,-1.066664 1.959995,-2.359994 v -2.373328 H 6.6708113 v 0.266666 h 1.4533296 v 2.119995 c 0,1.13333 -0.4266656,2.066661 -1.6533291,2.066661 -1.2399969,0 -1.6666625,-0.933331 -1.6666625,-2.066661 v -4.773321 c 0,-1.133331 0.4266656,-2.079995 1.6666625,-2.079995 1.2266635,0 1.6533291,0.946664 1.6533291,2.079995 v 0.626665 h 0.2933326 v -0.613332 c 0,-1.29333 -0.533332,-2.359994 -1.959995,-2.359994 z"
       id="path7586" />
    <path
       d="m 13.550754,-17.264904 0.546665,2.199994 h 0.293333 l -2.306661,-9.346643 H 11.670759 L 9.4174311,-15.06491 H 9.684097 l 0.546665,-2.199994 z m -1.679996,-6.799983 1.626663,6.533317 h -3.213325 z"
       id="path7588" />
    <path
       d="m 17.484042,-24.39822 v 9.33331 h 0.293333 v -3.95999 h 1.33333 c 1.479996,0 2.146661,-0.706665 2.146661,-2.186661 v -0.933331 c 0,-1.306663 -0.493332,-2.253328 -1.933328,-2.253328 z m 0.293333,5.093321 v -4.813321 h 1.546663 c 1.25333,0 1.639995,0.813331 1.639995,1.959995 v 0.959997 c 0,1.319997 -0.546665,1.893329 -1.853328,1.893329 z"
       id="path7590" />
    <path
       d="m 22.270686,-24.39822 v 9.33331 h 0.293333 v -9.33331 z"
       id="path7592" />
    <path
       d="m 25.564002,-24.464886 c -1.41333,0 -1.946662,1.066664 -1.946662,2.359994 v 4.746655 c 0,1.29333 0.533332,2.359994 1.946662,2.359994 1.426663,0 1.959995,-1.066664 1.959995,-2.359994 v -1.013331 h -0.293333 v 1.026664 c 0,1.13333 -0.426665,2.066661 -1.653329,2.066661 -1.239997,0 -1.666662,-0.933331 -1.666662,-2.066661 v -4.773321 c 0,-1.133331 0.426665,-2.079995 1.666662,-2.079995 1.226664,0 1.653329,0.946664 1.653329,2.079995 v 0.733331 h 0.293333 v -0.719998 c 0,-1.29333 -0.533332,-2.359994 -1.959995,-2.359994 z"
       id="path7594" />
    <path
       d="m 28.550648,-17.358237 c 0,1.306663 0.559998,2.359994 1.973328,2.359994 1.439997,0 1.999995,-1.053331 1.999995,-2.359994 v -4.746655 c 0,-1.306664 -0.559998,-2.359994 -1.999995,-2.359994 -1.41333,0 -1.973328,1.05333 -1.973328,2.359994 z m 0.293332,-4.759988 c 0,-1.146664 0.439999,-2.079995 1.679996,-2.079995 1.25333,0 1.706663,0.933331 1.706663,2.079995 v 4.773321 c 0,1.146664 -0.453333,2.079995 -1.706663,2.079995 -1.239997,0 -1.679996,-0.933331 -1.679996,-2.079995 z"
       id="path7596" />
  </g>
  <defs
     id="defs6">
    <clipPath
       clipPathUnits="userSpaceOnUse"
       id="clipPath3185">
      <path
         id="path3187"
         style="fill:#ffffff;fill-rule:evenodd;stroke:#ffffff;stroke-width:5.15903;stroke-linecap:round;stroke-linejoin:round;paint-order:stroke fill markers"
         d="m 1157.5591,335.78677 h 462.4206 L 1362.3723,1410.6277 H 899.95176 Z"
         sodipodi:nodetypes="ccccc"
         inkscape:export-filename="C:\Users\BUCH\Desktop\Retrogaming\Recalbox\travail thèmes\Thème vignette !!!!!!!\Maquette 2 !!!!\rect849.png"
         inkscape:export-xdpi="247.96268"
         inkscape:export-ydpi="247.96268" />
    </clipPath>
  </defs>
  <sodipodi:namedview
     id="namedview4"
     pagecolor="#ffffff"
     bordercolor="#666666"
     borderopacity="1.0"
     inkscape:pageshadow="2"
     inkscape:pageopacity="0.0"
     inkscape:pagecheckerboard="true"
     showgrid="false"
     inkscape:showpageshadow="false"
     inkscape:zoom="12.479331"
     inkscape:cx="21.275179"
     inkscape:cy="16.106633"
     inkscape:window-width="1920"
     inkscape:window-height="1138"
     inkscape:window-x="-8"
     inkscape:window-y="-8"
     inkscape:window-maximized="1"
     inkscape:current-layer="svg2"
     fit-margin-top="0"
     fit-margin-left="0"
     fit-margin-right="0"
     fit-margin-bottom="0" />
</svg>
