<?xml version="1.0" encoding="UTF-8" standalone="no"?>
<!-- Created with Inkscape (http://www.inkscape.org/) -->

<svg
   version="1.1"
   id="svg2"
   width="46.639721"
   height="9.4666424"
   viewBox="0 0 46.639723 9.4666423"
   sodipodi:docname="amigacdtv.svg"
   inkscape:version="1.1 (c68e22c387, 2021-05-23)"
   inkscape:export-filename="C:\Users\BUCH\Desktop\Retrogaming\Recalbox\travail thèmes\Thème vignette !!!!!!!\Maquette 2 !!!!\image1250.png"
   inkscape:export-xdpi="96.460785"
   inkscape:export-ydpi="96.460785"
   xmlns:inkscape="http://www.inkscape.org/namespaces/inkscape"
   xmlns:sodipodi="http://sodipodi.sourceforge.net/DTD/sodipodi-0.dtd"
   xmlns="http://www.w3.org/2000/svg"
   xmlns:svg="http://www.w3.org/2000/svg">
  <defs
     id="defs6">
    <clipPath
       clipPathUnits="userSpaceOnUse"
       id="clipPath3185">
      <path
         id="path3187"
         style="fill:#ffffff;fill-rule:evenodd;stroke:#ffffff;stroke-width:5.15903;stroke-linecap:round;stroke-linejoin:round;paint-order:stroke fill markers"
         d="m 1157.5591,335.78677 h 462.4206 L 1362.3723,1410.6277 H 899.95176 Z"
         sodipodi:nodetypes="ccccc"
         inkscape:export-filename="C:\Users\BUCH\Desktop\Retrogaming\Recalbox\travail thèmes\Thème vignette !!!!!!!\Maquette 2 !!!!\rect849.png"
         inkscape:export-xdpi="247.96268"
         inkscape:export-ydpi="247.96268" />
    </clipPath>
  </defs>
  <sodipodi:namedview
     id="namedview4"
     pagecolor="#ffffff"
     bordercolor="#666666"
     borderopacity="1.0"
     inkscape:pageshadow="2"
     inkscape:pageopacity="0.0"
     inkscape:pagecheckerboard="true"
     showgrid="false"
     inkscape:showpageshadow="false"
     inkscape:zoom="12.479331"
     inkscape:cx="26.884454"
     inkscape:cy="18.831138"
     inkscape:window-width="1920"
     inkscape:window-height="1138"
     inkscape:window-x="-8"
     inkscape:window-y="-8"
     inkscape:window-maximized="1"
     inkscape:current-layer="svg2"
     fit-margin-top="0"
     fit-margin-left="0"
     fit-margin-right="0"
     fit-margin-bottom="0" />
  <g
     aria-label="amiga cdtv"
     id="text14270"
     style="font-weight:300;font-size:13.3333px;line-height:1.25;font-family:'Bebas Neue';-inkscape-font-specification:'Bebas Neue, Light'"
     transform="translate(3.7536905,21.339719)">
    <path
       d="m 0.37963235,-14.139737 0.54666528,2.199994 H 1.2196302 l -2.3066608,-9.346643 h -0.4133323 l -2.2533276,9.346643 h 0.266666 l 0.5466652,-2.199994 z m -1.67999575,-6.799983 1.62666255,6.533317 H -2.8870261 Z"
       style="fill:#ffffff"
       id="path16629" />
    <path
       d="m 7.4462624,-20.833054 v 8.893311 H 7.739595 v -9.33331 H 7.2862628 l -2.2933275,8.853311 -2.2933276,-8.853311 H 2.2462755 v 9.33331 h 0.266666 v -8.893311 l 2.3066609,8.866644 h 0.3333325 z"
       style="fill:#ffffff"
       id="path16631" />
    <path
       d="m 8.8062411,-21.273053 v 9.33331 h 0.2933326 v -9.33331 z"
       style="fill:#ffffff"
       id="path16633" />
    <path
       d="m 12.099557,-21.339719 c -1.41333,0 -1.946662,1.066664 -1.946662,2.359994 v 4.746654 c 0,1.29333 0.533332,2.359994 1.946662,2.359994 1.426663,0 1.959995,-1.066664 1.959995,-2.359994 v -2.373327 H 12.31289 v 0.266666 h 1.453329 v 2.119995 c 0,1.13333 -0.426665,2.066661 -1.653329,2.066661 -1.239997,0 -1.666662,-0.933331 -1.666662,-2.066661 v -4.773322 c 0,-1.13333 0.426665,-2.079994 1.666662,-2.079994 1.226664,0 1.653329,0.946664 1.653329,2.079994 v 0.626666 h 0.293333 v -0.613332 c 0,-1.29333 -0.533332,-2.359994 -1.959995,-2.359994 z"
       style="fill:#ffffff"
       id="path16635" />
    <path
       d="m 19.192832,-14.139737 0.546666,2.199994 h 0.293332 l -2.306661,-9.346643 h -0.413332 l -2.253328,9.346643 h 0.266666 l 0.546666,-2.199994 z m -1.679995,-6.799983 1.626662,6.533317 h -3.213325 z"
       style="fill:#ffffff"
       id="path16637" />
    <path
       d="m 25.059449,-21.339719 c -1.41333,0 -1.946662,1.066664 -1.946662,2.359994 v 4.746654 c 0,1.29333 0.533332,2.359994 1.946662,2.359994 1.426663,0 1.959995,-1.066664 1.959995,-2.359994 v -1.01333 h -0.293332 v 1.026664 c 0,1.13333 -0.426666,2.066661 -1.65333,2.066661 -1.239996,0 -1.666662,-0.933331 -1.666662,-2.066661 v -4.773322 c 0,-1.13333 0.426666,-2.079994 1.666662,-2.079994 1.226664,0 1.65333,0.946664 1.65333,2.079994 v 0.733332 h 0.293332 v -0.719998 c 0,-1.29333 -0.533332,-2.359994 -1.959995,-2.359994 z"
       style="fill:#ffffff"
       id="path16639" />
    <path
       d="m 28.059428,-21.273053 v 9.33331 h 1.959995 c 1.41333,0 2.013329,-0.999998 2.013329,-2.319994 v -4.679988 c 0,-1.33333 -0.599999,-2.333328 -2.026662,-2.333328 z m 0.293333,9.053311 v -8.773311 h 1.653329 c 1.239997,0 1.733329,0.866664 1.733329,2.039994 v 4.706655 c 0,1.159997 -0.479999,2.026662 -1.733329,2.026662 z"
       style="fill:#ffffff"
       id="path16641" />
    <path
       d="m 35.112735,-11.939743 v -9.05331 h 2.039994 v -0.28 H 32.79274 v 0.28 h 2.026662 v 9.05331 z"
       style="fill:#ffffff"
       id="path16643" />
    <path
       d="m 37.926043,-21.273053 2.279994,9.33331 h 0.439999 l 2.239994,-9.33331 h -0.279999 l -2.186661,8.999977 -2.186661,-8.999977 z"
       style="fill:#ffffff"
       id="path16645" />
  </g>
</svg>
