<?xml version="1.0" encoding="UTF-8" standalone="no"?>
<!-- Created with Inkscape (http://www.inkscape.org/) -->

<svg
   version="1.1"
   id="svg2"
   width="24.586536"
   height="9.4666433"
   viewBox="0 0 24.586538 9.4666433"
   sodipodi:docname="vic20.svg"
   inkscape:version="1.1 (c68e22c387, 2021-05-23)"
   inkscape:export-filename="C:\Users\BUCH\Desktop\Retrogaming\Recalbox\travail thèmes\Thème vignette !!!!!!!\Maquette 2 !!!!\image1250.png"
   inkscape:export-xdpi="96.460785"
   inkscape:export-ydpi="96.460785"
   xmlns:inkscape="http://www.inkscape.org/namespaces/inkscape"
   xmlns:sodipodi="http://sodipodi.sourceforge.net/DTD/sodipodi-0.dtd"
   xmlns="http://www.w3.org/2000/svg"
   xmlns:svg="http://www.w3.org/2000/svg">
  <defs
     id="defs6">
    <clipPath
       clipPathUnits="userSpaceOnUse"
       id="clipPath3185">
      <path
         id="path3187"
         style="fill:#ffffff;fill-rule:evenodd;stroke:#ffffff;stroke-width:5.15903;stroke-linecap:round;stroke-linejoin:round;paint-order:stroke fill markers"
         d="m 1157.5591,335.78677 h 462.4206 L 1362.3723,1410.6277 H 899.95176 Z"
         sodipodi:nodetypes="ccccc"
         inkscape:export-filename="C:\Users\BUCH\Desktop\Retrogaming\Recalbox\travail thèmes\Thème vignette !!!!!!!\Maquette 2 !!!!\rect849.png"
         inkscape:export-xdpi="247.96268"
         inkscape:export-ydpi="247.96268" />
    </clipPath>
  </defs>
  <sodipodi:namedview
     id="namedview4"
     pagecolor="#ffffff"
     bordercolor="#666666"
     borderopacity="1.0"
     inkscape:pageshadow="2"
     inkscape:pageopacity="0.0"
     inkscape:pagecheckerboard="true"
     showgrid="false"
     inkscape:showpageshadow="false"
     inkscape:zoom="12.479331"
     inkscape:cx="22.557299"
     inkscape:cy="-3.9264925"
     inkscape:window-width="1920"
     inkscape:window-height="1138"
     inkscape:window-x="-8"
     inkscape:window-y="-8"
     inkscape:window-maximized="1"
     inkscape:current-layer="svg2"
     fit-margin-top="0"
     fit-margin-left="0"
     fit-margin-right="0"
     fit-margin-bottom="0" />
  <g
     aria-label="vic-20"
     id="text15538"
     style="font-weight:300;font-size:13.3333px;line-height:1.25;font-family:'Bebas Neue';-inkscape-font-specification:'Bebas Neue, Light';fill:#ffffff"
     transform="translate(-3.6986322,-16.162291)">
    <path
       d="m 3.6986322,16.228958 2.2799942,9.333309 H 6.4186253 L 8.6586196,16.228958 H 8.3786204 L 6.1919592,25.228935 4.0052981,16.228958 Z"
       id="path16317" />
    <path
       d="m 9.6852721,16.228958 v 9.333309 h 0.2933326 v -9.333309 z"
       id="path16319" />
    <path
       d="m 12.978588,16.162291 c -1.41333,0 -1.946662,1.066664 -1.946662,2.359994 v 4.746655 c 0,1.29333 0.533332,2.359994 1.946662,2.359994 1.426663,0 1.959995,-1.066664 1.959995,-2.359994 V 22.255609 H 14.64525 v 1.026664 c 0,1.133331 -0.426665,2.066662 -1.653329,2.066662 -1.239997,0 -1.666662,-0.933331 -1.666662,-2.066662 v -4.773321 c 0,-1.133331 0.426665,-2.079995 1.666662,-2.079995 1.226664,0 1.653329,0.946664 1.653329,2.079995 v 0.733331 h 0.293333 v -0.719998 c 0,-1.29333 -0.533332,-2.359994 -1.959995,-2.359994 z"
       id="path16321" />
    <path
       d="M 15.965233,21.028945 H 18.33856 V 20.762279 H 15.965233 Z"
       id="path16323" />
    <path
       d="m 21.338534,16.162291 c -1.439996,0 -1.946662,1.119997 -1.946662,2.413327 v 0.493332 h 0.28 v -0.506665 c 0,-1.119997 0.399999,-2.133328 1.653329,-2.133328 1.29333,0 1.666662,0.959998 1.666662,2.133328 0,2.50666 -3.599991,3.306658 -3.599991,6.799983 v 0.199999 h 3.839991 v -0.279999 h -3.546658 v -0.05333 c 0.05333,-3.213325 3.599991,-4.07999 3.599991,-6.679983 0,-1.319997 -0.479999,-2.386661 -1.946662,-2.386661 z"
       id="path16325" />
    <path
       d="m 24.311845,23.26894 c 0,1.306663 0.559998,2.359994 1.986661,2.359994 1.426663,0 1.986662,-1.053331 1.986662,-2.359994 v -4.746655 c 0,-1.319997 -0.559999,-2.359994 -1.986662,-2.359994 -1.426663,0 -1.986661,1.039997 -1.986661,2.359994 z m 0.293332,-4.759988 c 0,-1.146664 0.453333,-2.079995 1.693329,-2.079995 1.239997,0 1.693329,0.933331 1.693329,2.079995 v 4.759988 c 0,1.159997 -0.453332,2.093328 -1.693329,2.093328 -1.239996,0 -1.693329,-0.933331 -1.693329,-2.093328 z"
       id="path16327" />
  </g>
</svg>
