<?xml version="1.0" encoding="UTF-8" standalone="no"?>
<svg
   version="1.0"
   width="511.74652pt"
   height="440.34634pt"
   viewBox="0 0 511.74652 440.34634"
   preserveAspectRatio="xMidYMid meet"
   id="svg18"
   sodipodi:docname="auto-party.svg"
   inkscape:version="1.1 (c68e22c387, 2021-05-23)"
   xmlns:inkscape="http://www.inkscape.org/namespaces/inkscape"
   xmlns:sodipodi="http://sodipodi.sourceforge.net/DTD/sodipodi-0.dtd"
   xmlns="http://www.w3.org/2000/svg"
   xmlns:svg="http://www.w3.org/2000/svg">
  <defs
     id="defs22" />
  <sodipodi:namedview
     id="namedview20"
     pagecolor="#ffffff"
     bordercolor="#666666"
     borderopacity="1.0"
     inkscape:pageshadow="2"
     inkscape:pageopacity="0.0"
     inkscape:pagecheckerboard="0"
     inkscape:document-units="pt"
     showgrid="false"
     fit-margin-top="0"
     fit-margin-left="0"
     fit-margin-right="0"
     fit-margin-bottom="0"
     inkscape:zoom="1.1030273"
     inkscape:cx="341.33333"
     inkscape:cy="293.73705"
     inkscape:window-width="1920"
     inkscape:window-height="1138"
     inkscape:window-x="-8"
     inkscape:window-y="-8"
     inkscape:window-maximized="1"
     inkscape:current-layer="svg18" />
  <metadata
     id="metadata2">
Created by potrace 1.13, written by Peter Selinger 2001-2015
</metadata>
  <g
     transform="matrix(0.1,0,0,-0.1,-0.13340095,476.05562)"
     fill="#000000"
     stroke="none"
     id="g16"
     style="fill:#ffffff">
    <path
       d="m 1254,4736 c -310,-81 -541,-314 -626,-630 -30,-113 -30,-307 1,-421 45,-167 124,-298 255,-422 71,-67 105,-91 198,-136 156,-77 220,-92 393,-91 122,1 151,4 228,27 312,95 533,326 609,635 29,118 28,294 -1,407 -82,314 -332,561 -641,635 -122,29 -294,27 -416,-4 z"
       id="path4"
       style="fill:#ffffff" />
    <path
       d="m 3434,4736 c -481,-127 -761,-635 -608,-1103 60,-183 181,-345 337,-452 68,-46 199,-106 282,-127 98,-26 313,-25 410,0 153,41 275,108 382,210 129,121 210,257 254,421 31,113 31,307 1,421 -69,260 -229,456 -467,570 -131,63 -187,76 -355,80 -128,4 -155,1 -236,-20 z"
       id="path6"
       style="fill:#ffffff" />
    <path
       d="M 905,2965 C 697,2932 478,2815 316,2652 159,2494 54,2297 15,2088 2,2018 0,1920 2,1482 L 5,959 75,935 c 175,-59 497,-137 686,-166 74,-11 150,-24 169,-30 51,-13 238,-28 443,-36 l 177,-6 v 219 c 0,300 18,401 94,544 88,163 255,303 444,371 l 63,22 -49,51 c -91,95 -148,215 -172,362 -28,174 46,384 185,525 33,33 74,69 92,80 18,12 33,24 33,28 0,12 -160,61 -235,71 -108,15 -1002,11 -1100,-5 z"
       id="path8"
       style="fill:#ffffff" />
    <path
       d="m 3090,2965 c -82,-15 -210,-55 -210,-66 0,-4 29,-29 64,-54 56,-41 130,-127 178,-205 60,-98 85,-309 54,-445 -23,-97 -80,-207 -144,-276 -51,-55 -59,-79 -27,-79 23,0 179,-75 229,-110 63,-42 155,-134 195,-193 41,-61 104,-196 122,-262 8,-32 15,-144 18,-310 l 6,-260 175,2 c 371,4 811,81 1275,221 l 90,28 3,514 c 3,569 0,617 -53,762 -56,156 -103,237 -204,358 -167,199 -425,345 -674,379 -118,17 -1001,13 -1097,-4 z"
       id="path10"
       style="fill:#ffffff" />
    <path
       d="m 2455,2871 c -209,-46 -364,-195 -417,-402 -37,-150 -10,-297 79,-432 111,-166 321,-259 521,-229 308,47 517,351 447,651 -57,242 -254,406 -500,416 -49,2 -108,0 -130,-4 z"
       id="path12"
       style="fill:#ffffff" />
    <path
       d="m 2230,1774 c -14,-3 -63,-17 -109,-31 -201,-63 -379,-240 -448,-447 l -28,-81 -3,-347 c -3,-326 -2,-347 15,-356 56,-30 431,-111 633,-138 151,-20 474,-23 610,-5 197,25 490,103 558,147 l 23,15 -3,342 -4,342 -31,89 c -72,205 -234,367 -439,439 l -89,31 -330,2 c -181,1 -341,0 -355,-2 z"
       id="path14"
       style="fill:#ffffff" />
  </g>
</svg>
