<?xml version="1.0" encoding="UTF-8" standalone="no"?>
<!-- Created with Inkscape (http://www.inkscape.org/) -->

<svg
   version="1.1"
   id="svg2"
   width="41.933083"
   height="9.4666424"
   viewBox="0 0 41.933085 9.4666423"
   sodipodi:docname="dragon.svg"
   inkscape:version="1.1 (c68e22c387, 2021-05-23)"
   inkscape:export-filename="C:\Users\BUCH\Desktop\Retrogaming\Recalbox\travail thèmes\Thème vignette !!!!!!!\Maquette 2 !!!!\image1250.png"
   inkscape:export-xdpi="96.460785"
   inkscape:export-ydpi="96.460785"
   xmlns:inkscape="http://www.inkscape.org/namespaces/inkscape"
   xmlns:sodipodi="http://sodipodi.sourceforge.net/DTD/sodipodi-0.dtd"
   xmlns="http://www.w3.org/2000/svg"
   xmlns:svg="http://www.w3.org/2000/svg">
  <defs
     id="defs6">
    <clipPath
       clipPathUnits="userSpaceOnUse"
       id="clipPath3185">
      <path
         id="path3187"
         style="fill:#ffffff;fill-rule:evenodd;stroke:#ffffff;stroke-width:5.15903;stroke-linecap:round;stroke-linejoin:round;paint-order:stroke fill markers"
         d="m 1157.5591,335.78677 h 462.4206 L 1362.3723,1410.6277 H 899.95176 Z"
         sodipodi:nodetypes="ccccc"
         inkscape:export-filename="C:\Users\BUCH\Desktop\Retrogaming\Recalbox\travail thèmes\Thème vignette !!!!!!!\Maquette 2 !!!!\rect849.png"
         inkscape:export-xdpi="247.96268"
         inkscape:export-ydpi="247.96268" />
    </clipPath>
  </defs>
  <sodipodi:namedview
     id="namedview4"
     pagecolor="#ffffff"
     bordercolor="#666666"
     borderopacity="1.0"
     inkscape:pageshadow="2"
     inkscape:pageopacity="0.0"
     inkscape:pagecheckerboard="true"
     showgrid="false"
     inkscape:showpageshadow="false"
     inkscape:zoom="12.479331"
     inkscape:cx="23.518889"
     inkscape:cy="26.043063"
     inkscape:window-width="1920"
     inkscape:window-height="1138"
     inkscape:window-x="-8"
     inkscape:window-y="-8"
     inkscape:window-maximized="1"
     inkscape:current-layer="svg2"
     fit-margin-top="0"
     fit-margin-left="0"
     fit-margin-right="0"
     fit-margin-bottom="0" />
  <g
     aria-label="dragon 32"
     id="text2202"
     style="font-weight:300;font-size:13.3333px;line-height:1.25;font-family:'Bebas Neue';-inkscape-font-specification:'Bebas Neue, Light';fill:#ffffff"
     transform="translate(7.3196529,18.054286)">
    <path
       d="m -7.3196529,-17.98762 v 9.3333098 h 1.959995 c 1.4133298,0 2.0133283,-0.9999975 2.0133283,-2.3199938 v -4.679989 c 0,-1.333329 -0.5999985,-2.333327 -2.0266616,-2.333327 z m 0.2933326,9.0533105 v -8.7733115 h 1.6533291 c 1.2399969,0 1.733329,0.866665 1.733329,2.039995 v 4.706655 c 0,1.159997 -0.4799988,2.0266615 -1.733329,2.0266615 z"
       id="path3113" />
    <path
       d="m -2.3063396,-17.98762 v 9.3333098 h 0.2933326 v -4.3066558 h 1.14666373 c 1.21333027,0 2.03999487,0.359999 2.03999487,1.733329 v 1.4666629 c 0,0.399999 0.04,0.8133313 0.2266661,1.1066639 H 1.7203169 C 1.5069841,-8.9476428 1.4669842,-9.400975 1.4669842,-9.7609741 v -1.4666629 c 0,-1.026664 -0.4399989,-1.706662 -1.47999629,-1.866662 1.02666409,-0.186666 1.47999629,-0.813331 1.47999629,-1.959995 v -0.839998 c 0,-1.279997 -0.53333201,-2.093328 -1.91999518,-2.093328 z m 0.2933326,4.746655 v -4.466656 h 1.54666272 c 1.19999697,0 1.63999588,0.706665 1.63999588,1.839996 v 0.853331 c 0,1.439996 -0.7466648,1.773329 -2.03999487,1.773329 z"
       id="path3115" />
    <path
       d="m 6.8536261,-10.854305 0.5466653,2.1999948 H 7.693624 L 5.3869632,-18.000953 H 4.9736309 l -2.2533277,9.3466428 h 0.266666 l 0.5466653,-2.1999948 z m -1.6799957,-6.799982 1.6266625,6.533316 H 3.5869677 Z"
       id="path3117" />
    <path
       d="m 10.640247,-18.054286 c -1.41333,0 -1.9466619,1.066664 -1.9466619,2.359994 v 4.746654 c 0,1.2933303 0.5333319,2.3599943 1.9466619,2.3599943 1.426663,0 1.959995,-1.066664 1.959995,-2.3599943 v -2.373327 H 10.85358 v 0.266666 h 1.453329 v 2.119995 c 0,1.13333 -0.426665,2.066661 -1.653329,2.066661 -1.2399968,0 -1.6666624,-0.933331 -1.6666624,-2.066661 v -4.773322 c 0,-1.13333 0.4266656,-2.079994 1.6666624,-2.079994 1.226664,0 1.653329,0.946664 1.653329,2.079994 v 0.626665 h 0.293333 v -0.613331 c 0,-1.29333 -0.533332,-2.359994 -1.959995,-2.359994 z"
       id="path3119" />
    <path
       d="m 13.640217,-10.947638 c 0,1.3066636 0.559999,2.3599943 1.973329,2.3599943 1.439996,0 1.999995,-1.0533307 1.999995,-2.3599943 v -4.746654 c 0,-1.306664 -0.559999,-2.359994 -1.999995,-2.359994 -1.41333,0 -1.973329,1.05333 -1.973329,2.359994 z m 0.293333,-4.759988 c 0,-1.146664 0.439999,-2.079994 1.679996,-2.079994 1.25333,0 1.706662,0.93333 1.706662,2.079994 v 4.773322 c 0,1.1466633 -0.453332,2.0799943 -1.706662,2.0799943 -1.239997,0 -1.679996,-0.933331 -1.679996,-2.0799943 z"
       id="path3121" />
    <path
       d="m 18.946863,-17.560954 3.333325,8.9066438 h 0.359999 V -17.98762 h -0.279999 v 8.7333113 L 19.080196,-17.98762 h -0.413332 v 9.3333098 h 0.279999 z"
       id="path3123" />
    <path
       d="m 27.720137,-18.054286 c -1.426663,0 -1.959995,1.05333 -1.959995,2.359994 v 0.266666 h 0.293333 v -0.28 c 0,-1.146664 0.413332,-2.079994 1.653329,-2.079994 1.239997,0 1.666662,0.93333 1.666662,2.093328 v 0.266666 c 0,0.946664 -0.586665,1.693329 -1.533329,1.773328 h -0.693332 v 0.266666 h 0.679998 c 0.999998,0.05333 1.546663,0.706665 1.546663,1.719996 v 0.706665 c 0,1.159997 -0.426665,2.1066613 -1.666662,2.1066613 -1.239997,0 -1.653329,-0.9466643 -1.653329,-2.0933283 v -0.439999 h -0.293333 v 0.439999 c 0,1.3066636 0.533332,2.3599943 1.959995,2.3599943 1.426663,0 1.946662,-1.0533307 1.946662,-2.3599943 v -0.719998 c 0,-0.906664 -0.439999,-1.639996 -1.33333,-1.866662 0.839998,-0.266666 1.33333,-1.039997 1.33333,-1.933328 v -0.226666 c 0,-1.306664 -0.519999,-2.359994 -1.946662,-2.359994 z"
       id="path3125" />
    <path
       d="m 32.666769,-18.054286 c -1.439996,0 -1.946661,1.119997 -1.946661,2.413327 v 0.493332 h 0.279999 v -0.506666 c 0,-1.119997 0.399999,-2.133327 1.653329,-2.133327 1.29333,0 1.666663,0.959997 1.666663,2.133327 0,2.506661 -3.599991,3.306659 -3.599991,6.7999833 v 0.1999995 h 3.83999 V -8.9343095 H 31.01344 v -0.053333 c 0.05333,-3.2133255 3.599991,-4.0799895 3.599991,-6.6799835 0,-1.319996 -0.479999,-2.38666 -1.946662,-2.38666 z"
       id="path3127" />
  </g>
</svg>
