<?xml version="1.0" encoding="UTF-8" standalone="no"?>
<!-- Created with Inkscape (http://www.inkscape.org/) -->

<svg
   version="1.1"
   id="svg2"
   width="46.306438"
   height="9.4666424"
   viewBox="0 0 46.306438 9.4666422"
   sodipodi:docname="auto-demoscene.svg"
   inkscape:version="1.1 (c68e22c387, 2021-05-23)"
   inkscape:export-filename="C:\Users\BUCH\Desktop\Retrogaming\Recalbox\travail thèmes\Thème vignette !!!!!!!\Maquette 2 !!!!\image1250.png"
   inkscape:export-xdpi="96.460785"
   inkscape:export-ydpi="96.460785"
   xmlns:inkscape="http://www.inkscape.org/namespaces/inkscape"
   xmlns:sodipodi="http://sodipodi.sourceforge.net/DTD/sodipodi-0.dtd"
   xmlns="http://www.w3.org/2000/svg"
   xmlns:svg="http://www.w3.org/2000/svg">
  <defs
     id="defs6">
    <clipPath
       clipPathUnits="userSpaceOnUse"
       id="clipPath3185">
      <path
         id="path3187"
         style="fill:#ffffff;fill-rule:evenodd;stroke:#ffffff;stroke-width:5.15903;stroke-linecap:round;stroke-linejoin:round;paint-order:stroke fill markers"
         d="m 1157.5591,335.78677 h 462.4206 L 1362.3723,1410.6277 H 899.95176 Z"
         sodipodi:nodetypes="ccccc"
         inkscape:export-filename="C:\Users\BUCH\Desktop\Retrogaming\Recalbox\travail thèmes\Thème vignette !!!!!!!\Maquette 2 !!!!\rect849.png"
         inkscape:export-xdpi="247.96268"
         inkscape:export-ydpi="247.96268" />
    </clipPath>
  </defs>
  <sodipodi:namedview
     id="namedview4"
     pagecolor="#ffffff"
     bordercolor="#666666"
     borderopacity="1.0"
     inkscape:pageshadow="2"
     inkscape:pageopacity="0.0"
     inkscape:pagecheckerboard="true"
     showgrid="false"
     inkscape:showpageshadow="false"
     inkscape:zoom="12.479331"
     inkscape:cx="30.330152"
     inkscape:cy="-0.88145751"
     inkscape:window-width="1920"
     inkscape:window-height="1138"
     inkscape:window-x="-8"
     inkscape:window-y="-8"
     inkscape:window-maximized="1"
     inkscape:current-layer="svg2"
     fit-margin-top="0"
     fit-margin-left="0"
     fit-margin-right="0"
     fit-margin-bottom="0" />
  <g
     aria-label="demo scene"
     id="text10089"
     style="font-weight:300;font-size:13.3333px;line-height:1.25;font-family:'Bebas Neue';-inkscape-font-specification:'Bebas Neue, Light';fill:#ffffff"
     transform="translate(-3.3379694,-16.08216)">
    <path
       d="m 3.3379694,16.148826 v 9.33331 h 1.9599951 c 1.4133297,0 2.0133282,-0.999998 2.0133282,-2.319994 v -4.679989 c 0,-1.33333 -0.5999985,-2.333327 -2.0266615,-2.333327 z m 0.2933326,9.05331 v -8.773311 h 1.6533292 c 1.2399968,0 1.7333289,0.866665 1.7333289,2.039995 v 4.706655 c 0,1.159997 -0.4799988,2.026661 -1.7333289,2.026661 z"
       id="path10384" />
    <path
       d="M 8.6446153,20.615481 V 16.428825 H 11.911274 V 16.148826 H 8.3512827 v 9.33331 h 3.5599913 v -0.28 H 8.6446153 v -4.319989 h 2.7466597 v -0.266666 z"
       id="path10386" />
    <path
       d="m 18.151249,16.588825 v 8.893311 h 0.293333 v -9.33331 h -0.453333 l -2.293327,8.853311 -2.293328,-8.853311 h -0.453332 v 9.33331 h 0.266666 v -8.893311 l 2.306661,8.866644 h 0.333332 z"
       id="path10388" />
    <path
       d="m 19.497894,23.188808 c 0,1.306664 0.559999,2.359994 1.973328,2.359994 1.439997,0 1.999995,-1.05333 1.999995,-2.359994 v -4.746654 c 0,-1.306664 -0.559998,-2.359994 -1.999995,-2.359994 -1.413329,0 -1.973328,1.05333 -1.973328,2.359994 z m 0.293333,-4.759988 c 0,-1.146664 0.439998,-2.079994 1.679995,-2.079994 1.25333,0 1.706663,0.93333 1.706663,2.079994 v 4.773322 c 0,1.146663 -0.453333,2.079994 -1.706663,2.079994 -1.239997,0 -1.679995,-0.933331 -1.679995,-2.079994 z"
       id="path10390" />
    <path
       d="m 28.524514,16.08216 c -1.346664,0.01333 -1.919995,0.946664 -1.919995,2.30666 0,2.573327 3.573324,2.493327 3.573324,4.853321 0,1.133331 -0.439999,2.026662 -1.666663,2.026662 -1.226663,0 -1.666662,-0.893331 -1.666662,-2.026662 v -0.466665 h -0.279999 v 0.453332 c 0,1.29333 0.533332,2.319994 1.946661,2.319994 1.426663,0 1.959995,-1.026664 1.959995,-2.319994 0,-2.533327 -3.573324,-2.46666 -3.573324,-4.853321 0,-1.106664 0.413332,-2.026661 1.639996,-2.026661 1.21333,0 1.626663,0.93333 1.626663,2.039994 v 0.186667 h 0.293332 v -0.173333 c 0,-1.279997 -0.519999,-2.319994 -1.933328,-2.319994 z"
       id="path10392" />
    <path
       d="m 33.444495,16.08216 c -1.41333,0 -1.946662,1.066663 -1.946662,2.359994 v 4.746654 c 0,1.29333 0.533332,2.359994 1.946662,2.359994 1.426663,0 1.959995,-1.066664 1.959995,-2.359994 v -1.013331 h -0.293333 v 1.026665 c 0,1.13333 -0.426665,2.066661 -1.653329,2.066661 -1.239997,0 -1.666662,-0.933331 -1.666662,-2.066661 V 18.42882 c 0,-1.13333 0.426665,-2.079994 1.666662,-2.079994 1.226664,0 1.653329,0.946664 1.653329,2.079994 v 0.733332 h 0.293333 v -0.719998 c 0,-1.293331 -0.533332,-2.359994 -1.959995,-2.359994 z"
       id="path10394" />
    <path
       d="m 36.737805,20.615481 v -4.186656 h 3.266658 v -0.279999 h -3.559991 v 9.33331 h 3.559991 v -0.28 h -3.266658 v -4.319989 h 2.746659 v -0.266666 z"
       id="path10396" />
    <path
       d="m 41.324451,16.575492 3.333325,8.906644 h 0.359999 v -9.33331 h -0.28 v 8.733311 l -3.279991,-8.733311 h -0.413333 v 9.33331 h 0.28 z"
       id="path10398" />
    <path
       d="m 46.377751,20.615481 v -4.186656 h 3.266658 v -0.279999 h -3.559991 v 9.33331 h 3.559991 v -0.28 h -3.266658 v -4.319989 h 2.746659 v -0.266666 z"
       id="path10400" />
  </g>
</svg>
