<?xml version="1.0" encoding="UTF-8" standalone="no"?>
<!-- Created with Inkscape (http://www.inkscape.org/) -->

<svg
   version="1.1"
   id="svg2"
   width="57.266369"
   height="9.4666433"
   viewBox="0 0 57.266371 9.4666433"
   sodipodi:docname="auto-sportfight.svg"
   inkscape:version="1.1 (c68e22c387, 2021-05-23)"
   inkscape:export-filename="C:\Users\BUCH\Desktop\Retrogaming\Recalbox\travail thèmes\Thème vignette !!!!!!!\Maquette 2 !!!!\image1250.png"
   inkscape:export-xdpi="96.460785"
   inkscape:export-ydpi="96.460785"
   xmlns:inkscape="http://www.inkscape.org/namespaces/inkscape"
   xmlns:sodipodi="http://sodipodi.sourceforge.net/DTD/sodipodi-0.dtd"
   xmlns="http://www.w3.org/2000/svg"
   xmlns:svg="http://www.w3.org/2000/svg">
  <defs
     id="defs6">
    <clipPath
       clipPathUnits="userSpaceOnUse"
       id="clipPath3185">
      <path
         id="path3187"
         style="fill:#ffffff;fill-rule:evenodd;stroke:#ffffff;stroke-width:5.15903;stroke-linecap:round;stroke-linejoin:round;paint-order:stroke fill markers"
         d="m 1157.5591,335.78677 h 462.4206 L 1362.3723,1410.6277 H 899.95176 Z"
         sodipodi:nodetypes="ccccc"
         inkscape:export-filename="C:\Users\BUCH\Desktop\Retrogaming\Recalbox\travail thèmes\Thème vignette !!!!!!!\Maquette 2 !!!!\rect849.png"
         inkscape:export-xdpi="247.96268"
         inkscape:export-ydpi="247.96268" />
    </clipPath>
  </defs>
  <sodipodi:namedview
     id="namedview4"
     pagecolor="#ffffff"
     bordercolor="#666666"
     borderopacity="1.0"
     inkscape:pageshadow="2"
     inkscape:pageopacity="0.0"
     inkscape:pagecheckerboard="true"
     showgrid="false"
     inkscape:showpageshadow="false"
     inkscape:zoom="8.8242196"
     inkscape:cx="46.972992"
     inkscape:cy="22.664894"
     inkscape:window-width="1920"
     inkscape:window-height="1138"
     inkscape:window-x="-8"
     inkscape:window-y="-8"
     inkscape:window-maximized="1"
     inkscape:current-layer="svg2"
     fit-margin-top="0"
     fit-margin-left="0"
     fit-margin-right="0"
     fit-margin-bottom="0" />
  <g
     aria-label="violent sport"
     id="text3385"
     style="font-weight:300;font-size:13.3333px;line-height:1.25;font-family:'Bebas Neue';-inkscape-font-specification:'Bebas Neue, Light';fill:#ffffff"
     transform="translate(9.0259236,22.432291)">
    <path
       d="m -9.0259236,-22.365624 2.2799943,9.33331 h 0.4399989 l 2.2399943,-9.33331 h -0.2799993 l -2.1866611,8.999977 -2.1866612,-8.999977 z"
       id="path3570" />
    <path
       d="m -3.0392836,-22.365624 v 9.33331 h 0.2933326 v -9.33331 z"
       id="path3572" />
    <path
       d="m -1.6926297,-15.325642 c 0,1.306664 0.5599986,2.359994 1.97332837,2.359994 1.43999633,0 1.99999493,-1.05333 1.99999493,-2.359994 v -4.746655 c 0,-1.306663 -0.5599986,-2.359994 -1.99999493,-2.359994 -1.41332977,0 -1.97332837,1.053331 -1.97332837,2.359994 z m 0.2933326,-4.759988 c 0,-1.146664 0.4399989,-2.079995 1.67999577,-2.079995 1.25333013,0 1.70666233,0.933331 1.70666233,2.079995 v 4.773321 c 0,1.146664 -0.4533322,2.079995 -1.70666233,2.079995 -1.23999687,0 -1.67999577,-0.933331 -1.67999577,-2.079995 z"
       id="path3574" />
    <path
       d="m 6.7606749,-13.032314 v -0.28 H 3.6273495 v -9.05331 H 3.3340169 v 9.33331 z"
       id="path3576" />
    <path
       d="m 8.0673157,-17.898969 v -4.186656 h 3.2666583 v -0.279999 H 7.7739831 v 9.33331 h 3.5599909 v -0.28 H 8.0673157 v -4.319989 h 2.7466593 v -0.266666 z"
       id="path3578" />
    <path
       d="m 12.653962,-21.938958 3.333325,8.906644 h 0.359999 v -9.33331 h -0.279999 v 8.733311 l -3.279992,-8.733311 h -0.413332 v 9.33331 h 0.279999 z"
       id="path3580" />
    <path
       d="m 19.453922,-13.032314 v -9.053311 h 2.039995 v -0.279999 h -4.359989 v 0.279999 h 2.026661 v 9.053311 z"
       id="path3582" />
    <path
       d="m 26.307203,-22.432291 c -1.346663,0.01333 -1.919995,0.946665 -1.919995,2.306661 0,2.573327 3.573324,2.493327 3.573324,4.853321 0,1.133331 -0.439999,2.026662 -1.666662,2.026662 -1.226664,0 -1.666663,-0.893331 -1.666663,-2.026662 v -0.466665 h -0.279999 v 0.453332 c 0,1.29333 0.533332,2.319994 1.946662,2.319994 1.426663,0 1.959995,-1.026664 1.959995,-2.319994 0,-2.533327 -3.573324,-2.46666 -3.573324,-4.853321 0,-1.106664 0.413332,-2.026662 1.639996,-2.026662 1.21333,0 1.626662,0.933331 1.626662,2.039995 v 0.186666 h 0.293333 v -0.173332 c 0,-1.279997 -0.519999,-2.319995 -1.933329,-2.319995 z"
       id="path3584" />
    <path
       d="m 29.293858,-22.365624 v 9.33331 h 0.293332 v -3.95999 h 1.33333 c 1.479997,0 2.146661,-0.706665 2.146661,-2.186661 v -0.933331 c 0,-1.306664 -0.493332,-2.253328 -1.933328,-2.253328 z m 0.293332,5.09332 v -4.813321 h 1.546663 c 1.25333,0 1.639996,0.813332 1.639996,1.959995 v 0.959998 c 0,1.319997 -0.546665,1.893328 -1.853329,1.893328 z"
       id="path3586" />
    <path
       d="m 34.067168,-15.325642 c 0,1.306664 0.559999,2.359994 1.973329,2.359994 1.439996,0 1.999995,-1.05333 1.999995,-2.359994 v -4.746655 c 0,-1.306663 -0.559999,-2.359994 -1.999995,-2.359994 -1.41333,0 -1.973329,1.053331 -1.973329,2.359994 z m 0.293333,-4.759988 c 0,-1.146664 0.439999,-2.079995 1.679996,-2.079995 1.25333,0 1.706662,0.933331 1.706662,2.079995 v 4.773321 c 0,1.146664 -0.453332,2.079995 -1.706662,2.079995 -1.239997,0 -1.679996,-0.933331 -1.679996,-2.079995 z"
       id="path3588" />
    <path
       d="m 39.093815,-22.365624 v 9.33331 h 0.293333 v -4.306656 h 1.146663 c 1.213331,0 2.039995,0.359999 2.039995,1.733329 v 1.466663 c 0,0.399999 0.04,0.813331 0.226666,1.106664 h 0.319999 c -0.213332,-0.293333 -0.253332,-0.746665 -0.253332,-1.106664 v -1.466663 c 0,-1.026664 -0.439999,-1.706662 -1.479996,-1.866662 1.026664,-0.186666 1.479996,-0.813331 1.479996,-1.959995 v -0.839998 c 0,-1.279997 -0.533332,-2.093328 -1.919995,-2.093328 z m 0.293333,4.746655 v -4.466656 h 1.546662 c 1.199997,0 1.639996,0.706665 1.639996,1.839996 v 0.853331 c 0,1.439996 -0.746665,1.773329 -2.039995,1.773329 z"
       id="path3590" />
    <path
       d="m 46.200453,-13.032314 v -9.053311 h 2.039994 v -0.279999 h -4.359989 v 0.279999 h 2.026662 v 9.053311 z"
       id="path3592" />
  </g>
</svg>
