<?xml version="1.0" encoding="UTF-8" standalone="no"?>
<!-- Created with Inkscape (http://www.inkscape.org/) -->

<svg
   version="1.1"
   id="svg2"
   width="41.826447"
   height="9.4666433"
   viewBox="0 0 41.826449 9.4666433"
   sodipodi:docname="auto-tate.svg"
   inkscape:version="1.1 (c68e22c387, 2021-05-23)"
   inkscape:export-filename="C:\Users\BUCH\Desktop\Retrogaming\Recalbox\travail thèmes\Thème vignette !!!!!!!\Maquette 2 !!!!\image1250.png"
   inkscape:export-xdpi="96.460785"
   inkscape:export-ydpi="96.460785"
   xmlns:inkscape="http://www.inkscape.org/namespaces/inkscape"
   xmlns:sodipodi="http://sodipodi.sourceforge.net/DTD/sodipodi-0.dtd"
   xmlns="http://www.w3.org/2000/svg"
   xmlns:svg="http://www.w3.org/2000/svg">
  <defs
     id="defs6">
    <clipPath
       clipPathUnits="userSpaceOnUse"
       id="clipPath3185">
      <path
         id="path3187"
         style="fill:#ffffff;fill-rule:evenodd;stroke:#ffffff;stroke-width:5.15903;stroke-linecap:round;stroke-linejoin:round;paint-order:stroke fill markers"
         d="m 1157.5591,335.78677 h 462.4206 L 1362.3723,1410.6277 H 899.95176 Z"
         sodipodi:nodetypes="ccccc"
         inkscape:export-filename="C:\Users\BUCH\Desktop\Retrogaming\Recalbox\travail thèmes\Thème vignette !!!!!!!\Maquette 2 !!!!\rect849.png"
         inkscape:export-xdpi="247.96268"
         inkscape:export-ydpi="247.96268" />
    </clipPath>
  </defs>
  <sodipodi:namedview
     id="namedview4"
     pagecolor="#ffffff"
     bordercolor="#666666"
     borderopacity="1.0"
     inkscape:pageshadow="2"
     inkscape:pageopacity="0.0"
     inkscape:pagecheckerboard="true"
     showgrid="false"
     inkscape:showpageshadow="false"
     inkscape:zoom="8.8242196"
     inkscape:cx="46.746344"
     inkscape:cy="0.45329788"
     inkscape:window-width="1920"
     inkscape:window-height="1138"
     inkscape:window-x="-8"
     inkscape:window-y="-8"
     inkscape:window-maximized="1"
     inkscape:current-layer="svg2"
     fit-margin-top="0"
     fit-margin-left="0"
     fit-margin-right="0"
     fit-margin-bottom="0" />
  <g
     aria-label="tate mode"
     id="text7317"
     style="font-weight:300;font-size:13.3333px;line-height:1.25;font-family:'Bebas Neue';-inkscape-font-specification:'Bebas Neue, Light';fill:#ffffff"
     transform="translate(-2.5198222,-17.344599)">
    <path
       d="m 4.8398163,26.744576 v -9.053311 h 2.0399949 v -0.279999 h -4.359989 v 0.279999 h 2.0266615 v 9.053311 z"
       id="path7832" />
    <path
       d="m 11.279781,24.544581 0.546665,2.199995 h 0.293333 L 9.8131178,17.397932 H 9.3997855 l -2.2533277,9.346644 h 0.266666 l 0.5466653,-2.199995 z m -1.679996,-6.799983 1.626663,6.533317 H 8.0131223 Z"
       id="path7834" />
    <path
       d="m 14.679752,26.744576 v -9.053311 h 2.039994 v -0.279999 h -4.359988 v 0.279999 h 2.026661 v 9.053311 z"
       id="path7836" />
    <path
       d="m 17.826393,21.877921 v -4.186656 h 3.266659 v -0.279999 h -3.559991 v 9.33331 h 3.559991 v -0.28 h -3.266659 v -4.319989 h 2.74666 v -0.266666 z"
       id="path7838" />
    <path
       d="m 29.399673,17.851265 v 8.893311 h 0.293332 v -9.33331 h -0.453332 l -2.293328,8.853311 -2.293327,-8.853311 h -0.453332 v 9.33331 h 0.266666 v -8.893311 l 2.306661,8.866644 h 0.333332 z"
       id="path7840" />
    <path
       d="m 30.746318,24.451248 c 0,1.306663 0.559998,2.359994 1.973328,2.359994 1.439996,0 1.999995,-1.053331 1.999995,-2.359994 v -4.746655 c 0,-1.306663 -0.559999,-2.359994 -1.999995,-2.359994 -1.41333,0 -1.973328,1.053331 -1.973328,2.359994 z M 31.03965,19.69126 c 0,-1.146664 0.439999,-2.079995 1.679996,-2.079995 1.25333,0 1.706662,0.933331 1.706662,2.079995 v 4.773321 c 0,1.146664 -0.453332,2.079995 -1.706662,2.079995 -1.239997,0 -1.679996,-0.933331 -1.679996,-2.079995 z"
       id="path7842" />
    <path
       d="m 35.772966,17.411266 v 9.33331 h 1.959995 c 1.41333,0 2.013328,-0.999998 2.013328,-2.319995 v -4.679988 c 0,-1.33333 -0.599998,-2.333327 -2.026661,-2.333327 z m 0.293333,9.05331 v -8.773311 h 1.653329 c 1.239997,0 1.733329,0.866665 1.733329,2.039995 v 4.706655 c 0,1.159997 -0.479999,2.026661 -1.733329,2.026661 z"
       id="path7844" />
    <path
       d="m 41.079612,21.877921 v -4.186656 h 3.266658 v -0.279999 h -3.559991 v 9.33331 h 3.559991 v -0.28 h -3.266658 v -4.319989 h 2.74666 v -0.266666 z"
       id="path7846" />
  </g>
</svg>
