<?xml version="1.0" encoding="UTF-8" standalone="no"?>
<!-- Created with Inkscape (http://www.inkscape.org/) -->

<svg
   version="1.1"
   id="svg2"
   width="33.319813"
   height="9.4666433"
   viewBox="0 0 33.319814 9.4666433"
   sodipodi:docname="wasm4.svg"
   inkscape:version="1.1 (c68e22c387, 2021-05-23)"
   inkscape:export-filename="C:\Users\BUCH\Desktop\Retrogaming\Recalbox\travail thèmes\Thème vignette !!!!!!!\Maquette 2 !!!!\image1250.png"
   inkscape:export-xdpi="96.460785"
   inkscape:export-ydpi="96.460785"
   xmlns:inkscape="http://www.inkscape.org/namespaces/inkscape"
   xmlns:sodipodi="http://sodipodi.sourceforge.net/DTD/sodipodi-0.dtd"
   xmlns="http://www.w3.org/2000/svg"
   xmlns:svg="http://www.w3.org/2000/svg">
  <defs
     id="defs6">
    <clipPath
       clipPathUnits="userSpaceOnUse"
       id="clipPath3185">
      <path
         id="path3187"
         style="fill:#ffffff;fill-rule:evenodd;stroke:#ffffff;stroke-width:5.15903;stroke-linecap:round;stroke-linejoin:round;paint-order:stroke fill markers"
         d="m 1157.5591,335.78677 h 462.4206 L 1362.3723,1410.6277 H 899.95176 Z"
         sodipodi:nodetypes="ccccc"
         inkscape:export-filename="C:\Users\BUCH\Desktop\Retrogaming\Recalbox\travail thèmes\Thème vignette !!!!!!!\Maquette 2 !!!!\rect849.png"
         inkscape:export-xdpi="247.96268"
         inkscape:export-ydpi="247.96268" />
    </clipPath>
  </defs>
  <sodipodi:namedview
     id="namedview4"
     pagecolor="#ffffff"
     bordercolor="#666666"
     borderopacity="1.0"
     inkscape:pageshadow="2"
     inkscape:pageopacity="0.0"
     inkscape:pagecheckerboard="true"
     showgrid="false"
     inkscape:showpageshadow="false"
     inkscape:zoom="12.479331"
     inkscape:cx="30.490417"
     inkscape:cy="19.792728"
     inkscape:window-width="1920"
     inkscape:window-height="1138"
     inkscape:window-x="-8"
     inkscape:window-y="-8"
     inkscape:window-maximized="1"
     inkscape:current-layer="svg2"
     fit-margin-top="0"
     fit-margin-left="0"
     fit-margin-right="0"
     fit-margin-bottom="0" />
  <g
     aria-label="wasm-4"
     id="text2296"
     style="font-weight:300;font-size:13.3333px;line-height:1.25;font-family:'Bebas Neue';-inkscape-font-specification:'Bebas Neue, Light';fill:#ffffff"
     transform="translate(-0.09266957,16.050974)">
    <path
       d="m 3.7993269,-15.290976 1.5066628,8.6399784 H 5.6926554 L 7.3459846,-15.984307 H 7.0793186 L 5.5059892,-7.1043298 3.9859931,-15.930974 H 3.625994 L 2.0126647,-7.0509966 0.38600217,-15.984307 h -0.2933326 l 1.67999573,9.3333094 h 0.4266656 z"
       id="path2943" />
    <path
       d="m 12.265929,-8.8509921 0.546666,2.1999945 h 0.293332 l -2.30666,-9.3466434 h -0.413333 l -2.2533274,9.3466434 h 0.266666 l 0.5466653,-2.1999945 z m -1.679995,-6.7999829 1.626662,6.5333169 H 8.9992711 Z"
       id="path2945" />
    <path
       d="m 16.065901,-16.050974 c -1.346664,0.01333 -1.919996,0.946664 -1.919996,2.306661 0,2.573327 3.573325,2.493327 3.573325,4.853321 0,1.1333305 -0.439999,2.0266616 -1.666663,2.0266616 -1.226663,0 -1.666662,-0.8933311 -1.666662,-2.0266616 v -0.4666655 h -0.279999 v 0.4533322 c 0,1.2933301 0.533332,2.3199942 1.946661,2.3199942 1.426663,0 1.959995,-1.0266641 1.959995,-2.3199942 0,-2.5333267 -3.573324,-2.4666607 -3.573324,-4.8533207 0,-1.106664 0.413332,-2.026662 1.639996,-2.026662 1.21333,0 1.626663,0.933331 1.626663,2.039995 v 0.186666 h 0.293332 v -0.173333 c 0,-1.279997 -0.519999,-2.319994 -1.933328,-2.319994 z"
       id="path2947" />
    <path
       d="m 24.25254,-15.544308 v 8.8933104 h 0.293333 V -15.984307 H 24.09254 l -2.293327,8.8533106 -2.293328,-8.8533106 h -0.453332 v 9.3333094 h 0.266666 v -8.8933104 l 2.306661,8.8666438 h 0.333333 z"
       id="path2949" />
    <path
       d="m 25.599185,-11.18432 h 2.373327 v -0.266666 h -2.373327 z"
       id="path2951" />
    <path
       d="M 33.412481,-8.8509921 V -9.1309914 H 32.59915 v -6.8666496 h -0.359999 l -3.253325,6.8533163 v 0.2933326 h 3.319991 v 2.1999945 h 0.293333 v -2.1999945 z m -1.106664,-6.6266499 v 6.3466506 h -3.039992 z"
       id="path2953" />
  </g>
</svg>
