<?xml version="1.0" encoding="UTF-8" standalone="no"?>
<svg
   viewBox="0 0 470 356.36099"
   version="1.1"
   id="svg4"
   sodipodi:docname="auto-strategymoba.svg"
   width="470"
   height="356.36099"
   inkscape:version="1.1 (c68e22c387, 2021-05-23)"
   xmlns:inkscape="http://www.inkscape.org/namespaces/inkscape"
   xmlns:sodipodi="http://sodipodi.sourceforge.net/DTD/sodipodi-0.dtd"
   xmlns="http://www.w3.org/2000/svg"
   xmlns:svg="http://www.w3.org/2000/svg">
  <defs
     id="defs8" />
  <sodipodi:namedview
     id="namedview6"
     pagecolor="#ffffff"
     bordercolor="#666666"
     borderopacity="1.0"
     inkscape:pageshadow="2"
     inkscape:pageopacity="0.0"
     inkscape:pagecheckerboard="0"
     showgrid="false"
     fit-margin-top="0"
     fit-margin-left="0"
     fit-margin-right="0"
     fit-margin-bottom="0"
     inkscape:zoom="1.0399442"
     inkscape:cx="235.10878"
     inkscape:cy="177.89417"
     inkscape:window-width="1920"
     inkscape:window-height="1138"
     inkscape:window-x="-8"
     inkscape:window-y="-8"
     inkscape:window-maximized="1"
     inkscape:current-layer="svg4" />
  <path
     fill="#000000"
     d="M 131.39,0 C 82.057,15.867 38.067,45.849 17.034,85.986 30.532,85.077 27.616,100.502 27.616,115.933 H 14.133 c 0.299,20.005 4.471,22.494 4.471,22.494 8.813,0 8.813,16 8.813,32 H 10.576 L 0,332.427 c 0,2.752 3.504,5.265 9.857,7.543 0.22,-25.637 1.467,-47.543 8.747,-47.543 7.706,0 8.674,24.472 8.795,52.014 6.795,1.305 14.716,2.501 23.544,3.593 0.173,-27.374 1.5,-51.607 11.724,-51.607 10.528,0 11.617,25.708 11.73,54.07 9.233,0.829 19.047,1.576 29.416,2.23 0.127,-28.453 1.37,-54.3 13.687,-54.3 12.527,0 13.596,26.746 13.69,55.772 8.306,0.378 16.815,0.712 25.5,0.994 0.132,-28.636 1.492,-54.766 15.643,-54.766 14.282,0 17.254,8 17.365,36.943 27.602,20.197 24.014,14.35 27.7,18.983 0.115,-29.085 1.467,-55.926 17.602,-55.926 16.136,0 17.487,26.846 17.602,55.934 9.875,-0.068 19.698,-0.194 29.419,-0.375 0.112,-28.944 1.364,-55.559 15.646,-55.559 14.15,0 15.51,26.127 15.643,54.76 a 1988.66,1988.66 0 0 0 20.588,-0.764 l -34.499,-77.27 -30.497,-2.595 -24.543,-113.03 -35.274,2.962 -13.024,-52.692 -15.948,-2.326 z m -13.691,45.933 c 13.708,0 13.708,16 13.708,32 l -27.416,8 c 0,-16 0,-40 13.708,-40 z m -54.833,16 c 11.75,0 11.75,16 11.75,32 l -23.5,4 c 0,-16 0,-36 11.75,-36 z m 109.467,60.494 c 15.667,0 15.667,16 15.667,32 l -31.333,2 c 0,-16 0,-34 15.666,-34 z m -54.833,4 c 13.708,0 13.708,16 13.708,32 l -27.416,2 c 0,-16 0,-34 13.708,-34 z m -54.833,6 c 11.75,0 11.75,16 11.75,32 l -23.5,4 c 0,-16 0,-36 11.75,-36 z m 199.323,27.147 20.012,92.175 c 0,-23.77 0.146,-47.322 15.665,-47.322 15.666,0 15.666,24 15.666,48 -1.437,5.715 -1.537,6.167 -2.18,7.664 l 28.683,64.244 c 1.412,-15.195 4.743,-25.908 12.664,-25.908 12.316,0 13.56,25.846 13.687,54.299 9.64,-0.609 18.791,-1.3 27.457,-2.059 0.11,-28.43 1.182,-54.24 11.731,-54.24 10.253,0 11.559,24.37 11.725,51.84 10.484,-1.26 19.768,-2.66 27.463,-4.211 0.129,-27.382 1.122,-51.629 8.791,-51.629 7.21,0 8.501,21.485 8.74,46.797 5.109,-2.078 7.906,-4.342 7.906,-6.797 L 460.987,194.361 C 450.103,184.36 434.895,177.486 416.846,172.669 l -19.893,14.002 -30.259,-2.808 -20.7,-21.143 c -27.077,-1.717 -55.883,-2.184 -84.004,-3.146 z m -89.657,44.853 c 15.667,0 15.667,24 15.667,48 h -31.333 c 0,-24 0,-48 15.666,-48 z m 62.667,0 c 17.625,0 17.625,24 17.625,48 h -35.25 c 0,-24 0,-48 17.625,-48 z m -117.5,2 c 13.708,0 13.708,24 13.708,48 h -27.416 c 0,-24 0,-48 13.708,-48 z m 235,0 c 13.708,0 13.708,24 13.708,48 h -27.416 c 0,-24 0,-48 13.708,-48 z m -289.833,2 c 11.75,0 11.75,22 11.75,46 l -23.5,2 c 0,-24 0,-48 11.75,-48 z m 342.708,0 c 11.75,0 11.75,24 11.75,48 l -23.5,-2 c 0,-24 0,-46 11.75,-46 z m -382.77,2 c 8.812,0 8.812,22 8.812,46 l -17.625,2 c 0,-24 0,-48 8.812,-48 z m 426.75,0 c 8.812,0 8.812,24 8.812,48 l -17.625,-2 c 0,-24 0,-46 8.812,-46 z"
     id="path2"
     style="fill:#ffffff" />
</svg>
