<?xml version="1.0" encoding="UTF-8" standalone="no"?>
<svg
   viewBox="0 0 423.89 168.832"
   version="1.1"
   id="svg26"
   sodipodi:docname="consolegame.svg"
   inkscape:version="1.1 (c68e22c387, 2021-05-23)"
   xmlns:inkscape="http://www.inkscape.org/namespaces/inkscape"
   xmlns:sodipodi="http://sodipodi.sourceforge.net/DTD/sodipodi-0.dtd"
   xmlns="http://www.w3.org/2000/svg"
   xmlns:svg="http://www.w3.org/2000/svg">
  <defs
     id="defs30" />
  <sodipodi:namedview
     id="namedview28"
     pagecolor="#ffffff"
     bordercolor="#666666"
     borderopacity="1.0"
     inkscape:pageshadow="2"
     inkscape:pageopacity="0.0"
     inkscape:pagecheckerboard="true"
     showgrid="false"
     inkscape:showpageshadow="false"
     inkscape:zoom="1.3128406"
     inkscape:cx="212.13543"
     inkscape:cy="115.01778"
     inkscape:window-width="1920"
     inkscape:window-height="1138"
     inkscape:window-x="-8"
     inkscape:window-y="-8"
     inkscape:window-maximized="1"
     inkscape:current-layer="svg26" />
  <g
     id="g1426"
     style="fill:#194f91;fill-opacity:1">
    <path
       d="m 402.623,109.894 c -0.04,0.859 -0.291,1.776 -0.077,2.566 0.441,1.627 -0.058,3.021 -0.598,4.483 -0.735,1.991 -1.332,4.032 -2.054,6.028 -0.603,1.667 -1.369,3.276 -1.938,4.953 -0.542,1.596 -0.92,3.246 -1.373,4.872 -0.165,0.591 -0.285,1.201 -0.517,1.764 -1.622,3.933 -2.559,8.103 -5.065,11.736 -1.665,2.414 -2.383,5.476 -3.561,8.233 -0.408,0.955 -1.077,1.822 -1.355,2.806 -0.543,1.923 -1.335,3.386 -3.643,3.426 -0.531,0.009 -1.09,0.39 -1.574,0.698 -2.325,1.478 -4.68,1.008 -7.071,0.217 -0.293,-0.097 -0.891,-0.02 -0.996,0.171 -1.727,3.114 -4.626,3.915 -7.868,4.173 -1.75,0.139 -3.38,0.014 -5.099,-0.543 -1.865,-0.604 -3.907,-0.722 -5.886,-0.896 -1.338,-0.118 -3.35,-0.913 -3.42,-1.947 -0.114,-1.697 -1.248,-3.628 0.756,-5.099 0.366,-0.268 0.386,-1.039 0.517,-1.589 0.42,-1.753 0.931,-3.494 1.197,-5.271 0.454,-3.03 1.104,-5.99 2.408,-8.776 0.734,-1.569 1.578,-3.09 2.239,-4.688 1.191,-2.877 2.244,-5.811 3.439,-8.686 0.337,-0.811 1.713,-2.757 1.722,-2.708 0.521,2.857 1.168,6.446 1.683,9.304 a 3.5,3.5 0 0 0 0.102,0.451 c 0.579,1.824 0.983,3.73 1.794,5.445 0.821,1.737 0.461,3.073 -0.297,4.711 -0.992,2.146 -1.782,4.421 -1.748,6.906 0.013,0.941 -0.597,1.877 -0.815,2.839 -0.247,1.088 0.187,1.823 1.278,2.261 1.108,0.445 2.132,1.093 3.23,1.567 0.307,0.132 0.869,0.103 1.098,-0.099 0.661,-0.579 1.229,-1.268 1.801,-1.943 0.739,-0.873 1.473,-1.753 2.154,-2.67 0.283,-0.381 0.616,-0.879 0.593,-1.305 -0.088,-1.604 0.668,-2.713 1.802,-3.701 0.256,-0.223 0.498,-0.66 0.471,-0.976 -0.092,-1.104 0.287,-1.971 0.866,-2.899 0.509,-0.816 0.66,-1.86 0.942,-2.812 0.446,-1.505 0.897,-3.009 1.29,-4.527 0.19,-0.735 0.288,-1.499 0.364,-2.257 0.117,-1.163 0.64,-1.797 1.736,-2.437 1.664,-0.972 3.194,-2.318 4.469,-3.778 1.851,-2.119 3.382,-4.513 5.133,-6.724 0.809,-1.021 1.898,-1.82 2.714,-2.836 2.563,-3.188 5.05,-6.438 7.584,-9.649 a 35.504,35.504 0 0 1 2.042,-2.359 c 0.491,-0.521 0.78,-1.013 0.468,-1.756 -0.159,-0.379 -0.197,-0.834 -0.191,-1.253 0.019,-1.444 -0.307,-2.751 -1.315,-3.841 -0.545,-0.589 -0.629,-1.179 -0.021,-1.826 0.448,-0.476 0.726,-1.134 1.218,-1.545 1.785,-1.491 2.147,-3.39 2.067,-5.611 -0.095,-2.665 0.092,-5.363 -1.055,-7.847 -0.488,-1.057 -1.332,-1.955 -2.059,-2.89 -0.772,-0.806 -1.337,-0.186 -0.555,0.736 0.942,0.993 1.856,2.012 2.035,3.425 0.255,2.016 0.442,4.042 0.617,6.067 0.066,0.769 0.038,1.549 0.009,2.322 -0.016,0.419 0.014,0.937 -0.21,1.235 a 62.907,62.907 0 0 1 -3.155,3.854 c -0.138,0.156 -0.739,0.106 -0.976,-0.061 -3.571,-2.521 -7.211,-4.959 -10.624,-7.68 -1.5,-1.196 -2.504,-3.006 -3.773,-4.505 -1.272,-1.502 -2.616,-2.943 -3.874,-4.456 -0.285,-0.343 -0.448,-0.866 -0.485,-1.32 -0.156,-1.923 -0.055,-3.885 -0.4,-5.769 a 15.058,15.058 0 0 0 -3.462,-7.225 c -1.152,-1.326 -2.295,-2.746 -3.715,-3.73 -1.749,-1.212 -3.864,-1.672 -6.046,-1.657 -0.443,0.003 -0.888,-0.298 -1.332,-0.46 0.176,-0.404 0.292,-0.85 0.54,-1.204 0.549,-0.784 1.168,-1.517 1.751,-2.278 1.095,-1.429 2.516,-2.368 4.248,-2.84 2.218,-0.604 4.428,-1.242 6.663,-1.775 0.544,-0.13 1.363,-0.125 1.724,0.194 0.995,0.879 1.814,1.956 2.737,2.993 -1.546,0.426 -3.32,-0.361 -5.201,0.612 0.538,0.236 0.777,0.398 1.035,0.439 0.34,0.054 0.696,0.036 1.043,0.011 2.946,-0.213 5.74,0.34 8.568,1.214 2.418,0.748 4.786,1.648 7.204,2.349 3.273,0.949 5.562,3.217 8.083,5.213 2.663,2.109 5.29,4.263 7.969,6.352 0.654,0.51 0.989,0.962 0.732,1.844 -0.276,0.949 -0.334,1.959 -0.54,2.932 a 3.34,3.34 0 0 1 -0.477,1.175 c -1.476,2.163 -2.959,4.321 -4.495,6.442 -0.401,0.554 -1.03,0.937 -1.484,1.459 -0.579,0.604 -0.262,1.251 0.55,0.668 2.002,-1.387 3.088,-3.522 4.406,-5.465 0.751,-1.107 1.458,-2.245 2.173,-3.376 0.122,-0.193 0.202,-0.418 0.269,-0.638 0.501,-1.642 1.237,-1.877 2.59,-0.866 1.048,0.783 2.163,1.48 3.185,2.294 0.397,0.316 0.725,0.809 0.903,1.289 0.429,1.156 0.651,2.395 1.141,3.52 0.667,1.531 0.836,3.085 0.852,4.733 0.014,1.405 0.346,2.807 0.537,4.211 0.114,0.835 0.202,1.674 0.345,2.504 0.607,3.515 0.667,7.057 0.496,10.605 -0.024,0.5 -0.37,0.987 -0.579,1.475 -0.118,0.276 -0.342,0.533 -0.373,0.814 -0.179,1.594 -0.312,3.193 -0.466,4.79 -0.037,0.383 -0.085,0.765 -0.145,1.144 -0.15,0.952 -0.365,1.898 -0.455,2.856 -0.158,1.683 -0.303,3.371 -0.342,5.059 -0.058,2.471 -0.019,4.944 -0.018,7.416 0,3.167 -0.102,6.338 0.047,9.498 0.076,1.623 0.076,3.188 -0.156,4.804 -0.163,1.136 -0.106,2.521 0.414,3.494 1.29,2.414 0.842,4.669 0.013,7.014 -0.529,1.497 -0.843,2.983 -0.43,4.631 0.642,2.561 -2.041,6.314 -4.83,7.091 -1.401,0.39 -2.754,0.953 -4.154,1.348 -0.602,0.17 -1.268,0.127 -1.907,0.15 -0.611,0.022 -1.256,-0.121 -1.829,0.029 -1.233,0.321 -2.218,-0.453 -1.942,-1.71 0.12,-0.547 0.363,-1.167 0.756,-1.536 1.776,-1.671 1.464,-3.741 0.85,-5.62 -0.546,-1.672 -1.264,-3.282 -1.47,-5.05 -0.072,-0.613 -0.195,-1.242 -0.126,-1.844 0.232,-2.029 0.727,-4.044 0.777,-6.074 a 89.66,89.66 0 0 0 -0.265,-9.111 c -0.26,-3.364 -0.823,-6.704 -1.096,-10.067 -0.08,-0.99 0.263,-2.063 0.608,-3.028 0.803,-2.25 -0.168,-4.137 -0.986,-6.109 -0.571,-1.377 -0.974,-2.827 -1.412,-4.257 -0.446,-1.458 -0.843,-2.93 -1.261,-4.396 -0.136,-0.023 -0.271,-0.043 -0.405,-0.064 z"
       id="path2"
       style="fill:#194f91;fill-opacity:1" />
    <path
       d="m 374.577,138.366 c -0.015,1.511 0.189,3.047 0.5,4.529 0.297,1.414 0.717,2.941 -2.814,2.654 a 0.507,0.507 0 0 1 -0.122,-0.024 c -2.046,-0.677 -5.293,-3.608 -5.307,-6.609 -0.004,-0.943 -0.637,-1.874 -0.92,-2.829 -0.261,-0.882 -0.418,-1.796 -0.623,-2.694 -0.229,-1.001 -0.491,-1.996 -0.658,-3.009 -0.154,-0.935 -0.541,-1.861 -0.578,-2.801 -0.076,-1.948 0.453,-2.689 2.256,-3.424 2.782,-1.134 5.606,-2.171 8.338,-3.413 0.844,-0.383 1.555,-1.128 2.222,-1.836 a 312.096,312.096 0 0 0 6.041,-6.609 c 0.832,-0.936 1.688,-1.905 2.296,-2.992 0.637,-1.139 0.343,-2.082 -0.82,-2.618 -1.489,-0.686 -3.092,-1.116 -4.617,-1.731 -1.968,-0.793 -3.887,-1.714 -5.868,-2.473 -1.027,-0.393 -2.154,-0.516 -3.215,-0.833 -1.206,-0.36 -2.382,-0.823 -3.586,-1.191 -0.316,-0.097 -0.69,-0.006 -1.037,-10e-4 0.188,0.276 0.321,0.716 0.574,0.802 1.481,0.502 2.991,0.918 4.489,1.368 0.884,0.266 1.786,0.489 2.642,0.826 1.077,0.423 2.117,0.939 3.17,1.422 1.582,0.725 1.933,1.625 1.625,3.308 -0.453,2.475 -0.727,4.981 -1.137,7.464 a 5.713,5.713 0 0 1 -3.309,4.271 c -2.619,1.167 -5.313,2.168 -7.948,3.303 -0.89,0.384 -1.696,0.966 -2.583,1.482 0.206,-1.404 0.436,-2.692 0.573,-3.99 0.16,-1.516 0.291,-3.04 0.339,-4.563 0.054,-1.73 0.187,-3.49 -0.049,-5.19 -0.323,-2.338 -0.068,-4.721 -0.854,-7.034 -0.824,-2.428 -2.211,-4.59 -3.024,-7.005 -0.575,-1.707 -1.249,-3.404 -1.584,-5.161 -0.264,-1.385 -0.158,-2.86 -0.07,-4.287 0.119,-1.926 -1.067,-2.885 -2.434,-3.88 -1.543,-1.124 -3.115,-2.281 -4.394,-3.681 -2.886,-3.16 -5.61,-6.469 -8.373,-9.739 -0.645,-0.764 -15.915,-33.383 4.894,-34.426 4.042,0.188 6.768,3.573 6.685,7.264 -0.039,1.728 0.594,3.968 0.502,5.694 -0.033,0.618 -0.766,0.73 -0.853,1.339 -0.309,2.16 -0.63,4.32 -1.039,6.463 -0.048,0.249 -0.707,0.594 -1.025,0.541 -1.097,-0.183 -2.157,-0.586 -3.254,-0.78 -0.82,-0.145 -1.675,-0.147 -2.512,-0.111 -0.889,0.038 -0.824,0.932 -0.031,0.919 3.02,-0.188 5.794,1.388 8.897,1.074 1.555,-0.158 3.266,0.693 4.826,1.295 1.25,0.483 2.433,1.201 3.535,1.973 0.463,0.324 0.812,1.038 0.874,1.611 0.032,0.29 -0.638,0.776 -1.08,0.979 -3.876,1.783 -5.912,4.811 -5.828,9.045 0.059,2.996 0.457,5.987 0.782,8.972 0.058,0.528 0.422,1.079 0.777,1.51 2.094,2.545 4.856,3.114 7.953,2.558 1.018,-0.183 2.014,-0.487 3.032,-0.67 0.446,-0.08 1.03,-0.171 1.365,0.04 1.853,1.164 3.662,0.552 5.301,-0.271 1.464,-0.735 2.377,-0.752 3.433,0.645 1.074,1.42 2.531,2.495 4.311,3.02 0.228,0.067 0.507,0.29 0.625,0.497 1.625,2.86 4.658,4.14 7.016,6.153 1.914,1.634 4.029,2.998 6.156,4.344 2.63,1.664 3.533,4.112 3.522,6.993 -10e-4,0.352 -0.213,0.749 -0.434,1.047 -1.375,1.856 -2.74,3.723 -4.185,5.524 -2.053,2.559 -4.176,5.061 -6.262,7.594 -2.229,2.706 -4.383,5.477 -6.701,8.104 -1.187,1.346 -2.645,2.458 -4.011,3.64 -0.664,0.575 -1.262,0.358 -1.783,-0.295 -0.288,-0.361 -0.636,-0.678 -0.982,-0.986 -0.424,-0.377 -0.826,-0.89 -1.489,-0.353 -0.542,0.445 -2.142,5.692 -2.158,7.242 z"
       id="path4"
       style="fill:#194f91;fill-opacity:1" />
    <path
       d="m 359.239,73.695 c 0.001,-4.575 1.878,-7.39 5.689,-8.925 3.952,-1.591 8.211,-0.378 10.794,2.983 1.562,2.033 3.174,4.082 3.716,6.602 0.497,2.31 0.749,4.728 0.657,7.08 -0.034,0.876 -1.277,1.783 -2.107,2.519 -0.491,0.435 -1.238,0.617 -1.899,0.817 -1.074,0.325 -2.112,0.53 -3.246,-0.066 -0.616,-0.324 -1.496,-0.282 -2.238,-0.209 -1.941,0.193 -3.865,0.62 -5.808,0.721 -2.413,0.126 -4.637,-2.068 -4.838,-4.445 -0.212,-2.493 -0.504,-4.978 -0.72,-7.077 z"
       id="path6"
       style="fill:#194f91;fill-opacity:1" />
  </g>
  <g
     id="g16"
     style="fill:#d4a733;fill-opacity:1">
    <path
       d="m 151.797,167.025 c -1.255,-0.107 -2.512,-0.194 -3.764,-0.324 -1.544,-0.16 -2.873,-1.259 -3.243,-2.766 -0.749,-3.048 -0.259,-6.058 0.099,-9.084 0.19,-1.605 0.237,-3.227 0.373,-4.839 0.12,-1.411 0.138,-2.851 0.45,-4.221 0.34,-1.497 1.359,-2.197 2.861,-2.13 1.413,0.063 2.789,-0.492 3.904,-1.363 1.739,-1.357 3.341,-2.793 4.663,-4.563 0.428,-0.573 1.085,-0.984 1.664,-1.434 2.378,-1.848 4.918,-3.52 7.106,-5.569 2.048,-1.917 3.807,-4.165 5.543,-6.385 1.591,-2.034 3.539,-3.549 5.793,-4.73 2.28,-1.195 3.726,-3.229 4.63,-5.519 0.826,-2.093 2.055,-4.021 3.811,-5.428 2.914,-2.336 4.805,-5.401 4.929,-9.112 0.139,-4.163 2.026,-7.658 3.832,-11.187 0.963,-1.883 2.314,-3.563 3.397,-5.39 0.523,-0.882 0.839,-1.887 1.238,-2.841 1.062,-2.537 1.488,-5.298 3.145,-7.644 0.977,-1.383 1.417,-3.157 2.029,-4.781 1.489,-3.95 4.069,-7.272 6.166,-10.873 0.554,-0.951 0.906,-2.017 1.384,-3.014 0.326,-0.68 0.581,-1.462 1.095,-1.97 1.5,-1.483 3.284,-2.533 5.308,-3.223 0.956,-0.326 1.786,-1.013 2.686,-1.514 0.56,-0.312 1.162,-0.861 1.71,-0.822 1.785,0.128 2.869,-0.851 3.967,-2.006 1.195,-1.257 2.5,-2.409 3.727,-3.637 1.408,-0.777 3.846,-1.308 6.218,-0.77 1.49,0.637 2.948,1.376 4.484,1.871 1.351,0.436 2.039,1.351 2.431,2.572 0.363,1.132 0.755,2.285 0.876,3.455 0.08,0.775 -0.164,1.658 -0.497,2.385 -0.447,0.975 -1.597,1.845 -1.601,2.763 -0.007,2.091 -1.301,1.467 -2.357,1.489 -3.787,0.076 -7.25,-1.03 -10.451,-2.981 -0.677,-0.413 -1.236,-1.036 -1.804,-1.606 -0.408,-0.409 -0.697,-0.942 -1.127,-1.321 -0.196,-0.172 -0.603,-0.104 -0.914,-0.145 0.06,0.269 0.055,0.577 0.191,0.801 1.477,2.446 3.861,3.668 6.351,4.821 3.24,1.5 6.714,1.262 10.115,1.605 0.231,0.023 0.501,-0.05 0.689,0.046 2.186,1.108 4.11,0.341 6.177,-0.549 1.782,-0.767 3.83,-0.875 5.516,-2.003 0.96,-0.643 2.081,-1.086 2.935,-1.839 2.225,-1.962 4.35,-4.04 6.502,-6.084 1.436,-1.364 2.813,-2.767 5.04,-2.717 1.374,0.031 2.178,0.471 2.662,1.742 0.096,0.253 0.195,0.507 0.32,0.746 0.973,1.873 0.888,2.023 -0.579,3.558 -2.714,2.84 -5.876,5.13 -9.062,7.362 -3.6,2.522 -7.37,4.798 -11.031,7.235 -1.849,1.231 -3.772,1.041 -5.68,0.4 -2.232,-0.75 -4.427,-0.976 -6.481,0.296 -1.023,0.634 -1.89,1.564 -2.713,2.465 -0.97,1.061 -1.836,1.865 -3.462,1.112 -1.194,-0.553 -2.082,0.016 -2.716,1.272 -1.186,2.345 -2.298,4.732 -3.595,7.015 -2.414,4.251 -5.249,8.184 -8.956,11.448 -0.698,0.614 -1.18,1.625 -1.434,2.518 -0.284,0.997 -1.343,1.57 -2.35,1.322 -1.263,-0.311 -2.532,-0.709 -3.702,-1.27 -2.542,-1.219 -5.019,-2.576 -7.541,-3.839 -1.513,-0.758 -2.819,-0.146 -0.512,0.866 a 533.844,533.844 0 0 0 9.861,4.879 c 0.574,0.276 1.262,0.322 1.9,0.458 0.782,0.166 1.178,0.564 1.185,1.435 0.018,2.501 0.702,4.731 2.854,6.276 0.503,0.361 0.973,0.79 1.52,1.063 2.528,1.26 4.183,3.344 5.655,5.671 1.841,2.91 3.765,5.769 5.721,8.603 a 5.88,5.88 0 0 1 0.96,4.299 c -1.277,7.734 -2.275,15.498 -2.691,23.338 -0.115,2.168 -0.707,4.36 -1.416,6.426 -0.321,0.933 -1.39,1.683 -2.257,2.334 -0.794,0.596 -1.958,0.889 -1.95,2.077 0.008,1.189 1.042,1.751 1.957,2.255 0.947,0.521 2.001,0.859 2.913,1.43 0.992,0.621 1.976,1.325 2.764,2.177 0.423,0.457 0.79,1.55 0.54,1.914 -0.416,0.605 -1.312,1.061 -2.075,1.199 -0.966,0.175 -2.008,0.028 -3.004,-0.087 -1.877,-0.216 -3.738,-0.636 -5.619,-0.736 -2.379,-0.127 -4.773,0.045 -7.157,-0.033 -1.694,-0.055 -3.389,-0.261 -5.07,-0.495 -0.994,-0.139 -1.628,-1.017 -1.399,-2.058 0.437,-1.992 1.005,-3.956 1.561,-5.92 0.417,-1.474 0.836,-2.953 1.377,-4.383 0.295,-0.781 0.674,-1.538 1.188,-2.196 1.465,-1.874 1.981,-4.023 2.264,-6.3 0.125,-1.003 0.34,-2.115 0.89,-2.922 1.691,-2.482 1.931,-5.361 2.448,-8.15 0.281,-1.514 -0.377,-3.016 -1.521,-3.983 -2.859,-2.42 -4.37,-5.763 -6.442,-8.731 -1.509,-2.162 -3.487,-3.997 -5.262,-5.973 -0.821,-0.914 -1.641,-1.83 -2.493,-2.714 -2.014,-2.092 -1.802,-0.692 -0.839,0.539 a 35.476,35.476 0 0 0 2.095,2.458 c 0.847,0.899 1.786,1.715 2.595,2.645 0.196,0.225 0.2,0.879 0.014,1.129 -0.923,1.238 -1.856,2.491 -2.943,3.58 -1.603,1.605 -3.346,3.068 -5.018,4.605 -2.503,2.302 -4.985,4.627 -7.497,6.918 -1.591,1.452 -3.19,2.898 -4.842,4.279 -2.254,1.884 -4.561,3.704 -6.845,5.553 l -0.224,0.26 c -2.171,3.618 -5.991,5.535 -8.858,8.445 -1.113,1.129 -2.992,1.485 -4.484,2.266 -1.573,0.823 -3.059,1.813 -4.598,2.696 -0.42,0.241 -0.819,0.511 -1.189,0.823 -0.801,0.675 -1.658,1.389 -2.172,2.271 -0.572,0.98 -0.847,2.154 -1.125,3.275 -0.121,0.489 -0.005,1.078 0.142,1.582 0.183,0.625 0.527,1.202 0.772,1.811 0.837,2.081 -0.167,3.747 -2.416,3.959 -0.729,0.069 -1.47,0.011 -2.206,0.011 -0.006,0.02 -0.007,0.045 -0.009,0.07 z"
       id="path8"
       style="fill:#d4a733;fill-opacity:1" />
    <path
       d="m 283.103,163.249 c -1.004,-0.071 -2.043,-0.007 -3.003,-0.251 a 9.175,9.175 0 0 1 -2.774,-1.248 c -0.748,-0.499 -0.575,-1.238 0.159,-1.699 0.817,-0.513 1.718,-0.892 2.535,-1.405 1.315,-0.826 2.459,-1.776 2.225,-3.598 -0.184,-1.435 -0.205,-2.897 -0.478,-4.312 -0.137,-0.71 -0.516,-1.535 -1.056,-1.979 -4.009,-3.298 -6.105,-8.047 -9.234,-12.005 -2.324,-2.939 -4.525,-5.975 -6.864,-8.902 -1.954,-2.444 -3.529,-5.075 -4.477,-8.06 -0.16,-0.503 -0.059,-1.086 -0.192,-1.602 -0.581,-3.495 -1.065,-0.312 -1.044,0.056 0.144,2.459 1.165,4.64 2.444,6.671 0.589,0.935 0.468,1.526 -0.253,2.201 a 76.41,76.41 0 0 0 -2.069,2.037 c -0.82,0.827 -0.976,1.82 -0.969,2.974 0.019,3.226 1.226,6.371 0.597,9.639 -0.233,1.212 -0.535,2.465 -0.448,3.674 0.199,2.765 0.625,5.514 0.945,8.271 0.066,0.567 0.21,1.179 0.072,1.705 -0.341,1.3 -0.032,2.378 0.852,3.318 0.934,0.993 1.27,2.112 1.179,3.494 -0.102,1.562 0.124,3.144 0.067,4.712 -0.035,0.971 -0.723,1.489 -1.71,1.562 -1.347,0.1 -2.691,0.268 -4.039,0.309 -5.512,0.165 -10.953,-0.662 -16.406,-1.272 -1.427,-0.159 -1.993,-0.908 -2.193,-2.306 -0.177,-1.238 0.333,-2.238 1.441,-2.637 1.946,-0.701 3.977,-1.165 5.955,-1.785 0.597,-0.187 1.338,-0.413 1.667,-0.871 1.276,-1.775 1.896,-3.317 0.537,-5.182 -2.067,-2.834 -2.409,-6.03 -1.973,-9.402 0.071,-0.549 -0.114,-1.136 -0.212,-1.699 -0.21,-1.204 -0.542,-2.396 -0.644,-3.608 -0.265,-3.152 -0.43,-6.312 -0.647,-9.469 a 2.494,2.494 0 0 0 -0.184,-0.76 c -0.976,-2.423 -0.725,-4.754 0.308,-7.116 1.377,-3.149 2.658,-6.342 3.913,-9.543 0.491,-1.252 0.766,-2.587 1.193,-3.867 0.744,-2.228 1.446,-4.477 2.326,-6.651 0.612,-1.511 0.965,-2.984 0.772,-4.619 -0.217,-1.844 -0.321,-3.702 -0.443,-5.556 -0.11,-1.679 0.148,-2.016 1.777,-2.156 3.158,-0.272 6.321,-0.49 9.481,-0.737 0.423,-0.033 0.841,-0.12 1.264,-0.16 0.983,-0.092 1.97,-0.152 2.951,-0.267 0.265,-0.031 1.936,-0.815 0.221,-0.95 -0.722,-0.057 -1.459,-0.157 -2.179,-0.093 -4.042,0.355 -8.08,0.75 -12.12,1.13 -0.647,0.061 -0.99,-0.281 -0.916,-0.885 0.077,-0.634 0.174,-1.319 0.475,-1.864 1.211,-2.193 2.038,-4.49 2.287,-6.993 0.106,-1.069 0.234,-2.142 0.461,-3.19 0.071,-0.326 0.483,-0.794 0.765,-0.813 0.585,-0.04 1.252,0.048 1.772,0.309 3.172,1.594 6.312,3.251 9.462,4.888 2.054,1.067 4.112,2.128 6.159,3.209 0.668,0.353 0.659,0.747 0.046,1.215 -2.297,1.753 -2.238,2.175 -1.403,4.91 0.611,2.002 0.815,4.164 0.942,6.27 0.169,2.793 -0.267,5.517 -1.199,8.207 -0.801,2.311 -0.383,4.761 0.175,7.088 0.576,2.399 1.995,4.403 3.377,6.429 0.885,1.298 1.174,2.998 1.958,4.376 0.172,0.302 0.389,0.576 0.623,0.832 0.729,0.797 1.532,1.533 2.212,2.369 0.626,0.77 1.331,1.594 1.599,2.511 0.489,1.674 1.315,3.093 2.309,4.494 0.682,0.962 1.008,2.167 1.618,3.19 1.459,2.448 2.864,4.946 4.538,7.244 1.187,1.63 2.481,3.141 3.171,5.081 0.224,0.629 0.698,1.191 1.137,1.718 1.258,1.511 2.616,2.942 3.797,4.509 0.306,0.406 0.375,1.403 0.091,1.764 -0.749,0.95 -1.637,1.915 -2.683,2.477 -1.446,0.777 -3.098,1.164 -4.638,1.777 -0.523,0.208 -1.156,0.481 -1.428,0.918 -1.272,2.044 -3.194,2.223 -5.287,2.045 -0.231,-0.02 -0.463,-0.036 -0.695,-0.054 0.004,-0.007 0.004,-0.012 0.005,-0.017 z"
       id="path10"
       style="fill:#d4a733;fill-opacity:1" />
    <path
       d="m 281.379,28.069 c 4.093,0.158 8.047,2.796 9.071,6.059 1.042,3.323 -0.092,8.344 -3.628,10.289 -1.268,0.697 -2.244,1.967 -3.265,3.057 -0.745,0.795 -0.597,1.707 -0.177,2.698 0.359,0.848 0.436,1.82 0.599,2.744 0.349,1.967 0.322,4.093 1.099,5.869 a 16.96,16.96 0 0 1 1.426,6.51 c 0.091,4.203 -0.096,8.413 -0.235,12.618 a 49.314,49.314 0 0 1 -0.461,5.43 c -0.288,1.995 -1.057,2.551 -3.012,2.24 -2.394,-0.381 -4.847,-0.64 -7.13,-1.392 -3.466,-1.142 -6.435,-3.797 -10.065,-4.438 -2.109,-0.372 -3.794,-1.741 -5.339,-3.225 -0.326,-0.313 -0.911,-0.387 -1.233,-0.714 -1.217,-1.238 -2.681,-1.508 -4.351,-1.37 -1.134,0.094 -2.212,-1.726 -1.825,-2.951 0.719,-2.277 2.364,-3.754 4.35,-4.912 0.177,-0.103 0.496,-0.153 0.659,-0.064 1.501,0.823 3.293,1.249 4.113,3.02 0.173,0.375 0.436,0.791 0.775,0.994 3.858,2.314 7.58,4.943 12.23,5.496 0.192,0.023 0.4,0.049 0.568,0.064 1.402,0.123 1.351,-0.893 0.099,-1.084 -0.945,-0.144 -1.967,-0.109 -2.821,-0.466 -0.95,-0.398 -1.738,-1.177 -2.614,-1.763 -0.355,-0.237 -0.912,-0.671 -1.114,-0.555 -1.048,0.6 -1.795,-0.065 -2.572,-0.49 -0.943,-0.517 -1.835,-1.129 -2.736,-1.721 -0.252,-0.166 -0.545,-0.364 -0.665,-0.62 -0.795,-1.698 -2.263,-2.601 -3.871,-3.334 -0.834,-0.38 -1.007,-0.743 -0.546,-1.68 0.85,-1.727 1.414,-3.593 2.152,-5.378 0.209,-0.505 0.515,-1.055 0.936,-1.374 2.094,-1.587 4.332,-2.997 6.344,-4.678 1.829,-1.528 3.493,-3.271 5.098,-5.038 0.41,-0.451 0.59,-1.434 0.408,-2.03 -0.365,-1.194 -1.088,-2.274 -1.583,-3.435 -0.138,-0.323 -0.151,-0.908 0.049,-1.129 0.897,-0.993 1.051,-2.02 0.455,-3.2 -0.444,-0.88 -0.241,-1.643 0.463,-2.306 1.041,-0.981 2.118,-1.929 3.098,-2.968 0.817,-0.867 1.548,-1.821 2.259,-2.779 0.81,-1.087 1.625,-2.109 2.992,-1.994 z m -26.906,5.422 c -2.341,1.372 -4.581,2.695 -6.837,3.991 -0.196,0.112 -0.661,0.136 -0.715,0.04 a 1.23,1.23 0 0 1 -0.112,-0.849 c 0.589,-2.19 1.282,-4.355 1.803,-6.56 0.381,-1.61 0.599,-3.265 0.796,-4.911 0.171,-1.428 -0.39,-2.496 -1.71,-3.195 -0.9,-0.477 -1.076,-1.437 -0.378,-2.18 0.942,-1.003 1.789,-2.153 2.895,-2.928 1.512,-1.059 3.239,-1.553 5.161,-0.873 0.598,0.212 1.419,0.142 2.029,-0.088 3.79,-1.43 7.562,-2.91 11.315,-4.437 4.678,-1.903 9.326,-3.882 13.998,-5.8 3.821,-1.569 7.662,-3.086 11.482,-4.656 0.522,-0.215 2.308,-1.133 2.964,-1.035 1.462,0.218 0.878,1.626 0.342,2.121 -0.386,0.357 -0.876,0.638 -1.366,0.843 -2.276,0.951 -4.578,1.84 -6.853,2.796 -4.163,1.75 -8.302,3.558 -12.471,5.292 -4.92,2.047 -9.86,4.047 -14.794,6.06 -0.597,0.244 -1.586,0.617 -2.214,0.764 -2.626,0.613 -3.806,2.554 -4.64,4.961 -1.048,3.023 -1.244,6.108 -1.025,9.25 0.035,0.517 0.239,1.025 0.33,1.394 z"
       id="path12"
       style="fill:#d4a733;fill-opacity:1" />
    <path
       d="m 245.735,48.594 c -0.794,-2.279 -1.541,-4.356 -2.216,-6.456 -0.082,-0.255 0.129,-0.778 0.365,-0.934 2.892,-1.904 5.783,-3.815 8.746,-5.606 1.066,-0.644 2.316,-0.99 3.495,-1.436 1.817,-0.688 2.735,-2.154 3.487,-3.822 0.408,-0.904 0.855,-1.844 1.503,-2.573 0.965,-1.085 2.208,-1.538 3.765,-1.281 0.944,0.156 2.005,-0.017 2.942,-0.288 1.494,-0.432 2.914,-0.3 4.326,0.186 1.195,0.412 1.641,1.635 0.855,2.739 -0.749,1.051 -1.603,2.162 -2.671,2.827 -2.842,1.769 -5.54,3.831 -8.831,4.806 -0.7,0.207 -1.339,0.587 -1.869,1.089 -2.873,2.725 -6.523,4.308 -9.634,6.667 -1.279,0.97 -2.322,2.25 -3.478,3.383 -0.259,0.255 -0.542,0.484 -0.785,0.699 z m 10.282,-6.619 c 0.348,0.145 0.862,0.333 1.101,0.572 0.784,0.786 1.671,1.473 2.771,1.622 2.321,0.315 3.278,0.772 2.417,1.506 -2.313,1.974 -4.63,3.944 -6.985,5.866 -0.233,0.19 -0.863,0.214 -1.091,0.037 -1.643,-1.276 -3.225,-2.63 -4.836,-3.947 -0.519,-0.424 -0.702,-0.883 -0.083,-1.307 2.096,-1.434 4.218,-2.832 6.333,-4.239 0.091,-0.06 0.218,-0.066 0.373,-0.11 z"
       id="path14"
       style="fill:#d4a733;fill-opacity:1" />
  </g>
  <g
     id="g24"
     style="fill:#e06e2e;fill-opacity:1">
    <path
       d="m 127.567,51.173 c 1.325,1.601 4.029,7.268 4.056,7.782 0.002,0.037 2.629,6.517 4.218,9.584 0.83,1.602 1.947,3.055 2.788,4.653 0.625,1.187 1.091,2.474 1.492,3.759 0.478,1.534 0.142,2.8 -1.246,3.876 -1.348,1.044 -2.531,1.578 -4.147,0.573 -1.401,-0.872 -2.965,-1.482 -4.383,-2.331 -0.637,-0.381 -1.151,-1.018 -1.621,-1.617 -1.312,-1.674 -2.82,-3.041 -4.848,-3.836 -0.802,-0.315 -1.445,-1.014 -2.201,-1.471 -0.71,-0.43 -1.523,-0.701 -2.194,-1.178 -0.376,-0.267 -0.775,-0.803 -0.788,-1.229 -0.069,-2.327 2.67,-4.441 4.915,-3.829 0.378,0.103 0.736,0.423 1.009,0.727 0.358,0.4 0.735,0.844 0.908,1.338 0.688,1.967 2.607,2.496 4.063,3.555 0.187,0.136 2.774,0.385 0.532,-0.823 -1.587,-0.85 -2.235,-2.224 -2.443,-3.94 -0.112,-0.921 -0.761,-1.009 -1.831,-0.292 -0.163,-0.129 -0.406,-0.232 -0.505,-0.413 -0.591,-1.09 -1.546,-1.255 -2.668,-1.2 -2.442,0.119 -4.705,2.128 -5.029,4.534 -0.144,1.072 0.511,2.116 1.566,2.489 0.292,0.104 0.593,0.183 0.878,0.304 2.671,1.13 3.043,2.242 1.611,4.651 -1.658,2.79 -3.297,5.591 -4.046,8.801 -0.262,1.124 -0.415,2.298 -0.85,3.352 -0.804,1.948 -1.811,3.812 -2.675,5.736 -1.068,2.378 -2.63,3.081 -5.037,1.979 a 22.01,22.01 0 0 1 -3.932,-2.35 c -1.597,-1.189 -3.153,-2.464 -4.551,-3.877 -0.806,-0.815 -1.239,-1.991 -1.896,-2.967 -0.975,-1.741 -1.32,-0.604 -0.897,0.425 1.372,3.341 4.154,5.419 6.941,7.444 1.199,0.871 2.558,1.52 4.001,2.36 -1.655,1.294 -0.457,2.287 0.191,3.465 0.694,1.261 1.123,2.667 1.677,4.006 0.482,1.165 0.806,2.439 1.497,3.465 1.996,2.965 3.212,6.314 4.103,9.655 0.624,2.339 1.599,4.565 2.076,6.935 0.159,0.79 0.105,1.635 0.344,2.393 0.332,1.053 0.881,2.035 1.273,3.071 0.225,0.596 0.429,1.234 0.46,1.863 0.096,1.983 -0.262,3.992 0.913,5.855 0.361,0.573 0.247,1.514 0.185,2.273 -0.206,2.528 1.162,17.56 2.138,18.086 0.61,0.328 3.729,2.287 4.413,2.591 1.401,0.623 2.901,1.028 4.293,1.667 a 9.257,9.257 0 0 1 2.435,1.649 c 0.635,0.597 1.042,1.432 1.583,2.136 0.375,0.488 0.307,0.767 -0.227,1.099 -1.685,1.045 -3.366,1.217 -5.137,0.22 -1.581,-0.889 -3.263,-1.294 -5.11,-1.239 -0.862,0.025 -1.731,-0.458 -2.61,-0.65 -1.313,-0.286 -2.63,-0.684 -3.958,-0.735 -2.744,-0.105 -4.976,-2.242 -5.272,-4.972 -0.503,-4.646 -1.034,-9.295 -1.761,-13.91 -0.466,-2.954 -1.381,-5.834 -1.953,-8.774 -0.338,-1.736 -0.374,-3.529 -0.63,-5.284 -0.102,-0.701 -0.278,-1.389 -0.473,-2.071 a 155.096,155.096 0 0 0 -2.002,-6.52 c -0.641,-1.924 -1.794,-3.605 -3.127,-5.133 -0.757,-0.868 -1.143,-2.044 -1.681,-3.091 -0.282,-0.549 -0.502,-1.134 -0.829,-1.653 -1.434,-2.283 -2.82,-4.603 -4.37,-6.807 -1.689,-2.401 -3.404,-4.814 -5.379,-6.973 -0.985,-1.077 -2.493,-1.839 -3.908,-2.325 -3.321,-1.14 -6.712,-2.093 -10.116,-2.961 -1.187,-0.302 -2.416,-0.366 -3.637,-0.269 -5.516,0.439 -10.942,-0.04 -16.352,-1.121 -1.414,-0.282 -2.93,-0.015 -4.394,-0.094 -0.892,-0.048 -1.929,-0.027 -2.633,-0.466 -2.547,-1.59 -5.395,-1.942 -8.243,-2.478 -2.043,-0.384 -4.175,-0.636 -5.866,-2.184 -1.46,-1.336 -3.328,-0.85 -4.996,-0.533 -2.87,0.546 -5.606,0.084 -8.317,-0.724 -1.462,-0.436 -2.172,-1.506 -2.08,-3.043 a 24.86,24.86 0 0 1 0.534,-3.871 c 0.317,-1.433 1.712,-2.187 3.105,-1.724 1.978,0.658 3.904,0.928 6.026,0.661 0.993,-0.125 2.31,0.672 3.166,1.414 2.398,2.078 5.026,1.643 7.623,0.867 1.839,-0.55 3.65,-0.79 5.486,-0.425 2.226,0.441 4.419,1.058 6.614,1.645 1.994,0.533 3.942,1.399 5.965,1.616 1.958,0.21 3.993,-0.149 5.979,-0.385 3.055,-0.364 6.035,-1.124 9.164,-1.192 2.205,-0.048 4.386,-1.006 6.586,-1.524 1.302,-0.307 2.609,-0.675 3.933,-0.789 2.153,-0.185 4.064,-0.561 4.843,-2.974 0.134,-0.415 0.592,-0.832 1.022,-0.904 2.215,-0.369 3.586,-1.736 4.637,-3.573 1.106,-1.933 2.297,-3.82 3.324,-5.794 0.202,-0.387 -0.016,-1.202 -0.325,-1.598 -0.482,-0.619 -0.449,-0.956 0.133,-1.42 1.874,-1.497 3.788,-2.882 6.05,-3.804 1.067,-0.435 1.945,-1.373 2.839,-2.163 0.232,-0.205 0.257,-0.705 0.278,-1.076 0.041,-0.709 0.012,-1.421 0.012,-2.294 3.146,1.265 5.329,-0.401 7.599,-1.655 0.849,-0.386 0.931,-1.35 -0.517,-0.765 -1.529,0.615 -3.021,1.323 -4.563,1.9 -0.808,0.303 -1.334,0.02 -1.582,-0.958 -0.317,-1.25 -0.877,-2.438 -1.341,-3.649 -0.039,-0.101 -0.13,-0.226 -0.223,-0.256 -1.525,-0.485 -1.394,-1.705 -1.366,-2.927 0.015,-0.649 -0.103,-1.309 -0.225,-1.952 -0.565,-2.991 0.134,-5.803 1.551,-8.363 1.059,-1.913 3.176,-2.722 5.149,-3.356 1.81,-0.582 4.995,-1.286 7.683,-0.048 2.165,1.353 2.076,2.839 2.81,4.436 0.88,1.912 4.095,13.639 4.321,13.912 z"
       id="path18"
       style="fill:#e06e2e;fill-opacity:1" />
    <path
       d="m 27.205,115.826 c -0.194,1.912 -0.205,3.887 -0.735,5.705 -0.315,1.08 -0.109,2.111 -0.339,3.064 -0.437,1.806 -1.044,3.683 -2.058,5.215 -2.962,4.477 -6.169,8.79 -9.252,13.188 -0.412,0.587 -0.659,1.29 -0.977,1.942 -0.487,0.998 -0.873,2.06 -1.473,2.985 -1.947,3.003 -1.34,5.563 1.324,7.724 0.432,0.351 1.06,1.01 1.425,1.43 1.096,1.259 2.639,1.584 4.152,1.974 0.558,0.144 1.273,0.127 1.07,1.001 -0.212,0.91 0.433,2.295 -1.185,2.494 -2.895,0.356 -5.756,0.3 -8.205,-1.569 -2.175,-1.661 -4.711,-2.419 -7.256,-3.209 -1.064,-0.33 -2.1,-0.756 -3.134,-1.175 -0.585,-0.237 -0.777,-1.62 -0.271,-2.371 0.704,-1.044 1.603,-1.969 2.221,-3.057 0.818,-1.438 1.5,-2.962 2.146,-4.489 2.315,-5.474 4.588,-10.965 6.883,-16.447 0.164,-0.392 0.283,-0.863 0.576,-1.129 1.546,-1.402 1.399,-3.221 1.352,-5.032 -0.017,-0.658 0.005,-1.316 -10e-4,-1.974 -0.008,-1.022 -0.216,-1.833 -1.524,-1.86 -0.301,-0.006 -0.736,-0.453 -0.857,-0.787 -0.231,-0.645 -0.288,-1.354 -0.407,-2.038 -0.328,-1.891 -0.726,-3.774 -0.952,-5.678 -0.213,-1.794 -0.248,-3.609 -0.347,-5.416 -0.027,-0.486 -0.004,-0.974 -0.004,-1.559 1.15,0.197 2.255,0.478 3.375,0.56 3.224,0.238 6.452,0.497 9.681,0.542 1.471,0.021 2.967,-0.366 4.413,-0.726 0.465,-0.116 2.592,-1.206 -0.23,-0.897 -2.707,0.297 -5.422,0.699 -8.135,0.712 -2.336,0.011 -4.699,-0.337 -7.004,-0.773 -1.471,-0.279 -2.854,-1.258 -2.913,-3.063 C 8.479,98.536 7.975,95.974 7.861,93.396 7.73,90.425 7.891,87.442 7.812,84.467 7.728,81.303 7.452,78.143 7.38,74.979 7.346,73.486 7.378,71.929 7.757,70.5 c 0.97,-3.658 1.259,-7.37 1.318,-11.121 0.019,-1.222 0.351,-2.165 1.248,-3.18 0.905,-1.024 1.044,-2.689 1.678,-3.997 0.807,-1.667 0.961,-3.461 1.278,-5.228 0.125,-0.697 0.4,-1.096 1.21,-1.086 1.207,0.015 1.123,-1.059 1.378,-1.823 0.142,-0.426 0.138,-1.002 0.425,-1.262 2.195,-1.987 3.968,-4.501 6.802,-5.703 0.947,-0.402 1.998,-0.551 2.974,-0.894 0.774,-0.271 1.712,-0.475 2.218,-1.034 1.552,-1.714 3.483,-2.518 5.679,-2.85 0.837,-0.127 1.311,-0.485 1.405,-1.397 0.034,-0.33 0.427,-0.688 0.743,-0.908 a 8.186,8.186 0 0 1 1.615,-0.85 c 0.271,-0.109 0.675,-0.147 0.918,-0.021 0.949,0.491 1.842,1.091 2.786,1.593 1.342,0.713 2.493,1.54 2.71,3.216 0.034,0.267 0.386,0.664 0.638,0.705 3.203,0.519 5.84,2.343 8.706,3.65 1.579,0.72 2.68,1.78 3.433,3.274 0.115,0.228 0.067,0.539 0.094,0.811 -0.253,-0.014 -0.532,0.037 -0.755,-0.052 -3.461,-1.378 -6.937,-2.724 -10.358,-4.198 -0.998,-0.43 -1.858,-1.206 -2.74,-1.877 -1.274,-0.969 -1.691,-0.841 -2.93,0.061 -1.771,1.289 -3.74,2.304 -5.553,3.541 -1.323,0.903 -2.557,1.934 -3.826,2.916 -0.477,0.369 -1.289,0.928 -1.811,1.229 -0.966,0.556 -1.96,1.063 -2.913,1.64 -1.324,0.801 -1.525,5.126 -1.516,5.934 0.012,1.109 0.718,1.556 0.936,0.009 0.203,-1.443 0.347,-2.896 0.59,-4.333 0.062,-0.369 0.357,-0.903 0.657,-0.995 2.93,-0.898 4.686,-3.454 7.16,-4.979 2.5,-1.541 5.024,-3.043 7.542,-4.555 0.084,-0.051 0.218,-0.018 0.223,-0.019 0.371,0.677 0.872,1.258 1.007,1.914 0.208,1.015 0.215,2.081 0.212,3.125 -0.002,0.674 -0.426,1.439 -0.219,2.001 0.422,1.148 0.256,2.166 -0.064,3.258 -0.314,1.069 -0.538,1.977 -1.591,2.808 -1.279,1.01 -2.067,2.662 -3.008,4.076 -1.01,1.517 -1.438,1.73 -2.851,0.638 -2.106,-1.627 -3.8,-0.587 -5.338,1.028 -0.315,0.33 -0.289,1.283 -0.054,1.773 a 9.017,9.017 0 0 0 1.738,2.444 c 1.178,1.176 1.628,2.662 1.797,4.176 0.387,3.465 2.163,6.311 3.844,9.192 1.255,2.15 2.511,4.311 4.039,6.276 0.725,0.932 0.406,1.356 -0.489,1.468 -0.614,0.076 -1.224,0.183 -1.838,0.252 -1.427,0.159 -2.681,-0.004 -3.842,-1.102 -1.301,-1.229 -2.92,-1.985 -4.831,-1.848 -0.344,0.025 -0.825,-0.123 -1.041,-0.369 -0.731,-0.83 -1.38,-0.684 -2.204,-0.129 -0.372,0.25 -1.038,0.292 -1.455,0.128 -2.894,-1.143 -3.831,0.245 -4.664,2.609 -0.425,1.205 -0.5,2.563 -0.561,3.86 -0.09,1.909 0.938,3.385 2.803,3.897 1.398,0.384 2.869,0.534 4.317,0.697 1.174,0.133 2.248,0.185 2.181,1.84 -0.021,0.521 0.485,1.043 0.636,1.596 0.28,1.024 0.413,2.091 0.724,3.104 0.515,1.676 1.031,3.361 1.721,4.969 0.501,1.168 1.101,2.171 0.802,3.59 -0.166,0.787 0.37,1.77 0.724,2.607 0.512,1.208 1.213,2.338 1.703,3.553 0.296,0.733 0.323,1.572 0.512,2.353 0.249,1.033 0.415,2.109 0.833,3.073 1.182,2.718 2.55,5.357 3.698,8.089 0.7,1.665 0,3.355 -0.432,4.982 a 432.803,432.803 0 0 1 -2.762,9.879 c -0.333,1.144 -0.809,2.247 -1.214,3.37 -0.628,1.742 -1.201,3.459 -1.128,5.39 0.053,1.399 -0.383,2.813 -0.569,4.225 -0.304,2.3 0.876,3.733 2.809,4.705 1.174,0.59 2.303,1.331 3.542,1.71 1.033,0.315 2.198,0.264 3.304,0.26 1.378,-0.004 1.561,0.185 2.051,2.011 0.305,1.136 -0.487,1.289 -1.186,1.607 -1.884,0.858 -3.825,1.486 -5.926,1.267 -0.913,-0.095 -1.804,-0.398 -2.717,-0.509 a 161.3,161.3 0 0 0 -5.379,-0.54 c -1.421,-0.125 -2.856,-0.139 -4.26,-0.358 -0.377,-0.059 -0.842,-0.634 -0.962,-1.059 -0.448,-1.581 -0.645,-3.124 0.436,-4.654 0.444,-0.629 0.436,-1.634 0.485,-2.476 0.204,-3.476 0.315,-6.958 0.534,-10.433 0.094,-1.499 0.392,-2.983 0.552,-4.479 0.164,-1.536 0.201,-3.088 0.425,-4.613 0.176,-1.203 0.359,-2.47 0.881,-3.544 0.916,-1.886 1.139,-3.592 -0.378,-5.23 -1.812,-1.957 -1.837,-4.141 -1.13,-6.584 0.323,-1.122 -0.354,-6.491 -0.731,-2.764 z m 81.212,-61.597 c -1.491,-0.526 -2.834,-1.008 -4.183,-1.474 a 2.4,2.4 0 0 0 -2.74,0.888 c -0.223,0.315 -0.446,0.639 -0.601,0.989 -0.776,1.756 -1.643,3.421 -3.559,4.219 -0.182,0.076 -0.294,0.321 -0.439,0.488 l 0.115,0.348 c 0.48,-0.126 1.015,-0.156 1.431,-0.394 1.461,-0.838 2.412,-2.121 3.062,-3.667 0.94,-2.237 1.378,-2.395 3.571,-1.436 0.283,0.124 0.564,0.252 0.847,0.377 0.541,0.24 1.584,-0.137 1.509,0.843 -0.072,0.947 -0.335,1.994 -0.862,2.756 -0.439,0.636 -1.392,0.91 -2.101,1.369 -2.196,1.421 -4.577,2.635 -6.516,4.35 -1.67,1.477 -2.869,3.502 -4.208,5.335 -1.132,1.55 -2.331,2.988 -4.204,3.663 -1.704,0.614 -3.382,0.789 -4.989,-0.387 -0.504,-0.369 -0.732,-1.021 -0.605,-1.632 0.744,-3.578 2.297,-6.566 5.586,-8.507 2.262,-1.335 4.286,-2.913 5.683,-5.321 1.126,-1.941 2.746,-3.622 4.295,-5.28 0.617,-0.66 1.605,-1.011 2.477,-1.381 0.772,-0.328 1.631,-0.443 2.423,-0.732 1.027,-0.374 2.235,0.06 2.701,1.048 0.448,0.95 0.825,1.934 1.226,2.906 0.051,0.126 0.038,0.278 0.081,0.632 z"
       id="path20"
       style="fill:#e06e2e;fill-opacity:1" />
    <path
       d="m 50.371,100.6 c -2.603,0.016 -5.362,-2.691 -5.759,-6.002 a 2.728,2.728 0 0 0 -1.138,-1.91 C 43.211,92.5 43.292,92.162 43.268,91.87 c 0.289,-0.018 0.609,-0.127 0.861,-0.04 2.317,0.796 4.609,1.669 6.937,2.428 1.15,0.375 2.343,0.646 2.867,1.87 0.215,0.503 0.181,1.119 0.224,1.686 0.01,0.132 -0.133,0.273 -0.193,0.414 -0.933,2.183 -1.196,2.357 -3.593,2.372 z"
       id="path22"
       style="fill:#e06e2e;fill-opacity:1" />
  </g>
</svg>
