<?xml version="1.0" encoding="UTF-8" standalone="no"?>
<!-- Created with Inkscape (http://www.inkscape.org/) -->

<svg
   version="1.1"
   id="svg2"
   width="74.559608"
   height="9.4666433"
   viewBox="0 0 74.559612 9.4666433"
   sodipodi:docname="auto-sportsimulation.svg"
   inkscape:version="1.1 (c68e22c387, 2021-05-23)"
   inkscape:export-filename="C:\Users\BUCH\Desktop\Retrogaming\Recalbox\travail thèmes\Thème vignette !!!!!!!\Maquette 2 !!!!\image1250.png"
   inkscape:export-xdpi="96.460785"
   inkscape:export-ydpi="96.460785"
   xmlns:inkscape="http://www.inkscape.org/namespaces/inkscape"
   xmlns:sodipodi="http://sodipodi.sourceforge.net/DTD/sodipodi-0.dtd"
   xmlns="http://www.w3.org/2000/svg"
   xmlns:svg="http://www.w3.org/2000/svg">
  <defs
     id="defs6">
    <clipPath
       clipPathUnits="userSpaceOnUse"
       id="clipPath3185">
      <path
         id="path3187"
         style="fill:#ffffff;fill-rule:evenodd;stroke:#ffffff;stroke-width:5.15903;stroke-linecap:round;stroke-linejoin:round;paint-order:stroke fill markers"
         d="m 1157.5591,335.78677 h 462.4206 L 1362.3723,1410.6277 H 899.95176 Z"
         sodipodi:nodetypes="ccccc"
         inkscape:export-filename="C:\Users\BUCH\Desktop\Retrogaming\Recalbox\travail thèmes\Thème vignette !!!!!!!\Maquette 2 !!!!\rect849.png"
         inkscape:export-xdpi="247.96268"
         inkscape:export-ydpi="247.96268" />
    </clipPath>
  </defs>
  <sodipodi:namedview
     id="namedview4"
     pagecolor="#ffffff"
     bordercolor="#666666"
     borderopacity="1.0"
     inkscape:pageshadow="2"
     inkscape:pageopacity="0.0"
     inkscape:pagecheckerboard="true"
     showgrid="false"
     inkscape:showpageshadow="false"
     inkscape:zoom="12.479331"
     inkscape:cx="37.141414"
     inkscape:cy="13.78279"
     inkscape:window-width="1920"
     inkscape:window-height="1138"
     inkscape:window-x="-8"
     inkscape:window-y="-8"
     inkscape:window-maximized="1"
     inkscape:current-layer="svg2"
     fit-margin-top="0"
     fit-margin-left="0"
     fit-margin-right="0"
     fit-margin-bottom="0" />
  <g
     aria-label="sports simulation"
     id="text1727"
     style="font-weight:300;font-size:13.3333px;line-height:1.25;font-family:'Bebas Neue';-inkscape-font-specification:'Bebas Neue, Light';fill:#ffffff"
     transform="translate(16.96222,-18.646399)">
    <path
       d="m -15.002225,18.646399 c -1.346663,0.01333 -1.919995,0.946664 -1.919995,2.306661 0,2.573327 3.573324,2.493327 3.573324,4.853321 0,1.13333 -0.439999,2.026661 -1.666662,2.026661 -1.226664,0 -1.666663,-0.893331 -1.666663,-2.026661 v -0.466666 h -0.279999 v 0.453333 c 0,1.29333 0.533332,2.319994 1.946662,2.319994 1.426663,0 1.959995,-1.026664 1.959995,-2.319994 0,-2.533327 -3.573325,-2.466661 -3.573325,-4.853321 0,-1.106664 0.413333,-2.026662 1.639996,-2.026662 1.213331,0 1.626663,0.933331 1.626663,2.039995 v 0.186666 h 0.293332 v -0.173333 c 0,-1.279997 -0.519998,-2.319994 -1.933328,-2.319994 z"
       id="path1912" />
    <path
       d="m -12.015573,18.713066 v 9.333309 h 0.293333 v -3.95999 h 1.33333 c 1.4799959,0 2.1466609,-0.706665 2.1466609,-2.186661 v -0.933331 c 0,-1.306663 -0.4933321,-2.253327 -1.9333289,-2.253327 z m 0.293333,5.09332 v -4.813321 h 1.546662 c 1.2533306,0 1.6399963,0.813331 1.6399963,1.959995 v 0.959997 c 0,1.319997 -0.5466653,1.893329 -1.8533283,1.893329 z"
       id="path1914" />
    <path
       d="m -7.2422618,25.753048 c 0,1.306663 0.5599986,2.359994 1.9733284,2.359994 1.4399964,0 1.9999949,-1.053331 1.9999949,-2.359994 v -4.746655 c 0,-1.306663 -0.5599985,-2.359994 -1.9999949,-2.359994 -1.4133298,0 -1.9733284,1.053331 -1.9733284,2.359994 z m 0.2933326,-4.759988 c 0,-1.146664 0.4399989,-2.079995 1.6799958,-2.079995 1.2533302,0 1.7066623,0.933331 1.7066623,2.079995 v 4.773321 c 0,1.146664 -0.4533321,2.079995 -1.7066623,2.079995 -1.2399969,0 -1.6799958,-0.933331 -1.6799958,-2.079995 z"
       id="path1916" />
    <path
       d="m -2.2156152,18.713066 v 9.333309 h 0.2933326 v -4.306656 h 1.1466638 c 1.21333027,0 2.0399948,0.36 2.0399948,1.733329 v 1.466663 c 0,0.399999 0.04,0.813332 0.2266661,1.106664 H 1.8110413 C 1.5977085,27.753043 1.5577086,27.29971 1.5577086,26.939711 v -1.466663 c 0,-1.026664 -0.4399988,-1.706662 -1.47999622,-1.866662 C 1.1043765,23.41972 1.5577086,22.793055 1.5577086,21.646391 v -0.839997 c 0,-1.279997 -0.5333319,-2.093328 -1.91999511,-2.093328 z m 0.2933326,4.746654 v -4.466655 h 1.54666279 c 1.19999697,0 1.63999581,0.706665 1.63999581,1.839995 v 0.853331 c 0,1.439997 -0.74666473,1.773329 -2.0399948,1.773329 z"
       id="path1918" />
    <path
       d="m 4.8910224,28.046375 v -9.05331 h 2.0399949 v -0.279999 h -4.359989 v 0.279999 h 2.0266616 v 9.05331 z"
       id="path1920" />
    <path
       d="m 9.677659,18.646399 c -1.3466633,0.01333 -1.9199952,0.946664 -1.9199952,2.306661 0,2.573327 3.5733242,2.493327 3.5733242,4.853321 0,1.13333 -0.439999,2.026661 -1.6666623,2.026661 -1.2266636,0 -1.6666625,-0.893331 -1.6666625,-2.026661 V 25.339715 H 7.7176639 v 0.453333 c 0,1.29333 0.533332,2.319994 1.9466618,2.319994 1.4266633,0 1.9599953,-1.026664 1.9599953,-2.319994 0,-2.533327 -3.5733246,-2.466661 -3.5733246,-4.853321 0,-1.106664 0.4133323,-2.026662 1.6399959,-2.026662 1.2133307,0 1.6266627,0.933331 1.6266627,2.039995 v 0.186666 h 0.293332 v -0.173333 c 0,-1.279997 -0.519998,-2.319994 -1.933328,-2.319994 z"
       id="path1922" />
    <path
       d="m 16.664285,18.646399 c -1.346664,0.01333 -1.919996,0.946664 -1.919996,2.306661 0,2.573327 3.573325,2.493327 3.573325,4.853321 0,1.13333 -0.439999,2.026661 -1.666663,2.026661 -1.226663,0 -1.666662,-0.893331 -1.666662,-2.026661 V 25.339715 H 14.70429 v 0.453333 c 0,1.29333 0.533332,2.319994 1.946661,2.319994 1.426663,0 1.959995,-1.026664 1.959995,-2.319994 0,-2.533327 -3.573324,-2.466661 -3.573324,-4.853321 0,-1.106664 0.413332,-2.026662 1.639996,-2.026662 1.21333,0 1.626662,0.933331 1.626662,2.039995 v 0.186666 h 0.293333 v -0.173333 c 0,-1.279997 -0.519999,-2.319994 -1.933328,-2.319994 z"
       id="path1924" />
    <path
       d="m 19.650937,18.713066 v 9.333309 h 0.293333 v -9.333309 z"
       id="path1926" />
    <path
       d="m 26.210909,19.153064 v 8.893311 h 0.293333 V 18.713066 H 26.05091 l -2.293328,8.85331 -2.293327,-8.85331 h -0.453332 v 9.333309 h 0.266666 v -8.893311 l 2.30666,8.866645 h 0.333333 z"
       id="path1928" />
    <path
       d="m 27.850889,18.713066 h -0.293333 v 7.026648 c 0,1.279997 0.506666,2.373328 1.933329,2.373328 1.413329,0 1.919995,-1.093331 1.919995,-2.373328 v -7.026648 h -0.279999 v 7.039982 c 0,1.119997 -0.399999,2.093328 -1.639996,2.093328 -1.239997,0 -1.639996,-0.973331 -1.639996,-2.093328 z"
       id="path1930" />
    <path
       d="m 35.890851,28.046375 v -0.279999 h -3.133326 v -9.05331 h -0.293332 v 9.333309 z"
       id="path1932" />
    <path
       d="m 40.997484,25.846381 0.546665,2.199994 h 0.293332 l -2.30666,-9.346643 h -0.413333 l -2.253327,9.346643 h 0.266666 l 0.546665,-2.199994 z m -1.679996,-6.799983 1.626662,6.533317 h -3.213325 z"
       id="path1934" />
    <path
       d="m 44.397452,28.046375 v -9.05331 h 2.039995 v -0.279999 h -4.359989 v 0.279999 h 2.026662 v 9.05331 z"
       id="path1936" />
    <path
       d="m 47.250764,18.713066 v 9.333309 h 0.293333 v -9.333309 z"
       id="path1938" />
    <path
       d="m 48.597416,25.753048 c 0,1.306663 0.559999,2.359994 1.973328,2.359994 1.439997,0 1.999995,-1.053331 1.999995,-2.359994 v -4.746655 c 0,-1.306663 -0.559998,-2.359994 -1.999995,-2.359994 -1.413329,0 -1.973328,1.053331 -1.973328,2.359994 z m 0.293333,-4.759988 c 0,-1.146664 0.439999,-2.079995 1.679995,-2.079995 1.253331,0 1.706663,0.933331 1.706663,2.079995 v 4.773321 c 0,1.146664 -0.453332,2.079995 -1.706663,2.079995 -1.239996,0 -1.679995,-0.933331 -1.679995,-2.079995 z"
       id="path1940" />
    <path
       d="m 53.904062,19.139731 3.333325,8.906644 h 0.359999 v -9.333309 h -0.279999 v 8.733311 l -3.279992,-8.733311 h -0.413332 v 9.333309 h 0.279999 z"
       id="path1942" />
  </g>
</svg>
