<?xml version="1.0" encoding="UTF-8" standalone="no"?>
<!-- Created with Inkscape (http://www.inkscape.org/) -->

<svg
   version="1.1"
   id="svg2"
   width="64.33297"
   height="9.4666433"
   viewBox="0 0 64.332976 9.4666434"
   sodipodi:docname="mastersystem.svg"
   inkscape:version="1.1 (c68e22c387, 2021-05-23)"
   inkscape:export-filename="C:\Users\BUCH\Desktop\Retrogaming\Recalbox\travail thèmes\Thème vignette !!!!!!!\Maquette 2 !!!!\image1250.png"
   inkscape:export-xdpi="96.460785"
   inkscape:export-ydpi="96.460785"
   xmlns:inkscape="http://www.inkscape.org/namespaces/inkscape"
   xmlns:sodipodi="http://sodipodi.sourceforge.net/DTD/sodipodi-0.dtd"
   xmlns="http://www.w3.org/2000/svg"
   xmlns:svg="http://www.w3.org/2000/svg">
  <defs
     id="defs6">
    <clipPath
       clipPathUnits="userSpaceOnUse"
       id="clipPath3185">
      <path
         id="path3187"
         style="fill:#ffffff;fill-rule:evenodd;stroke:#ffffff;stroke-width:5.15903;stroke-linecap:round;stroke-linejoin:round;paint-order:stroke fill markers"
         d="m 1157.5591,335.78677 h 462.4206 L 1362.3723,1410.6277 H 899.95176 Z"
         sodipodi:nodetypes="ccccc"
         inkscape:export-filename="C:\Users\BUCH\Desktop\Retrogaming\Recalbox\travail thèmes\Thème vignette !!!!!!!\Maquette 2 !!!!\rect849.png"
         inkscape:export-xdpi="247.96268"
         inkscape:export-ydpi="247.96268" />
    </clipPath>
  </defs>
  <sodipodi:namedview
     id="namedview4"
     pagecolor="#ffffff"
     bordercolor="#666666"
     borderopacity="1.0"
     inkscape:pageshadow="2"
     inkscape:pageopacity="0.0"
     inkscape:pagecheckerboard="true"
     showgrid="false"
     inkscape:showpageshadow="false"
     inkscape:zoom="12.479331"
     inkscape:cx="30.410284"
     inkscape:cy="8.0933826"
     inkscape:window-width="1920"
     inkscape:window-height="1138"
     inkscape:window-x="-8"
     inkscape:window-y="-8"
     inkscape:window-maximized="1"
     inkscape:current-layer="svg2"
     fit-margin-top="0"
     fit-margin-left="0"
     fit-margin-right="0"
     fit-margin-bottom="0" />
  <g
     aria-label="master system"
     id="text3365"
     style="font-weight:300;font-size:13.3333px;line-height:1.25;font-family:'Bebas Neue';-inkscape-font-specification:'Bebas Neue, Light';fill:#ffffff"
     transform="translate(9.242833,-11.514607)">
    <path
       d="m -4.0428462,12.021272 v 8.893311 h 0.2933326 v -9.33331 h -0.4533322 l -2.2933275,8.853311 -2.2933275,-8.853311 H -9.242833 v 9.33331 h 0.266666 v -8.893311 l 2.3066608,8.866645 h 0.3333325 z"
       id="path3616" />
    <path
       d="m 1.4104556,18.714589 0.5466653,2.199994 H 2.2504535 L -0.05620738,11.56794 h -0.41333229 l -2.25332763,9.346643 h 0.266666 l 0.5466653,-2.199994 z m -1.67999578,-6.799983 1.62666258,6.533317 h -3.2133252 z"
       id="path3618" />
    <path
       d="m 5.2104272,11.514607 c -1.3466632,0.01333 -1.9199951,0.946664 -1.9199951,2.306661 0,2.573327 3.5733243,2.493327 3.5733243,4.853321 0,1.13333 -0.4399989,2.026661 -1.6666625,2.026661 -1.2266635,0 -1.6666624,-0.893331 -1.6666624,-2.026661 V 18.207923 H 3.2504322 v 0.453333 c 0,1.29333 0.533332,2.319994 1.9466617,2.319994 1.4266631,0 1.9599951,-1.026664 1.9599951,-2.319994 0,-2.533327 -3.5733243,-2.466661 -3.5733243,-4.853322 0,-1.106663 0.4133323,-2.026661 1.6399958,-2.026661 1.2133303,0 1.6266626,0.933331 1.6266626,2.039995 v 0.186666 h 0.2933326 v -0.173333 c 0,-1.279997 -0.5199987,-2.319994 -1.9333285,-2.319994 z"
       id="path3620" />
    <path
       d="m 10.237075,20.914583 v -9.05331 h 2.039994 v -0.28 H 7.9170805 v 0.28 H 9.943742 v 9.05331 z"
       id="path3622" />
    <path
       d="m 13.383715,16.047929 v -4.186656 h 3.266659 v -0.28 h -3.559991 v 9.33331 h 3.559991 v -0.279999 h -3.266659 v -4.319989 h 2.74666 v -0.266666 z"
       id="path3624" />
    <path
       d="m 17.690362,11.581273 v 9.33331 h 0.293333 v -4.306656 h 1.146663 c 1.213331,0 2.039995,0.36 2.039995,1.733329 v 1.466663 c 0,0.399999 0.04,0.813332 0.226666,1.106664 h 0.32 c -0.213333,-0.293332 -0.253333,-0.746665 -0.253333,-1.106664 v -1.466663 c 0,-1.026664 -0.439999,-1.706662 -1.479996,-1.866662 1.026664,-0.186666 1.479996,-0.813331 1.479996,-1.959995 v -0.839997 c 0,-1.279997 -0.533332,-2.093329 -1.919995,-2.093329 z m 0.293333,4.746655 v -4.466655 h 1.546662 c 1.199997,0 1.639996,0.706665 1.639996,1.839995 v 0.853331 c 0,1.439997 -0.746664,1.773329 -2.039995,1.773329 z"
       id="path3626" />
    <path
       d="m 26.756978,11.514607 c -1.346663,0.01333 -1.919995,0.946664 -1.919995,2.306661 0,2.573327 3.573324,2.493327 3.573324,4.853321 0,1.13333 -0.439999,2.026661 -1.666662,2.026661 -1.226664,0 -1.666663,-0.893331 -1.666663,-2.026661 v -0.466666 h -0.279999 v 0.453333 c 0,1.29333 0.533332,2.319994 1.946662,2.319994 1.426663,0 1.959995,-1.026664 1.959995,-2.319994 0,-2.533327 -3.573325,-2.466661 -3.573325,-4.853322 0,-1.106663 0.413333,-2.026661 1.639996,-2.026661 1.213331,0 1.626663,0.933331 1.626663,2.039995 v 0.186666 h 0.293332 v -0.173333 c 0,-1.279997 -0.519998,-2.319994 -1.933328,-2.319994 z"
       id="path3628" />
    <path
       d="m 31.770266,20.914583 h 0.293333 v -3.773324 l 2.213328,-5.559986 h -0.306666 l -2.039995,5.159987 -2.039995,-5.159987 h -0.293333 l 2.173328,5.559986 z"
       id="path3630" />
    <path
       d="m 37.116883,11.514607 c -1.346663,0.01333 -1.919995,0.946664 -1.919995,2.306661 0,2.573327 3.573324,2.493327 3.573324,4.853321 0,1.13333 -0.439999,2.026661 -1.666662,2.026661 -1.226664,0 -1.666663,-0.893331 -1.666663,-2.026661 v -0.466666 h -0.279999 v 0.453333 c 0,1.29333 0.533332,2.319994 1.946662,2.319994 1.426663,0 1.959995,-1.026664 1.959995,-2.319994 0,-2.533327 -3.573324,-2.466661 -3.573324,-4.853322 0,-1.106663 0.413332,-2.026661 1.639996,-2.026661 1.21333,0 1.626662,0.933331 1.626662,2.039995 v 0.186666 h 0.293333 v -0.173333 c 0,-1.279997 -0.519999,-2.319994 -1.933329,-2.319994 z"
       id="path3632" />
    <path
       d="m 42.143529,20.914583 v -9.05331 h 2.039995 v -0.28 h -4.359989 v 0.28 h 2.026661 v 9.05331 z"
       id="path3634" />
    <path
       d="m 45.290169,16.047929 v -4.186656 h 3.266659 v -0.28 h -3.559991 v 9.33331 h 3.559991 v -0.279999 h -3.266659 v -4.319989 h 2.74666 v -0.266666 z"
       id="path3636" />
    <path
       d="m 54.796803,12.021272 v 8.893311 h 0.293333 v -9.33331 h -0.453333 l -2.293327,8.853311 -2.293328,-8.853311 h -0.453332 v 9.33331 h 0.266666 v -8.893311 l 2.306661,8.866645 h 0.333332 z"
       id="path3638" />
  </g>
</svg>
