<?xml version="1.0" encoding="UTF-8" standalone="no"?>
<svg
   viewBox="0 0 218.52 317.48"
   version="1.1"
   id="svg610"
   sodipodi:docname="auto-arcade-exidy.svg"
   inkscape:version="1.1 (c68e22c387, 2021-05-23)"
   xmlns:inkscape="http://www.inkscape.org/namespaces/inkscape"
   xmlns:sodipodi="http://sodipodi.sourceforge.net/DTD/sodipodi-0.dtd"
   xmlns="http://www.w3.org/2000/svg"
   xmlns:svg="http://www.w3.org/2000/svg">
  <defs
     id="defs614">
    <linearGradient
       id="a"
       gradientTransform="rotate(90,602.18396,390.31957)"
       gradientUnits="userSpaceOnUse"
       x1="312.93539"
       x2="291.9762"
       y1="1095.2787"
       y2="1074.3195">
      <stop
         offset="0"
         stop-color="#a4a5a9"
         id="stop2" />
      <stop
         offset="1"
         stop-color="#e6e6e7"
         id="stop4" />
    </linearGradient>
    <linearGradient
       id="b"
       gradientTransform="rotate(90,602.18396,390.31957)"
       gradientUnits="userSpaceOnUse"
       x1="292.05191"
       x2="312.9278"
       y1="1095.271"
       y2="1074.3951">
      <stop
         offset="0"
         stop-color="#211c1d"
         stop-opacity="0"
         id="stop7" />
      <stop
         offset=".0448"
         stop-color="#211c1d"
         stop-opacity=".0896"
         id="stop9" />
      <stop
         offset=".5"
         stop-color="#211c1d"
         id="stop11" />
      <stop
         offset=".9552"
         stop-color="#211c1d"
         stop-opacity=".0896"
         id="stop13" />
      <stop
         offset="1"
         stop-color="#211c1d"
         stop-opacity="0"
         id="stop15" />
    </linearGradient>
    <linearGradient
       id="c"
       gradientTransform="rotate(-90,-717.02648,-3093.8286)"
       gradientUnits="userSpaceOnUse"
       x1="-3911.9182"
       x2="-3891.0425"
       y1="-2458.6936"
       y2="-2479.5693">
      <stop
         offset="0"
         stop-color="#fff"
         stop-opacity="0"
         id="stop18" />
      <stop
         offset=".5"
         stop-color="#fff"
         id="stop20" />
      <stop
         offset="1"
         stop-color="#fff"
         stop-opacity="0"
         id="stop22" />
    </linearGradient>
  </defs>
  <sodipodi:namedview
     id="namedview612"
     pagecolor="#ffffff"
     bordercolor="#666666"
     borderopacity="1.0"
     inkscape:pageshadow="2"
     inkscape:pageopacity="0.0"
     inkscape:pagecheckerboard="true"
     showgrid="false"
     inkscape:zoom="1.6771178"
     inkscape:cx="89.141023"
     inkscape:cy="150.85404"
     inkscape:window-width="1920"
     inkscape:window-height="1138"
     inkscape:window-x="-8"
     inkscape:window-y="-8"
     inkscape:window-maximized="1"
     inkscape:current-layer="svg610"
     inkscape:snap-global="false" />
  <path
     d="M 5.0900021,20.831 H 213.43 v 218.63 H 5.0900021 Z"
     fill="#1229b8"
     id="path2"
     style="fill:#d19451;fill-opacity:1;stroke-width:1.24817" />
  <path
     d="m5.09 264.961h208.246v48.75h-208.246z"
     fill="#bcc9a7"
     stroke="#000"
     id="path6"
     style="fill:#d19451;fill-opacity:1" />
  <path
     d="m14.463 313.711h12.805v3.769h-12.805zm176.605 0h12.805v3.769h-12.805z"
     fill="#1a1818"
     id="path8"
     style="fill:#000000" />
  <path
     d="m5.09 258.461h208.246v6.5h-208.246z"
     fill="#18111c"
     id="path10"
     style="fill:#000000" />
  <path
     d="m5.09 239.461h208.246v19h-208.246z"
     fill="#acb5a2"
     stroke="#000"
     stroke-miterlimit="10"
     id="path12"
     style="fill:#f8fe14;fill-opacity:1" />
  <path
     d="m213.43 0h5.09v317.48h-5.09z"
     fill="#18111c"
     id="path16"
     style="fill:#000000" />
  <path
     d="m111.178 305.003h-3.231c-1.408 0-2.553-1.374-2.553-3.063v-3.063h8.337v3.063c0 1.689-1.145 3.063-2.553 3.063z"
     fill="#1a1818"
     id="path20" />
  <path
     d="m5.137 0h208.246v26.188h-208.246z"
     fill="#18111c"
     id="path78"
     style="fill:#000000" />
  <path
     d="m0 0h5.09v317.48h-5.09z"
     fill="#18111c"
     id="path480"
     style="fill:#000000" />
  <path
     d="m141.372 282.946h-4.867a1.321 1.321 0 0 1 -1.317-1.317v-3.033c0-.724.593-1.317 1.317-1.317h4.867c.724 0 1.317.593 1.317 1.317v3.033c0 .724-.593 1.317-1.317 1.317z"
     fill="#5e5353"
     id="path540" />
  <path
     d="m136.595 278.883h4.688v1.229h-4.688z"
     fill="#1a1818"
     id="path542" />
  <path
     d="m 70.415,267.836 h 77.596 v 43 H 70.415 Z"
     fill="#1a1818"
     id="path18" />
  <path
     d="m 91.199,281.522 h -6.785 a 1.235,1.235 0 0 1 -1.231,-1.231 v -3.205 c 0,-0.677 0.554,-1.231 1.231,-1.231 h 6.785 c 0.677,0 1.231,0.554 1.231,1.231 v 3.205 c 0,0.677 -0.554,1.231 -1.231,1.231 z"
     fill="#5b2a2a"
     id="path530" />
  <path
     d="m 84.729,276.835 h 1.313 v 3.937 h -1.313 z"
     fill="#471313"
     id="path536" />
  <path
     d="m 100.483,281.522 h -4.867 a 1.321,1.321 0 0 1 -1.317,-1.317 v -3.033 c 0,-0.724 0.593,-1.317 1.317,-1.317 h 4.867 c 0.724,0 1.317,0.593 1.317,1.317 v 3.033 c 0,0.724 -0.593,1.317 -1.317,1.317 z"
     fill="#5e5353"
     id="path532" />
  <path
     d="m 95.705,277.46 h 4.688 v 1.229 h -4.688 z"
     fill="#1a1818"
     id="path534" />
  <path
     d="m 94.064,287.147 h 26.414 v 6.25 H 94.064 Z"
     fill="#595757"
     id="path538" />
  <path
     d="m 130.199,281.637 h -6.785 a 1.235,1.235 0 0 1 -1.231,-1.231 v -3.205 c 0,-0.677 0.554,-1.231 1.231,-1.231 h 6.785 c 0.677,0 1.231,0.554 1.231,1.231 v 3.205 c 0,0.677 -0.554,1.231 -1.231,1.231 z"
     fill="#5b2a2a"
     id="path544" />
  <path
     d="m 123.729,276.949 h 1.313 v 3.938 h -1.313 z"
     fill="#471313"
     id="path546" />
  <path
     d="m 126.195,303.309 h 2.378 a 2.57,2.57 0 0 0 2.563,-2.563 v -2.563 h -7.503 v 2.563 a 2.57,2.57 0 0 0 2.562,2.563 z"
     fill="#353434"
     id="path550" />
  <path
     d="m 114.253,281.637 h 4.867 c 0.724,0 1.317,-0.593 1.317,-1.317 v -3.033 c 0,-0.724 -0.593,-1.317 -1.317,-1.317 h -4.867 c -0.724,0 -1.317,0.593 -1.317,1.317 v 3.033 c 0,0.724 0.593,1.317 1.317,1.317 z"
     fill="#5e5353"
     id="path552" />
  <path
     d="m 119.03,278.803 h -4.688 v -1.229 h 4.688 z"
     fill="#1a1818"
     id="path554" />
  <ellipse
     cx="133.68201"
     cy="286.92902"
     fill="#c6c6c6"
     rx="2.546"
     ry="2.4070001"
     id="ellipse556" />
  <path
     d="m 133.197,285.21 h 0.938 v 3.594 h -0.938 z"
     fill="#353535"
     id="path558" />
  <path
     d="M 88.541,303.194 H 86.163 A 2.57,2.57 0 0 1 83.6,300.632 v -2.563 h 7.503 v 2.563 a 2.57,2.57 0 0 1 -2.562,2.562 z"
     fill="#353434"
     id="path22" />
  <g
     id="g16735"
     transform="matrix(0.74486512,0,0,0.74486512,10.278808,-61.522184)">
    <path
       d="m 40.815121,417.6366 c 0,2.679 -4.776,4.85 -10.667,4.85 -5.891,0 -10.667,-2.172 -10.667,-4.85"
       fill="#848383"
       id="path37" />
    <path
       d="m 30.149121,422.9876 c -6.262,0 -11.167,-2.351 -11.167,-5.351 h 1 c 0,2.358 4.656,4.351 10.167,4.351 5.511,0 10.166,-1.992 10.166,-4.351 h 1 c 0,3.001 -4.904,5.351 -11.166,5.351 z"
       id="path39" />
    <ellipse
       cx="30.148113"
       cy="417.6366"
       fill="#666565"
       rx="10.667"
       ry="3.017"
       id="ellipse41" />
    <path
       d="m 30.149121,421.1536 c -5.549,0 -11.167,-1.208 -11.167,-3.517 0,-2.31 5.618,-3.518 11.167,-3.518 5.549,0 11.166,1.208 11.166,3.518 0,2.309 -5.617,3.517 -11.166,3.517 z m 0,-6.034 c -6.206,0 -10.167,1.491 -10.167,2.518 0,1.027 3.961,2.517 10.167,2.517 6.206,0 10.166,-1.49 10.166,-2.517 0,-1.027 -3.96,-2.518 -10.166,-2.518 z"
       id="path43" />
    <path
       d="m 196.36912,417.4456 v -4.085 c 0,0.721 -2.728,1.306 -6.094,1.306 -3.366,0 -6.094,-0.585 -6.094,-1.306 v 4.085 -0.078 c 1.558,0.367 3.71,0.594 6.087,0.594 2.385,0 4.543,-0.228 6.102,-0.597"
       fill="#ae0009"
       id="path45" />
    <path
       d="m 190.26712,418.4616 c -2.338,0 -4.54,-0.216 -6.201,-0.607 l 0.096,-0.409 h -0.481 v -4.085 h 1 c 0.193,0.212 2.12,0.807 5.595,0.807 3.474,0 5.4,-0.595 5.616,-0.897 l 0.978,0.091 v 4.085 h -0.48 l 0.096,0.405 c -1.666,0.393 -3.874,0.61 -6.219,0.61 z m -5.587,-1.495 c 1.539,0.32 3.503,0.495 5.587,0.495 2.091,0 4.061,-0.176 5.602,-0.498 v -2.54 c -1.638,0.696 -4.789,0.743 -5.594,0.743 -0.805,0 -3.957,-0.047 -5.595,-0.743 z"
       fill="#020202"
       id="path47" />
    <path
       d="m 184.16512,417.3676 v -2.568 c -1.537,0.329 -2.487,0.782 -2.487,1.282 0,0.502 0.956,0.957 2.502,1.286"
       fill="#ae0009"
       id="path49" />
    <path
       d="m 184.07612,417.8566 c -1.977,-0.421 -2.897,-0.985 -2.897,-1.775 0,-0.787 0.916,-1.35 2.883,-1.771 l 0.604,-0.129 v 3.187 h -0.485 z m -0.411,-2.424 c -1.093,0.292 -1.448,0.58 -1.492,0.679 0.043,0.048 0.399,0.328 1.492,0.619 z"
       fill="#020202"
       id="path51" />
    <path
       d="m 196.37012,417.3636 v -2.564 c 1.546,0.329 2.501,0.782 2.501,1.282 0,0.501 -0.956,0.954 -2.501,1.282 z"
       fill="#ae0009"
       id="path53" />
    <path
       d="m 195.87012,417.9806 v -3.799 l 0.604,0.128 c 1.976,0.421 2.896,0.983 2.896,1.771 0,0.789 -0.921,1.352 -2.897,1.771 z m 1,-2.549 v 1.3 c 1.103,-0.293 1.462,-0.582 1.506,-0.681 -0.044,-0.046 -0.405,-0.327 -1.506,-0.619 z"
       fill="#020202"
       id="path55" />
    <ellipse
       cx="190.27512"
       cy="413.31061"
       fill="#ae0009"
       rx="6.0939999"
       ry="1.306"
       id="ellipse57" />
    <path
       d="m 190.27512,415.1166 c -1.102,0 -6.595,-0.087 -6.595,-1.807 0,-1.719 5.493,-1.806 6.595,-1.806 1.102,0 6.594,0.087 6.594,1.806 0,1.72 -5.493,1.807 -6.594,1.807 z m -5.513,-1.807 c 0.483,0.317 2.361,0.807 5.513,0.807 3.152,0 5.028,-0.489 5.512,-0.807 -0.483,-0.316 -2.361,-0.806 -5.512,-0.806 -3.151,0 -5.029,0.49 -5.513,0.806 z"
       fill="#020202"
       id="path59" />
    <path
       d="m 196.36912,422.5696 v -4.085 c 0,0.721 -2.728,1.306 -6.094,1.306 -3.366,0 -6.094,-0.585 -6.094,-1.306 v 4.085 -0.078 c 1.558,0.367 3.71,0.594 6.087,0.594 2.385,0 4.543,-0.228 6.102,-0.597"
       fill="#ae0009"
       id="path61" />
    <path
       d="m 190.26712,423.5856 c -2.338,0 -4.54,-0.216 -6.2,-0.607 l 0.096,-0.408 h -0.481 v -4.085 h 1 c 0.193,0.212 2.12,0.806 5.594,0.806 3.474,0 5.4,-0.594 5.616,-0.897 l 0.978,0.092 v 4.085 h -0.48 l 0.094,0.402 c -1.664,0.395 -3.872,0.612 -6.217,0.612 z m -5.586,-1.495 c 1.538,0.32 3.502,0.495 5.586,0.495 2.091,0 4.061,-0.176 5.602,-0.498 v -2.54 c -1.638,0.696 -4.789,0.743 -5.594,0.743 -0.805,0 -3.956,-0.047 -5.594,-0.743 z"
       fill="#020202"
       id="path63" />
    <path
       d="m 184.16512,422.4916 v -2.568 c -1.537,0.329 -2.487,0.782 -2.487,1.282 0,0.502 0.956,0.957 2.502,1.286"
       fill="#ae0009"
       id="path65" />
    <path
       d="m 184.07712,422.9806 c -1.978,-0.421 -2.898,-0.984 -2.898,-1.774 0,-0.788 0.916,-1.352 2.883,-1.771 l 0.604,-0.129 v 3.186 h -0.484 z m -0.412,-2.424 c -1.093,0.292 -1.449,0.58 -1.492,0.679 0.044,0.048 0.4,0.329 1.492,0.619 z"
       fill="#020202"
       id="path67" />
    <path
       d="m 196.37012,422.4886 v -2.564 c 1.546,0.329 2.501,0.782 2.501,1.282 0,0.5 -0.956,0.953 -2.501,1.282 z"
       fill="#ae0009"
       id="path69" />
    <path
       d="m 195.87012,423.1046 v -3.798 l 0.604,0.128 c 1.977,0.42 2.897,0.982 2.897,1.771 0,0.789 -0.921,1.352 -2.897,1.771 z m 1,-2.548 v 1.3 c 1.103,-0.293 1.462,-0.582 1.506,-0.681 -0.044,-0.047 -0.405,-0.328 -1.506,-0.619 z"
       fill="#020202"
       id="path71" />
    <ellipse
       cx="190.27512"
       cy="418.4346"
       fill="#ae0009"
       rx="6.0939999"
       ry="1.306"
       id="ellipse73" />
    <path
       d="m 190.27512,420.2406 c -1.102,0 -6.594,-0.087 -6.594,-1.806 0,-1.72 5.492,-1.807 6.594,-1.807 1.102,0 6.594,0.087 6.594,1.807 0,1.719 -5.493,1.806 -6.594,1.806 z m -5.512,-1.806 c 0.483,0.316 2.361,0.806 5.512,0.806 3.151,0 5.028,-0.489 5.512,-0.806 -0.483,-0.317 -2.36,-0.807 -5.512,-0.807 -3.152,0 -5.029,0.49 -5.512,0.807 z"
       fill="#020202"
       id="path75" />
    <path
       d="m 59.234121,417.5096 v -4.085 c 0,0.721 -2.728,1.306 -6.094,1.306 -3.366,0 -6.094,-0.585 -6.094,-1.306 v 4.085 -0.078 c 1.558,0.367 3.71,0.594 6.087,0.594 2.385,0 4.543,-0.228 6.102,-0.597"
       fill="#ae0009"
       id="path77" />
    <path
       d="m 53.132121,418.5256 c -2.334,0 -4.536,-0.216 -6.201,-0.607 l 0.096,-0.409 h -0.481 v -4.085 h 1 c 0.193,0.212 2.12,0.806 5.594,0.806 3.475,0 5.401,-0.594 5.617,-0.896 l 0.978,0.091 v 4.085 h -0.48 l 0.096,0.405 c -1.666,0.393 -3.874,0.61 -6.219,0.61 z m -5.587,-1.495 c 1.541,0.32 3.506,0.495 5.587,0.495 2.091,0 4.061,-0.176 5.602,-0.498 v -2.541 c -1.638,0.696 -4.79,0.743 -5.595,0.743 -0.805,0 -3.956,-0.047 -5.594,-0.743 z"
       fill="#020202"
       id="path79" />
    <path
       d="m 47.030121,417.4316 v -2.568 c -1.537,0.329 -2.487,0.782 -2.487,1.282 0,0.502 0.956,0.957 2.502,1.286"
       fill="#ae0009"
       id="path81" />
    <path
       d="m 46.941121,417.9216 c -1.949,-0.415 -2.897,-0.996 -2.897,-1.775 0,-0.787 0.916,-1.351 2.882,-1.771 l 0.604,-0.129 v 3.187 h -0.484 z m -0.411,-2.424 c -1.092,0.292 -1.447,0.58 -1.491,0.679 0.044,0.048 0.399,0.328 1.491,0.619 z"
       fill="#020202"
       id="path83" />
    <path
       d="m 59.235121,417.4286 v -2.564 c 1.546,0.329 2.501,0.782 2.501,1.282 0,0.5 -0.956,0.953 -2.501,1.282 z"
       fill="#ae0009"
       id="path85" />
    <path
       d="m 58.735121,418.0466 v -3.8 l 0.604,0.128 c 1.976,0.421 2.896,0.983 2.896,1.771 0,0.787 -0.921,1.351 -2.896,1.771 z m 1,-2.55 v 1.299 c 1.102,-0.293 1.462,-0.581 1.506,-0.681 -0.044,-0.046 -0.405,-0.327 -1.506,-0.618 z"
       fill="#020202"
       id="path87" />
    <ellipse
       cx="53.140118"
       cy="413.3746"
       fill="#ae0009"
       rx="6.0939999"
       ry="1.306"
       id="ellipse89" />
    <path
       d="m 53.139121,415.1806 c -1.102,0 -6.594,-0.087 -6.594,-1.806 0,-1.719 5.492,-1.806 6.594,-1.806 1.102,0 6.595,0.087 6.595,1.806 0,1.719 -5.493,1.806 -6.595,1.806 z m -5.512,-1.806 c 0.483,0.317 2.361,0.806 5.512,0.806 3.151,0 5.029,-0.488 5.513,-0.806 -0.483,-0.317 -2.362,-0.806 -5.513,-0.806 -3.151,0 -5.028,0.488 -5.512,0.806 z"
       fill="#020202"
       id="path91" />
    <path
       d="m 59.234121,422.6336 v -4.085 c 0,0.721 -2.728,1.306 -6.094,1.306 -3.366,0 -6.094,-0.585 -6.094,-1.306 v 4.085 -0.078 c 1.558,0.367 3.71,0.594 6.087,0.594 2.385,0 4.543,-0.228 6.102,-0.597"
       fill="#ae0009"
       id="path93" />
    <path
       d="m 53.132121,423.6496 c -2.334,0 -4.536,-0.216 -6.201,-0.607 l 0.096,-0.409 h -0.481 v -4.085 h 1 c 0.193,0.212 2.12,0.807 5.595,0.807 3.474,0 5.4,-0.595 5.616,-0.897 l 0.978,0.091 v 4.085 h -0.48 l 0.096,0.405 c -1.666,0.393 -3.874,0.61 -6.219,0.61 z m -5.587,-1.495 c 1.541,0.32 3.506,0.495 5.587,0.495 2.091,0 4.061,-0.176 5.602,-0.498 v -2.54 c -1.638,0.696 -4.789,0.743 -5.594,0.743 -0.805,0 -3.957,-0.047 -5.595,-0.743 z"
       fill="#020202"
       id="path95" />
    <path
       d="m 47.030121,422.5556 v -2.568 c -1.537,0.329 -2.487,0.782 -2.487,1.282 0,0.502 0.956,0.957 2.502,1.286"
       fill="#ae0009"
       id="path97" />
    <path
       d="m 46.941121,423.0456 c -1.949,-0.415 -2.897,-0.996 -2.897,-1.775 0,-0.787 0.916,-1.35 2.882,-1.771 l 0.604,-0.129 v 3.187 h -0.484 z m -0.411,-2.424 c -1.092,0.292 -1.447,0.58 -1.491,0.679 0.044,0.048 0.399,0.328 1.491,0.619 z"
       fill="#020202"
       id="path99" />
    <path
       d="m 59.235121,422.5526 v -2.564 c 1.546,0.329 2.501,0.782 2.501,1.282 0,0.5 -0.956,0.953 -2.501,1.282 z"
       fill="#ae0009"
       id="path101" />
    <path
       d="m 58.735121,423.1696 v -3.799 l 0.604,0.128 c 1.976,0.421 2.896,0.983 2.896,1.771 0,0.778 -0.947,1.357 -2.897,1.771 z m 1,-2.549 v 1.3 c 1.102,-0.293 1.462,-0.582 1.506,-0.682 -0.044,-0.046 -0.405,-0.327 -1.506,-0.618 z"
       fill="#020202"
       id="path103" />
    <ellipse
       cx="53.140118"
       cy="418.4986"
       fill="#ae0009"
       rx="6.0939999"
       ry="1.306"
       id="ellipse105" />
    <path
       d="m 53.140121,420.3046 c -1.102,0 -6.595,-0.087 -6.595,-1.806 0,-1.719 5.493,-1.806 6.595,-1.806 1.102,0 6.594,0.087 6.594,1.806 0,1.719 -5.492,1.806 -6.594,1.806 z m -5.513,-1.806 c 0.483,0.317 2.361,0.806 5.513,0.806 3.15,0 5.028,-0.488 5.512,-0.806 -0.483,-0.317 -2.361,-0.806 -5.512,-0.806 -3.151,0 -5.029,0.489 -5.513,0.806 z"
       fill="#020202"
       id="path107" />
    <path
       d="m 82.730121,417.9256 v -4.085 c 0,0.721 -2.728,1.306 -6.094,1.306 -3.366,0 -6.094,-0.585 -6.094,-1.306 v 4.085 -0.078 c 1.558,0.367 3.71,0.594 6.087,0.594 2.385,0 4.543,-0.228 6.102,-0.597"
       fill="#ffffff"
       id="path109" />
    <path
       d="m 76.628121,418.9416 c -2.339,0 -4.541,-0.216 -6.201,-0.607 l 0.096,-0.409 h -0.481 v -4.084 h 1 c 0.193,0.212 2.12,0.806 5.594,0.806 3.474,0 5.401,-0.594 5.617,-0.897 l 0.978,0.092 v 4.084 h -0.48 l 0.096,0.405 c -1.667,0.393 -3.875,0.61 -6.219,0.61 z m -5.587,-1.495 c 1.538,0.32 3.502,0.495 5.587,0.495 2.091,0 4.06,-0.176 5.602,-0.499 v -2.539 c -1.638,0.696 -4.79,0.743 -5.595,0.743 -0.805,0 -3.956,-0.047 -5.594,-0.743 z"
       fill="#020202"
       id="path111" />
    <path
       d="m 70.526121,417.8476 v -2.568 c -1.537,0.329 -2.487,0.782 -2.487,1.282 0,0.502 0.956,0.957 2.502,1.286"
       fill="#ffffff"
       id="path113" />
    <path
       d="m 70.437121,418.3376 c -1.977,-0.421 -2.897,-0.985 -2.897,-1.775 0,-0.787 0.916,-1.351 2.882,-1.771 l 0.604,-0.129 v 3.187 h -0.484 z m -0.411,-2.424 c -1.092,0.292 -1.447,0.58 -1.491,0.679 0.043,0.048 0.399,0.328 1.491,0.619 z"
       fill="#020202"
       id="path115" />
    <path
       d="m 82.731121,417.8446 v -2.564 c 1.546,0.329 2.501,0.782 2.501,1.282 0,0.5 -0.956,0.953 -2.501,1.282 z"
       fill="#ffffff"
       id="path117" />
    <path
       d="m 82.231121,418.4616 v -3.799 l 0.604,0.128 c 1.976,0.421 2.896,0.983 2.896,1.771 0,0.789 -0.921,1.352 -2.897,1.771 z m 1,-2.549 v 1.3 c 1.103,-0.293 1.462,-0.582 1.506,-0.681 -0.044,-0.047 -0.405,-0.328 -1.506,-0.619 z"
       fill="#020202"
       id="path119" />
    <ellipse
       cx="76.636116"
       cy="413.79059"
       fill="#ffffff"
       rx="6.0939999"
       ry="1.306"
       id="ellipse121" />
    <path
       d="m 76.635121,415.5976 c -1.102,0 -6.594,-0.087 -6.594,-1.807 0,-1.719 5.492,-1.806 6.594,-1.806 1.102,0 6.595,0.087 6.595,1.806 0,1.72 -5.493,1.807 -6.595,1.807 z m -5.512,-1.807 c 0.483,0.317 2.36,0.807 5.512,0.807 3.152,0 5.029,-0.489 5.513,-0.807 -0.483,-0.316 -2.362,-0.806 -5.513,-0.806 -3.151,0 -5.028,0.489 -5.512,0.806 z"
       fill="#020202"
       id="path123" />
    <path
       d="m 82.730121,423.0496 v -4.085 c 0,0.721 -2.728,1.306 -6.094,1.306 -3.366,0 -6.094,-0.585 -6.094,-1.306 v 4.085 -0.078 c 1.558,0.367 3.71,0.594 6.087,0.594 2.385,0 4.543,-0.228 6.102,-0.597"
       fill="#ffffff"
       id="path125" />
    <path
       d="m 76.628121,424.0656 c -2.339,0 -4.541,-0.216 -6.201,-0.607 l 0.096,-0.408 h -0.481 v -4.085 h 1 c 0.193,0.212 2.12,0.806 5.594,0.806 3.474,0 5.401,-0.594 5.617,-0.897 l 0.978,0.092 v 4.085 h -0.48 l 0.096,0.404 c -1.667,0.393 -3.875,0.61 -6.219,0.61 z m -5.587,-1.495 c 1.538,0.32 3.502,0.495 5.587,0.495 2.091,0 4.06,-0.176 5.602,-0.499 v -2.539 c -1.638,0.696 -4.79,0.743 -5.595,0.743 -0.805,0 -3.956,-0.047 -5.594,-0.743 z"
       fill="#020202"
       id="path127" />
    <path
       d="m 70.526121,422.9726 v -2.568 c -1.537,0.329 -2.487,0.782 -2.487,1.282 0,0.502 0.956,0.957 2.502,1.286"
       fill="#ffffff"
       id="path129" />
    <path
       d="m 70.437121,423.4616 c -1.977,-0.421 -2.897,-0.985 -2.897,-1.774 0,-0.789 0.916,-1.352 2.882,-1.771 l 0.604,-0.129 v 3.186 h -0.484 z m -0.411,-2.424 c -1.093,0.292 -1.448,0.58 -1.491,0.679 0.044,0.048 0.399,0.328 1.491,0.619 z"
       fill="#020202"
       id="path131" />
    <path
       d="m 82.731121,422.9686 v -2.564 c 1.546,0.329 2.501,0.782 2.501,1.282 0,0.5 -0.956,0.953 -2.501,1.282 z"
       fill="#ffffff"
       id="path133" />
    <path
       d="m 82.231121,423.5856 v -3.798 l 0.604,0.128 c 1.977,0.42 2.897,0.982 2.897,1.771 0,0.789 -0.921,1.352 -2.897,1.771 z m 1,-2.549 v 1.3 c 1.103,-0.293 1.462,-0.582 1.506,-0.681 -0.044,-0.047 -0.405,-0.328 -1.506,-0.619 z"
       fill="#020202"
       id="path135" />
    <ellipse
       cx="76.636116"
       cy="418.91458"
       fill="#ffffff"
       rx="6.0939999"
       ry="1.306"
       id="ellipse137" />
    <path
       d="m 76.635121,420.7216 c -1.102,0 -6.594,-0.087 -6.594,-1.806 0,-1.72 5.492,-1.807 6.594,-1.807 1.102,0 6.595,0.087 6.595,1.807 0,1.719 -5.493,1.806 -6.595,1.806 z m -5.512,-1.806 c 0.483,0.316 2.361,0.806 5.512,0.806 3.151,0 5.029,-0.489 5.513,-0.806 -0.483,-0.317 -2.361,-0.807 -5.513,-0.807 -3.152,0 -5.028,0.49 -5.512,0.807 z"
       fill="#020202"
       id="path139" />
    <path
       d="m 106.16212,417.9256 v -4.085 c 0,0.721 -2.728,1.306 -6.094,1.306 -3.365999,0 -6.093999,-0.585 -6.093999,-1.306 v 4.085 -0.078 c 1.558,0.367 3.71,0.594 6.086999,0.594 2.385,0 4.543,-0.228 6.102,-0.597"
       fill="#4b92e2"
       id="path141" />
    <path
       d="m 100.06112,418.9416 c -2.338999,0 -4.540999,-0.216 -6.200999,-0.607 l 0.096,-0.409 h -0.482 v -4.084 h 1 c 0.193,0.212 2.12,0.806 5.593999,0.806 3.474,0 5.4,-0.594 5.616,-0.897 l 0.978,0.092 v 4.084 h -0.479 l 0.096,0.405 c -1.666,0.393 -3.874,0.61 -6.218,0.61 z m -5.586999,-1.495 c 1.538,0.32 3.502,0.495 5.586999,0.495 2.09,0 4.059,-0.176 5.601,-0.498 v -2.54 c -1.638,0.696 -4.789,0.743 -5.594,0.743 -0.804999,0 -3.955999,-0.047 -5.593999,-0.743 z"
       fill="#020202"
       id="path143" />
    <path
       d="m 93.958121,417.8476 v -2.568 c -1.537,0.329 -2.487,0.782 -2.487,1.282 0,0.502 0.956,0.957 2.502,1.286"
       fill="#4b92e2"
       id="path145" />
    <path
       d="m 93.870121,418.3376 c -1.977,-0.421 -2.897,-0.985 -2.897,-1.775 0,-0.787 0.916,-1.351 2.882,-1.771 l 0.604,-0.129 v 3.187 h -0.485 z m -0.412,-2.424 c -1.092,0.292 -1.447,0.58 -1.491,0.679 0.043,0.048 0.399,0.328 1.491,0.619 z"
       fill="#020202"
       id="path147" />
    <path
       d="m 106.16312,417.8446 v -2.564 c 1.546,0.329 2.501,0.782 2.501,1.282 0,0.5 -0.955,0.953 -2.501,1.282 z"
       fill="#4b92e2"
       id="path149" />
    <path
       d="m 105.66412,418.4616 v -3.8 l 0.604,0.129 c 1.976,0.421 2.896,0.984 2.896,1.771 0,0.789 -0.921,1.352 -2.897,1.771 z m 1,-2.549 v 1.3 c 1.103,-0.293 1.462,-0.582 1.506,-0.681 -0.045,-0.046 -0.405,-0.328 -1.506,-0.619 z"
       fill="#020202"
       id="path151" />
    <ellipse
       cx="100.06812"
       cy="413.79059"
       fill="#4b92e2"
       rx="6.0939999"
       ry="1.306"
       id="ellipse153" />
    <path
       d="m 100.06812,415.5976 c -1.101999,0 -6.593999,-0.087 -6.593999,-1.807 0,-1.719 5.492,-1.806 6.593999,-1.806 1.102,0 6.594,0.087 6.594,1.806 0,1.72 -5.493,1.807 -6.594,1.807 z m -5.511999,-1.807 c 0.483,0.317 2.36,0.807 5.511999,0.807 3.152,0 5.029,-0.489 5.512,-0.807 -0.483,-0.316 -2.361,-0.806 -5.512,-0.806 -3.150999,0 -5.027999,0.489 -5.511999,0.806 z"
       fill="#020202"
       id="path155" />
    <path
       d="m 106.16212,423.0496 v -4.085 c 0,0.721 -2.728,1.306 -6.094,1.306 -3.365999,0 -6.093999,-0.585 -6.093999,-1.306 v 4.085 -0.078 c 1.558,0.367 3.71,0.594 6.086999,0.594 2.385,0 4.543,-0.228 6.102,-0.597"
       fill="#4b92e2"
       id="path157" />
    <path
       d="m 100.06112,424.0656 c -2.338999,0 -4.540999,-0.216 -6.200999,-0.607 l 0.096,-0.408 h -0.482 v -4.085 h 1 c 0.193,0.212 2.12,0.806 5.593999,0.806 3.474,0 5.401,-0.594 5.617,-0.897 l 0.978,0.092 v 4.085 h -0.48 l 0.096,0.404 c -1.666,0.393 -3.874,0.61 -6.218,0.61 z m -5.586999,-1.495 c 1.538,0.32 3.502,0.495 5.586999,0.495 2.091,0 4.06,-0.176 5.602,-0.499 v -2.539 c -1.638,0.696 -4.79,0.743 -5.595,0.743 -0.804999,0 -3.955999,-0.047 -5.593999,-0.743 z"
       fill="#020202"
       id="path159" />
    <path
       d="m 93.958121,422.9726 v -2.568 c -1.537,0.329 -2.487,0.782 -2.487,1.282 0,0.502 0.956,0.957 2.502,1.286"
       fill="#4b92e2"
       id="path161" />
    <path
       d="m 93.870121,423.4616 c -1.977,-0.421 -2.897,-0.985 -2.897,-1.774 0,-0.789 0.916,-1.352 2.882,-1.771 l 0.604,-0.129 v 3.186 h -0.485 z m -0.412,-2.424 c -1.093,0.292 -1.448,0.58 -1.491,0.679 0.044,0.048 0.399,0.328 1.491,0.619 z"
       fill="#020202"
       id="path163" />
    <path
       d="m 106.16312,422.9686 v -2.564 c 1.546,0.329 2.501,0.782 2.501,1.282 0,0.5 -0.955,0.953 -2.501,1.282 z"
       fill="#4b92e2"
       id="path165" />
    <path
       d="m 105.66412,423.5856 v -3.798 l 0.604,0.128 c 1.977,0.42 2.897,0.982 2.897,1.771 0,0.789 -0.921,1.352 -2.897,1.771 z m 1,-2.549 v 1.3 c 1.103,-0.293 1.462,-0.582 1.506,-0.681 -0.045,-0.047 -0.405,-0.328 -1.506,-0.619 z"
       fill="#020202"
       id="path167" />
    <ellipse
       cx="100.06812"
       cy="418.91458"
       fill="#4b92e2"
       rx="6.0939999"
       ry="1.306"
       id="ellipse169" />
    <path
       d="m 100.06812,420.7216 c -1.101999,0 -6.593999,-0.087 -6.593999,-1.806 0,-1.72 5.492,-1.807 6.593999,-1.807 1.102,0 6.595,0.087 6.595,1.807 0,1.719 -5.494,1.806 -6.595,1.806 z m -5.511999,-1.806 c 0.483,0.316 2.361,0.806 5.511999,0.806 3.151,0 5.029,-0.489 5.513,-0.806 -0.483,-0.317 -2.361,-0.807 -5.513,-0.807 -3.151999,0 -5.027999,0.49 -5.511999,0.807 z"
       fill="#020202"
       id="path171" />
    <path
       d="m 27.636121,400.0996 h 5.02 v 15.706 h -5.02 z"
       fill="#b2aaab"
       id="path173" />
    <path
       d="m 27.136121,399.7516 h 1 v 16.054 h -1 z"
       id="path175" />
    <path
       d="m 32.156121,399.7516 h 1 v 16.054 h -1 z"
       id="path177" />
    <path
       d="m 128.17812,413.4276 v -4.085 c 0,0.721 -2.728,1.306 -6.094,1.306 -3.366,0 -6.094,-0.585 -6.094,-1.306 v 4.085 -0.078 c 1.558,0.367 3.71,0.594 6.087,0.594 2.385,0 4.543,-0.228 6.102,-0.597"
       fill="#ffffff"
       id="path503" />
    <path
       d="m 122.07712,414.4436 c -2.339,0 -4.541,-0.216 -6.201,-0.607 l 0.096,-0.408 h -0.481 v -4.085 h 1 c 0.193,0.212 2.121,0.806 5.595,0.806 3.474,0 5.4,-0.594 5.616,-0.897 l 0.978,0.092 v 4.085 h -0.48 l 0.096,0.404 c -1.667,0.393 -3.875,0.61 -6.219,0.61 z m -5.587,-1.495 c 1.538,0.32 3.502,0.495 5.587,0.495 2.091,0 4.061,-0.176 5.602,-0.498 v -2.54 c -1.638,0.696 -4.789,0.743 -5.594,0.743 -0.805,0 -3.957,-0.047 -5.595,-0.743 z"
       fill="#020202"
       id="path505" />
    <path
       d="m 115.97412,413.3496 v -2.568 c -1.537,0.329 -2.487,0.782 -2.487,1.282 0,0.502 0.956,0.957 2.502,1.286"
       fill="#ffffff"
       id="path507" />
    <path
       d="m 115.88512,413.8396 c -1.977,-0.421 -2.897,-0.985 -2.897,-1.774 0,-0.788 0.916,-1.351 2.882,-1.772 l 0.604,-0.129 v 3.187 h -0.484 z m -0.411,-2.424 c -1.093,0.292 -1.448,0.58 -1.491,0.679 0.044,0.048 0.399,0.328 1.491,0.619 z"
       fill="#020202"
       id="path509" />
    <path
       d="m 128.17912,413.3466 v -2.564 c 1.546,0.329 2.501,0.782 2.501,1.282 0,0.5 -0.955,0.953 -2.501,1.282 z"
       fill="#ffffff"
       id="path511" />
    <path
       d="m 127.67912,413.9636 v -3.799 l 0.604,0.128 c 1.976,0.421 2.896,0.983 2.896,1.771 0,0.789 -0.921,1.352 -2.897,1.771 z m 1,-2.549 v 1.3 c 1.103,-0.293 1.462,-0.582 1.506,-0.681 -0.044,-0.047 -0.404,-0.328 -1.506,-0.619 z"
       fill="#020202"
       id="path513" />
    <ellipse
       cx="122.08411"
       cy="409.2926"
       fill="#ffffff"
       rx="6.0939999"
       ry="1.306"
       id="ellipse515" />
    <path
       d="m 122.08412,411.0986 c -1.102,0 -6.595,-0.087 -6.595,-1.807 0,-1.719 5.493,-1.806 6.595,-1.806 1.102,0 6.594,0.087 6.594,1.806 0,1.721 -5.492,1.807 -6.594,1.807 z m -5.512,-1.806 c 0.483,0.317 2.361,0.807 5.513,0.807 3.152,0 5.028,-0.489 5.512,-0.807 -0.483,-0.316 -2.361,-0.806 -5.512,-0.806 -3.151,0 -5.03,0.489 -5.513,0.806 z"
       fill="#020202"
       id="path517" />
    <path
       d="m 153.23512,413.4916 v -4.085 c 0,0.721 -2.728,1.306 -6.094,1.306 -3.366,0 -6.094,-0.585 -6.094,-1.306 v 4.085 -0.078 c 1.558,0.367 3.71,0.594 6.087,0.594 2.385,0 4.543,-0.228 6.102,-0.597"
       fill="#ffffff"
       id="path519" />
    <path
       d="m 147.13312,414.5086 c -2.333,0 -4.535,-0.216 -6.2,-0.607 l 0.096,-0.409 h -0.481 v -4.085 h 1 c 0.193,0.212 2.12,0.807 5.594,0.807 3.474,0 5.4,-0.595 5.616,-0.897 l 0.978,0.091 v 4.085 h -0.48 l 0.096,0.405 c -1.666,0.393 -3.874,0.61 -6.219,0.61 z m -5.586,-1.495 c 1.541,0.32 3.505,0.495 5.586,0.495 2.091,0 4.061,-0.176 5.602,-0.498 v -2.54 c -1.638,0.696 -4.789,0.743 -5.594,0.743 -0.805,0 -3.956,-0.047 -5.594,-0.743 z"
       fill="#020202"
       id="path521" />
    <path
       d="m 141.03112,413.4146 v -2.568 c -1.537,0.329 -2.487,0.782 -2.487,1.282 0,0.502 0.956,0.957 2.502,1.286"
       fill="#ffffff"
       id="path523" />
    <path
       d="m 140.94312,413.9036 c -1.95,-0.415 -2.898,-0.996 -2.898,-1.775 0,-0.787 0.916,-1.35 2.883,-1.771 l 0.604,-0.129 v 3.187 h -0.484 z m -0.411,-2.424 c -1.093,0.292 -1.448,0.58 -1.492,0.679 0.044,0.048 0.4,0.328 1.492,0.619 z"
       fill="#020202"
       id="path525" />
    <path
       d="m 153.23612,413.4106 v -2.564 c 1.546,0.329 2.501,0.782 2.501,1.282 0,0.5 -0.955,0.953 -2.501,1.282 z"
       fill="#ffffff"
       id="path527" />
    <path
       d="m 152.73612,414.0276 v -3.799 l 0.604,0.128 c 1.977,0.421 2.897,0.984 2.897,1.771 0,0.789 -0.921,1.352 -2.898,1.771 z m 1,-2.549 v 1.3 c 1.103,-0.293 1.463,-0.582 1.507,-0.682 -0.044,-0.044 -0.405,-0.327 -1.507,-0.618 z"
       fill="#020202"
       id="path529" />
    <ellipse
       cx="147.14111"
       cy="409.3566"
       fill="#ffffff"
       rx="6.0939999"
       ry="1.306"
       id="ellipse531" />
    <path
       d="m 147.14112,411.1626 c -1.102,0 -6.594,-0.087 -6.594,-1.806 0,-1.719 5.492,-1.806 6.594,-1.806 1.102,0 6.594,0.087 6.594,1.806 0,1.719 -5.492,1.806 -6.594,1.806 z m -5.512,-1.806 c 0.483,0.317 2.361,0.806 5.512,0.806 3.151,0 5.028,-0.488 5.512,-0.806 -0.483,-0.317 -2.361,-0.806 -5.512,-0.806 -3.151,0 -5.028,0.489 -5.512,0.806 z"
       fill="#020202"
       id="path533" />
    <ellipse
       cx="30.148113"
       cy="390.84961"
       fill="#1a1818"
       rx="9.2670002"
       ry="9.25"
       id="ellipse775" />
    <path
       d="m 30.149121,400.5996 c -5.386,0 -9.768,-4.374 -9.768,-9.75 0,-5.376 4.382,-9.75 9.768,-9.75 5.386,0 9.767,4.374 9.767,9.75 0,5.376 -4.381,9.75 -9.767,9.75 z m 0,-18.5 c -4.834,0 -8.768,3.925 -8.768,8.75 0,4.825 3.934,8.75 8.768,8.75 4.834,0 8.767,-3.925 8.767,-8.75 0,-4.825 -3.933,-8.75 -8.767,-8.75 z"
       id="path777" />
    <path
       d="m 220.22712,417.7176 v -4.085 c 0,0.721 -2.728,1.306 -6.094,1.306 -3.366,0 -6.094,-0.585 -6.094,-1.306 v 4.085 -0.078 c 1.558,0.367 3.71,0.594 6.087,0.594 2.385,0 4.543,-0.228 6.102,-0.597"
       fill="#ffffff"
       id="path807" />
    <path
       d="m 214.12512,418.7336 c -2.334,0 -4.536,-0.216 -6.201,-0.607 l 0.096,-0.409 h -0.481 v -4.085 h 1 c 0.193,0.212 2.12,0.807 5.595,0.807 3.474,0 5.4,-0.595 5.616,-0.897 l 0.978,0.091 v 4.085 h -0.48 l 0.096,0.405 c -1.666,0.393 -3.874,0.61 -6.219,0.61 z m -5.586,-1.495 c 1.541,0.32 3.506,0.495 5.587,0.495 2.091,0 4.061,-0.176 5.602,-0.498 v -2.54 c -1.638,0.696 -4.789,0.743 -5.594,0.743 -0.805,0 -3.957,-0.047 -5.595,-0.743 z"
       fill="#020202"
       id="path809" />
    <path
       d="m 208.02312,417.6396 v -2.568 c -1.537,0.329 -2.487,0.782 -2.487,1.282 0,0.502 0.956,0.957 2.502,1.286"
       fill="#ffffff"
       id="path811" />
    <path
       d="m 207.93412,418.1296 c -1.949,-0.415 -2.897,-0.996 -2.897,-1.775 0,-0.787 0.916,-1.35 2.882,-1.771 l 0.604,-0.129 v 3.187 h -0.484 z m -0.411,-2.424 c -1.092,0.292 -1.447,0.58 -1.491,0.679 0.044,0.048 0.399,0.328 1.491,0.619 z"
       fill="#020202"
       id="path813" />
    <path
       d="m 220.22812,417.6366 v -2.564 c 1.546,0.329 2.501,0.782 2.501,1.282 0,0.5 -0.956,0.953 -2.501,1.282 z"
       fill="#ffffff"
       id="path815" />
    <path
       d="m 219.72812,418.2536 v -3.799 l 0.604,0.128 c 1.976,0.421 2.896,0.983 2.896,1.771 0,0.778 -0.947,1.357 -2.897,1.771 z m 1,-2.549 v 1.3 c 1.102,-0.293 1.462,-0.582 1.506,-0.682 -0.044,-0.046 -0.404,-0.327 -1.506,-0.618 z"
       fill="#020202"
       id="path817" />
    <ellipse
       cx="214.13312"
       cy="413.58258"
       fill="#ffffff"
       rx="6.0939999"
       ry="1.306"
       id="ellipse819" />
    <path
       d="m 214.13312,415.3886 c -1.102,0 -6.595,-0.087 -6.595,-1.806 0,-1.719 5.493,-1.806 6.595,-1.806 1.102,0 6.594,0.087 6.594,1.806 0,1.719 -5.492,1.806 -6.594,1.806 z m -5.512,-1.806 c 0.483,0.317 2.361,0.806 5.513,0.806 3.15,0 5.028,-0.488 5.512,-0.806 -0.483,-0.317 -2.361,-0.806 -5.512,-0.806 -3.151,0 -5.03,0.489 -5.513,0.806 z"
       fill="#020202"
       id="path821" />
    <path
       d="m 220.22712,422.8416 v -4.085 c 0,0.721 -2.728,1.306 -6.094,1.306 -3.366,0 -6.094,-0.585 -6.094,-1.306 v 4.085 -0.078 c 1.558,0.367 3.71,0.594 6.087,0.594 2.385,0 4.543,-0.228 6.102,-0.597"
       fill="#ffffff"
       id="path823" />
    <path
       d="m 214.12512,423.8576 c -2.339,0 -4.541,-0.216 -6.201,-0.607 l 0.096,-0.409 h -0.481 v -4.084 h 1 c 0.193,0.212 2.121,0.806 5.595,0.806 3.474,0 5.4,-0.594 5.616,-0.897 l 0.978,0.092 v 4.084 h -0.48 l 0.096,0.405 c -1.666,0.393 -3.874,0.61 -6.219,0.61 z m -5.586,-1.495 c 1.538,0.32 3.502,0.495 5.587,0.495 2.091,0 4.061,-0.176 5.602,-0.498 v -2.54 c -1.638,0.696 -4.789,0.743 -5.594,0.743 -0.805,0 -3.957,-0.047 -5.595,-0.743 z"
       fill="#020202"
       id="path825" />
    <path
       d="m 208.02312,422.7636 v -2.568 c -1.537,0.329 -2.487,0.782 -2.487,1.282 0,0.502 0.956,0.957 2.502,1.286"
       fill="#ffffff"
       id="path827" />
    <path
       d="m 207.93412,423.2536 c -1.977,-0.421 -2.897,-0.985 -2.897,-1.775 0,-0.787 0.916,-1.35 2.882,-1.771 l 0.604,-0.129 v 3.187 h -0.484 z m -0.411,-2.424 c -1.092,0.292 -1.447,0.58 -1.491,0.679 0.043,0.048 0.399,0.328 1.491,0.619 z"
       fill="#020202"
       id="path829" />
    <path
       d="m 220.22812,422.7606 v -2.564 c 1.546,0.329 2.501,0.782 2.501,1.282 0,0.5 -0.955,0.953 -2.501,1.282 z"
       fill="#ffffff"
       id="path831" />
    <path
       d="m 219.72812,423.3776 v -3.799 l 0.604,0.128 c 1.976,0.421 2.896,0.983 2.896,1.771 0,0.789 -0.921,1.352 -2.897,1.771 z m 1,-2.549 v 1.3 c 1.103,-0.293 1.462,-0.582 1.506,-0.681 -0.044,-0.047 -0.404,-0.328 -1.506,-0.619 z"
       fill="#020202"
       id="path833" />
    <ellipse
       cx="214.13312"
       cy="418.7066"
       fill="#ffffff"
       rx="6.0939999"
       ry="1.306"
       id="ellipse835" />
    <path
       d="m 214.13312,420.5136 c -1.102,0 -6.595,-0.087 -6.595,-1.807 0,-1.719 5.493,-1.806 6.595,-1.806 1.102,0 6.594,0.087 6.594,1.806 0,1.72 -5.492,1.807 -6.594,1.807 z m -5.512,-1.807 c 0.483,0.317 2.361,0.807 5.513,0.807 3.152,0 5.028,-0.489 5.512,-0.807 -0.483,-0.316 -2.361,-0.806 -5.512,-0.806 -3.151,0 -5.03,0.49 -5.513,0.806 z"
       fill="#020202"
       id="path837" />
    <path
       d="m 243.65912,417.7176 v -4.085 c 0,0.721 -2.728,1.306 -6.094,1.306 -3.366,0 -6.094,-0.585 -6.094,-1.306 v 4.085 -0.078 c 1.558,0.367 3.71,0.594 6.087,0.594 2.385,0 4.543,-0.228 6.102,-0.597"
       fill="#4b92e2"
       id="path839" />
    <path
       d="m 237.55812,418.7336 c -2.334,0 -4.536,-0.216 -6.201,-0.607 l 0.096,-0.409 h -0.481 v -4.085 h 1 c 0.193,0.212 2.12,0.807 5.594,0.807 3.475,0 5.401,-0.595 5.617,-0.897 l 0.978,0.091 v 4.085 h -0.48 l 0.096,0.405 c -1.666,0.393 -3.874,0.61 -6.219,0.61 z m -5.587,-1.495 c 1.541,0.32 3.506,0.495 5.587,0.495 2.091,0 4.061,-0.176 5.602,-0.498 v -2.54 c -1.638,0.696 -4.79,0.743 -5.595,0.743 -0.805,0 -3.956,-0.047 -5.594,-0.743 z"
       fill="#020202"
       id="path841" />
    <path
       d="m 231.45612,417.6396 v -2.568 c -1.537,0.329 -2.487,0.782 -2.487,1.282 0,0.502 0.956,0.957 2.502,1.286"
       fill="#4b92e2"
       id="path843" />
    <path
       d="m 231.36712,418.1296 c -1.949,-0.415 -2.897,-0.996 -2.897,-1.775 0,-0.787 0.916,-1.35 2.882,-1.771 l 0.604,-0.129 v 3.187 h -0.484 z m -0.411,-2.424 c -1.092,0.292 -1.447,0.58 -1.491,0.679 0.044,0.048 0.399,0.328 1.491,0.619 z"
       fill="#020202"
       id="path845" />
    <path
       d="m 243.66012,417.6366 v -2.564 c 1.546,0.329 2.501,0.782 2.501,1.282 10e-4,0.5 -0.955,0.953 -2.501,1.282 z"
       fill="#4b92e2"
       id="path847" />
    <path
       d="m 243.16112,418.2536 v -3.799 l 0.604,0.128 c 1.976,0.421 2.896,0.983 2.896,1.771 0,0.778 -0.947,1.357 -2.897,1.771 z m 1,-2.549 v 1.3 c 1.102,-0.293 1.462,-0.582 1.506,-0.682 -0.044,-0.046 -0.405,-0.327 -1.506,-0.618 z"
       fill="#020202"
       id="path849" />
    <ellipse
       cx="237.56512"
       cy="413.58258"
       fill="#4b92e2"
       rx="6.0939999"
       ry="1.306"
       id="ellipse851" />
    <path
       d="m 237.56512,415.3886 c -1.102,0 -6.594,-0.087 -6.594,-1.806 0,-1.719 5.492,-1.806 6.594,-1.806 1.102,0 6.595,0.087 6.595,1.806 0,1.719 -5.494,1.806 -6.595,1.806 z m -5.512,-1.806 c 0.483,0.317 2.361,0.806 5.512,0.806 3.151,0 5.029,-0.488 5.513,-0.806 -0.483,-0.317 -2.362,-0.806 -5.513,-0.806 -3.151,0 -5.028,0.489 -5.512,0.806 z"
       fill="#020202"
       id="path853" />
    <path
       d="m 243.66012,422.8416 v -4.085 c 0,0.721 -2.728,1.306 -6.094,1.306 -3.366,0 -6.094,-0.585 -6.094,-1.306 v 4.085 -0.078 c 1.558,0.367 3.71,0.594 6.087,0.594 2.385,0 4.543,-0.228 6.102,-0.597"
       fill="#4b92e2"
       id="path855" />
    <path
       d="m 237.55812,423.8576 c -2.339,0 -4.541,-0.216 -6.201,-0.607 l 0.096,-0.409 h -0.481 v -4.084 h 1 c 0.193,0.212 2.121,0.806 5.595,0.806 3.474,0 5.4,-0.594 5.616,-0.897 l 0.978,0.092 v 4.084 h -0.48 l 0.096,0.405 c -1.666,0.393 -3.874,0.61 -6.219,0.61 z m -5.587,-1.495 c 1.538,0.32 3.502,0.495 5.587,0.495 2.091,0 4.061,-0.176 5.602,-0.498 v -2.54 c -1.638,0.696 -4.789,0.743 -5.594,0.743 -0.805,0 -3.957,-0.047 -5.595,-0.743 z"
       fill="#020202"
       id="path857" />
    <path
       d="m 231.45612,422.7636 v -2.568 c -1.537,0.329 -2.487,0.782 -2.487,1.282 0,0.502 0.956,0.957 2.502,1.286"
       fill="#4b92e2"
       id="path859" />
    <path
       d="m 231.36712,423.2536 c -1.977,-0.421 -2.897,-0.985 -2.897,-1.775 0,-0.787 0.916,-1.35 2.882,-1.771 l 0.604,-0.129 v 3.187 h -0.484 z m -0.411,-2.424 c -1.092,0.292 -1.447,0.58 -1.491,0.679 0.043,0.048 0.399,0.328 1.491,0.619 z"
       fill="#020202"
       id="path861" />
    <path
       d="m 243.66012,422.7606 v -2.564 c 1.546,0.329 2.501,0.782 2.501,1.282 10e-4,0.5 -0.955,0.953 -2.501,1.282 z"
       fill="#4b92e2"
       id="path863" />
    <path
       d="m 243.16112,423.3776 v -3.799 l 0.604,0.128 c 1.976,0.421 2.896,0.983 2.896,1.771 0,0.789 -0.921,1.352 -2.897,1.771 z m 1,-2.549 v 1.3 c 1.103,-0.293 1.462,-0.582 1.506,-0.681 -0.044,-0.047 -0.405,-0.328 -1.506,-0.619 z"
       fill="#020202"
       id="path865" />
    <ellipse
       cx="237.56512"
       cy="418.7066"
       fill="#4b92e2"
       rx="6.0939999"
       ry="1.306"
       id="ellipse867" />
    <path
       d="m 237.56612,420.5136 c -1.102,0 -6.595,-0.087 -6.595,-1.807 0,-1.719 5.493,-1.806 6.595,-1.806 1.102,0 6.594,0.087 6.594,1.806 0,1.72 -5.493,1.807 -6.594,1.807 z m -5.513,-1.807 c 0.483,0.317 2.361,0.807 5.513,0.807 3.152,0 5.028,-0.489 5.512,-0.807 -0.483,-0.316 -2.361,-0.806 -5.512,-0.806 -3.151,0 -5.029,0.49 -5.513,0.806 z"
       fill="#020202"
       id="path869" />
    <path
       d="m 178.01412,417.6366 c 0,2.679 -4.776,4.85 -10.667,4.85 -5.891,0 -10.667,-2.172 -10.667,-4.85"
       fill="#848383"
       id="path871" />
    <path
       d="m 167.34712,422.9876 c -6.262,0 -11.167,-2.351 -11.167,-5.351 h 1 c 0,2.358 4.656,4.351 10.167,4.351 5.511,0 10.167,-1.992 10.167,-4.351 h 1 c 0,3.001 -4.905,5.351 -11.167,5.351 z"
       id="path873" />
    <ellipse
       cx="167.34712"
       cy="417.6366"
       fill="#666565"
       rx="10.667"
       ry="3.017"
       id="ellipse875" />
    <path
       d="m 167.34712,421.1536 c -5.549,0 -11.167,-1.208 -11.167,-3.517 0,-2.31 5.618,-3.518 11.167,-3.518 5.549,0 11.167,1.208 11.167,3.518 0,2.309 -5.618,3.517 -11.167,3.517 z m 0,-6.034 c -6.206,0 -10.167,1.491 -10.167,2.518 0,1.027 3.961,2.517 10.167,2.517 6.206,0 10.167,-1.49 10.167,-2.517 0,-1.027 -3.961,-2.518 -10.167,-2.518 z"
       id="path877" />
    <path
       d="m 164.83512,400.0996 h 5.02 v 15.706 h -5.02 z"
       fill="#b2aaab"
       id="path879" />
    <path
       d="m 164.33412,399.7516 h 1 v 16.054 h -1 z"
       id="path881" />
    <path
       d="m 169.35512,399.7516 h 1 v 16.054 h -1 z"
       id="path883" />
    <ellipse
       cx="167.34712"
       cy="390.84961"
       fill="#1a1818"
       rx="9.2670002"
       ry="9.25"
       id="ellipse885" />
    <path
       d="m 167.34712,400.5996 c -5.386,0 -9.768,-4.374 -9.768,-9.75 0,-5.376 4.382,-9.75 9.768,-9.75 5.386,0 9.767,4.374 9.767,9.75 0,5.376 -4.381,9.75 -9.767,9.75 z m 0,-18.5 c -4.834,0 -8.768,3.925 -8.768,8.75 0,4.825 3.934,8.75 8.768,8.75 4.834,0 8.767,-3.925 8.767,-8.75 0,-4.825 -3.933,-8.75 -8.767,-8.75 z"
       id="path887" />
  </g>
  <path
     d="M 29.358,109.456 H 188.975 V 212.831 H 29.358 Z"
     stroke="#000000"
     stroke-miterlimit="10"
     id="path14" />
  <g
     id="g1162"
     transform="matrix(0.10896546,0,0,0.10896546,54.57151,26.77795)">
    <path
       style="fill:#ffffff;stroke:#ffffff;stroke-width:35;stroke-linecap:round;stroke-linejoin:round;stroke-miterlimit:4;stroke-dasharray:none"
       d="m 177.35918,644.34793 c -2.75,-0.4516 -9.275,-2.0009 -14.5,-3.443 -5.225,-1.4421 -10.77931,-2.6223 -12.34292,-2.6227 -1.5636,-4e-4 -7.21769,-0.8922 -12.56465,-1.9818 -37.18569,-7.578 -64.272182,-26.212 -76.069192,-52.3314 -6.30976,-13.9703 -6.52429,-16.5293 -6.51293,-77.68749 l 0.0103,-55.5 2.79074,-9 c 3.31912,-10.704 9.2263,-21.46006 15.89481,-28.94196 5.21099,-5.84659 17.43996,-15.53267 19.63037,-15.54843 0.7351,-0.005 7.640952,3.62204 15.346342,8.06071 7.70539,4.43868 14.24704,7.83309 14.537,7.54313 1.50686,-1.50686 -2.6066,-4.32225 -25.734382,-17.61345 -28.29525,-16.26088 -32.22052,-19.55884 -38.43825,-32.29533 -7.11602,-14.57659 -6.92746,-12.50827 -7.31201,-80.20467 -0.23018,-40.52295 0.0217,-63.77977 0.75047,-69.28079 4.17756,-31.53546 21.9391,-60.38446 47.735462,-77.53385 13.81391,-9.18347 16.33333,-10.04328 76.77883,-26.2027 65.24116,-17.441479 116.26573,-31.123099 179.25,-48.063689 11.4125,-3.06957 28.15305,-7.55079 37.20123,-9.95826 l 16.45123,-4.37722 5.54877,3.13395 c 3.05182,1.72368 13.95791,8.0049 24.23576,13.95826 10.27784,5.95337 19.16534,10.8243 19.75,10.8243 0.73845,0 1.06301,17.68806 1.06301,57.932609 0,54.31173 -0.10938,57.96469 -1.75,58.44587 -2.33515,0.68487 -35.02225,9.47088 -76.75,20.62973 -146.57659,39.19758 -148.35938,39.69775 -153.69722,43.12054 -10.04138,6.43885 -18.20347,19.56094 -18.26925,29.37125 l -0.0335,5 4.73171,0.30404 c 4.96548,0.31907 7.91947,-0.41518 85.76829,-21.31865 21.725,-5.83347 47.15,-12.63146 56.5,-15.10666 9.35,-2.4752 20.825,-5.56827 25.5,-6.87348 4.675,-1.30521 17.275,-4.68838 28,-7.51814 10.725,-2.82976 27.825,-7.38926 38,-10.13222 10.175,-2.74296 24.35,-6.55946 31.5,-8.48112 7.15,-1.92165 13.83674,-3.73783 14.85942,-4.03596 1.4772,-0.43062 0.86053,-1.11939 -3,-3.35071 -9.74657,-5.63337 -17.8372,-16.41489 -20.28326,-27.02937 -1.47286,-6.39135 -1.28809,-18.5723 0.3766,-24.82677 4.54996,-17.09488 18.44162,-31.81414 34.47874,-36.53282 6.80024,-2.00087 19.15724,-2.06083 25.637,-0.12439 2.71232,0.81055 14.3815,6.93072 25.9315,13.60036 11.55,6.66963 24.12084,13.70407 27.93519,15.63208 8.96094,4.52941 17.70408,12.88371 21.56102,20.60214 1.65208,3.30611 3.00379,6.81268 3.00379,7.79238 0,0.97969 0.42882,2.04628 0.95293,2.3702 0.5241,0.32391 5.88168,-0.7316 11.90571,-2.34559 l 10.95279,-2.93453 24.03454,13.9046 c 13.21897,7.64754 24.73639,13.90461 25.59425,13.90461 4.73848,0 -0.87265,-4.15173 -22.44025,-16.60377 l -24,-13.85639 v -41.76992 c 0,-22.97346 0.16334,-41.769919 0.36297,-41.769919 0.19963,0 10.81761,6.06416 23.59551,13.475919 20.01331,11.60861 23.4283,13.28016 24.64527,12.06318 1.5281,-1.52809 2.39633,-0.96063 -31.39461,-20.519069 -7.85997,-4.54941 -14.09793,-8.46457 -13.86214,-8.70036 0.23579,-0.23579 10.26667,-3.06007 22.29085,-6.27617 12.02418,-3.2161 32.23113,-8.62496 44.90433,-12.01969 l 23.04218,-6.17223 24.35813,14.07421 c 13.39697,7.74082 24.73235,14.07421 25.18972,14.07421 0.45738,0 0.95224,10.483439 1.09969,23.296529 l 0.2681,23.29654 21.5,-5.75997 c 11.825,-3.16798 38.6,-10.32003 59.5,-15.89343 l 38,-10.13345 25.20286,14.34689 25.20286,14.34689 -0.20286,95.5 -0.20286,95.5 -8,2.12166 c -4.4,1.16692 -22.625,6.07205 -40.5,10.90029 -17.875,4.82824 -34.30203,9.21152 -36.5045,9.74063 -3.95478,0.95007 -4.31488,0.78251 -29,-13.49426 l -24.9955,-14.45627 -0.27382,-16.57752 -0.27383,-16.57752 -8.72617,2.34137 c -4.7994,1.28775 -18.06435,4.84991 -29.47768,7.91591 -11.41332,3.066 -29.97582,8.05206 -41.25,11.08013 -11.27417,3.02807 -29.72283,7.98309 -40.997,11.01116 -11.27418,3.02807 -29.61168,7.94623 -40.75,10.92924 -47.87782,12.82239 -93.67074,25.09246 -112.5,30.14402 -11.13668,2.98778 -29.36168,7.87297 -40.5,10.85598 -83.43663,22.34557 -151.81734,40.68277 -177.2515,47.53233 -10.45,2.81425 -33.4,8.94937 -51,13.63361 -17.6,4.68424 -33.92878,9.43837 -36.28618,10.56474 -6.85636,3.27597 -14.79249,11.21886 -18.14737,18.1628 -7.67292,15.88142 -5.53135,32.25943 5.6848,43.47558 5.69394,5.69394 12.01082,8.41605 20.74875,8.9412 7.4737,0.44916 3.16643,1.46121 68.5,-16.09489 11.275,-3.02977 36.7,-9.84847 56.5,-15.15269 65.75428,-17.61489 76.944,-20.62184 83.9799,-22.56741 3.83895,-1.06155 7.77645,-1.93009 8.75,-1.93009 1.67307,0 1.7701,3.17177 1.7701,57.86339 v 57.8634 l -15.75,4.1514 c -8.6625,2.2833 -22.275,5.9091 -30.25,8.0574 -7.975,2.1483 -30.7,8.2478 -50.5,13.5545 -75.64302,20.2732 -91.56947,24.5472 -110,29.5194 -45.08354,12.1626 -49.4228,13.1237 -61,13.5104 -6.05,0.2021 -13.25,0 -16,-0.4535 z"
       id="path975" />
    <path
       style="fill:#000000"
       d="m 175.35923,643.81904 c -3.85,-0.70509 -10.0849,-2.23948 -13.85534,-3.40975 -3.77043,-1.17026 -8.33322,-2.12775 -10.13953,-2.12775 -5.28299,0 -19.25064,-2.93011 -29.50513,-6.18954 -31.614423,-10.04876 -54.704253,-30.46514 -62.610093,-55.36079 -3.98487,-12.54844 -4.57234,-23.31059 -4.15132,-76.0502 0.37203,-46.60247 0.49341,-49.27254 2.58408,-56.84145 2.93907,-10.64042 8.16663,-20.94356 14.55719,-28.69113 5.20837,-6.31435 19.1061,-17.86689 21.49391,-17.86689 0.67965,0 7.538963,3.66213 15.242923,8.13806 9.47708,5.50611 14.33549,7.80976 15.02229,7.12296 1.36566,-1.36566 -0.37726,-2.511 -27.638983,-18.16284 -26.16029,-15.01948 -31.08787,-19.20787 -36.89584,-31.36112 -7.32522,-15.32811 -7.10649,-12.66535 -7.08383,-86.23706 l 0.0203,-66 2.62737,-9.57377 c 8.26581,-30.11954 24.76815,-52.50983 49.955193,-67.77895 10.39562,-6.30213 17.20545,-8.75039 45.21031,-16.25391 14.39156,-3.85602 38.54147,-10.33355 53.66647,-14.39451 15.125,-4.060959 42.575,-11.426049 61,-16.366859 18.425,-4.94081 43.85,-11.7661 56.5,-15.16731 12.65,-3.4012 37.85,-10.15614 56,-15.01096 l 33,-8.82696 24.08823,13.93661 c 13.24853,7.66514 24.61103,13.93662 25.25,13.93662 0.869,0 1.16177,14.60674 1.16177,57.961459 v 57.96145 l -3.75,0.99873 c -119.12728,31.72684 -221.80459,59.67998 -225.25,61.32265 -10.99691,5.24299 -21.20016,19.90754 -21.39913,30.75571 l -0.10087,5.5 4.7571,0.30508 c 5.08848,0.32633 12.1801,-1.36429 60.2429,-14.36177 26.79783,-7.24686 42.79104,-11.5393 78,-20.93452 8.8,-2.34821 24.775,-6.63045 35.5,-9.51609 10.725,-2.88563 26.7,-7.16684 35.5,-9.51378 31.58787,-8.42444 62.09706,-16.64566 67.35867,-18.15096 l 5.35866,-1.53306 -4.85866,-2.7755 c -26.25275,-14.99682 -28.7648,-54.32154 -4.91115,-76.88132 3.25901,-3.08224 8.61509,-6.69109 13.07168,-8.80751 6.36971,-3.02496 8.93165,-3.66439 16.38432,-4.08932 5.36008,-0.30562 10.8577,-0.0182 13.98012,0.73084 3.15699,0.75735 13.54732,6.07719 26.88123,13.76317 11.95432,6.89076 24.85538,14.09133 28.66901,16.00127 9.20816,4.61164 17.82588,12.92651 21.60571,20.84642 1.62822,3.41164 2.96041,6.94027 2.96041,7.8414 0,2.7294 2.04061,2.69067 13.23218,-0.25119 l 10.73217,-2.82109 6.76783,3.93764 c 28.60979,16.6457 41.32836,23.71029 42.68623,23.71029 5.7597,0 -3.04177,-5.81898 -43.66841,-28.87084 l -2.75,-1.56038 V 134.97047 93.090621 l 5.25,2.98271 c 2.8875,1.64049 13.50529,7.747799 23.59509,13.571799 15.57865,8.99225 18.55275,10.38143 19.72212,9.21206 1.77216,-1.77216 3.23081,-0.76883 -23.33882,-16.05356 -12.24938,-7.046719 -22.11812,-12.965689 -21.93054,-13.153279 0.18759,-0.18759 18.08482,-5.08663 39.77161,-10.88676 21.6868,-5.80013 41.96576,-11.25101 45.06436,-12.11305 5.05917,-1.40748 5.87517,-1.41158 8,-0.0401 5.84448,3.77221 46.17442,26.67115 46.97361,26.67115 0.49822,0 0.89257,10.429799 0.89257,23.606989 0,21.46179 0.14892,23.54984 1.6388,22.97812 1.44313,-0.55378 60.62272,-16.50938 102.91438,-27.74708 l 15.05319,-3.99991 21.84265,12.66666 c 12.01345,6.96666 23.35427,13.3875 25.2018,14.26853 l 3.35917,1.60188 -0.255,95.54835 -0.25499,95.54835 -13.5,3.58259 c -7.425,1.97043 -27.45,7.31121 -44.5,11.8684 l -31,8.2858 -25,-14.50103 -25,-14.50104 -0.5,-16.47218 -0.5,-16.47218 -36.5,9.78599 c -20.075,5.38229 -96.35,25.83296 -169.5,45.44593 -188.67579,50.58772 -231.65509,62.10562 -304,81.46812 -35.2,9.42098 -66.29927,18.23566 -69.10948,19.58818 -6.44802,3.10335 -14.75418,11.8179 -17.98001,18.86403 -11.39111,24.88146 3.48762,51.5855 28.74196,51.5855 3.3426,0 10.18822,-1.1084 15.21249,-2.46311 85.26247,-22.98961 200.04796,-53.53689 201.17204,-53.53689 1.26704,0 1.463,7.70448 1.463,57.52144 v 57.52144 l -2.25,0.929 c -5.30456,2.19021 -249.9053,67.09372 -256.25,67.99459 -9.16473,1.30128 -18.34923,1.15536 -27,-0.42897 z m 30.33562,-1.62884 c 3.48459,-0.54836 26.20959,-6.34124 50.5,-12.87307 40.82834,-10.97897 73.916,-19.85087 166.36718,-44.60856 19.36154,-5.18487 35.44904,-9.42703 35.75,-9.42703 0.30096,0 0.5472,-25.68032 0.5472,-57.06739 0,-55.70188 -0.0457,-57.05289 -1.90865,-56.4616 -3.10145,0.98436 -15.12708,4.28095 -36.51564,10.01003 -124.11814,33.24597 -130.241,34.89142 -151.57571,40.7342 -23.5982,6.46267 -30.48412,6.79018 -40.37618,1.92033 -22.31866,-10.98744 -26.28232,-41.61921 -7.92489,-61.24479 7.92268,-8.46998 10.37021,-9.49878 43.80107,-18.41139 11.55,-3.07921 33.6,-8.98305 49,-13.11964 15.4,-4.13659 40.375,-10.82348 55.5,-14.85975 15.125,-4.03627 40.1,-10.72403 55.5,-14.86169 15.4,-4.13766 43.075,-11.56553 61.5,-16.50637 18.425,-4.94084 48.575,-13.02793 67,-17.97131 18.425,-4.94337 52.85,-14.17362 76.5,-20.51166 42.59804,-11.41599 50.13849,-13.43629 120,-32.15147 19.8,-5.30421 45.225,-12.12177 56.5,-15.15013 11.275,-3.02836 27.025,-7.25816 35,-9.39955 7.975,-2.14139 15.9625,-4.32426 17.75,-4.85082 l 3.25,-0.95739 v 37.37118 c 0,20.55415 0.3375,37.55386 0.75,37.77714 0.4125,0.22328 12.9,-2.88225 27.75,-6.90119 14.85,-4.01894 34.3125,-9.23103 43.25,-11.58243 l 16.25,-4.27528 v -94.63466 -94.63466 l -12.25,3.24707 c -12.06075,3.19691 -60.60326,16.19264 -123.08869,32.95312 -17.51128,4.69706 -32.47378,8.5401 -33.25,8.5401 -1.19361,0 -1.41131,-6.75967 -1.41131,-43.82161 V 94.638321 l -15.75,4.20903 c -8.6625,2.314969 -27,7.215229 -40.75,10.889469 -13.75,3.67424 -27.3625,7.35683 -30.25,8.18353 l -5.25,1.50311 v 43.87002 c 0,24.12851 -0.35567,44.08984 -0.79037,44.3585 -0.67391,0.4165 -14.27349,4.11234 -81.49377,22.14688 l -8.78413,2.35669 2.8324,-3.687 c 4.2483,-5.53011 6.03607,-8.60607 8.21536,-14.13499 13.0242,-33.04265 -11.94423,-66.92367 -45.1258,-61.23366 -27.9333,4.79003 -47.38415,34.52856 -40.32078,61.64668 3.09376,11.87775 10.61695,21.50596 21.46709,27.47366 3.025,1.66379 5.13688,3.03322 4.69306,3.04318 -0.84789,0.019 -17.90556,4.53559 -58.69306,15.54082 -13.475,3.63581 -31.025,8.34796 -39,10.47145 -19.0713,5.07808 -50.43645,13.48364 -76.5,20.50128 -27.38941,7.37462 -82.95435,22.26032 -107,28.66501 -23.24952,6.19264 -29.33589,6.50874 -38.92476,2.02157 -8.00312,-3.74512 -13.03827,-8.82515 -16.94238,-17.09341 -2.72011,-5.76074 -3.11115,-7.65663 -3.11212,-15.0886 -0.002,-14.00981 5.83834,-25.76412 17.00316,-34.22171 6.3448,-4.80633 7.8043,-5.26923 63.9761,-20.29111 25.85,-6.913 56.9,-15.23013 69,-18.48252 12.1,-3.2524 37.3,-10.00222 56,-14.99962 18.7,-4.9974 36.3625,-9.75549 39.25,-10.57354 l 5.25,-1.48737 v -56.47206 c 0,-34.009979 -0.36866,-56.472069 -0.92685,-56.472069 -0.92734,0 -8.68202,2.03395 -47.07315,12.3467 -11.275,3.02872 -36.7,9.83601 -56.5,15.127309 -19.8,5.29129 -40.725,10.92203 -46.5,12.51275 -5.775,1.59072 -27.6,7.45424 -48.5,13.03004 -84.15494,22.45125 -85.69269,22.89534 -95.44419,27.56362 -28.90019,13.83522 -49.63204,39.46109 -58.18443,71.91958 l -2.37138,9 v 66.5 c 0,60.60695 0.15728,67.06961 1.77485,72.92776 2.87844,10.42453 7.6588,18.97444 14.85685,26.57224 l 6.6317,7 -5.79997,6.29768 c -6.41633,6.96693 -12.76322,18.80601 -15.65526,29.20232 -1.64619,5.91773 -1.80817,11.56128 -1.80817,63 0,51.66652 0.15994,57.18439 1.86955,64.5 4.84071,20.71385 16.32363,38.98233 31.9701,50.86206 20.08134,15.24695 42.43713,20.64745 68.49597,16.5466 z m -24.33562,-9.95489 c -35.22684,-5.44946 -61.44054,-30.38094 -70.15186,-66.72045 -1.32206,-5.51498 -1.69505,-14.93947 -2.06142,-52.08559 -0.30062,-30.48085 -0.0773,-48.13224 0.6809,-53.83012 2.11396,-15.88551 10.01811,-32.62322 20.88227,-44.22001 l 4.12428,-4.4024 -7.40079,-7.74631 c -8.03026,-8.40518 -13.09797,-17.42187 -16.28813,-28.98054 -1.62492,-5.88743 -1.78525,-12.03655 -1.78525,-68.46835 0,-54.37574 0.20626,-62.92229 1.67727,-69.5 6.63652,-29.67554 24.13444,-54.20875 49.45333,-69.33672 10.62164,-6.34641 12.60896,-6.97092 76.8694,-24.1559 11,-2.9417 29.33683,-7.86179 40.7485,-10.93354 11.41168,-3.07175 29.86168,-8.02565 41,-11.00866 23.58936,-6.31758 84.12143,-22.535349 110.62898,-29.639759 10.10761,-2.70898 18.77888,-4.92542 19.2695,-4.92542 0.50361,0 0.77467,9.46441 0.62252,21.735579 l -0.2695,21.73558 -6.5,1.7734 c -5.91964,1.61507 -31.76345,8.55395 -109,29.26574 -15.125,4.05592 -42.8,11.47918 -61.5,16.49613 -18.7,5.01695 -40.75,10.91181 -49,13.0997 -20.97755,5.56319 -27.09299,7.6232 -34.16269,11.50785 -13.6073,7.47689 -24.34863,19.04863 -31.45434,33.88602 -7.03837,14.69681 -7.21289,15.96234 -7.65376,55.5 -0.42303,37.93785 0.0977,44.86327 4.30958,57.31245 6.52094,19.27423 21.01181,33.29034 39.50655,38.21221 3.00006,0.79838 9.24216,1.45694 13.87133,1.46347 4.62916,0.007 8.18076,0.24778 7.89242,0.53611 -0.28833,0.28833 -3.77371,1.42472 -7.74529,2.5253 -29.43862,8.15785 -51.95033,33.81155 -56.99554,64.95046 -1.57722,9.73456 -1.30895,63.78884 0.3623,73 1.8743,10.33032 4.892,17.8196 10.6475,26.42478 8.1665,12.20993 19.31189,20.64726 33.34353,25.24185 6.87149,2.25004 9.79651,2.64096 19.57841,2.61657 11.07731,-0.0276 12.45565,-0.28769 37.5,-7.07587 24.99443,-6.77466 58.36235,-15.73743 151.01171,-40.56242 23.65643,-6.33864 43.80268,-11.82832 44.76943,-12.1993 1.64936,-0.63292 1.74112,0.69682 1.4883,21.56666 l -0.26944,22.24116 -29,7.7488 c -45.38465,12.12677 -104.36428,27.94199 -147.5,39.5517 -61.06085,16.43415 -64.6588,17.28256 -75.62535,17.83267 -5.43106,0.27244 -12.57465,0.0777 -15.87465,-0.43283 z m 30,-58.95529 c -25.30234,-3.80552 -44.19912,-20.86226 -50.528,-45.60796 -1.75531,-6.8632 -1.972,-11.13109 -1.972,-38.84038 0,-34.5715 0.35604,-37.3107 6.55888,-50.46139 8.10105,-17.1751 21.7005,-31.15831 38.56097,-39.6491 6.9005,-3.47504 13.19061,-5.26865 97.88015,-27.91023 15.675,-4.19068 29.2875,-7.8545 30.25,-8.14181 1.62951,-0.48642 1.75,0.99427 1.75,21.50646 v 22.02884 l -4.25,1.0976 c -5.43216,1.4029 -41.27513,10.99869 -72.49118,19.40717 -13.33265,3.59133 -26.59434,7.72212 -29.47041,9.17954 -12.99175,6.58342 -24.23995,22.28379 -26.78814,37.39121 -3.72156,22.06385 8.85404,43.54242 28.93123,49.41331 10.98396,3.21189 16.01153,2.45894 56.91131,-8.52324 20.71145,-5.56132 42.38219,-11.37012 48.15719,-12.90843 8.60246,-2.29147 68.38787,-18.32039 106.25,-28.48642 l 8.75,-2.34939 v 21.85032 21.85032 l -3.25,1.02461 c -1.7875,0.56353 -7.525,2.15519 -12.75,3.53701 -5.225,1.38183 -30.65,8.18952 -56.5,15.1282 -25.85,6.93869 -53.525,14.35036 -61.5,16.47039 -7.975,2.12003 -29.8,7.9625 -48.5,12.98326 -29.84684,8.01357 -44.29332,11.18187 -49.5,10.856 -0.825,-0.0516 -3.75,-0.43229 -6.5,-0.84589 z m 144.5,-175.99848 c -1.1,-1.1 -2,-2.79345 -2,-3.76322 0,-0.96977 10.65326,-12.94559 23.6739,-26.61293 17.73121,-18.61186 23.31647,-25.05413 22.25,-25.66408 -0.78314,-0.44791 -11.5489,-7.2596 -23.9239,-15.13708 -20.73589,-13.19972 -22.5236,-14.56458 -22.80107,-17.40786 -0.16558,-1.69685 0.28442,-3.56391 1,-4.14903 0.71559,-0.58512 6.47607,-2.42787 12.80107,-4.09501 6.325,-1.66714 19.42017,-5.13836 29.10037,-7.71381 l 17.60038,-4.68265 12.28931,7.8011 12.28931,7.8011 2.50719,-2.93826 c 1.37896,-1.61605 7.67208,-8.30583 13.98472,-14.86618 l 11.47752,-11.9279 19.6256,-5.33642 c 14.84922,-4.03766 20.15208,-5.10438 21.78887,-4.38305 2.4906,1.09763 3.83122,4.3747 2.64771,6.47223 -0.44604,0.79053 -10.85271,12.02188 -23.12594,24.95857 -12.27322,12.93669 -22.3181,23.82497 -22.32195,24.19617 -0.004,0.3712 10.71289,7.48642 23.81496,15.81161 19.96862,12.68825 23.87005,15.54953 24.11928,17.68888 0.17568,1.50789 -0.43808,3.19866 -1.5,4.13216 -0.98853,0.86899 -14.58052,4.98302 -30.20442,9.14227 -32.41544,8.62935 -27.73226,8.73176 -42.71552,-0.93407 -4.71484,-3.04159 -9.22711,-5.78138 -10.02725,-6.08842 -0.95538,-0.36661 -6.37308,4.56046 -15.78142,14.35226 l -14.3266,14.91052 -19.50118,5.21655 c -10.72564,2.8691 -19.78012,5.21655 -20.12105,5.21655 -0.34094,0 -1.51989,-0.9 -2.61989,-2 z m 30.84867,-16.15926 c 5.12608,-1.15309 6.00003,-1.88276 21,-17.53311 8.60823,-8.98148 16.45559,-16.58558 17.43857,-16.898 1.17417,-0.37319 6.38864,2.34354 15.20128,7.91983 l 13.41403,8.48788 19.68559,-5.37887 c 10.82708,-2.95838 19.87229,-5.56556 20.10046,-5.79374 0.22818,-0.22818 -9.28341,-6.57334 -21.13686,-14.10036 -19.88158,-12.62494 -21.55174,-13.90785 -21.55174,-16.55472 0,-2.35568 3.2946,-6.32546 18.40721,-22.17944 10.12396,-10.62062 18.27526,-19.44641 18.11399,-19.61288 -0.16126,-0.16647 -3.68881,0.5672 -7.839,1.63038 l -7.54578,1.93305 -11.8152,12.36962 c -6.49836,6.80329 -13.45111,14.05712 -15.45056,16.11962 -1.99945,2.0625 -4.57907,3.75 -5.73248,3.75 -1.15341,0 -7.77324,-3.60321 -14.71073,-8.00713 l -12.61362,-8.00713 -18.48298,5.00713 c -10.16563,2.75392 -19.12374,5.00713 -19.90691,5.00713 -3.55103,0 -0.0998,2.69671 18.64386,14.56769 11.03729,6.99029 20.76404,13.77223 21.61501,15.07097 2.0542,3.1351 1.47373,3.97468 -13.87289,20.06547 -24.33672,25.51683 -23.55308,24.61503 -20.80992,23.94783 1.375,-0.33443 4.9069,-1.14948 7.84867,-1.81122 z m -182.60135,1.10376 c -17.79428,-3.14651 -31.09422,-12.79386 -38.8643,-28.19093 -5.97237,-11.83475 -6.35346,-15.17889 -6.35346,-55.75357 0,-41.70952 0.26822,-43.78285 7.62621,-58.95131 3.836,-7.90791 5.99393,-10.86021 13.21446,-18.07898 12.16838,-12.16544 18.38383,-15.03007 52.12977,-24.02601 14.575,-3.88538 35.725,-9.539 47,-12.5636 11.275,-3.0246 32.875,-8.8163 48,-12.87045 15.125,-4.05415 43.7,-11.71677 63.5,-17.02805 47.42138,-12.72062 57.84987,-15.46757 58.75,-15.47522 0.99436,-0.008 0.97307,42.73772 -0.0216,43.35245 -0.42437,0.26228 -23.71187,6.6191 -51.75,14.12626 -28.03812,7.50716 -59.07841,15.83417 -68.97841,18.50447 -9.9,2.67029 -28.35,7.62423 -41,11.00874 -61.98738,16.58474 -61.85305,16.53761 -70.79133,24.83583 -25.48816,23.663 -21.78301,63.72955 7.20492,77.91202 4.3914,2.14852 7.26752,2.75681 14.53822,3.0748 8.00877,0.35028 10.57609,-0.0174 22.05599,-3.15922 7.14571,-1.95561 25.8172,-6.97116 41.4922,-11.14568 15.675,-4.17452 29.2875,-7.82871 30.25,-8.12043 1.62956,-0.49389 1.75,0.97751 1.75,21.3787 v 21.9091 l -3.75,1.09958 c -4.25011,1.24621 -86.97714,23.41872 -97.83497,26.22173 -8.89274,2.29572 -21.31635,3.15127 -28.16771,1.93977 z M 530.51422,350.4528 c -1.48843,-1.6447 -1.65499,-6.36248 -1.65499,-46.87756 0,-35.65942 0.26998,-45.27287 1.2953,-46.12382 1.22715,-1.01844 33.53153,-10.03736 57.05298,-15.92837 l 10.84829,-2.71698 1.90171,2.34852 c 1.8049,2.22895 1.90172,4.60052 1.90172,46.58275 0,40.86037 -0.13348,44.35451 -1.75,45.81132 -0.9625,0.8674 -9.4,3.616 -18.75,6.108 -9.35,2.49199 -23.73483,6.35204 -31.96629,8.57789 -8.23146,2.22584 -15.47422,4.04699 -16.09501,4.04699 -0.6208,0 -1.87347,-0.82293 -2.78371,-1.82874 z m 56.09501,-23.0929 4.25,-1.15545 v -37.52884 c 0,-35.27876 -0.10492,-37.49679 -1.75,-36.99422 -0.9625,0.29405 -10.3,2.82974 -20.75,5.63486 -10.45,2.80513 -21.3625,5.75744 -24.25,6.5607 l -5.25,1.46046 v 36.8054 c 0,20.24297 0.22235,37.02774 0.49411,37.2995 0.40608,0.40609 15.76145,-3.51998 47.25589,-12.08241 z m 284.47251,11.36494 -2.22251,-1.55671 v -38.44329 c 0,-21.14382 -0.30613,-38.4433 -0.68028,-38.4433 -0.37416,0 -3.41166,1.77829 -6.75,3.95175 -15.1424,9.85861 -26.68718,13.0687 -40.65822,11.30523 -17.22778,-2.17455 -29.45816,-10.527 -36.07238,-24.63481 l -3.33912,-7.12217 -0.32167,-26.03015 c -0.29849,-24.1544 -0.1904,-26.14702 1.5,-27.65191 1.00192,-0.89196 13.97167,-4.88162 28.82167,-8.8659 37.72019,-10.12038 35.13096,-9.596 37.37116,-7.56864 1.72848,1.56425 1.93152,3.70936 2.31107,24.41576 0.28271,15.42373 0.81233,23.42211 1.65212,24.95084 2.19584,3.99723 9.69661,2.20434 14.07735,-3.36488 1.98993,-2.52978 2.0883,-3.82031 2.0883,-27.39753 0,-19.86595 0.27311,-24.96936 1.38564,-25.89268 1.31535,-1.09164 9.28222,-3.365 47.80742,-13.6419 18.54382,-4.94671 19.98377,-5.13332 22.23551,-2.88158 1.40355,1.40355 1.57143,10.51726 1.57143,85.30887 0,67.89913 -0.25037,84.07985 -1.32373,85.54775 -0.93663,1.28092 -10.95249,4.40401 -34.25,10.67964 -18.10945,4.87813 -32.93864,8.8745 -32.95376,8.88082 -0.0151,0.006 -1.02763,-0.68903 -2.25,-1.54521 z m 34.2399,-17.9433 c 13.35659,-3.575 24.56661,-6.5 24.91115,-6.5 0.34454,0 0.62644,-34.65857 0.62644,-77.01905 v -77.01905 l -2.75,0.68832 c -1.5125,0.37858 -13.1,3.45478 -25.75,6.83601 l -23,6.14768 -0.5,23.93304 c -0.33557,16.06249 -0.8985,24.62788 -1.71179,26.04591 -1.76793,3.08255 -8.13639,8.42576 -11.93336,10.01224 -4.87151,2.03544 -13.22907,1.74898 -17.0563,-0.58462 -6.06588,-3.69858 -6.73941,-6.33306 -7.29668,-28.54048 -0.48174,-19.19795 -0.58072,-19.98622 -2.46812,-19.6565 -3.80836,0.6653 -43.06303,11.22167 -45.37089,12.20114 l -2.33714,0.99189 0.38616,20.73174 c 0.3463,18.59153 0.61787,21.3175 2.63065,26.40598 5.09166,12.87214 17.20064,19.9322 34.30103,19.99899 10.52203,0.0411 23.7124,-6.10833 38.9677,-18.16695 5.58123,-4.41171 7.33129,-4.82075 10.06,-2.3513 1.71409,1.55123 1.82874,4.1844 1.82874,42 0,28.42481 0.32171,40.34501 1.08885,40.34501 0.59887,0 12.01697,-2.925 25.37356,-6.5 z m -265.96241,-3.90215 c -11.31419,-3.58759 -19.88079,-10.88505 -24.5315,-20.89714 -15.80971,-34.03531 13.63292,-77.21398 52.5315,-77.0393 8.55153,0.0384 16.94745,2.38483 22.38332,6.2555 1.60898,1.1457 3.19345,2.08309 3.52105,2.08309 0.3276,0 0.60252,-22.6125 0.61094,-50.25 0.008,-27.6375 0.3957,-50.85006 0.86061,-51.58348 0.46491,-0.73341 4.62052,-2.3917 9.23469,-3.68509 19.67018,-5.51372 61.21229,-16.48143 62.42626,-16.48143 0.72615,0 2.02742,0.70714 2.8917,1.57143 1.40511,1.40511 1.57143,11.0235 1.57143,90.87755 0,80.99279 -0.15035,89.43091 -1.61514,90.64658 -0.88833,0.73724 -17.19063,5.50207 -36.22734,10.58849 -31.95221,8.53733 -34.78685,9.13362 -36.88486,7.75895 -1.5273,-1.00073 -2.27266,-2.47266 -2.27266,-4.48805 v -2.99894 l -6.49471,5.35714 c -7.15309,5.9002 -15.3328,10.28421 -23.00529,12.32995 -6.23572,1.66264 -19.69063,1.63829 -25,-0.0453 z m 23.7946,-10.60712 c 12.21706,-3.77347 23.42098,-13.19751 29.4527,-24.77379 2.87324,-5.51441 6.08022,-7.44343 9.15748,-5.50829 1.2322,0.77488 1.66065,3.08406 1.88275,10.14726 0.24784,7.88219 0.52385,9.1357 2,9.08331 0.94186,-0.0334 13.63747,-3.29593 28.21247,-7.25 l 26.5,-7.18922 0.25596,-80.94404 c 0.14077,-44.51923 -0.0842,-81.23594 -0.5,-81.59271 -0.87332,-0.74937 -54.01141,13.3922 -55.34922,14.73001 -0.49261,0.49261 -1.00527,26.08455 -1.14832,57.32436 l -0.25842,56.43445 -2.85409,1.00361 c -3.09339,1.08776 -2.32529,1.69682 -10.25419,-8.1309 -9.80843,-12.15737 -30.28969,-13.65942 -46.17058,-3.38605 -17.47197,11.30263 -26.89448,32.91361 -21.8765,50.17484 5.02952,17.30094 22.24145,25.65563 40.94996,19.87716 z M 555.21428,237.24205 c -15.26866,-3.02192 -27.0858,-17.08456 -28.13833,-33.4852 -1.09591,-17.07664 7.933,-32.48624 23.5598,-40.20943 7.11408,-3.51596 8.22047,-3.76588 16.67162,-3.76588 7.87371,0 9.78849,0.36175 14.71152,2.77935 19.38005,9.51717 26.20464,32.90346 15.50812,53.14268 -5.85303,11.07472 -16.86883,19.34035 -28.78781,21.60073 -5.83233,1.10608 -7.66439,1.09765 -13.52492,-0.0623 z m 19.50812,-12.88873 c 11.27464,-5.75699 17.56322,-16.92693 16.97433,-30.15026 -0.42505,-9.54438 -3.8981,-15.82779 -11.26655,-20.38336 -6.51678,-4.02901 -16.9614,-4.78608 -23.86979,-1.73017 -20.56288,9.09594 -25.70378,37.38971 -9.15833,50.40436 6.73607,5.2986 18.95615,6.1303 27.32034,1.85943 z"
       id="path845-9"
       inkscape:export-filename="C:\Users\BUCH\Desktop\Retrogaming\Recalbox\travail thèmes\travail uniflyered\auto-arcade-exidy\path845.png"
       inkscape:export-xdpi="160.08984"
       inkscape:export-ydpi="160.08984" />
  </g>
</svg>
