{
    "partitioning": {
        "mount_points": {
            "/": {
                "device": "/dev/sdc1",
                "format": false
            }
        }
    },
    "desktops": {
        "gnome": {
            "title": "Gnome",
            "enabled": false,
            "picture_path": "media/pictures/desktops/gnome.png"
        },
        "plasma": {
            "title": "KDE Plasma",
            "enabled": false,
            "picture_path": "media/pictures/desktops/plasma.png"
        },
        "cinnamon": {
            "title": "Cinnamon",
            "enabled": false,
            "picture_path": "media/pictures/desktops/cinnamon.png"
        },
        "budgie": {
            "title": "Budgie",
            "enabled": false,
            "picture_path": "media/pictures/desktops/budgie.png"
        },
        "deepin": {
            "title": "Deepin",
            "enabled": false,
            "picture_path": "media/pictures/desktops/deepin.png"
        },
        "xfce": {
            "title": "XFCE",
            "enabled": false,
            "picture_path": "media/pictures/desktops/xfce.png"
        },
        "mate": {
            "title": "MATE",
            "enabled": false,
            "picture_path": "media/pictures/desktops/mate.png"
        },
        "lxde": {
            "title": "LXDE",
            "enabled": false,
            "picture_path": "media/pictures/desktops/lxde.png"
        },
        "lxqt": {
            "title": "LXQt",
            "enabled": false,
            "picture_path": "media/pictures/desktops/lxqt.png"
        },
        "i3": {
            "title": "i3",
            "enabled": false,
            "picture_path": "media/pictures/desktops/i3.png"
        },
        "openbox": {
            "title": "Openbox",
            "enabled": false,
            "picture_path": "media/pictures/desktops/openbox.png"
        },
        "enlightenment": {
            "title": "Enlightenment",
            "enabled": false,
            "picture_path": "media/pictures/desktops/enlightenment.png"
        },
        "pantheon": {
            "title": "Pantheon",
            "enabled": false,
            "picture_path": "media/pictures/desktops/pantheon.png"
        }
    },
    "display_managers": {
        "lightdm": {
            "title": "LightDM",
            "enabled": false,
            "picture_path": "media/pictures/display_managers/lightdm.png"
        },
        "gdm": {
            "title": "GDM",
            "enabled": false,
            "picture_path": "media/pictures/display_managers/gdm.png"
        },
        "sddm": {
            "title": "SDDM",
            "enabled": false,
            "picture_path": "media/pictures/display_managers/sddm.png"
        }
    },
    "kernels": [
        "linux"
    ],
    "timezone": {
        "region": "America",
        "city": "Chicago"
    },
    "hostname": "rebornos_device",
    "other_packages": [
        "sudo",
        "nano",
        "xorg",
        "xorg-xinit",
        "virtualbox-guest-utils",
        "virtualbox-guest-dkms",
        "xf86-video-vmware"
    ],
    "other_services": [
        "vboxservice"
    ]
}