{
    "other_packages": [
        "sudo",
        "nano",
        "virtualbox-guest-utils",
        "virtualbox-guest-dkms",
        "xf86-video-vmware",
        "networkmanager",
        "grub",
        "os-prober",
        "chromium",        
        "xorg-server",
        "budgie-desktop",
        "lightdm",
        "lightdm-webkit2-greeter",
        "lightdm-gtk-greeter",
        "light-locker",
        "adapta-gtk-theme",
        "gnome-tweaks",
        "nautilus",
        "gnome-terminal",
        "gedit",
        "gnome-disk-utility",
        "gnome-control-center",
        "gnome-system-monitor",
        "pulseaudio",
        "pulseaudio-alsa"        
    ],
    "other_services": [
    ]
}