<?xml version="1.0" encoding="UTF-8" standalone="no"?>
<svg
   xmlns:dc="http://purl.org/dc/elements/1.1/"
   xmlns:cc="http://creativecommons.org/ns#"
   xmlns:rdf="http://www.w3.org/1999/02/22-rdf-syntax-ns#"
   xmlns:svg="http://www.w3.org/2000/svg"
   xmlns="http://www.w3.org/2000/svg"
   xmlns:sodipodi="http://sodipodi.sourceforge.net/DTD/sodipodi-0.dtd"
   xmlns:inkscape="http://www.inkscape.org/namespaces/inkscape"
   width="63.934288mm"
   height="61.872459mm"
   viewBox="0 0 63.934286 61.87246"
   version="1.1"
   id="svg8"
   inkscape:version="1.0.2 (e86c870879, 2021-01-15)"
   sodipodi:docname="Fenix_Logo.svg">
  <defs
     id="defs2">
    <inkscape:perspective
       sodipodi:type="inkscape:persp3d"
       inkscape:vp_x="0 : 59.219609 : 1"
       inkscape:vp_y="0 : 999.99999 : 0"
       inkscape:vp_z="210 : 59.219609 : 1"
       inkscape:persp3d-origin="105 : 9.7196094 : 1"
       id="perspective817" />
    <inkscape:perspective
       id="perspective817-5"
       inkscape:persp3d-origin="105 : 9.7196094 : 1"
       inkscape:vp_z="210 : 59.219609 : 1"
       inkscape:vp_y="0 : 999.99999 : 0"
       inkscape:vp_x="0 : 59.219609 : 1"
       sodipodi:type="inkscape:persp3d" />
  </defs>
  <sodipodi:namedview
     id="base"
     pagecolor="#ffffff"
     bordercolor="#666666"
     borderopacity="1.0"
     inkscape:pageopacity="0.0"
     inkscape:pageshadow="2"
     inkscape:zoom="0.7"
     inkscape:cx="2.7827496"
     inkscape:cy="112.87527"
     inkscape:document-units="mm"
     inkscape:current-layer="layer1"
     showgrid="false"
     inkscape:window-width="1920"
     inkscape:window-height="1004"
     inkscape:window-x="0"
     inkscape:window-y="0"
     inkscape:window-maximized="1"
     inkscape:pagecheckerboard="true"
     inkscape:snap-nodes="false"
     inkscape:snap-smooth-nodes="true"
     inkscape:object-paths="false"
     inkscape:object-nodes="true"
     inkscape:document-rotation="0"
     fit-margin-top="0"
     fit-margin-left="0"
     fit-margin-right="0"
     fit-margin-bottom="0" />
  <metadata
     id="metadata5">
    <rdf:RDF>
      <cc:Work
         rdf:about="">
        <dc:format>image/svg+xml</dc:format>
        <dc:type
           rdf:resource="http://purl.org/dc/dcmitype/StillImage" />
        <dc:title></dc:title>
      </cc:Work>
    </rdf:RDF>
  </metadata>
  <g
     inkscape:label="Layer 1"
     inkscape:groupmode="layer"
     id="layer1"
     transform="translate(-151.95869,14.034691)">
    <g
       id="layer2"
       inkscape:label="Layer 2"
       style="display:none"
       transform="matrix(1.0002257,0,0,1.0002257,108.33439,-58.636514)">
      <g
         id="g849">
        <path
           id="path815"
           d="M 113.28,140.924 H 37.76 L 0.001,75.52 37.76,10.12 h 75.52 l 37.76,65.402 z"
           inkscape:connector-curvature="0"
           style="fill:#1a1a1a" />
        <path
           id="path817"
           d="M 40.688,15.19 24.914,42.5 40.502,51.5 51.08,33.188 h 21.147 v -18 z m 38.127,0 v 18 h 21.147 l 10.578,18.32 15.588,-9 -15.774,-27.32 z m 50.608,33.027 -15.588,9 10.57,18.305 -10.578,18.322 15.588,9 15.774,-27.32 z m -107.804,0 -15.764,27.305 15.774,27.32 15.587,-9 L 26.638,75.52 37.208,57.215 Z m 18.891,51.333 -15.588,9 15.765,27.305 h 31.538 v -18 H 51.08 Z m 70.02,0 -10.57,18.305 H 78.816 v 18 h 31.54 L 126.12,108.55 Z"
           inkscape:connector-curvature="0"
           style="fill:#277748" />
        <path
           id="path819"
           d="m 54.256,38.688 -9,15.57 13.457,7.77 4.505,-7.802 h 9 v -15.54 z m 24.56,0 v 15.54 h 9 l 4.505,7.802 13.457,-7.77 -9,-15.57 z M 41.97,59.966 33,75.52 l 9,15.57 13.457,-7.77 -4.505,-7.802 4.495,-7.785 z m 67.1,0 -13.457,7.77 4.495,7.785 -4.505,7.802 13.457,7.77 9,-15.57 z M 58.732,89.03 45.275,96.8 l 8.98,15.556 h 17.97 v -15.54 h -9 z m 33.578,0 -4.495,7.785 h -9 v 15.54 h 17.97 l 8.98,-15.556 z"
           inkscape:connector-curvature="0"
           style="fill:#649f4b" />
        <path
           id="path821"
           d="M 84.45,90.986 H 66.592 l -8.93,-15.465 8.93,-15.465 H 84.45 l 8.93,15.465 z"
           inkscape:connector-curvature="0"
           style="fill:#656565" />
      </g>
    </g>
    <g
       id="layer2-9"
       inkscape:label="Layer 2"
       style="display:none"
       transform="matrix(1.0002257,0,0,1.0002257,211.11475,-177.33985)">
      <g
         id="g849-1">
        <path
           id="path815-2"
           d="M 113.28,140.924 H 37.76 L 0.001,75.52 37.76,10.12 h 75.52 l 37.76,65.402 z"
           inkscape:connector-curvature="0"
           style="fill:#1a1a1a" />
        <path
           id="path817-7"
           d="M 40.688,15.19 24.914,42.5 40.502,51.5 51.08,33.188 h 21.147 v -18 z m 38.127,0 v 18 h 21.147 l 10.578,18.32 15.588,-9 -15.774,-27.32 z m 50.608,33.027 -15.588,9 10.57,18.305 -10.578,18.322 15.588,9 15.774,-27.32 z m -107.804,0 -15.764,27.305 15.774,27.32 15.587,-9 L 26.638,75.52 37.208,57.215 Z m 18.891,51.333 -15.588,9 15.765,27.305 h 31.538 v -18 H 51.08 Z m 70.02,0 -10.57,18.305 H 78.816 v 18 h 31.54 L 126.12,108.55 Z"
           inkscape:connector-curvature="0"
           style="fill:#277748" />
        <path
           id="path819-0"
           d="m 54.256,38.688 -9,15.57 13.457,7.77 4.505,-7.802 h 9 v -15.54 z m 24.56,0 v 15.54 h 9 l 4.505,7.802 13.457,-7.77 -9,-15.57 z M 41.97,59.966 33,75.52 l 9,15.57 13.457,-7.77 -4.505,-7.802 4.495,-7.785 z m 67.1,0 -13.457,7.77 4.495,7.785 -4.505,7.802 13.457,7.77 9,-15.57 z M 58.732,89.03 45.275,96.8 l 8.98,15.556 h 17.97 v -15.54 h -9 z m 33.578,0 -4.495,7.785 h -9 v 15.54 h 17.97 l 8.98,-15.556 z"
           inkscape:connector-curvature="0"
           style="fill:#649f4b" />
        <path
           id="path821-9"
           d="M 84.45,90.986 H 66.592 l -8.93,-15.465 8.93,-15.465 H 84.45 l 8.93,15.465 z"
           inkscape:connector-curvature="0"
           style="fill:#656565" />
      </g>
    </g>
    <g
       id="g880"
       transform="matrix(0.42341,0,0,0.42341,106.0498,9.7452578)">
      <g
         id="layer1-3"
         inkscape:label="Layer 1"
         transform="matrix(0.95506582,0,0,0.95506582,110.73138,-55.225995)"
         style="stroke-width:1.04728" />
      <path
         style="fill:#1a1a1a;stroke-width:1.00023"
         inkscape:connector-curvature="0"
         d="m 219.32118,80.041756 c -21.0468,12.151353 -51.8615,12.151712 -72.90832,0 -21.04682,-12.151712 -36.45351,-38.839608 -36.45319,-63.142151 4.2e-4,-31.786111 15.40705,-50.987296 36.45319,-63.13829 35.59379,-20.550084 72.90832,0 72.90832,0 l 36.45415,63.14022 c 0,0 -15.40735,50.988868 -36.45415,63.140221 z"
         id="path1158"
         sodipodi:nodetypes="zzssccz" />
      <path
         style="fill:#800000;fill-opacity:1;stroke-width:1.00023"
         inkscape:connector-curvature="0"
         d="m 149.2396,-41.344019 -15.22849,26.365545 15.04893,8.688756 10.21218,-17.678721 H 179.6879 V -41.34595 Z m 36.80847,0 v 17.377511 h 20.41568 l 10.21218,17.6864441 15.04893,-8.6887551 -15.22849,-26.3752 z m 48.85783,31.8848365 -15.04892,8.688755 10.20446,17.6719625 -10.21218,17.688376 15.04892,8.688755 15.22849,-26.375199 z m -104.07584,0 -15.21884,26.3607175 15.2285,26.3752 15.04796,-8.688755 -10.21219,-17.688375 10.20446,-17.67196338 z m 18.2377,49.5577635 -15.04893,8.688756 15.21981,26.360718 h 30.44733 v -17.37751 h -20.41375 z m 67.59852,0 -10.20446,17.671964 h -20.41279 v 17.37751 h 30.44927 l 15.21884,-26.360718 z"
         id="path1160" />
      <path
         style="fill:#d4aa00;fill-opacity:1;stroke-width:1.00023"
         inkscape:connector-curvature="0"
         d="m 162.33839,-18.658644 -8.68876,15.0315468 12.99162,7.5012921 4.34921,-7.5321855 h 8.68875 V -18.660575 Z m 23.71064,0 v 15.0025843 h 8.68876 l 4.34921,7.5321855 12.99161,-7.5012922 -8.68875,-15.0315476 z m -35.57176,20.5421485 -8.65979,15.0161005 8.68875,15.031547 12.99163,-7.501293 -4.34921,-7.532186 4.33954,-7.5157726 z m 64.7795,0 -12.99162,7.5012922 4.33954,7.5157733 -4.34919,7.532186 12.99161,7.501292 8.68876,-15.031547 z m -48.59717,28.0588875 -12.99163,7.501292 8.66945,15.018031 h 17.34855 V 37.45913 h -8.68876 z m 32.41677,0 -4.33955,7.515773 h -8.68875 V 52.46075 h 17.34854 l 8.66945,-15.018031 z"
         id="path1162" />
      <path
         style="fill:#656565;stroke-width:1.00023"
         inkscape:connector-curvature="0"
         d="M 191.48819,31.830749 H 174.24777 L 165.62659,16.90057 174.24777,1.9703921 h 17.24042 l 8.62118,14.9301779 z"
         id="path1164" />
      <g
         id="layer1-3-2"
         inkscape:label="Layer 1"
         transform="matrix(0.96820523,0,0,0.96820523,212.03251,-174.92164)"
         style="stroke-width:1.03307" />
      <path
         style="fill:#ff6600;stroke:none;stroke-width:0.264583px;stroke-linecap:butt;stroke-linejoin:miter;stroke-opacity:1"
         d="m 166.21242,27.37852 c 0,0 -2.15952,4.090967 -15.3716,1.523662 -18.69828,-3.633356 -17.09229,-28.48082022 -17.09229,-28.48082022 0,0 6.8657,14.48885122 18.35414,17.46354722 16.74816,4.336593 14.10975,9.493611 14.10975,9.493611 z"
         id="path832"
         inkscape:connector-curvature="0"
         sodipodi:nodetypes="cscsc" />
      <path
         sodipodi:nodetypes="cscsc"
         inkscape:connector-curvature="0"
         id="path834"
         d="m 178.16517,46.177662 c 0,0 -1.22878,3.559934 -12.14535,3.198808 -15.4496,-0.511071 -22.18351,-16.566828 -22.18351,-16.566828 0,0 12.25517,6.655569 21.83899,7.565162 13.97158,1.326033 12.48987,5.802858 12.48987,5.802858 z"
         style="fill:#ff6600;stroke:none;stroke-width:0.264583px;stroke-linecap:butt;stroke-linejoin:miter;stroke-opacity:1" />
      <path
         style="fill:#ff6600;stroke:none;stroke-width:0.264583px;stroke-linecap:butt;stroke-linejoin:miter;stroke-opacity:1"
         d="m 191.75025,62.39887 c 0,0 -1.0479,3.035882 -10.35748,2.727917 -13.1753,-0.435838 -20.63576,-12.261033 -20.63576,-12.261033 0,0 12.16895,3.808784 20.34196,4.584475 11.91487,1.130833 10.65128,4.948641 10.65128,4.948641 z"
         id="path836"
         inkscape:connector-curvature="0"
         sodipodi:nodetypes="cscsc" />
      <path
         sodipodi:nodetypes="cscsc"
         inkscape:connector-curvature="0"
         id="path859"
         d="m 166.21242,27.37852 c 0,0 -2.15952,4.090967 -15.3716,1.523662 -9.50467,-1.846902 -10.66835,-15.002241 -10.66835,-15.002241 0,0 0.3507,4.481782 12.15963,5.508636 16.1746,1.406463 13.88032,7.969943 13.88032,7.969943 z"
         style="fill:#ffff00;fill-opacity:1;stroke:none;stroke-width:0.264583px;stroke-linecap:butt;stroke-linejoin:miter;stroke-opacity:1" />
      <path
         style="fill:#ffff00;fill-opacity:1;stroke:none;stroke-width:0.264583px;stroke-linecap:butt;stroke-linejoin:miter;stroke-opacity:1"
         d="m 178.16517,46.177662 c 0,0 -1.22878,3.559928 -12.14535,3.198808 -9.16181,-0.303072 -13.23586,-10.237755 -13.23586,-10.237755 0,0 4.06929,1.912436 13.69434,1.93932 13.16858,0.03677 11.68687,5.099627 11.68687,5.099627 z"
         id="path861"
         inkscape:connector-curvature="0"
         sodipodi:nodetypes="cscsc" />
      <path
         sodipodi:nodetypes="cscsc"
         inkscape:connector-curvature="0"
         id="path863"
         d="m 191.75025,62.39887 c 0,0 -1.0479,3.035876 -10.35748,2.727917 -7.235,-0.23933 -13.17937,-8.276059 -13.17937,-8.276059 0,0 5.15929,2.634179 13.34443,2.005964 11.22657,-0.861655 10.19242,3.542178 10.19242,3.542178 z"
         style="fill:#ffff00;fill-opacity:1;stroke:none;stroke-width:0.264583px;stroke-linecap:butt;stroke-linejoin:miter;stroke-opacity:1" />
      <path
         style="fill:#ff6600;stroke:none;stroke-width:0.264583px;stroke-linecap:butt;stroke-linejoin:miter;stroke-opacity:1"
         d="m 259.13299,17.917493 c 0,0 -17.1963,3.149306 -21.25203,9.11641 -4.05573,5.967111 -3.73127,12.597229 -3.73127,12.597229 l 2.43344,-3.978073 c 0,0 -0.81115,6.464365 0.6489,8.619151 0,0 -0.32446,-6.132858 4.38021,-5.635598 0,0 3.56904,8.287651 -4.38021,7.956144 -7.94923,-0.331506 -10.56719,-16.573254 -24.51171,-22.542399 -21.56147,-9.229684 -51.91337,-5.967111 -60.83598,-24.36569081 0,0 6.48917,15.74653381 15.08732,19.55885281 8.59815,3.812318 23.52325,5.635598 25.63222,10.276683 0,0 -10.38267,3.646565 -19.14305,-2.983553 0,0 2.59567,14.089002 26.28114,14.917762 0,0 -2.75789,6.132864 -12.97834,1.823286 0,0 3.08236,11.602702 27.90343,7.956143 0,0 1.94676,7.458878 -16.06069,4.64108 0,0 2.59568,6.29861 19.46752,5.138343 0,0 -19.46752,26.520471 -53.86013,7.458885 0,0 4.70465,8.950657 14.11395,13.094482 0,0 -49.80439,-0.99452 -46.39758,-49.891642 0,0 -6.65139,3.315059 -2.7579,24.862945 0,0 -29.03903,-35.636887 6.81363,-74.257327 0,0 -10.22044,2.320539 -17.03407,12.431475 0,0 19.27384,-41.206399 51.04618,-37.422177 0,0 -3.1777,-5.356376 -14.07547,-4.418735 0,0 34.28071,-13.824106 63.39868,0.890149 0,0 -11.64277,-9.924255 -37.37334,-9.924255 -34.8277,0 -73.52127,27.257516 -73.52127,73.551284 0,52.908516 44.70852,72.577666 74.30458,72.577666 29.46423,0 57.08485,-18.279476 65.27214,-41.959406 1.59172,-4.603689 0.22943,-14.767835 0.22943,-14.767835 0,0 13.31176,-9.54565 10.90027,-15.321276 z"
         id="path830"
         inkscape:connector-curvature="0"
         sodipodi:nodetypes="csccccsscsccccccccccccccccssssccc" />
      <path
         sodipodi:nodetypes="csccccssscscccccccccsccscc"
         inkscape:connector-curvature="0"
         id="path857"
         d="m 259.07785,17.917493 c 0,0 -17.14116,3.149306 -21.19689,9.11641 -4.05574,5.967111 -3.73127,12.597229 -3.73127,12.597229 l 2.3783,-3.978073 c 0,0 -0.75601,6.464365 0.70404,8.619151 0,0 -0.37958,-6.132858 4.32506,-5.635598 0,0 3.6242,8.287651 -4.32506,7.956144 -7.94922,-0.331506 -10.56719,-16.573254 -24.51171,-22.542399 -6.44964,-2.760861 -11.64114,-3.885083 -15.60594,-4.783365 -9.16516,-2.076501 -12.55082,-2.025679 -26.92799,-5.934539 0,0 4.93528,4.911665 13.53343,8.723984 8.59815,3.812319 14.91974,3.525911 17.02872,8.166996 0,0 -1.32032,5.170227 -15.35751,2.876697 0,0 5.15815,6.895823 25.36344,5.072538 0,0 -0.46363,7.656532 -11.94593,8.855591 0,0 8.99755,2.843201 19.94167,0.742854 0,0 8.23295,8.302875 -8.62737,10.524894 0,0 1.63284,1.416217 16.78398,-0.564487 0,0 -13.21313,24.166617 -45.1723,20.685804 0,0 -0.48668,2.154786 8.92262,6.298611 0,0 -19.35158,2.232797 -36.08153,-6.179389 -6.5669,-3.301979 -13.33663,-3.664172 -23.03492,-26.202521 0,23.389615 20.22074,36.932748 51.19046,37.631985 30.7578,0 57.08486,-18.279476 65.27215,-41.959406 1.59171,-4.603689 0.22942,-14.767835 0.22942,-14.767835 0,0 13.25663,-9.54565 10.84513,-15.321276 z"
         style="fill:#ffff00;stroke:none;stroke-width:0.264583px;stroke-linecap:butt;stroke-linejoin:miter;stroke-opacity:1" />
      <path
         style="fill:#d40000;stroke:none;stroke-width:0.264583px;stroke-linecap:butt;stroke-linejoin:miter;stroke-opacity:1"
         d="m 259.07785,17.917493 c 0,0 -17.19631,3.149306 -21.25203,9.11641 -4.05573,5.967111 -3.67613,12.597229 -3.67613,12.597229 l 2.3783,-3.978073 c 0,0 -0.75602,6.464365 0.70404,8.619151 0,0 -0.37959,-6.132858 4.32506,-5.635598 0,0 3.56905,8.287651 -4.38019,7.956144 -7.94924,-0.331506 -10.64141,-16.831968 -24.58593,-22.801113 -13.67243,-5.227444 -15.46288,-4.476271 -26.91168,-6.82122 8.17304,4.956719 17.55674,6.195836 24.28273,12.883723 0,0 -0.20958,4.484671 -10.80539,5.472877 0,0 2.8639,3.028062 18.36593,0.149927 0,0 3.95633,3.948211 -6.95816,10.03698 4.12788,0.262017 11.22357,-1.853035 14.12242,-0.627117 0,0 6.16241,6.564013 -1.01784,11.005775 0,0 5.76968,-0.158435 9.56478,-1.061747 0,0 -13.72765,28.210904 -42.17105,25.575516 0,0 1.59783,2.944345 8.71286,3.806427 -15.22323,4.475834 -37.24104,1.939884 -55.12213,-9.029841 10.12878,9.711546 19.38004,14.36091 38.07771,14.783067 30.7578,0 57.12648,-18.279476 65.31377,-41.959406 1.59171,-4.603689 0.1878,-14.767835 0.1878,-14.767835 0,0 13.25662,-9.54565 10.84513,-15.321276 z"
         id="path865"
         inkscape:connector-curvature="0"
         sodipodi:nodetypes="csccccsccccccsccccccscc" />
      <path
         style="fill:#d40000;fill-opacity:1;stroke:none;stroke-width:0.264583px;stroke-linecap:butt;stroke-linejoin:miter;stroke-opacity:1"
         d="m 166.21242,27.37852 c 0,0 -2.15952,4.090967 -15.3716,1.523662 -4.92892,-0.957768 -5.1621,-7.852736 -5.1621,-7.852736 l 10.09479,0.351619 c 12.10124,0.421499 10.43891,5.977455 10.43891,5.977455 z"
         id="path867"
         inkscape:connector-curvature="0"
         sodipodi:nodetypes="cscsc" />
      <path
         sodipodi:nodetypes="cscsc"
         inkscape:connector-curvature="0"
         id="path869"
         d="m 178.16517,46.177662 c 0,0 -1.11407,3.208316 -8.70395,3.081602 -9.16539,-0.153009 -11.28573,-7.190424 -11.28573,-7.190424 0,0 3.74404,0.680377 13.3502,0.06404 7.37962,-0.473483 6.63948,4.044783 6.63948,4.044783 z"
         style="fill:#d40000;fill-opacity:1;stroke:none;stroke-width:0.264583px;stroke-linecap:butt;stroke-linejoin:miter;stroke-opacity:1" />
      <path
         style="fill:#d40000;fill-opacity:1;stroke:none;stroke-width:0.264583px;stroke-linecap:butt;stroke-linejoin:miter;stroke-opacity:1"
         d="m 191.75025,62.39887 c 0,0 -1.21156,2.749332 -6.86956,2.562164 -7.23499,-0.23933 -11.63819,-5.126753 -11.63819,-5.126753 0,0 1.75248,0.562271 9.93763,-0.06595 9.86141,-0.756877 8.57012,2.630538 8.57012,2.630538 z"
         id="path871"
         inkscape:connector-curvature="0"
         sodipodi:nodetypes="cscsc" />
    </g>
  </g>
</svg>
