<?xml version="1.0" encoding="UTF-8" standalone="no"?>
<svg
   xmlns:dc="http://purl.org/dc/elements/1.1/"
   xmlns:cc="http://creativecommons.org/ns#"
   xmlns:rdf="http://www.w3.org/1999/02/22-rdf-syntax-ns#"
   xmlns:svg="http://www.w3.org/2000/svg"
   xmlns="http://www.w3.org/2000/svg"
   xmlns:sodipodi="http://sodipodi.sourceforge.net/DTD/sodipodi-0.dtd"
   xmlns:inkscape="http://www.inkscape.org/namespaces/inkscape"
   width="800"
   height="800"
   viewBox="0 0 211.66666 211.66667"
   version="1.1"
   id="svg8"
   inkscape:version="1.0.2 (e86c870879, 2021-01-15)"
   sodipodi:docname="sign-up-or-self-host.svg">
  <defs
     id="defs2">
    <filter
       inkscape:collect="always"
       style="color-interpolation-filters:sRGB"
       id="filter1091"
       x="-0.070815914"
       width="1.1416318"
       y="-0.31586149"
       height="1.631723">
      <feGaussianBlur
         inkscape:collect="always"
         stdDeviation="3.1339382"
         id="feGaussianBlur1093" />
    </filter>
    <filter
       inkscape:collect="always"
       style="color-interpolation-filters:sRGB"
       id="filter2785-0"
       x="-0.75573868"
       width="2.5114772"
       y="-0.75573844"
       height="2.511477">
      <feGaussianBlur
         inkscape:collect="always"
         stdDeviation="0.83314995"
         id="feGaussianBlur2787-6" />
    </filter>
    <filter
       inkscape:collect="always"
       style="color-interpolation-filters:sRGB"
       id="filter2789-3"
       x="-0.75573868"
       width="2.5114772"
       y="-0.75573844"
       height="2.511477">
      <feGaussianBlur
         inkscape:collect="always"
         stdDeviation="0.83314995"
         id="feGaussianBlur2791-2" />
    </filter>
    <filter
       inkscape:collect="always"
       style="color-interpolation-filters:sRGB"
       id="filter2793-0"
       x="-0.75573868"
       width="2.5114772"
       y="-0.75573844"
       height="2.511477">
      <feGaussianBlur
         inkscape:collect="always"
         stdDeviation="0.83314995"
         id="feGaussianBlur2795-6" />
    </filter>
    <filter
       inkscape:collect="always"
       style="color-interpolation-filters:sRGB"
       id="filter1091-3"
       x="-0.070815913"
       width="1.1416318"
       y="-0.31586149"
       height="1.631723">
      <feGaussianBlur
         inkscape:collect="always"
         stdDeviation="3.1339382"
         id="feGaussianBlur1093-0" />
    </filter>
    <filter
       inkscape:collect="always"
       style="color-interpolation-filters:sRGB"
       id="filter2785-0-9"
       x="-0.75573868"
       width="2.5114772"
       y="-0.75573844"
       height="2.511477">
      <feGaussianBlur
         inkscape:collect="always"
         stdDeviation="0.83314995"
         id="feGaussianBlur2787-6-2" />
    </filter>
    <filter
       inkscape:collect="always"
       style="color-interpolation-filters:sRGB"
       id="filter2789-3-5"
       x="-0.75573868"
       width="2.5114772"
       y="-0.75573844"
       height="2.511477">
      <feGaussianBlur
         inkscape:collect="always"
         stdDeviation="0.83314995"
         id="feGaussianBlur2791-2-4" />
    </filter>
    <filter
       inkscape:collect="always"
       style="color-interpolation-filters:sRGB"
       id="filter2793-0-0"
       x="-0.75573868"
       width="2.5114772"
       y="-0.75573844"
       height="2.511477">
      <feGaussianBlur
         inkscape:collect="always"
         stdDeviation="0.83314995"
         id="feGaussianBlur2795-6-5" />
    </filter>
    <filter
       inkscape:collect="always"
       style="color-interpolation-filters:sRGB"
       id="filter1091-3-5"
       x="-0.070815913"
       width="1.1416318"
       y="-0.31586149"
       height="1.631723">
      <feGaussianBlur
         inkscape:collect="always"
         stdDeviation="3.1339382"
         id="feGaussianBlur1093-0-4" />
    </filter>
    <filter
       inkscape:collect="always"
       style="color-interpolation-filters:sRGB"
       id="filter2785-0-9-8"
       x="-0.75573868"
       width="2.5114772"
       y="-0.75573844"
       height="2.511477">
      <feGaussianBlur
         inkscape:collect="always"
         stdDeviation="0.83314995"
         id="feGaussianBlur2787-6-2-1" />
    </filter>
    <filter
       inkscape:collect="always"
       style="color-interpolation-filters:sRGB"
       id="filter2789-3-5-2"
       x="-0.75573868"
       width="2.5114772"
       y="-0.75573844"
       height="2.511477">
      <feGaussianBlur
         inkscape:collect="always"
         stdDeviation="0.83314995"
         id="feGaussianBlur2791-2-4-8" />
    </filter>
    <filter
       inkscape:collect="always"
       style="color-interpolation-filters:sRGB"
       id="filter2793-0-0-9"
       x="-0.75573868"
       width="2.5114772"
       y="-0.75573844"
       height="2.511477">
      <feGaussianBlur
         inkscape:collect="always"
         stdDeviation="0.83314995"
         id="feGaussianBlur2795-6-5-3" />
    </filter>
  </defs>
  <sodipodi:namedview
     id="base"
     pagecolor="#ffffff"
     bordercolor="#666666"
     borderopacity="1.0"
     inkscape:pageopacity="0.0"
     inkscape:pageshadow="2"
     inkscape:zoom="0.49497475"
     inkscape:cx="-20.41429"
     inkscape:cy="230.01928"
     inkscape:document-units="mm"
     inkscape:current-layer="layer1"
     inkscape:document-rotation="0"
     showgrid="false"
     units="px"
     inkscape:window-width="1920"
     inkscape:window-height="1044"
     inkscape:window-x="0"
     inkscape:window-y="0"
     inkscape:window-maximized="1" />
  <metadata
     id="metadata5">
    <rdf:RDF>
      <cc:Work
         rdf:about="">
        <dc:format>image/svg+xml</dc:format>
        <dc:type
           rdf:resource="http://purl.org/dc/dcmitype/StillImage" />
        <dc:title></dc:title>
      </cc:Work>
    </rdf:RDF>
  </metadata>
  <g
     inkscape:label="Layer 1"
     inkscape:groupmode="layer"
     id="layer1">
    <g
       id="g3299"
       transform="matrix(1.2380545,0,0,1.2380545,-20.782816,-7.9595784)">
      <rect
         style="opacity:0.758064;fill:black;fill-opacity:1;stroke:none;stroke-width:0.23417;stroke-dasharray:2.81004, 2.81004;filter:url(#filter1091)"
         id="rect833-3-6-3"
         width="106.21132"
         height="23.8125"
         x="52.160706"
         y="114.52679"
         ry="0.14064257" />
      <rect
         style="opacity:0.767742;fill:black;fill-opacity:1;stroke:none;stroke-width:0.23417;stroke-dasharray:2.81004, 2.81004"
         id="rect833-3-6"
         width="106.21132"
         height="23.8125"
         x="49.136902"
         y="117.17262"
         ry="0.14064257" />
      <rect
         style="fill:#9388a2;fill-opacity:1;stroke:none;stroke-width:0.0607243;stroke-dasharray:0.72869, 0.72869;filter:url(#filter2785-0)"
         id="rect1099-6-7-1"
         width="2.6458352"
         height="2.6458359"
         x="149.08798"
         y="135.12648"
         ry="0.68289316" />
      <rect
         style="fill:#9388a2;fill-opacity:1;stroke:none;stroke-width:0.0607243;stroke-dasharray:0.72869, 0.72869"
         id="rect1099-6-5"
         width="2.6458352"
         height="2.6458359"
         x="148.75729"
         y="135.50441"
         ry="0.68289316" />
      <rect
         style="fill:#9388a2;fill-opacity:1;stroke:none;stroke-width:0.0607243;stroke-dasharray:0.72869, 0.72869;filter:url(#filter2789-3)"
         id="rect1099-6-1-9-5"
         width="2.6458352"
         height="2.6458359"
         x="145.23737"
         y="135.12648"
         ry="0.68289316" />
      <rect
         style="fill:#9388a2;fill-opacity:1;stroke:none;stroke-width:0.0607243;stroke-dasharray:0.72869, 0.72869"
         id="rect1099-6-1-4"
         width="2.6458352"
         height="2.6458359"
         x="144.90668"
         y="135.50441"
         ry="0.68289316" />
      <rect
         style="fill:#9388a2;fill-opacity:1;stroke:none;stroke-width:0.0607243;stroke-dasharray:0.72869, 0.72869;filter:url(#filter2793-0)"
         id="rect1099-6-1-8-2-7"
         width="2.6458352"
         height="2.6458359"
         x="141.38672"
         y="135.12648"
         ry="0.68289316" />
      <rect
         style="fill:#9388a2;fill-opacity:1;stroke:none;stroke-width:0.0607243;stroke-dasharray:0.72869, 0.72869"
         id="rect1099-6-1-8-6"
         width="2.6458352"
         height="2.6458359"
         x="141.05603"
         y="135.50441"
         ry="0.68289316" />
    </g>
    <g
       id="g3912"
       transform="matrix(1.2380545,0,0,1.2380545,-68.431586,-62.88802)">
      <g
         id="g3895">
        <g
           id="g3879">
          <g
             id="g3740"
             transform="translate(36.310828,23.519719)">
            <g
               id="g3726">
              <g
                 id="g3713">
                <g
                   id="g3701">
                  <g
                     id="g3299-9"
                     transform="translate(2.1759841,-41.708597)">
                    <rect
                       style="opacity:0.758064;fill:black;fill-opacity:1;stroke:none;stroke-width:0.23417;stroke-dasharray:2.81004, 2.81004;filter:url(#filter1091-3)"
                       id="rect833-3-6-3-4"
                       width="106.21132"
                       height="23.8125"
                       x="52.160706"
                       y="114.52679"
                       ry="0.14064257" />
                    <rect
                       style="opacity:0.767742;fill:black;fill-opacity:1;stroke:none;stroke-width:0.23417;stroke-dasharray:2.81004, 2.81004"
                       id="rect833-3-6-6"
                       width="106.21132"
                       height="23.8125"
                       x="49.136902"
                       y="117.17262"
                       ry="0.14064257" />
                    <rect
                       style="fill:#9388a2;fill-opacity:1;stroke:none;stroke-width:0.0607243;stroke-dasharray:0.72869, 0.72869;filter:url(#filter2785-0-9)"
                       id="rect1099-6-7-1-9"
                       width="2.6458352"
                       height="2.6458359"
                       x="149.08798"
                       y="135.12648"
                       ry="0.68289316" />
                    <rect
                       style="fill:#9388a2;fill-opacity:1;stroke:none;stroke-width:0.0607243;stroke-dasharray:0.72869, 0.72869"
                       id="rect1099-6-5-2"
                       width="2.6458352"
                       height="2.6458359"
                       x="148.75729"
                       y="135.50441"
                       ry="0.68289316" />
                    <rect
                       style="fill:#9388a2;fill-opacity:1;stroke:none;stroke-width:0.0607243;stroke-dasharray:0.72869, 0.72869;filter:url(#filter2789-3-5)"
                       id="rect1099-6-1-9-5-2"
                       width="2.6458352"
                       height="2.6458359"
                       x="145.23737"
                       y="135.12648"
                       ry="0.68289316" />
                    <rect
                       style="fill:#9388a2;fill-opacity:1;stroke:none;stroke-width:0.0607243;stroke-dasharray:0.72869, 0.72869"
                       id="rect1099-6-1-4-4"
                       width="2.6458352"
                       height="2.6458359"
                       x="144.90668"
                       y="135.50441"
                       ry="0.68289316" />
                    <rect
                       style="fill:#9388a2;fill-opacity:1;stroke:none;stroke-width:0.0607243;stroke-dasharray:0.72869, 0.72869;filter:url(#filter2793-0-0)"
                       id="rect1099-6-1-8-2-7-7"
                       width="2.6458352"
                       height="2.6458359"
                       x="141.38672"
                       y="135.12648"
                       ry="0.68289316" />
                    <rect
                       style="fill:#9388a2;fill-opacity:1;stroke:none;stroke-width:0.0607243;stroke-dasharray:0.72869, 0.72869"
                       id="rect1099-6-1-8-6-7"
                       width="2.6458352"
                       height="2.6458359"
                       x="141.05603"
                       y="135.50441"
                       ry="0.68289316" />
                  </g>
                </g>
              </g>
            </g>
          </g>
        </g>
      </g>
    </g>
    <g
       id="g3740-6"
       transform="matrix(1.2380545,0,0,1.2380545,-23.476803,4.9543046)">
      <g
         id="g3726-8">
        <g
           id="g3713-0">
          <g
             id="g3701-2">
            <g
               id="g3299-9-1"
               transform="translate(2.1759841,-41.708597)">
              <rect
                 style="opacity:0.758064;fill:black;fill-opacity:1;stroke:none;stroke-width:0.23417;stroke-dasharray:2.81004, 2.81004;filter:url(#filter1091-3-5)"
                 id="rect833-3-6-3-4-0"
                 width="106.21132"
                 height="23.8125"
                 x="52.160706"
                 y="114.52679"
                 ry="0.14064257" />
              <rect
                 style="opacity:0.767742;fill:black;fill-opacity:1;stroke:none;stroke-width:0.23417;stroke-dasharray:2.81004, 2.81004"
                 id="rect833-3-6-6-5"
                 width="106.21132"
                 height="23.8125"
                 x="49.136902"
                 y="117.17262"
                 ry="0.14064257" />
              <rect
                 style="fill:#9388a2;fill-opacity:1;stroke:none;stroke-width:0.0607243;stroke-dasharray:0.72869, 0.72869;filter:url(#filter2785-0-9-8)"
                 id="rect1099-6-7-1-9-1"
                 width="2.6458352"
                 height="2.6458359"
                 x="149.08798"
                 y="135.12648"
                 ry="0.68289316" />
              <rect
                 style="fill:#9388a2;fill-opacity:1;stroke:none;stroke-width:0.0607243;stroke-dasharray:0.72869, 0.72869"
                 id="rect1099-6-5-2-1"
                 width="2.6458352"
                 height="2.6458359"
                 x="148.75729"
                 y="135.50441"
                 ry="0.68289316" />
              <rect
                 style="fill:#9388a2;fill-opacity:1;stroke:none;stroke-width:0.0607243;stroke-dasharray:0.72869, 0.72869;filter:url(#filter2789-3-5-2)"
                 id="rect1099-6-1-9-5-2-0"
                 width="2.6458352"
                 height="2.6458359"
                 x="145.23737"
                 y="135.12648"
                 ry="0.68289316" />
              <rect
                 style="fill:#9388a2;fill-opacity:1;stroke:none;stroke-width:0.0607243;stroke-dasharray:0.72869, 0.72869"
                 id="rect1099-6-1-4-4-8"
                 width="2.6458352"
                 height="2.6458359"
                 x="144.90668"
                 y="135.50441"
                 ry="0.68289316" />
              <rect
                 style="fill:#9388a2;fill-opacity:1;stroke:none;stroke-width:0.0607243;stroke-dasharray:0.72869, 0.72869;filter:url(#filter2793-0-0-9)"
                 id="rect1099-6-1-8-2-7-7-5"
                 width="2.6458352"
                 height="2.6458359"
                 x="141.38672"
                 y="135.12648"
                 ry="0.68289316" />
              <rect
                 style="fill:#9388a2;fill-opacity:1;stroke:none;stroke-width:0.0607243;stroke-dasharray:0.72869, 0.72869"
                 id="rect1099-6-1-8-6-7-0"
                 width="2.6458352"
                 height="2.6458359"
                 x="141.05603"
                 y="135.50441"
                 ry="0.68289316" />
            </g>
          </g>
        </g>
      </g>
    </g>
  </g>
</svg>
