[
  {
    "orig_doc_id": "1354",
    "Title": "&nbsp;ՀՀ ՕՐԵՆՔԸ ՎԻՃԱԿԱԽԱՂԵՐԻ ՄԱՍԻՆ"
  },
  {
    "orig_doc_id": "110824",
    "Title": "ԱԶԳԱՅԻՆ ԺՈՂՈՎԻ ԿԱՆՈՆԱԿԱՐԳ ՍԱՀՄԱՆԱԴՐԱԿԱՆ ՕՐԵՆՔԸ "
  },
  {
    "orig_doc_id": "72865",
    "Title": "ԸՆԴԵՐՔԻ ՄԱՍԻՆ ՀՀ ՕՐԵՆՍԳԻՐՔ"
  },
  {
    "orig_doc_id": "110534",
    "Title": "ԿՈՒՍԱԿՑՈՒԹՅՈՒՆՆԵՐԻ ՄԱՍԻՆ ՍԱՀՄԱՆԱԴՐԱԿԱՆ ՕՐԵՆՔԸ "
  },
  {
    "orig_doc_id": "21354",
    "Title": "ՀՀ ԱՆՏԱՌԱՅԻՆ ՕՐԵՆՍԳԻՐՔ"
  },
  {
    "orig_doc_id": "51",
    "Title": "ՀՀ ԱՇԽԱՏԱՆՔԱՅԻՆ ՕՐԵՆՍԳԻՐՔ"
  },
  {
    "orig_doc_id": "119531",
    "Title": "ՀՀ ԴԱՏԱԿԱՆ ՕՐԵՆՍԳԻՐՔ ՀՀ ՍԱՀՄԱՆԱԴՐԱԿԱՆ ՕՐԵՆՔԸ"
  },
  {
    "orig_doc_id": "72865",
    "Title": "ՀՀ ԸՆԴԵՐՔԻ ՄԱՍԻՆ ՕՐԵՆՍԳԻՐՔ"
  },
  {
    "orig_doc_id": "49",
    "Title": "ՀՀ ԸՆՏԱՆԵԿԱՆ ՕՐԵՆՍԳԻՐՔ"
  },
  {
    "orig_doc_id": "105967",
    "Title": "ՀՀ ԸՆՏՐԱԿԱՆ ՕՐԵՆՍԳԻՐՔ ՀՀ ՍԱՀՄԱՆԱԴՐԱԿԱՆ ՕՐԵՆՔԸ"
  },
  {
    "orig_doc_id": "109017",
    "Title": "ՀՀ ՀԱՐԿԱՅԻՆ ՕՐԵՆՍԳԻՐՔ"
  },
  {
    "orig_doc_id": "39",
    "Title": "ՀՀ ՀՈՂԱՅԻՆ ՕՐԵՆՍԳԻՐՔ"
  },
  {
    "orig_doc_id": "41",
    "Title": "ՀՀ ՋՐԱՅԻՆ ՕՐԵՆՍԳԻՐՔ"
  },
  {
    "orig_doc_id": "138834",
    "Title": "ՀՀ ՍԱՀՄԱՆԱԴՐԱԿԱՆ ՕՐԵՆՔԸ «ԱԶԳԱՅԻՆ ԺՈՂՈՎԻ ԿԱՆՈՆԱԿԱՐԳ» ՍԱՀՄԱՆԱԴՐԱԿԱՆ ՕՐԵՆՔՈՒՄ ՓՈՓՈԽՈՒԹՅՈՒՆՆԵՐ ԵՎ ԼՐԱՑՈՒՄ ԿԱՏԱՐԵԼՈՒ ՄԱՍԻՆ"
  },
  {
    "orig_doc_id": "149243",
    "Title": "ՀՀ ՍԱՀՄԱՆԱԴՐԱԿԱՆ ՕՐԵՆՔԸ «ԿՈՒՍԱԿՑՈՒԹՅՈՒՆՆԵՐԻ ՄԱՍԻՆ» ՍԱՀՄԱՆԱԴՐԱԿԱՆ ՕՐԵՆՔՈՒՄ ԼՐԱՑՈՒՄՆԵՐ ԵՎ ՓՈՓՈԽՈՒԹՅՈՒՆՆԵՐ ԿԱՏԱՐԵԼՈՒ ՄԱՍԻՆ"
  },
  {
    "orig_doc_id": "153061",
    "Title": "ՀՀ ՍԱՀՄԱՆԱԴՐԱԿԱՆ ՕՐԵՆՔԸ «ՀԱՆՐԱՔՎԵԻ ՄԱՍԻՆ» ՍԱՀՄԱՆԱԴՐԱԿԱՆ ՕՐԵՆՔՈՒՄ ՓՈՓՈԽՈՒԹՅՈՒՆՆԵՐ ԵՎ ԼՐԱՑՈՒՄ ԿԱՏԱՐԵԼՈՒ ՄԱՍԻՆ"
  },
  {
    "orig_doc_id": "156892",
    "Title": "ՀՀ ՍԱՀՄԱՆԱԴՐԱԿԱՆ ՕՐԵՆՔԸ «ՀՀ ԴԱՏԱԿԱՆ ՕՐԵՆՍԳԻՐՔ» ՍԱՀՄԱՆԱԴՐԱԿԱՆ ՕՐԵՆՔՈՒՄ ԼՐԱՑՈՒՄՆԵՐ ԵՎ ՓՈՓՈԽՈՒԹՅՈՒՆՆԵՐ ԿԱՏԱՐԵԼՈՒ ՄԱՍԻՆ"
  },
  {
    "orig_doc_id": "172480",
    "Title": "ՀՀ ՍԱՀՄԱՆԱԴՐԱԿԱՆ ՕՐԵՆՔԸ «ՀՀ ԴԱՏԱԿԱՆ ՕՐԵՆՍԳԻՐՔ» ՍԱՀՄԱՆԱԴՐԱԿԱՆ ՕՐԵՆՔՈՒՄ ՓՈՓՈԽՈՒԹՅՈՒՆՆԵՐ ԵՎ ԼՐԱՑՈՒՄՆԵՐ ԿԱՏԱՐԵԼՈՒ ՄԱՍԻՆ"
  },
  {
    "orig_doc_id": "153062",
    "Title": "ՀՀ ՍԱՀՄԱՆԱԴՐԱԿԱՆ ՕՐԵՆՔԸ «ՀՀ ԸՆՏՐԱԿԱՆ ՕՐԵՆՍԳԻՐՔ» ՍԱՀՄԱՆԱԴՐԱԿԱՆ ՕՐԵՆՔՈՒՄ ՓՈՓՈԽՈՒԹՅՈՒՆՆԵՐ ԵՎ ԼՐԱՑՈՒՄՆԵՐ ԿԱՏԱՐԵԼՈՒ ՄԱՍԻՆ"
  },
  {
    "orig_doc_id": "120709",
    "Title": "ՀՀ ՍԱՀՄԱՆԱԴՐԱԿԱՆ ՕՐԵՆՔԸ ՀԱՆՐԱՔՎԵԻ ՄԱՍԻՆ"
  },
  {
    "orig_doc_id": "119246",
    "Title": "ՀՀ ՍԱՀՄԱՆԱԴՐԱԿԱՆ ՕՐԵՆՔԸ ՍԱՀՄԱՆԱԴՐԱԿԱՆ ԴԱՏԱՐԱՆԻ ՄԱՍԻՆ"
  },
  {
    "orig_doc_id": "87705",
    "Title": "ՀՀ ՎԱՐՉԱԿԱՆ ԴԱՏԱՎԱՐՈՒԹՅԱՆ ՕՐԵՆՍԳԻՐՔ"
  },
  {
    "orig_doc_id": "725",
    "Title": "ՀՀ ՏԱՐԱԾՔՈՒՄ ԳՈՐԾՈՂ ԿԱԶՄԱԿԵՐՊՈՒԹՅՈՒՆՆԵՐՈՒՄ ՍՏՈՒԳՈՒՄՆԵՐԻ ԿԱԶՄԱԿԵՐՊՄԱՆ ԵՎ ԱՆՑԿԱՑՄԱՆ ՄԱՍԻՆ"
  },
  {
    "orig_doc_id": "120057",
    "Title": "ՀՀ ՔԱՂԱՔԱՑԻԱԿԱՆ ԴԱՏԱՎԱՐՈՒԹՅԱՆ ՕՐԵՆՍԳԻՐՔ"
  },
  {
    "orig_doc_id": "29",
    "Title": "ՀՀ ՔԱՂԱՔԱՑԻԱԿԱՆ ՕՐԵՆՍԳԻՐՔ"
  },
  {
    "orig_doc_id": "154763",
    "Title": "ՀՀ ՔՐԵԱԿԱՆ ԴԱՏԱՎԱՐՈՒԹՅԱՆ ՕՐԵՆՍԳԻՐՔ"
  },
  {
    "orig_doc_id": "33",
    "Title": "ՀՀ ՔՐԵԱԿԱՆ ԴԱՏԱՎԱՐՈՒԹՅԱՆ ՕՐԵՆՍԳԻՐՔ"
  },
  {
    "orig_doc_id": "153080",
    "Title": "ՀՀ ՔՐԵԱԿԱՆ ՕՐԵՆՍԳԻՐՔ"
  },
  {
    "orig_doc_id": "164938",
    "Title": "ՀՀ ՔՐԵԱԿԱՏԱՐՈՂԱԿԱՆ ՕՐԵՆՍԳԻՐՔ"
  },
  {
    "orig_doc_id": "1271",
    "Title": "ՀՀ ՕՐԵՆՔԸ 1988-1992 ԹՎԱԿԱՆՆԵՐԻՆ ԱԴՐԲԵՋԱՆԻ ՀԱՆՐԱՊԵՏՈՒԹՅՈՒՆԻՑ ԲՌՆԱԳԱՂԹՎԱԾ ՓԱԽՍՏԱԿԱՆՆԵՐԻ ՀԱՄԱՐ ԿԱՌՈՒՑՎԱԾ ԲՆԱԿԱՐԱՆՆԵՐԸ ՍԵՓԱԿԱՆՈՒԹՅԱՆ ԻՐԱՎՈՒՆՔՈՎ ՓԱԽՍՏԱԿԱՆՆԵՐԻՆ ՀԱՏԿԱՑՆԵԼՈՒ ՄԱՍԻՆ"
  },
  {
    "orig_doc_id": "91591",
    "Title": "ՀՀ ՕՐԵՆՔԸ «ԱՌԵՎՏՐԻ ԵՎ ԾԱՌԱՅՈՒԹՅՈՒՆՆԵՐԻ ՄԱՍԻՆ» ՀՀ ՕՐԵՆՔՈՒՄ ԼՐԱՑՈՒՄ ԿԱՏԱՐԵԼՈՒ ՄԱՍԻՆ"
  },
  {
    "orig_doc_id": "155027",
    "Title": "ՀՀ ՕՐԵՆՔԸ «ԱՎՏՈՄՈԲԻԼԱՅԻՆ ՏՐԱՆՍՊՈՐՏԻ ՄԱՍԻՆ» ՕՐԵՆՔՈՒՄ ԼՐԱՑՈՒՄՆԵՐ ԵՎ ՓՈՓՈԽՈՒԹՅՈՒՆՆԵՐ ԿԱՏԱՐԵԼՈՒ ՄԱՍԻՆ"
  },
  {
    "orig_doc_id": "150012",
    "Title": "ՀՀ ՕՐԵՆՔԸ «ԱՎՏՈՄՈԲԻԼԱՅԻՆ ՏՐԱՆՍՊՈՐՏԻ ՄԱՍԻՆ» ՕՐԵՆՔՈՒՄ ԼՐԱՑՈՒՄՆԵՐ ԿԱՏԱՐԵԼՈՒ ՄԱՍԻՆ"
  },
  {
    "orig_doc_id": "101321",
    "Title": "ՀՀ ՕՐԵՆՔԸ «ԲՆԱԿՉՈՒԹՅԱՆ ԲԺՇԿԱԿԱՆ ՕԳՆՈՒԹՅԱՆ ԵՎ ՍՊԱՍԱՐԿՄԱՆ ՄԱՍԻՆ» ՀՀ ՕՐԵՆՔՈՒՄ ՓՈՓՈԽՈՒԹՅՈՒՆՆԵՐ ԵՎ ԼՐԱՑՈՒՄՆԵՐ ԿԱՏԱՐԵԼՈՒ ՄԱՍԻՆ"
  },
  {
    "orig_doc_id": "1114",
    "Title": "ՀՀ ՕՐԵՆՔԸ «ԳԱՖԷՍՃԵԱՆ ԹԱՆԳԱՐԱՆ» ՀԻՄՆԱԴՐԱՄԻՆ ՀԱՐԿԱՅԻՆ, ՄԱՔՍԱՅԻՆ ԵՎ ՊԱՐՏԱԴԻՐ ՎՃԱՐՆԵՐԻ ԳԾՈՎ ԱՐՏՈՆՈՒԹՅՈՒՆՆԵՐ ՏՐԱՄԱԴՐԵԼՈՒ ՄԱՍԻՆ"
  },
  {
    "orig_doc_id": "69875",
    "Title": "ՀՀ ՕՐԵՆՔԸ «ԳՈՒՅՔԻ ՆԿԱՏՄԱՄԲ ԻՐԱՎՈՒՆՔՆԵՐԻ ՊԵՏԱԿԱՆ ԳՐԱՆՑՄԱՆ ՄԱՍԻՆ» ՀՀ ՕՐԵՆՔՈՒՄ ՓՈՓՈԽՈՒԹՅՈՒՆ ԿԱՏԱՐԵԼՈՒ ՄԱՍԻՆ"
  },
  {
    "orig_doc_id": "148941",
    "Title": "ՀՀ ՕՐԵՆՔԸ «ԳՈՒՅՔԻ ՆԿԱՏՄԱՄԲ ԻՐԱՎՈՒՆՔՆԵՐԻ ՊԵՏԱԿԱՆ ԳՐԱՆՑՄԱՆ ՄԱՍԻՆ» ՕՐԵՆՔՈՒՄ ՓՈՓՈԽՈՒԹՅՈՒՆՆԵՐ ԵՎ ԼՐԱՑՈՒՄՆԵՐ ԿԱՏԱՐԵԼՈՒ ՄԱՍԻՆ"
  },
  {
    "orig_doc_id": "1847",
    "Title": "ՀՀ ՕՐԵՆՔԸ «ԴԱՏԱԿԱՆ ԱԿՏԵՐԻ ՀԱՐԿԱԴԻՐ ԿԱՏԱՐՄԱՆ ՄԱՍԻՆ» ՀՀ ՕՐԵՆՔՈՒՄ ԼՐԱՑՈՒՄ ԵՎ ՓՈՓՈԽՈՒԹՅՈՒՆՆԵՐ ԿԱՏԱՐԵԼՈՒ ՄԱՍԻՆ"
  },
  {
    "orig_doc_id": "140332",
    "Title": "ՀՀ ՕՐԵՆՔԸ «ԵՐԵՎԱՆ ՔԱՂԱՔՈՒՄ ՏԵՂԱԿԱՆ ԻՆՔՆԱԿԱՌԱՎԱՐՄԱՆ ՄԱՍԻՆ» ՕՐԵՆՔՈՒՄ ՓՈՓՈԽՈՒԹՅՈՒՆՆԵՐ ԿԱՏԱՐԵԼՈՒ ՄԱՍԻՆ"
  },
  {
    "orig_doc_id": "931",
    "Title": "ՀՀ ՕՐԵՆՔԸ «ԵՐԵՎԱՆԻ ԷԼԵԿՏՐԱՑԱՆՑ», «ՀՅՈՒՍԻՍԱՅԻՆ ԷԼԵԿՏՐԱՑԱՆՑ», «ՀԱՐԱՎԱՅԻՆ ԷԼԵԿՏՐԱՑԱՆՑ» ԵՎ «ԿԵՆՏՐՈՆԱԿԱՆ ԷԼԵԿՏՐԱՑԱՆՑ» ՓԱԿ ԲԱԺՆԵՏԻՐԱԿԱՆ ԸՆԿԵՐՈՒԹՅՈՒՆՆԵՐԻ ՄԱՍՆԱՎՈՐԵՑՄԱՆ ՄԱՍԻՆ"
  },
  {
    "orig_doc_id": "118523",
    "Title": "ՀՀ ՕՐԵՆՔԸ «ԼԻՑԵՆԶԱՎՈՐՄԱՆ ՄԱՍԻՆ» ՀՀ ՕՐԵՆՔՈՒՄ ՓՈՓՈԽՈՒԹՅՈՒՆ ԿԱՏԱՐԵԼՈՒ ՄԱՍԻՆ"
  },
  {
    "orig_doc_id": "169843",
    "Title": "ՀՀ ՕՐԵՆՔԸ «ԼԻՑԵՆԶԱՎՈՐՄԱՆ ՄԱՍԻՆ» ՕՐԵՆՔՈՒՄ ՓՈՓՈԽՈՒԹՅՈՒՆՆԵՐ ԵՎ ԼՐԱՑՈՒՄՆԵՐ ԿԱՏԱՐԵԼՈՒ ՄԱՍԻՆ"
  },
  {
    "orig_doc_id": "149248",
    "Title": "ՀՀ ՕՐԵՆՔԸ «ԿՈՌՈՒՊՑԻԱՅԻ ԿԱՆԽԱՐԳԵԼՄԱՆ ՀԱՆՁՆԱԺՈՂՈՎԻ ՄԱՍԻՆ» ՕՐԵՆՔՈՒՄ ԼՐԱՑՈՒՄՆԵՐ ԿԱՏԱՐԵԼՈՒ ՄԱՍԻՆ"
  },
  {
    "orig_doc_id": "153071",
    "Title": "ՀՀ ՕՐԵՆՔԸ «ԿՈՌՈՒՊՑԻԱՅԻ ԿԱՆԽԱՐԳԵԼՄԱՆ ՀԱՆՁՆԱԺՈՂՈՎԻ ՄԱՍԻՆ» ՕՐԵՆՔՈՒՄ ԼՐԱՑՈՒՄՆԵՐ ԿԱՏԱՐԵԼՈՒ ՄԱՍԻՆ"
  },
  {
    "orig_doc_id": "146421",
    "Title": "ՀՀ ՕՐԵՆՔԸ «ԿՈՌՈՒՊՑԻԱՅԻ ԿԱՆԽԱՐԳԵԼՄԱՆ ՀԱՆՁՆԱԺՈՂՈՎԻ ՄԱՍԻՆ» ՕՐԵՆՔՈՒՄ ՓՈՓՈԽՈՒԹՅՈՒՆՆԵՐ ԵՎ ԼՐԱՑՈՒՄՆԵՐ ԿԱՏԱՐԵԼՈՒ ՄԱՍԻՆ"
  },
  {
    "orig_doc_id": "114384",
    "Title": "ՀՀ ՕՐԵՆՔԸ «ՀԱՆՐԱՅԻՆ ԾԱՌԱՅՈՒԹՅՈՒՆՆԵՐԸ ԿԱՐԳԱՎՈՐՈՂ ՄԱՐՄՆԻ ՄԱՍԻՆ» ՀՀ ՕՐԵՆՔՈՒՄ ՓՈՓՈԽՈՒԹՅՈՒՆՆԵՐ ԵՎ ԼՐԱՑՈՒՄՆԵՐ ԿԱՏԱՐԵԼՈՒ ՄԱՍԻՆ"
  },
  {
    "orig_doc_id": "151812",
    "Title": "ՀՀ ՕՐԵՆՔԸ «ՀԱՏՈՒԿ ՔՆՆՉԱԿԱՆ ԾԱՌԱՅՈՒԹՅԱՆ ՄԱՍԻՆ» ՕՐԵՆՔՆ ՈՒԺԸ ԿՈՐՑՐԱԾ ՃԱՆԱՉԵԼՈՒ ՄԱՍԻՆ"
  },
  {
    "orig_doc_id": "29140",
    "Title": "ՀՀ ՕՐԵՆՔԸ «ՀՀ ԲՅՈՒՋԵՏԱՅԻՆ ՀԱՄԱԿԱՐԳԻ ՄԱՍԻՆ» ՀՀ ՕՐԵՆՔՈՒՄ ԼՐԱՑՈՒՄ ԿԱՏԱՐԵԼՈՒ ՄԱՍԻՆ"
  },
  {
    "orig_doc_id": "751",
    "Title": "ՀՀ ՕՐԵՆՔԸ «ՀՀ ԿԱՌԱՎԱՐՈՒԹՅԱՆ ԵՎ ԱՄԵՐԻԿԱՅԻ ՄԻԱՑՅԱԼ ՆԱՀԱՆԳՆԵՐԻ ԿԱՌԱՎԱՐՈՒԹՅԱՆ ՄԻՋԵՎ ՀԱՄԱԳՈՐԾԱԿՑՈՒԹՅԱՆ ՎԵՐԱԲԵՐՅԱԼ ՄԱՐԴԱՍԻՐԱԿԱՆ ԵՎ ՏԵԽՆԻԿԱԿԱՆ ՏՆՏԵՍԱԿԱՆ ՕԳՆՈՒԹՅԱՆ ՎԵՐԱՀՍԿՈՒՄԸ ՀԵՇՏԱՑՆԵԼՈՒ ՄԱՍԻՆ» 1992 ԹՎԱԿԱՆԻ ԴԵԿՏԵՄԲԵՐԻ 15-ԻՆ ՍՏՈՐԱԳՐՎԱԾ ՀԱՄԱՁԱՅՆԱԳՐՈՎ ՆԱԽԱՏԵՍՎԱԾ ՀԱՐԿԱՅԻՆ, ՄԱՔՍԱՅԻՆ ԵՎ ՊԱՐՏԱԴԻՐ ՎՃԱՐՆԵՐԻ ԱՐՏՈՆՈՒԹՅՈՒՆՆԵՐԻՑ ՕԳՏՎԵԼՈՒ ՄԱՍԻՆ"
  },
  {
    "orig_doc_id": "158942",
    "Title": "ՀՀ ՕՐԵՆՔԸ «ՀՀ ՔԱՂԱՔԱՑԻՈՒԹՅԱՆ ՄԱՍԻՆ» ՕՐԵՆՔՈՒՄ ՓՈՓՈԽՈՒԹՅՈՒՆՆԵՐ ԵՎ ԼՐԱՑՈՒՄՆԵՐ ԿԱՏԱՐԵԼՈՒ ՄԱՍԻՆ"
  },
  {
    "orig_doc_id": "1848",
    "Title": "ՀՀ ՕՐԵՆՔԸ «ՀՐԱՊԱՐԱԿԱՅԻՆ ՍԱԿԱՐԿՈՒԹՅՈՒՆՆԵՐԻ ՄԱՍԻՆ» ՀՀ ՕՐԵՆՔՈՒՄ ՓՈՓՈԽՈՒԹՅՈՒՆՆԵՐ ԵՎ ԼՐԱՑՈՒՄՆԵՐ ԿԱՏԱՐԵԼՈՒ ՄԱՍԻՆ"
  },
  {
    "orig_doc_id": "63755",
    "Title": "ՀՀ ՕՐԵՆՔԸ «ՃԱՆԱՊԱՐՀԱՅԻՆ ԵՐԹԵՎԵԿՈՒԹՅԱՆ ԱՆՎՏԱՆԳՈՒԹՅԱՆ ԱՊԱՀՈՎՄԱՆ ՄԱՍԻՆ» ՀՀ ՕՐԵՆՔՈՒՄ ԼՐԱՑՈՒՄՆԵՐ ԵՎ ՓՈՓՈԽՈՒԹՅՈՒՆՆԵՐ ԿԱՏԱՐԵԼՈՒ ՄԱՍԻՆ"
  },
  {
    "orig_doc_id": "142606",
    "Title": "ՀՀ ՕՐԵՆՔԸ «ՆԱԽԱԴՊՐՈՑԱԿԱՆ ԿՐԹՈՒԹՅԱՆ ՄԱՍԻՆ» ՕՐԵՆՔՈՒՄ ՓՈՓՈԽՈՒԹՅՈՒՆ ԿԱՏԱՐԵԼՈՒ ՄԱՍԻՆ"
  },
  {
    "orig_doc_id": "41100",
    "Title": "ՀՀ ՕՐԵՆՔԸ «ՈՍՏԻԿԱՆՈՒԹՅՈՒՆՈՒՄ ԾԱՌԱՅՈՒԹՅԱՆ ՄԱՍԻՆ» ՀՀ ՕՐԵՆՔՈՒՄ ՓՈՓՈԽՈՒԹՅՈՒՆՆԵՐ ԵՎ ԼՐԱՑՈՒՄՆԵՐ ԿԱՏԱՐԵԼՈՒ ՄԱՍԻՆ"
  },
  {
    "orig_doc_id": "73183",
    "Title": "ՀՀ ՕՐԵՆՔԸ «ՈՍՏԻԿԱՆՈՒԹՅՈՒՆՈՒՄ ԾԱՌԱՅՈՒԹՅԱՆ ՄԱՍԻՆ» ՀՀ ՕՐԵՆՔՈՒՄ ՓՈՓՈԽՈՒԹՅՈՒՆՆԵՐ ԵՎ ԼՐԱՑՈՒՄՆԵՐ ԿԱՏԱՐԵԼՈՒ ՄԱՍԻՆ"
  },
  {
    "orig_doc_id": "164906",
    "Title": "ՀՀ ՕՐԵՆՔԸ «ՊԱՇՏՈՆԱՏԱՐ ԱՆՁԱՆՑ ԳՈՐԾՈՒՆԵՈՒԹՅԱՆ ԱՊԱՀՈՎՄԱՆ, ՍՊԱՍԱՐԿՄԱՆ ԵՎ ՍՈՑԻԱԼԱԿԱՆ ԵՐԱՇԽԻՔՆԵՐԻ ՄԱՍԻՆ» ՕՐԵՆՔՈՒՄ ՓՈՓՈԽՈՒԹՅՈՒՆ ԿԱՏԱՐԵԼՈՒ ՄԱՍԻՆ"
  },
  {
    "orig_doc_id": "151808",
    "Title": "ՀՀ ՕՐԵՆՔԸ «ՊԱՇՏՈՆԱՏԱՐ ԱՆՁԱՆՑ ԳՈՐԾՈՒՆԵՈՒԹՅԱՆ ԱՊԱՀՈՎՄԱՆ, ՍՊԱՍԱՐԿՄԱՆ ԵՎ ՍՈՑԻԱԼԱԿԱՆ ԵՐԱՇԽԻՔՆԵՐԻ ՄԱՍԻՆ» ՕՐԵՆՔՈՒՄ ՓՈՓՈԽՈՒԹՅՈՒՆՆԵՐ ԿԱՏԱՐԵԼՈՒ ՄԱՍԻՆ"
  },
  {
    "orig_doc_id": "1276",
    "Title": "ՀՀ ՕՐԵՆՔԸ «ՊԵՏԱԿԱՆ ԳՈՒՅՔԻ ՄԱՍՆԱՎՈՐԵՑՄԱՆ 2001-2003 ԹՎԱԿԱՆՆԵՐԻ ԾՐԱԳՐԻ ՄԱՍԻՆ» ՀՀ ՕՐԵՆՔՈՒՄ ԼՐԱՑՈՒՄՆԵՐ ԵՎ ՓՈՓՈԽՈՒԹՅՈՒՆ ԿԱՏԱՐԵԼՈՒ ՄԱՍԻՆ"
  },
  {
    "orig_doc_id": "175712",
    "Title": "ՀՀ ՕՐԵՆՔԸ «ՊԵՏԱԿԱՆ ՊԱՇՏՈՆՆԵՐ ԵՎ ՊԵՏԱԿԱՆ ԾԱՌԱՅՈՒԹՅԱՆ ՊԱՇՏՈՆՆԵՐ ԶԲԱՂԵՑՆՈՂ ԱՆՁԱՆՑ ՎԱՐՁԱՏՐՈՒԹՅԱՆ ՄԱՍԻՆ» ՕՐԵՆՔՈՒՄ ԼՐԱՑՈՒՄՆԵՐ ԵՎ ՓՈՓՈԽՈՒԹՅՈՒՆ ԿԱՏԱՐԵԼՈՒ ՄԱՍԻՆ"
  },
  {
    "orig_doc_id": "151805",
    "Title": "ՀՀ ՕՐԵՆՔԸ «ՊԵՏԱԿԱՆ ՊԱՇՏՈՆՆԵՐ ԵՎ ՊԵՏԱԿԱՆ ԾԱՌԱՅՈՒԹՅԱՆ ՊԱՇՏՈՆՆԵՐ ԶԲԱՂԵՑՆՈՂ ԱՆՁԱՆՑ ՎԱՐՁԱՏՐՈՒԹՅԱՆ ՄԱՍԻՆ» ՕՐԵՆՔՈՒՄ ԼՐԱՑՈՒՄՆԵՐ ԵՎ ՓՈՓՈԽՈՒԹՅՈՒՆՆԵՐ ԿԱՏԱՐԵԼՈՒ ՄԱՍԻՆ"
  },
  {
    "orig_doc_id": "172490",
    "Title": "ՀՀ ՕՐԵՆՔԸ «ՊԵՏԱԿԱՆ ՊԱՇՏՈՆՆԵՐ ԵՎ ՊԵՏԱԿԱՆ ԾԱՌԱՅՈՒԹՅԱՆ ՊԱՇՏՈՆՆԵՐ ԶԲԱՂԵՑՆՈՂ ԱՆՁԱՆՑ ՎԱՐՁԱՏՐՈՒԹՅԱՆ ՄԱՍԻՆ» ՕՐԵՆՔՈՒՄ ՓՈՓՈԽՈՒԹՅՈՒՆ ԿԱՏԱՐԵԼՈՒ ՄԱՍԻՆ"
  },
  {
    "orig_doc_id": "80176",
    "Title": "ՀՀ ՕՐԵՆՔԸ «ՊԵՏԱԿԱՆ ՏՈՒՐՔԻ ՄԱՍԻՆ» ՀՀ ՕՐԵՆՔՈՒՄ ՓՈՓՈԽՈՒԹՅՈՒՆՆԵՐ ԵՎ ԼՐԱՑՈՒՄՆԵՐ ԿԱՏԱՐԵԼՈՒ ԵՎ «ՊԵՏԱԿԱՆ ՏՈՒՐՔԻ ՄԱՍԻՆ» ՀՀ ՕՐԵՆՔՈՒՄ ՓՈՓՈԽՈՒԹՅՈՒՆՆԵՐ ԵՎ ԼՐԱՑՈՒՄՆԵՐ ԿԱՏԱՐԵԼՈՒ ՄԱՍԻՆ» ՀՀ 2010 ԹՎԱԿԱՆԻ ԱՊՐԻԼԻ 27-Ի ՀՕ-55-Ն ՕՐԵՆՔԸ ՉԵՂՅԱԼ ՃԱՆԱՉԵԼՈՒ ՄԱՍԻՆ"
  },
  {
    "orig_doc_id": "1036",
    "Title": "ՀՀ ՕՐԵՆՔԸ «ՊԵՏԱԿԱՆ ՏՈՒՐՔԻ ՄԱՍԻՆ» ՀՀ ՕՐԵՆՔՈՒՄ ՓՈՓՈԽՈՒԹՅՈՒՆՆԵՐ ԵՎ ԼՐԱՑՈՒՄՆԵՐ ԿԱՏԱՐԵԼՈՒ ՄԱՍԻՆ"
  },
  {
    "orig_doc_id": "140328",
    "Title": "ՀՀ ՕՐԵՆՔԸ «ՍՈՑԻԱԼԱԿԱՆ ԱՋԱԿՑՈՒԹՅԱՆ ՄԱՍԻՆ» ՕՐԵՆՔՈՒՄ ՓՈՓՈԽՈՒԹՅՈՒՆՆԵՐ ԵՎ ԼՐԱՑՈՒՄ ԿԱՏԱՐԵԼՈՒ ՄԱՍԻՆ"
  },
  {
    "orig_doc_id": "140328",
    "Title": "ՀՀ ՕՐԵՆՔԸ «ՍՈՑԻԱԼԱԿԱՆ ԱՋԱԿՑՈՒԹՅԱՆ ՄԱՍԻՆ» ՕՐԵՆՔՈՒՄ ՓՈՓՈԽՈՒԹՅՈՒՆՆԵՐ ԿԱՏԱՐԵԼՈՒ ՄԱՍԻՆ"
  },
  {
    "orig_doc_id": "149252",
    "Title": "ՀՀ ՕՐԵՆՔԸ «ՎԱՐԿԱՅԻՆ ՏԵՂԵԿԱՏՎՈՒԹՅԱՆ ՇՐՋԱՆԱՌՈՒԹՅԱՆ ԵՎ ՎԱՐԿԱՅԻՆ ԲՅՈՒՐՈՆԵՐԻ ԳՈՐԾՈՒՆԵՈՒԹՅԱՆ ՄԱՍԻՆ» ՕՐԵՆՔՈՒՄ ՓՈՓՈԽՈՒԹՅՈՒՆՆԵՐ ԵՎ ԼՐԱՑՈՒՄՆԵՐ ԿԱՏԱՐԵԼՈՒ ՄԱՍԻՆ"
  },
  {
    "orig_doc_id": "161735",
    "Title": "ՀՀ ՕՐԵՆՔԸ «ՏԵՂԱԿԱՆ ԻՆՔՆԱԿԱՌԱՎԱՐՄԱՆ ՄԱՍԻՆ» ՕՐԵՆՔՈՒՄ ԼՐԱՑՈՒՄ ԿԱՏԱՐԵԼՈՒ ՄԱՍԻՆ"
  },
  {
    "orig_doc_id": "140331",
    "Title": "ՀՀ ՕՐԵՆՔԸ «ՏԵՂԱԿԱՆ ԻՆՔՆԱԿԱՌԱՎԱՐՄԱՆ ՄԱՍԻՆ» ՕՐԵՆՔՈՒՄ ՓՈՓՈԽՈՒԹՅՈՒՆ ԿԱՏԱՐԵԼՈՒ ՄԱՍԻՆ"
  },
  {
    "orig_doc_id": "153065",
    "Title": "ՀՀ ՕՐԵՆՔԸ «ՏԵՂԱԿԱՆ ՀԱՆՐԱՔՎԵԻ ՄԱՍԻՆ» ՕՐԵՆՔՈՒՄ ԼՐԱՑՈՒՄ ԵՎ ՓՈՓՈԽՈՒԹՅՈՒՆՆԵՐ ԿԱՏԱՐԵԼՈՒ ՄԱՍԻՆ"
  },
  {
    "orig_doc_id": "120837",
    "Title": "ՀՀ ՕՐԵՆՔԸ «ՏՆՏԵՍԱԿԱՆ ՄՐՑԱԿՑՈՒԹՅԱՆ ՊԱՇՏՊԱՆՈՒԹՅԱՆ ՄԱՍԻՆ» ՀՀ ՕՐԵՆՔՈՒՄ ԼՐԱՑՈՒՄՆԵՐ ԵՎ ՓՈՓՈԽՈՒԹՅՈՒՆՆԵՐ ԿԱՏԱՐԵԼՈՒ ՄԱՍԻՆ"
  },
  {
    "orig_doc_id": "171803",
    "Title": "ՀՀ ՕՐԵՆՔԸ «ՔԱՂԱՔԱՇԻՆՈՒԹՅԱՆ ՄԱՍԻՆ» ՕՐԵՆՔՈՒՄ ԼՐԱՑՈՒՄՆԵՐ ԵՎ ՓՈՓՈԽՈՒԹՅՈՒՆՆԵՐ ԿԱՏԱՐԵԼՈՒ ՄԱՍԻՆ"
  },
  {
    "orig_doc_id": "69095",
    "Title": "ՀՀ ՕՐԵՆՔԸ ԱԶԱՏ ՏՆՏԵՍԱԿԱՆ ԳՈՏԻՆԵՐԻ ՄԱՍԻՆ"
  },
  {
    "orig_doc_id": "1051",
    "Title": "ՀՀ ՕՐԵՆՔԸ ԱԶԳԱՅԻՆ ԱՆՎՏԱՆԳՈՒԹՅԱՆ ՄԱՐՄԻՆՆԵՐԻ ՄԱՍԻՆ"
  },
  {
    "orig_doc_id": "1479",
    "Title": "ՀՀ ՕՐԵՆՔԸ ԱԶԳԱՅԻՆ ԱՆՎՏԱՆԳՈՒԹՅԱՆ ՄԱՐՄԻՆՆԵՐՈՒՄ ԾԱՌԱՅՈՒԹՅԱՆ ՄԱՍԻՆ"
  },
  {
    "orig_doc_id": "114364",
    "Title": "ՀՀ ՕՐԵՆՔԸ ԱԶԴԱՐԱՐՄԱՆ ՀԱՄԱԿԱՐԳԻ ՄԱՍԻՆ"
  },
  {
    "orig_doc_id": "44695",
    "Title": "ՀՀ ՕՐԵՆՔԸ ԱԿՏԻՎՆԵՐԻ ԱՐԺԵԹՂԹԱՎՈՐՄԱՆ ԵՎ ԱԿՏԻՎՆԵՐՈՎ ԱՊԱՀՈՎՎԱԾ ԱՐԺԵԹՂԹԵՐԻ ՄԱՍԻՆ"
  },
  {
    "orig_doc_id": "1766",
    "Title": "ՀՀ ՕՐԵՆՔԸ ԱՀԱԲԵԿՉՈՒԹՅԱՆ ԴԵՄ ՊԱՅՔԱՐԻ ՄԱՍԻՆ"
  },
  {
    "orig_doc_id": "69863",
    "Title": "ՀՀ ՕՐԵՆՔԸ ԱՂԲԱՀԱՆՈՒԹՅԱՆ ԵՎ ՍԱՆԻՏԱՐԱԿԱՆ ՄԱՔՐՄԱՆ ՄԱՍԻՆ"
  },
  {
    "orig_doc_id": "1363",
    "Title": "ՀՀ ՕՐԵՆՔԸ ԱՅԼԸՆՏՐԱՆՔԱՅԻՆ ԾԱՌԱՅՈՒԹՅԱՆ ՄԱՍԻՆ"
  },
  {
    "orig_doc_id": "91575",
    "Title": "ՀՀ ՕՐԵՆՔԸ ԱՆԱՍՆԱԲՈՒԺՈՒԹՅԱՆ ՄԱՍԻՆ"
  },
  {
    "orig_doc_id": "160074",
    "Title": "ՀՀ ՕՐԵՆՔԸ ԱՆԿԱՆԽԻԿ ԳՈՐԾԱՌՆՈՒԹՅՈՒՆՆԵՐԻ ՄԱՍԻՆ"
  },
  {
    "orig_doc_id": "860",
    "Title": "ՀՀ ՕՐԵՆՔԸ ԱՆՀԱՏ ՁԵՌՆԱՐԿԱՏԻՐՈՋ ՄԱՍԻՆ"
  },
  {
    "orig_doc_id": "152964",
    "Title": "ՀՀ ՕՐԵՆՔԸ ԱՆՁԻ ՖՈՒՆԿՑԻՈՆԱԼՈՒԹՅԱՆ ԳՆԱՀԱՏՄԱՆ ՄԱՍԻՆ"
  },
  {
    "orig_doc_id": "98338",
    "Title": "ՀՀ ՕՐԵՆՔԸ ԱՆՁՆԱԿԱՆ ՏՎՅԱԼՆԵՐԻ ՊԱՇՏՊԱՆՈՒԹՅԱՆ ՄԱՍԻՆ"
  },
  {
    "orig_doc_id": "1884",
    "Title": "ՀՀ ՕՐԵՆՔԸ ԱՆՇԱՐԺ ԳՈՒՅՔԻ ԳՆԱՀԱՏՄԱՆ ԳՈՐԾՈՒՆԵՈՒԹՅԱՆ ՄԱՍԻՆ"
  },
  {
    "orig_doc_id": "136988",
    "Title": "ՀՀ ՕՐԵՆՔԸ ԱՆՇԱՐԺ ԳՈՒՅՔԻ ՀԱՐԿՈՎ ՀԱՐԿՄԱՆ ՆՊԱՏԱԿՈՎ ԱՆՇԱՐԺ ԳՈՒՅՔԻ ՇՈՒԿԱՅԱԿԱՆ ԱՐԺԵՔԻՆ ՄՈՏԱՐԿՎԱԾ ԿԱԴԱՍՏՐԱՅԻՆ ԳՆԱՀԱՏՄԱՆ ԿԱՐԳԸ ՍԱՀՄԱՆԵԼՈՒ ՄԱՍԻՆ"
  },
  {
    "orig_doc_id": "642",
    "Title": "ՀՀ ՕՐԵՆՔԸ ԱՇԽԱՐՀԱԳՐԱԿԱՆ ԱՆՎԱՆՈՒՄՆԵՐԻ ՄԱՍԻՆ"
  },
  {
    "orig_doc_id": "58409",
    "Title": "ՀՀ ՕՐԵՆՔԸ ԱՇԽԱՐՀԱԳՐԱԿԱՆ ՆՇՈՒՄՆԵՐԻ ՄԱՍԻՆ"
  },
  {
    "orig_doc_id": "137752",
    "Title": "ՀՀ ՕՐԵՆՔԸ ԱՈՒԴԻՏՈՐԱԿԱՆ ԳՈՐԾՈՒՆԵՈՒԹՅԱՆ ՄԱՍԻՆ"
  },
  {
    "orig_doc_id": "35747",
    "Title": "ՀՀ ՕՐԵՆՔԸ ԱՊԱՀՈՎԱԳՐՈՒԹՅԱՆ ԵՎ ԱՊԱՀՈՎԱԳՐԱԿԱՆ ԳՈՐԾՈՒՆԵՈՒԹՅԱՆ ՄԱՍԻՆ"
  },
  {
    "orig_doc_id": "44704",
    "Title": "ՀՀ ՕՐԵՆՔԸ ԱՊԱՀՈՎՎԱԾ ՀԻՊՈՏԵԿԱՅԻՆ ՊԱՐՏԱՏՈՄՍԵՐԻ ՄԱՍԻՆ"
  },
  {
    "orig_doc_id": "44704",
    "Title": "ՀՀ ՕՐԵՆՔԸ ԱՊԱՀՈՎՎԱԾ ՀԻՓՈԹԵՔԱՅԻՆ ՊԱՐՏԱՏՈՄՍԵՐԻ ՄԱՍԻՆ"
  },
  {
    "orig_doc_id": "58408",
    "Title": "ՀՀ ՕՐԵՆՔԸ ԱՊՐԱՆՔԱՅԻՆ ՆՇԱՆՆԵՐԻ ՄԱՍԻՆ"
  },
  {
    "orig_doc_id": "142347",
    "Title": "ՀՀ ՕՐԵՆՔԸ ԱՊՕՐԻՆԻ ԾԱԳՈՒՄ ՈՒՆԵՑՈՂ ԳՈՒՅՔԻ ԲՌՆԱԳԱՆՁՄԱՆ ՄԱՍԻՆ"
  },
  {
    "orig_doc_id": "1219",
    "Title": "ՀՀ ՕՐԵՆՔԸ ԱՌԱՆՑ ԾՆՈՂԱԿԱՆ ԽՆԱՄՔԻ ՄՆԱՑԱԾ ԵՐԵԽԱՆԵՐԻ ՍՈՑԻԱԼԱԿԱՆ ՊԱՇՏՊԱՆՈՒԹՅԱՆ ՄԱՍԻՆ"
  },
  {
    "orig_doc_id": "988",
    "Title": "ՀՀ ՕՐԵՆՔԸ ԱՌԵՎՏՐԱԱՐԴՅՈՒՆԱԲԵՐԱԿԱՆ ՊԱԼԱՏՆԵՐԻ ՄԱՍԻՆ"
  },
  {
    "orig_doc_id": "30646",
    "Title": "ՀՀ ՕՐԵՆՔԸ ԱՌԵՎՏՐԱՅԻՆ ԱՐԲԻՏՐԱԺԻ ՄԱՍԻՆ"
  },
  {
    "orig_doc_id": "1695",
    "Title": "ՀՀ ՕՐԵՆՔԸ ԱՌԵՎՏՐԻ ԵՎ ԾԱՌԱՅՈՒԹՅՈՒՆՆԵՐԻ ՄԱՍԻՆ"
  },
  {
    "orig_doc_id": "32515",
    "Title": "ՀՀ ՕՐԵՆՔԸ ԱՎԻԱՑԻԱՅԻ ՄԱՍԻՆ"
  },
  {
    "orig_doc_id": "29748",
    "Title": "ՀՀ ՕՐԵՆՔԸ ԱՎՏՈՄՈԲԻԼԱՅԻՆ ՃԱՆԱՊԱՐՀՆԵՐԻ ՄԱՍԻՆ"
  },
  {
    "orig_doc_id": "29704",
    "Title": "ՀՀ ՕՐԵՆՔԸ ԱՎՏՈՄՈԲԻԼԱՅԻՆ ՏՐԱՆՍՊՈՐՏԻ ՄԱՍԻՆ"
  },
  {
    "orig_doc_id": "74625",
    "Title": "ՀՀ ՕՐԵՆՔԸ ԱՎՏՈՄՈԲԻԼԱՅԻՆ ՏՐԱՆՍՊՈՐՏՈՎ ՎՏԱՆԳԱՎՈՐ ԲԵՌՆԵՐ ԵՎ ՉՎՆԱՍԱԶԵՐԾՎԱԾ ՏԱՐԱՆԵՐ ՓՈԽԱԴՐԵԼՈՒ ՄԱՍԻՆ"
  },
  {
    "orig_doc_id": "69727",
    "Title": "ՀՀ ՕՐԵՆՔԸ ԱՎՏՈՏՐԱՆՍՊՈՐՏԱՅԻՆ ՄԻՋՈՑՆԵՐԻ ԿԱՅԱՆԱՏԵՂԵՐԻ ՏԵՂԱԿԱՆ ՎՃԱՐԻ ԵՎ ՎԱՐՉԱԿԱՆ ՎԱՐՈՒՅԹԻ ԱՌԱՆՁՆԱՀԱՏԿՈՒԹՅՈՒՆՆԵՐԻ ՄԱՍԻՆ"
  },
  {
    "orig_doc_id": "69727",
    "Title": "ՀՀ ՕՐԵՆՔԸ ԱՎՏՈՏՐԱՆՍՊՈՐՏԱՅԻՆ ՄԻՋՈՑՆԵՐԻ ԿԱՅԱՆԱՏԵՂԵՐԻ ՏԵՂԱԿԱՆ ՎՃԱՐԻ ՄԱՍԻՆ"
  },
  {
    "orig_doc_id": "58667",
    "Title": "ՀՀ ՕՐԵՆՔԸ ԱՎՏՈՏՐԱՆՍՊՈՐՏԱՅԻՆ ՄԻՋՈՑՆԵՐԻ ՕԳՏԱԳՈՐԾՈՒՄԻՑ ԲԽՈՂ ՊԱՏԱՍԽԱՆԱՏՎՈՒԹՅԱՆ ՊԱՐՏԱԴԻՐ ԱՊԱՀՈՎԱԳՐՈՒԹՅԱՆ ՄԱՍԻՆ"
  },
  {
    "orig_doc_id": "83564",
    "Title": "ՀՀ ՕՐԵՆՔԸ ԱՐԴԱՐԱԴԱՏՈՒԹՅԱՆ ԱԿԱԴԵՄԻԱՅԻ ՄԱՍԻՆ"
  },
  {
    "orig_doc_id": "94508",
    "Title": "ՀՀ ՕՐԵՆՔԸ ԱՐԴՅՈՒՆԱԲԵՐԱԿԱՆ ՔԱՂԱՔԱԿԱՆՈՒԹՅԱՆ ՄԱՍԻՆ"
  },
  {
    "orig_doc_id": "39647",
    "Title": "ՀՀ ՕՐԵՆՔԸ ԱՐԺԵԹՂԹԵՐԻ ՇՈՒԿԱՅԻ ՄԱՍԻՆ"
  },
  {
    "orig_doc_id": "1696",
    "Title": "ՀՀ ՕՐԵՆՔԸ ԱՐԺՈՒԹԱՅԻՆ ԿԱՐԳԱՎՈՐՄԱՆ ԵՎ ԱՐԺՈՒԹԱՅԻՆ ՎԵՐԱՀՍԿՈՂՈՒԹՅԱՆ ՄԱՍԻՆ"
  },
  {
    "orig_doc_id": "1644",
    "Title": "ՀՀ ՕՐԵՆՔԸ ԱՐԽԻՎԱՅԻՆ ԳՈՐԾԻ ՄԱՍԻՆ"
  },
  {
    "orig_doc_id": "823",
    "Title": "ՀՀ ՕՐԵՆՔԸ ԱՐՀԵՍՏԱԿՑԱԿԱՆ ՄԻՈՒԹՅՈՒՆՆԵՐԻ ՄԱՍԻՆ"
  },
  {
    "orig_doc_id": "75358",
    "Title": "ՀՀ ՕՐԵՆՔԸ ԱՐՏԱԿԱՐԳ ԴՐՈՒԹՅԱՆ ԻՐԱՎԱԿԱՆ ՌԵԺԻՄԻ ՄԱՍԻՆ"
  },
  {
    "orig_doc_id": "595",
    "Title": "ՀՀ ՕՐԵՆՔԸ ԱՐՏԱԿԱՐԳ ԻՐԱՎԻՃԱԿՆԵՐՈՒՄ ԲՆԱԿՉՈՒԹՅԱՆ ՊԱՇՏՊԱՆՈՒԹՅԱՆ ՄԱՍԻՆ"
  },
  {
    "orig_doc_id": "151220",
    "Title": "ՀՀ ՕՐԵՆՔԸ ԱՐՏՈՆԱԳՐԵՐԻ ՄԱՍԻՆ"
  },
  {
    "orig_doc_id": "1105",
    "Title": "ՀՀ ՕՐԵՆՔԸ ԲԱԶՄԱԲՆԱԿԱՐԱՆ ՇԵՆՔԻ ԿԱՌԱՎԱՐՄԱՆ ՄԱՍԻՆ"
  },
  {
    "orig_doc_id": "961",
    "Title": "ՀՀ ՕՐԵՆՔԸ ԲԱԺՆԵՏԻՐԱԿԱՆ ԸՆԿԵՐՈՒԹՅՈՒՆՆԵՐԻ ՄԱՍԻՆ"
  },
  {
    "orig_doc_id": "45526",
    "Title": "ՀՀ ՕՐԵՆՔԸ ԲԱՆԿԱՅԻՆ ԱՎԱՆԴՆԵՐԻ ՆԵՐԳՐԱՎՄԱՆ ՄԱՍԻՆ"
  },
  {
    "orig_doc_id": "334",
    "Title": "ՀՀ ՕՐԵՆՔԸ ԲԱՆԿԱՅԻՆ ԳԱՂՏՆԻՔԻ ՄԱՍԻՆ"
  },
  {
    "orig_doc_id": "309",
    "Title": "ՀՀ ՕՐԵՆՔԸ ԲԱՆԿԵՐԻ ԵՎ ԲԱՆԿԱՅԻՆ ԳՈՐԾՈՒՆԵՈՒԹՅԱՆ ՄԱՍԻՆ"
  },
  {
    "orig_doc_id": "1002",
    "Title": "ՀՀ ՕՐԵՆՔԸ ԲԱՆԿԵՐԻ ԵՎ ՎԱՐԿԱՅԻՆ ԿԱԶՄԱԿԵՐՊՈՒԹՅՈՒՆՆԵՐԻ ՍՆԱՆԿՈՒԹՅԱՆ ՄԱՍԻՆ"
  },
  {
    "orig_doc_id": "1002",
    "Title": "ՀՀ ՕՐԵՆՔԸ ԲԱՆԿԵՐԻ, ՎԱՐԿԱՅԻՆ ԿԱԶՄԱԿԵՐՊՈՒԹՅՈՒՆՆԵՐԻ ԵՎ ԱՊԱՀՈՎԱԳՐԱԿԱՆ ԸՆԿԵՐՈՒԹՅՈՒՆՆԵՐԻ ՍՆԱՆԿՈՒԹՅԱՆ ՄԱՍԻՆ"
  },
  {
    "orig_doc_id": "1002",
    "Title": "ՀՀ ՕՐԵՆՔԸ ԲԱՆԿԵՐԻ, ՎԱՐԿԱՅԻՆ ԿԱԶՄԱԿԵՐՊՈՒԹՅՈՒՆՆԵՐԻ, ՆԵՐԴՐՈՒՄԱՅԻՆ ԸՆԿԵՐՈՒԹՅՈՒՆՆԵՐԻ ԵՎ ԱՊԱՀՈՎԱԳՐԱԿԱՆ ԸՆԿԵՐՈՒԹՅՈՒՆՆԵՐԻ ՍՆԱՆԿՈՒԹՅԱՆ ՄԱՍԻՆ"
  },
  {
    "orig_doc_id": "1002",
    "Title": "ՀՀ ՕՐԵՆՔԸ ԲԱՆԿԵՐԻ, ՎԱՐԿԱՅԻՆ ԿԱԶՄԱԿԵՐՊՈՒԹՅՈՒՆՆԵՐԻ, ՆԵՐԴՐՈՒՄԱՅԻՆ ԸՆԿԵՐՈՒԹՅՈՒՆՆԵՐԻ, ՆԵՐԴՐՈՒՄԱՅԻՆ ՖՈՆԴԻ ԿԱՌԱՎԱՐԻՉՆԵՐԻ ԵՎ ԱՊԱՀՈՎԱԳՐԱԿԱՆ ԸՆԿԵՐՈՒԹՅՈՒՆՆԵՐԻ ՍՆԱՆԿՈՒԹՅԱՆ ՄԱՍԻՆ"
  },
  {
    "orig_doc_id": "1234",
    "Title": "ՀՀ ՕՐԵՆՔԸ ԲԱՐԵԳՈՐԾՈՒԹՅԱՆ ՄԱՍԻՆ"
  },
  {
    "orig_doc_id": "1595",
    "Title": "ՀՀ ՕՐԵՆՔԸ ԲԱՐՁՐԱԳՈՒՅՆ ԵՎ ՀԵՏԲՈՒՀԱԿԱՆ ՄԱՍՆԱԳԻՏԱԿԱՆ ԿՐԹՈՒԹՅԱՆ ՄԱՍԻՆ"
  },
  {
    "orig_doc_id": "117334",
    "Title": "ՀՀ ՕՐԵՆՔԸ ԲՆԱԿԱՐԱՆԱՅԻՆ ՀԻՊՈՏԵԿԱՅԻՆ ԿՐԵԴԻՏԱՎՈՐՄԱՆ ՄԱՍԻՆ"
  },
  {
    "orig_doc_id": "265",
    "Title": "ՀՀ ՕՐԵՆՔԸ ԲՆԱԿՉՈՒԹՅԱՆ ԲԺՇԿԱԿԱՆ ՕԳՆՈՒԹՅԱՆ ԵՎ ՍՊԱՍԱՐԿՄԱՆ ՄԱՍԻՆ"
  },
  {
    "orig_doc_id": "1228",
    "Title": "ՀՀ ՕՐԵՆՔԸ ԲՆԱԿՉՈՒԹՅԱՆ ՊԵՏԱԿԱՆ ՌԵԳԻՍՏՐԻ ՄԱՍԻՆ"
  },
  {
    "orig_doc_id": "1776",
    "Title": "ՀՀ ՕՐԵՆՔԸ ԲՆԱՊԱՀՊԱՆԱԿԱՆ ԻՐԱՎԱԽԱԽՏՈՒՄՆԵՐԻ ՀԵՏԵՎԱՆՔՈՎ ԿԵՆԴԱՆԱԿԱՆ ԵՎ ԲՈՒՍԱԿԱՆ ԱՇԽԱՐՀԻՆ ՊԱՏՃԱՌՎԱԾ ՎՆԱՍԻ ՀԱՏՈՒՑՄԱՆ ՍԱԿԱԳՆԵՐԻ ՄԱՍԻՆ"
  },
  {
    "orig_doc_id": "1769",
    "Title": "ՀՀ ՕՐԵՆՔԸ ԲՆԱՊԱՀՊԱՆԱԿԱՆ ՎԵՐԱՀՍԿՈՂՈՒԹՅԱՆ ՄԱՍԻՆ"
  },
  {
    "orig_doc_id": "29624",
    "Title": "ՀՀ ՕՐԵՆՔԸ ԲՆՈՒԹՅԱՆ ՀԱՏՈՒԿ ՊԱՀՊԱՆՎՈՂ ՏԱՐԱԾՔՆԵՐԻ ՄԱՍԻՆ"
  },
  {
    "orig_doc_id": "644",
    "Title": "ՀՀ ՕՐԵՆՔԸ ԲՈՒՍԱԿԱՆ ԱՇԽԱՐՀԻ ՄԱՍԻՆ"
  },
  {
    "orig_doc_id": "91587",
    "Title": "ՀՀ ՕՐԵՆՔԸ ԲՈՒՍԱՍԱՆԻՏԱՐԻԱՅԻ ՄԱՍԻՆ"
  },
  {
    "orig_doc_id": "179",
    "Title": "ՀՀ ՕՐԵՆՔԸ ԲՌՆԱԴԱՏՎԱԾՆԵՐԻ ՄԱՍԻՆ"
  },
  {
    "orig_doc_id": "936",
    "Title": "ՀՀ ՕՐԵՆՔԸ ԳԱՆՁԱՊԵՏԱԿԱՆ ՀԱՄԱԿԱՐԳԻ ՄԱՍԻՆ"
  },
  {
    "orig_doc_id": "804",
    "Title": "ՀՀ ՕՐԵՆՔԸ ԳԻՏԱԿԱՆ ԵՎ ԳԻՏԱՏԵԽՆԻԿԱԿԱՆ ԳՈՐԾՈՒՆԵՈՒԹՅԱՆ ՄԱՍԻՆ"
  },
  {
    "orig_doc_id": "97399",
    "Title": "ՀՀ ՕՐԵՆՔԸ ԳԻՏԱԿԱՆ ԵՎ ԳԻՏԱՏԵԽՆԻԿԱԿԱՆ ՓՈՐՁԱՔՆՆՈՒԹՅԱՆ ՄԱՍԻՆ"
  },
  {
    "orig_doc_id": "1102",
    "Title": "ՀՀ ՕՐԵՆՔԸ ԳՅՈՒՂԱՏՆՏԵՍԱԿԱՆ ՎԱՐԿԱՅԻՆ ԱԿՈՒՄԲՆԵՐԻ ՄԱՍԻՆ"
  },
  {
    "orig_doc_id": "1804",
    "Title": "ՀՀ ՕՐԵՆՔԸ ԳՅՈՒՂԱՏՆՏԵՍԱԿԱՆ ՏԵԽՆԻԿԱՅԻ ՇԱՀԱԳՈՐԾՄԱՆ ՄԱՍԻՆ"
  },
  {
    "orig_doc_id": "1884",
    "Title": "ՀՀ ՕՐԵՆՔԸ ԳՆԱՀԱՏՄԱՆ ԳՈՐԾՈՒՆԵՈՒԹՅԱՆ ՄԱՍԻՆ"
  },
  {
    "orig_doc_id": "110820",
    "Title": "ՀՀ ՕՐԵՆՔԸ ԳՆՈՒՄՆԵՐԻ ՄԱՍԻՆ"
  },
  {
    "orig_doc_id": "286",
    "Title": "ՀՀ ՕՐԵՆՔԸ ԳՈՎԱԶԴԻ ՄԱՍԻՆ"
  },
  {
    "orig_doc_id": "32898",
    "Title": "ՀՀ ՕՐԵՆՔԸ ԳՈՐԾԱՏՈՒՆԵՐԻ ՄԻՈՒԹՅՈՒՆՆԵՐԻ ՄԱՍԻՆ"
  },
  {
    "orig_doc_id": "101773",
    "Title": "ՀՀ ՕՐԵՆՔԸ ԳՈՐԾՈՒՆԵՈՒԹՅԱՆ ԻՐԱԿԱՆԱՑՄԱՆ ԾԱՆՈՒՑՄԱՆ ՄԱՍԻՆ"
  },
  {
    "orig_doc_id": "669",
    "Title": "ՀՀ ՕՐԵՆՔԸ ԳՈՒՅՔԻ ՆԿԱՏՄԱՄԲ ԻՐԱՎՈՒՆՔՆԵՐԻ ՊԵՏԱԿԱՆ ԳՐԱՆՑՄԱՆ ՄԱՍԻՆ"
  },
  {
    "orig_doc_id": "75198",
    "Title": "ՀՀ ՕՐԵՆՔԸ ԳՐԱԴԱՐԱՆՆԵՐԻ ԵՎ ԳՐԱԴԱՐԱՆԱՅԻՆ ԳՈՐԾԻ ՄԱՍԻՆ"
  },
  {
    "orig_doc_id": "1431",
    "Title": "ՀՀ ՕՐԵՆՔԸ ԳՐԱՎԱՏՆԵՐԻ ԵՎ ԳՐԱՎԱՏՆԱՅԻՆ ԳՈՐԾՈՒՆԵՈՒԹՅԱՆ ՄԱՍԻՆ"
  },
  {
    "orig_doc_id": "535",
    "Title": "ՀՀ ՕՐԵՆՔԸ ԴԱՏԱԿԱՆ ԱԿՏԵՐԻ ՀԱՐԿԱԴԻՐ ԿԱՏԱՐՄԱՆ ՄԱՍԻՆ"
  },
  {
    "orig_doc_id": "1546",
    "Title": "ՀՀ ՕՐԵՆՔԸ ԴԱՏԱԿԱՆ ԱԿՏԵՐԻ ՀԱՐԿԱԴԻՐ ԿԱՏԱՐՈՒՄՆ ԱՊԱՀՈՎՈՂ ԾԱՌԱՅՈՒԹՅԱՆ ՄԱՍԻՆ"
  },
  {
    "orig_doc_id": "123320",
    "Title": "ՀՀ ՕՐԵՆՔԸ ԴԱՏԱԿԱՆ ԴԵՊԱՐՏԱՄԵՆՏՈՒՄ ԾԱՌԱՅՈՒԹՅԱՆ ՄԱՍԻՆ"
  },
  {
    "orig_doc_id": "106446",
    "Title": "ՀՀ ՕՐԵՆՔԸ ԴԵՂԵՐԻ ՄԱՍԻՆ"
  },
  {
    "orig_doc_id": "986",
    "Title": "ՀՀ ՕՐԵՆՔԸ ԴԻՎԱՆԱԳԻՏԱԿԱՆ ԾԱՌԱՅՈՒԹՅԱՆ ՄԱՍԻՆ"
  },
  {
    "orig_doc_id": "64550",
    "Title": "ՀՀ ՕՐԵՆՔԸ ԵԿԱՄՏԱՅԻՆ ՀԱՐԿԻ ԵՎ ՊԱՐՏԱԴԻՐ ԿՈՒՏԱԿԱՅԻՆ ՎՃԱՐԻ ԱՆՁՆԱՎՈՐՎԱԾ ՀԱՇՎԱՌՄԱՆ ՄԱՍԻՆ"
  },
  {
    "orig_doc_id": "64550",
    "Title": "ՀՀ ՕՐԵՆՔԸ ԵԿԱՄՏԱՅԻՆ ՀԱՐԿԻ ԵՎ ՍՈՑԻԱԼԱԿԱՆ ՎՃԱՐԻ ԱՆՁՆԱՎՈՐՎԱԾ ՀԱՇՎԱՌՄԱՆ ՄԱՍԻՆ"
  },
  {
    "orig_doc_id": "64542",
    "Title": "ՀՀ ՕՐԵՆՔԸ ԵԿԱՄՏԱՅԻՆ ՀԱՐԿԻ ՄԱՍԻՆ"
  },
  {
    "orig_doc_id": "64550",
    "Title": "ՀՀ ՕՐԵՆՔԸ ԵԿԱՄՏԱՅԻՆ ՀԱՐԿԻ, ՇԱՀՈՒԹԱՀԱՐԿԻ ԵՎ ՍՈՑԻԱԼԱԿԱՆ ՎՃԱՐԻ ԱՆՁՆԱՎՈՐՎԱԾ ՀԱՇՎԱՌՄԱՆ ՄԱՍԻՆ"
  },
  {
    "orig_doc_id": "293",
    "Title": "ՀՀ ՕՐԵՆՔԸ ԵՐԵԽԱՅԻ ԻՐԱՎՈՒՆՔՆԵՐԻ ՄԱՍԻՆ"
  },
  {
    "orig_doc_id": "94450",
    "Title": "ՀՀ ՕՐԵՆՔԸ ԵՐԵԽԱՆԵՐԻՆ ԿՐԾՔՈՎ ԿԵՐԱԿՐՄԱՆ ԽՐԱԽՈՒՍՄԱՆ ԵՎ ՄԱՆԿԱԿԱՆ ՍՆՆԴԻ ՇՐՋԱՆԱՌՈՒԹՅԱՆ ՄԱՍԻՆ"
  },
  {
    "orig_doc_id": "44973",
    "Title": "ՀՀ ՕՐԵՆՔԸ ԵՐԵՎԱՆ ՔԱՂԱՔՈՒՄ ԻՐԱՎՈՒՆՔ ՀԱՍՏԱՏՈՂ ՓԱՍՏԱԹՂԹԵՐԸ ՉՊԱՀՊԱՆՎԱԾ ԱՆՀԱՏԱԿԱՆ ԲՆԱԿԵԼԻ ՏՆԵՐԻ ԿԱՐԳԱՎԻՃԱԿԻ ՄԱՍԻՆ"
  },
  {
    "orig_doc_id": "49042",
    "Title": "ՀՀ ՕՐԵՆՔԸ ԵՐԵՎԱՆ ՔԱՂԱՔՈՒՄ ՏԵՂԱԿԱՆ ԻՆՔՆԱԿԱՌԱՎԱՐՄԱՆ ՄԱՍԻՆ"
  },
  {
    "orig_doc_id": "41108",
    "Title": "ՀՀ ՕՐԵՆՔԸ ԵՐԿԱԹՈՒՂԱՅԻՆ ՏՐԱՆՍՊՈՐՏԻ ՄԱՍԻՆ"
  },
  {
    "orig_doc_id": "57837",
    "Title": "ՀՀ ՕՐԵՆՔԸ ԵՐԿԱԿԻ ՆՇԱՆԱԿՈՒԹՅԱՆ ԱՊՐԱՆՔՆԵՐԻ ԱՐՏԱՀԱՆՄԱՆ, ՀՀ ՏԱՐԱԾՔՈՎ ԴՐԱՆՑ ՏԱՐԱՆՑԻԿ ՓՈԽԱԴՐՄԱՆ, ԻՆՉՊԵՍ ՆԱԵՎ ԵՐԿԱԿԻ ՆՇԱՆԱԿՈՒԹՅԱՆ ՏԵՂԵԿԱՏՎՈՒԹՅԱՆ ԵՎ ՄՏԱՎՈՐ ԳՈՐԾՈՒՆԵՈՒԹՅԱՆ ԱՐԴՅՈՒՆՔՆԵՐԻ ՓՈԽԱՆՑՄԱՆ ՆԿԱՏՄԱՄԲ ՀՍԿՈՂՈՒԹՅԱՆ ՄԱՍԻՆ"
  },
  {
    "orig_doc_id": "84326",
    "Title": "ՀՀ ՕՐԵՆՔԸ ԵՐԿՐԱՊԱՀ ԿԱՄԱՎՈՐԱԿԱՆԻ ԿԱՐԳԱՎԻՃԱԿԻ ՄԱՍԻՆ"
  },
  {
    "orig_doc_id": "1379",
    "Title": "ՀՀ ՕՐԵՆՔԸ ԶԱՆԳՎԱԾԱՅԻՆ ԼՐԱՏՎՈՒԹՅԱՆ ՄԱՍԻՆ"
  },
  {
    "orig_doc_id": "87734",
    "Title": "ՀՀ ՕՐԵՆՔԸ ԶԲԱՂՎԱԾՈՒԹՅԱՆ ՄԱՍԻՆ"
  },
  {
    "orig_doc_id": "1374",
    "Title": "ՀՀ ՕՐԵՆՔԸ ԶԲՈՍԱՇՐՋՈՒԹՅԱՆ ԵՎ ԶԲՈՍԱՇՐՋԱՅԻՆ ԳՈՐԾՈՒՆԵՈՒԹՅԱՆ ՄԱՍԻՆ"
  },
  {
    "orig_doc_id": "169842",
    "Title": "ՀՀ ՕՐԵՆՔԸ ԶԵՆՔԻ ՇՐՋԱՆԱՌՈՒԹՅԱՆ ԿԱՐԳԱՎՈՐՄԱՆ ՄԱՍԻՆ"
  },
  {
    "orig_doc_id": "117633",
    "Title": "ՀՀ ՕՐԵՆՔԸ ԶԻՆՎՈՐԱԿԱՆ ԾԱՌԱՅՈՒԹՅԱՆ ԵՎ ԶԻՆԾԱՌԱՅՈՂԻ ԿԱՐԳԱՎԻՃԱԿԻ ՄԱՍԻՆ"
  },
  {
    "orig_doc_id": "99167",
    "Title": "ՀՀ ՕՐԵՆՔԸ ԶՈՐԱՄԱՍԵՐԻ ԵՎ ԶԻՆՎՈՐԱԿԱՆ ՀԱՍՏԱՏՈՒԹՅՈՒՆՆԵՐԻ ԿԱՐԳԱՎԻՃԱԿԻ ՄԱՍԻՆ"
  },
  {
    "orig_doc_id": "1869",
    "Title": "ՀՀ ՕՐԵՆՔԸ ԷԼԵԿՏՐՈՆԱՅԻՆ ՀԱՂՈՐԴԱԿՑՈՒԹՅԱՆ ՄԱՍԻՆ"
  },
  {
    "orig_doc_id": "1547",
    "Title": "ՀՀ ՕՐԵՆՔԸ ԷԼԵԿՏՐՈՆԱՅԻՆ ՓԱՍՏԱԹՂԹԻ ԵՎ ԷԼԵԿՏՐՈՆԱՅԻՆ ԹՎԱՅԻՆ ՍՏՈՐԱԳՐՈՒԹՅԱՆ ՄԱՍԻՆ"
  },
  {
    "orig_doc_id": "1684",
    "Title": "ՀՀ ՕՐԵՆՔԸ ԷՆԵՐԳԱԽՆԱՅՈՂՈՒԹՅԱՆ ԵՎ ՎԵՐԱԿԱՆԳՆՎՈՂ ԷՆԵՐԳԵՏԻԿԱՅԻ ՄԱՍԻՆ"
  },
  {
    "orig_doc_id": "1539",
    "Title": "ՀՀ ՕՐԵՆՔԸ ԷՆԵՐԳԵՏԻԿԱՅԻ ԲՆԱԳԱՎԱՌՈՒՄ ԵՎ ԷՆԵՐԳԱՍՊԱՌՄԱՆ ՈԼՈՐՏՈՒՄ ՊԵՏԱԿԱՆ ՏԵԽՆԻԿԱԿԱՆ ՎԵՐԱՀՍԿՈՂՈՒԹՅԱՆ ՄԱՍԻՆ"
  },
  {
    "orig_doc_id": "838",
    "Title": "ՀՀ ՕՐԵՆՔԸ ԷՆԵՐԳԵՏԻԿԱՅԻ ՄԱՍԻՆ"
  },
  {
    "orig_doc_id": "885",
    "Title": "ՀՀ ՕՐԵՆՔԸ ԸՆԿԵՐՈՒԹՅՈՒՆՆԵՐԻ ԿՈՂՄԻՑ ՎՃԱՐՎՈՂ ԲՆԱՊԱՀՊԱՆԱԿԱՆ ՀԱՐԿԻ ՆՊԱՏԱԿԱՅԻՆ ՕԳՏԱԳՈՐԾՄԱՆ ՄԱՍԻՆ"
  },
  {
    "orig_doc_id": "885",
    "Title": "ՀՀ ՕՐԵՆՔԸ ԸՆԿԵՐՈՒԹՅՈՒՆՆԵՐԻ ԿՈՂՄԻՑ ՎՃԱՐՎՈՂ ԲՆԱՊԱՀՊԱՆԱԿԱՆ ՎՃԱՐՆԵՐԻ ՆՊԱՏԱԿԱՅԻՆ ՕԳՏԱԳՈՐԾՄԱՆ ՄԱՍԻՆ"
  },
  {
    "orig_doc_id": "118672",
    "Title": "ՀՀ ՕՐԵՆՔԸ ԸՆՏԱՆԻՔՈՒՄ ԲՌՆՈՒԹՅԱՆ ԿԱՆԽԱՐԳԵԼՄԱՆ, ԸՆՏԱՆԻՔՈՒՄ ԲՌՆՈՒԹՅԱՆ ԵՆԹԱՐԿՎԱԾ ԱՆՁԱՆՑ ՊԱՇՏՊԱՆՈՒԹՅԱՆ ԵՎ ԸՆՏԱՆԻՔՈՒՄ ՀԱՄԵՐԱՇԽՈՒԹՅԱՆ ՎԵՐԱԿԱՆԳՆՄԱՆ ՄԱՍԻՆ"
  },
  {
    "orig_doc_id": "24724",
    "Title": "ՀՀ ՕՐԵՆՔԸ ԹԱՆԿԱՐԺԵՔ ՄԵՏԱՂՆԵՐԻ ՄԱՍԻՆ"
  },
  {
    "orig_doc_id": "1722",
    "Title": "ՀՀ ՕՐԵՆՔԸ ԹԱՓՈՆՆԵՐԻ ՄԱՍԻՆ"
  },
  {
    "orig_doc_id": "1342",
    "Title": "ՀՀ ՕՐԵՆՔԸ ԹՄՐԱՄԻՋՈՑՆԵՐԻ ԵՎ ՀՈԳԵՄԵՏ (ՀՈԳԵՆԵՐԳՈՐԾՈՒՆ) ՆՅՈՒԹԵՐԻ ՄԱՍԻՆ"
  },
  {
    "orig_doc_id": "1342",
    "Title": "ՀՀ ՕՐԵՆՔԸ ԹՄՐԱՄԻՋՈՑՆԵՐԻ ԵՎ ՀՈԳԵՄԵՏ ՆՅՈՒԹԵՐԻ ՄԱՍԻՆ"
  },
  {
    "orig_doc_id": "63136",
    "Title": "ՀՀ ՕՐԵՆՔԸ ԺԱՄԱՆԱԿԱՎՈՐ ԱՆԱՇԽԱՏՈՒՆԱԿՈՒԹՅԱՆ ԵՎ ՄԱՅՐՈՒԹՅԱՆ ՆՊԱՍՏՆԵՐԻ ՄԱՍԻՆ"
  },
  {
    "orig_doc_id": "63136",
    "Title": "ՀՀ ՕՐԵՆՔԸ ԺԱՄԱՆԱԿԱՎՈՐ ԱՆԱՇԽԱՏՈՒՆԱԿՈՒԹՅԱՆ ՆՊԱՍՏՆԵՐԻ ՄԱՍԻՆ"
  },
  {
    "orig_doc_id": "1673",
    "Title": "ՀՀ ՕՐԵՆՔԸ ԻՆԿԱՍԱՑԻԱՅԻ ՄԱՍԻՆ"
  },
  {
    "orig_doc_id": "506",
    "Title": "ՀՀ ՕՐԵՆՔԸ ԻՆՏԵԳՐԱԼ ՄԻԿՐՈՍԽԵՄԱՆԵՐԻ ՏՈՊՈԼՈԳԻԱՆԵՐԻ ԻՐԱՎԱԿԱՆ ՊԱՇՏՊԱՆՈՒԹՅԱՆ ՄԱՍԻՆ"
  },
  {
    "orig_doc_id": "34988",
    "Title": "ՀՀ ՕՐԵՆՔԸ ԻՆՏԵՐՆԵՏՈՎ ՀՐԱՊԱՐԱԿԱՅԻՆ ԵՎ ԱՆՀԱՏԱԿԱՆ ԾԱՆՈՒՑՄԱՆ ՄԱՍԻՆ"
  },
  {
    "orig_doc_id": "34988",
    "Title": "ՀՀ ՕՐԵՆՔԸ ԻՆՏԵՐՆԵՏՈՎ ՀՐԱՊԱՐԱԿԱՅԻՆ ԾԱՆՈՒՑՄԱՆ ՄԱՍԻՆ"
  },
  {
    "orig_doc_id": "84415",
    "Title": "ՀՀ ՕՐԵՆՔԸ ԻՐԱՆ-ՀԱՅԱՍՏԱՆ 400 ԿՎ ԼԱՐՄԱՆ ԷԼԵԿՏՐԱՀԱՂՈՐԴՄԱՆ ՕԴԱՅԻՆ ԳԾԻ` ՀՀ ՏԱՐԱԾՔՈՎ ԱՆՑՆՈՂ ՀԱՏՎԱԾԻ ՇԻՆԱՐԱՐՈՒԹՅԱՆ ԱՇԽԱՏԱՆՔՆԵՐԻ ՆԿԱՏՄԱՄԲ ՀԱՐԿԱՅԻՆ ԵՎ ՄԱՔՍԱՅԻՆ ՎՃԱՐՆԵՐԻ ԱՐՏՈՆՈՒԹՅՈՒՆՆԵՐ ՍԱՀՄԱՆԵԼՈՒ ՄԱՍԻՆ"
  },
  {
    "orig_doc_id": "863",
    "Title": "ՀՀ ՕՐԵՆՔԸ ԻՐԱՎԱԲԱՆԱԿԱՆ ԱՆՁԱՆՑ ՊԵՏԱԿԱՆ ԳՐԱՆՑՄԱՆ ՄԱՍԻՆ"
  },
  {
    "orig_doc_id": "863",
    "Title": "ՀՀ ՕՐԵՆՔԸ ԻՐԱՎԱԲԱՆԱԿԱՆ ԱՆՁԱՆՑ ՊԵՏԱԿԱՆ ԳՐԱՆՑՄԱՆ, ԻՐԱՎԱԲԱՆԱԿԱՆ ԱՆՁԱՆՑ ԱՌԱՆՁՆԱՑՎԱԾ ՍՏՈՐԱԲԱԺԱՆՈՒՄՆԵՐԻ, ՀԻՄՆԱՐԿՆԵՐԻ ԵՎ ԱՆՀԱՏ ՁԵՌՆԱՐԿԱՏԵՐԵՐԻ ՊԵՏԱԿԱՆ ՀԱՇՎԱՌՄԱՆ ՄԱՍԻՆ"
  },
  {
    "orig_doc_id": "44973",
    "Title": "ՀՀ ՕՐԵՆՔԸ ԻՐԱՎՈՒՆՔ ՀԱՍՏԱՏՈՂ ՓԱՍՏԱԹՂԹԵՐԸ ՉՊԱՀՊԱՆՎԱԾ ԱՆՀԱՏԱԿԱՆ ԲՆԱԿԵԼԻ ՏՆԵՐԻ ԿԱՐԳԱՎԻՃԱԿԻ ՄԱՍԻՆ"
  },
  {
    "orig_doc_id": "122",
    "Title": "ՀՀ ՕՐԵՆՔԸ ԼԵԶՎԻ ՄԱՍԻՆ"
  },
  {
    "orig_doc_id": "22555",
    "Title": "ՀՀ ՕՐԵՆՔԸ ԼԻՑԵՆԶԱՎՈՐՄԱՆ ՄԱՍԻՆ"
  },
  {
    "orig_doc_id": "657",
    "Title": "ՀՀ ՕՐԵՆՔԸ ԽԱՂԱՂ ՆՊԱՏԱԿՆԵՐՈՎ ԱՏՈՄԱՅԻՆ ԷՆԵՐԳԻԱՅԻ ԱՆՎՏԱՆԳ ՕԳՏԱԳՈՐԾՄԱՆ ՄԱՍԻՆ"
  },
  {
    "orig_doc_id": "45599",
    "Title": "ՀՀ ՕՐԵՆՔԸ ԽԱՂՈՂԻ ՀՈՒՄՔՈՎ ՈԳԵԼԻՑ ԽՄԻՉՔՆԵՐԻ ՄԱՍԻՆ"
  },
  {
    "orig_doc_id": "82",
    "Title": "ՀՀ ՕՐԵՆՔԸ ԽՂՃԻ ԱԶԱՏՈՒԹՅԱՆ ԵՎ ԿՐՈՆԱԿԱՆ ԿԱԶՄԱԿԵՐՊՈՒԹՅՈՒՆՆԵՐԻ ՄԱՍԻՆ"
  },
  {
    "orig_doc_id": "139759",
    "Title": "ՀՀ ՕՐԵՆՔԸ ԾԽԱԽՈՏԱՅԻՆ ԱՐՏԱԴՐԱՏԵՍԱԿՆԵՐԻ ԵՎ ԴՐԱՆՑ ՓՈԽԱՐԻՆԻՉՆԵՐԻ ՕԳՏԱԳՈՐԾՄԱՆ ՀԵՏԵՎԱՆՔՈՎ ԱՌՈՂՋՈՒԹՅԱՆԸ ՀԱՍՑՎՈՂ ՎՆԱՍԻ ՆՎԱԶԵՑՄԱՆ ԵՎ ԿԱՆԽԱՐԳԵԼՄԱՆ ՄԱՍԻՆ"
  },
  {
    "orig_doc_id": "902",
    "Title": "ՀՀ ՕՐԵՆՔԸ ԿԱԶՄԱԿԵՐՊՈՒԹՅՈՒՆՆԵՐԻ ԵՎ ԱՆՀԱՏ ՁԵՌՆԱՐԿԱՏԵՐԵՐԻ ԿՈՂՄԻՑ ՆԵՐՄՈՒԾՎՈՂ` ԱԿՑԻԶԱՅԻՆ ՀԱՐԿՈՎ ՀԱՐԿՄԱՆ ՈՉ ԵՆԹԱԿԱ ԱՅՆ ԱՊՐԱՆՔՆԵՐԻ ՑԱՆԿԸ ՀԱՍՏԱՏԵԼՈՒ ՄԱՍԻՆ, ՈՐՈՆՑ ՆԵՐՄՈՒԾՈՒՄՆ ԱԶԱՏՎԱԾ Է ԱՎԵԼԱՑՎԱԾ ԱՐԺԵՔԻ ՀԱՐԿԻՑ"
  },
  {
    "orig_doc_id": "902",
    "Title": "ՀՀ ՕՐԵՆՔԸ ԿԱԶՄԱԿԵՐՊՈՒԹՅՈՒՆՆԵՐԻ ԵՎ ԱՆՀԱՏ ՁԵՌՆԱՐԿԱՏԵՐԵՐԻ ԿՈՂՄԻՑ ՆԵՐՄՈՒԾՎՈՂ` ՄԱՔՍԱՏՈՒՐՔԻ 0 ՏՈԿՈՍ ԴՐՈՒՅՔԱՉԱՓ ՈՒՆԵՑՈՂ ԵՎ ԱԿՑԻԶԱՅԻՆ ՀԱՐԿՈՎ ՀԱՐԿՄԱՆ ՈՉ ԵՆԹԱԿԱ ԱՅՆ ԱՊՐԱՆՔՆԵՐԻ ՑԱՆԿԸ ՀԱՍՏԱՏԵԼՈՒ ՄԱՍԻՆ, ՈՐՈՆՑԻՑ ԱՎԵԼԱՑՎԱԾ ԱՐԺԵՔԻ ՀԱՐԿԸ ՄԱՔՍԱՅԻՆ ՄԱՐՄԻՆՆԵՐԻ ԿՈՂՄԻՑ ՉԻ ՀԱՇՎԱՐԿՎՈՒՄ ԵՎ ԳԱՆՁՎՈՒՄ"
  },
  {
    "orig_doc_id": "83841",
    "Title": "ՀՀ ՕՐԵՆՔԸ ԿԱՆԱՆՑ ԵՎ ՏՂԱՄԱՐԴԿԱՆՑ ՀԱՎԱՍԱՐ ԻՐԱՎՈՒՆՔՆԵՐԻ ԵՎ ՀԱՎԱՍԱՐ ՀՆԱՐԱՎՈՐՈՒԹՅՈՒՆՆԵՐԻ ԱՊԱՀՈՎՄԱՆ ՄԱՍԻՆ"
  },
  {
    "orig_doc_id": "120915",
    "Title": "ՀՀ ՕՐԵՆՔԸ ԿԱՌԱՎԱՐՈՒԹՅԱՆ ԿԱՌՈՒՑՎԱԾՔԻ ԵՎ ԳՈՐԾՈՒՆԵՈՒԹՅԱՆ ՄԱՍԻՆ"
  },
  {
    "orig_doc_id": "120842",
    "Title": "ՀՀ ՕՐԵՆՔԸ ԿԱՌԱՎԱՐՉԱԿԱՆ ԻՐԱՎԱՀԱՐԱԲԵՐՈՒԹՅՈՒՆՆԵՐԻ ԿԱՐԳԱՎՈՐՄԱՆ ՄԱՍԻՆ"
  },
  {
    "orig_doc_id": "715",
    "Title": "ՀՀ ՕՐԵՆՔԸ ԿԵՆԴԱՆԱԿԱՆ ԱՇԽԱՐՀԻ ՄԱՍԻՆ"
  },
  {
    "orig_doc_id": "91588",
    "Title": "ՀՀ ՕՐԵՆՔԸ ԿԵՐԻ ՄԱՍԻՆ"
  },
  {
    "orig_doc_id": "114355",
    "Title": "ՀՀ ՕՐԵՆՔԸ ԿՈՌՈՒՊՑԻԱՅԻ ԿԱՆԽԱՐԳԵԼՄԱՆ ՀԱՆՁՆԱԺՈՂՈՎԻ ՄԱՍԻՆ"
  },
  {
    "orig_doc_id": "64546",
    "Title": "ՀՀ ՕՐԵՆՔԸ ԿՈՒՏԱԿԱՅԻՆ ԿԵՆՍԱԹՈՇԱԿՆԵՐԻ ՄԱՍԻՆ<BR>"
  },
  {
    "orig_doc_id": "22493",
    "Title": "ՀՀ ՕՐԵՆՔԸ ԿՐԹՈՒԹՅԱՆ ՄԱՍԻՆ"
  },
  {
    "orig_doc_id": "21486",
    "Title": "ՀՀ ՕՐԵՆՔԸ ԿՐԹՈՒԹՅԱՆ ՊԵՏԱԿԱՆ ՏԵՍՉՈՒԹՅԱՆ ՄԱՍԻՆ"
  },
  {
    "orig_doc_id": "151799",
    "Title": "ՀՀ ՕՐԵՆՔԸ ՀԱԿԱԿՈՌՈՒՊՑԻՈՆ ԿՈՄԻՏԵԻ ՄԱՍԻՆ"
  },
  {
    "orig_doc_id": "49188",
    "Title": "ՀՀ ՕՐԵՆՔԸ ՀԱՄԱՀԱՅԿԱԿԱՆ ԲԱՆԿԻ ՄԱՍԻՆ"
  },
  {
    "orig_doc_id": "1556",
    "Title": "ՀՀ ՕՐԵՆՔԸ ՀԱՄԱՅՆՔԱՅԻՆ ԾԱՌԱՅՈՒԹՅԱՆ ՄԱՍԻՆ"
  },
  {
    "orig_doc_id": "982",
    "Title": "ՀՀ ՕՐԵՆՔԸ ՀԱՄԱՅՆՔԱՅԻՆ ԿԱՌԱՎԱՐՉԱԿԱՆ ՀԻՄՆԱՐԿՆԵՐԻ ՄԱՍԻՆ"
  },
  {
    "orig_doc_id": "29862",
    "Title": "ՀՀ ՕՐԵՆՔԸ ՀԱՄԱՅՆՔԻ ԲՅՈՒՋԵԻ ԵԿԱՄՈՒՏՆԵՐԸ ՆՎԱԶԵՑՆՈՂ` ՀՀ ՕՐԵՆՔՆԵՐԻ ԿԻՐԱՐԿՄԱՆ ԱՐԴՅՈՒՆՔՈՒՄ ՀԱՄԱՅՆՔԻ ԲՅՈՒՋԵԻ ԵԿԱՄՈՒՏՆԵՐԻ ԿՈՐՈՒՍՏՆԵՐԸ ՊԵՏՈՒԹՅԱՆ ԿՈՂՄԻՑ ՓՈԽՀԱՏՈՒՑԵԼՈՒ ԿԱՐԳԻ ՄԱՍԻՆ"
  },
  {
    "orig_doc_id": "1103",
    "Title": "ՀՀ ՕՐԵՆՔԸ ՀԱՄԱՏԻՐՈՒԹՅԱՆ ՄԱՍԻՆ"
  },
  {
    "orig_doc_id": "1863",
    "Title": "ՀՀ ՕՐԵՆՔԸ ՀԱՅԱՍՏԱՆԻ ՓՐԿԱՐԱՐ ԾԱՌԱՅՈՒԹՅԱՆ ՄԱՍԻՆ"
  },
  {
    "orig_doc_id": "598",
    "Title": "ՀՀ ՕՐԵՆՔԸ ՀԱՅՐԵՆԱԿԱՆ ՄԵԾ ՊԱՏԵՐԱԶՄԻ ՎԵՏԵՐԱՆՆԵՐԻ ՄԱՍԻՆ"
  },
  {
    "orig_doc_id": "119042",
    "Title": "ՀՀ ՕՐԵՆՔԸ ՀԱՆՐԱԳՐԵՐԻ ՄԱՍԻՆ"
  },
  {
    "orig_doc_id": "53007",
    "Title": "ՀՀ ՕՐԵՆՔԸ ՀԱՆՐԱԿՐԹՈՒԹՅԱՆ ՄԱՍԻՆ"
  },
  {
    "orig_doc_id": "120832",
    "Title": "ՀՀ ՕՐԵՆՔԸ ՀԱՆՐԱՅԻՆ ԾԱՌԱՅՈՒԹՅԱՆ ՄԱՍԻՆ"
  },
  {
    "orig_doc_id": "1391",
    "Title": "ՀՀ ՕՐԵՆՔԸ ՀԱՆՐԱՅԻՆ ԾԱՌԱՅՈՒԹՅՈՒՆՆԵՐԸ ԿԱՐԳԱՎՈՐՈՂ ՄԱՐՄՆԻ ՄԱՍԻՆ"
  },
  {
    "orig_doc_id": "73085",
    "Title": "ՀՀ ՕՐԵՆՔԸ ՀԱՆՐԱՅԻՆ ԾԱՌԱՅՈՒԹՅՈՒՆՆԵՐԻ ՀԱՄԱՐԱՆԻՇԻ ՄԱՍԻՆ"
  },
  {
    "orig_doc_id": "91454",
    "Title": "ՀՀ ՕՐԵՆՔԸ ՀԱՆՐԱՅԻՆ ՀԱՏՎԱԾԻ ԿԱԶՄԱԿԵՐՊՈՒԹՅՈՒՆՆԵՐԻ ՀԱՇՎԱՊԱՀԱԿԱՆ ՀԱՇՎԱՌՄԱՆ ՄԱՍԻՆ"
  },
  {
    "orig_doc_id": "29455",
    "Title": "ՀՀ ՕՐԵՆՔԸ ՀԱՆՐՈՒԹՅԱՆ ԳԵՐԱԿԱ ՇԱՀԵՐԻ ԱՊԱՀՈՎՄԱՆ ՆՊԱՏԱԿՈՎ ՍԵՓԱԿԱՆՈՒԹՅԱՆ ՕՏԱՐՄԱՆ ՄԱՍԻՆ"
  },
  {
    "orig_doc_id": "29455",
    "Title": "ՀՀ ՕՐԵՆՔԸ ՀԱՆՐՈՒԹՅԱՆ ԳԵՐԱԿԱ ՇԱՀԵՐԻ ԱՊԱՀՈՎՄԱՆ ՆՊԱՏԱԿՈՎ ՍԵՓԱԿԱՆՈՒԹՅԱՆ ՕՏԱՐՄԱՆ ՄԱՍԻՆ&nbsp;&nbsp; "
  },
  {
    "orig_doc_id": "152960",
    "Title": "ՀՀ ՕՐԵՆՔԸ ՀԱՇՄԱՆԴԱՄՈՒԹՅՈՒՆ ՈՒՆԵՑՈՂ ԱՆՁԱՆՑ ԻՐԱՎՈՒՆՔՆԵՐԻ ՄԱՍԻՆ"
  },
  {
    "orig_doc_id": "137755",
    "Title": "ՀՀ ՕՐԵՆՔԸ ՀԱՇՎԱՊԱՀԱԿԱՆ ՀԱՇՎԱՌՄԱՆ ԵՎ ԱՈՒԴԻՏՈՐԱԿԱՆ ԳՈՐԾՈՒՆԵՈՒԹՅԱՆ ԿԱՐԳԱՎՈՐՄԱՆ ԵՎ ՀԱՆՐԱՅԻՆ ՎԵՐԱՀՍԿՈՂՈՒԹՅԱՆ ՄԱՍԻՆ"
  },
  {
    "orig_doc_id": "137754",
    "Title": "ՀՀ ՕՐԵՆՔԸ ՀԱՇՎԱՊԱՀԱԿԱՆ ՀԱՇՎԱՌՄԱՆ ՄԱՍԻՆ"
  },
  {
    "orig_doc_id": "119273",
    "Title": "ՀՀ ՕՐԵՆՔԸ ՀԱՇՎԵՔՆՆԻՉ ՊԱԼԱՏԻ ՄԱՍԻՆ"
  },
  {
    "orig_doc_id": "123437",
    "Title": "ՀՀ ՕՐԵՆՔԸ ՀԱՇՏԱՐԱՐՈՒԹՅԱՆ ՄԱՍԻՆ"
  },
  {
    "orig_doc_id": "110802",
    "Title": "ՀՀ ՕՐԵՆՔԸ ՀԱՍԱՐԱԿԱԿԱՆ ԿԱԶՄԱԿԵՐՊՈՒԹՅՈՒՆՆԵՐԻ ՄԱՍԻՆ"
  },
  {
    "orig_doc_id": "29455",
    "Title": "ՀՀ ՕՐԵՆՔԸ ՀԱՍԱՐԱԿՈՒԹՅԱՆ ԵՎ ՊԵՏՈՒԹՅԱՆ ԿԱՐԻՔՆԵՐԻ ՀԱՄԱՐ ՍԵՓԱԿԱՆՈՒԹՅԱՆ ՕՏԱՐՄԱՆ ՄԱՍԻՆ"
  },
  {
    "orig_doc_id": "74371",
    "Title": "ՀՀ ՕՐԵՆՔԸ ՀԱՎԱՏԱՐՄԱԳՐՄԱՆ ՄԱՍԻՆ"
  },
  {
    "orig_doc_id": "67136",
    "Title": "ՀՀ ՕՐԵՆՔԸ ՀԱՎԱՔՆԵՐԻ ԱԶԱՏՈՒԹՅԱՆ ՄԱՍԻՆ"
  },
  {
    "orig_doc_id": "1427",
    "Title": "ՀՀ ՕՐԵՆՔԸ ՀԱՏՈՒԿ ՊԵՏԱԿԱՆ ՊԱՇՏՊԱՆՈՒԹՅԱՆ ԵՆԹԱԿԱ ԱՆՁԱՆՑ ԱՆՎՏԱՆԳՈՒԹՅԱՆ ԱՊԱՀՈՎՄԱՆ ՄԱՍԻՆ"
  },
  {
    "orig_doc_id": "1546",
    "Title": "ՀՀ ՕՐԵՆՔԸ ՀԱՐԿԱԴԻՐ ԿԱՏԱՐՈՒՄՆ ԱՊԱՀՈՎՈՂ ԾԱՌԱՅՈՒԹՅԱՆ ՄԱՍԻՆ"
  },
  {
    "orig_doc_id": "1546",
    "Title": "ՀՀ ՕՐԵՆՔԸ ՀԱՐԿԱԴԻՐ ԿԱՏԱՐՈՒՄՆ ԱՊԱՀՈՎՈՂ ԾԱՌԱՅՈՒԹՅԱՆ ՄԱՍԻՆ<BR><BR>"
  },
  {
    "orig_doc_id": "1210",
    "Title": "ՀՀ ՕՐԵՆՔԸ ՀԱՐԿԱՅԻՆ ԾԱՌԱՅՈՒԹՅԱՆ ՄԱՍԻՆ"
  },
  {
    "orig_doc_id": "25161",
    "Title": "ՀՀ ՕՐԵՆՔԸ ՀԵՂԻՆԱԿԱՅԻՆ ԻՐԱՎՈՒՆՔԻ ԵՎ ՀԱՐԱԿԻՑ ԻՐԱՎՈՒՆՔՆԵՐԻ ՄԱՍԻՆ"
  },
  {
    "orig_doc_id": "834",
    "Title": "ՀՀ ՕՐԵՆՔԸ ՀԻԴՐՈՕԴԵՐԵՎՈՒԹԱԲԱՆԱԿԱՆ ԳՈՐԾՈՒՆԵՈՒԹՅԱՆ ՄԱՍԻՆ"
  },
  {
    "orig_doc_id": "1340",
    "Title": "ՀՀ ՕՐԵՆՔԸ ՀԻՄՆԱԴՐԱՄՆԵՐԻ ՄԱՍԻՆ"
  },
  {
    "orig_doc_id": "600",
    "Title": "ՀՀ ՕՐԵՆՔԸ ՀՀ 1999 ԹՎԱԿԱՆԻ ՊԵՏԱԿԱՆ ԲՅՈՒՋԵԻ ՄԱՍԻՆ"
  },
  {
    "orig_doc_id": "110819",
    "Title": "ՀՀ ՕՐԵՆՔԸ ՀՀ ԱԶԳԱՅԻՆ ԺՈՂՈՎԻ ՊԱՏԳԱՄԱՎՈՐԻ ԳՈՐԾՈՒՆԵՈՒԹՅԱՆ ԵՐԱՇԽԻՔՆԵՐԻ ՄԱՍԻՆ"
  },
  {
    "orig_doc_id": "52573",
    "Title": "ՀՀ ՕՐԵՆՔԸ ՀՀ ԱԺ ԱՇԽԱՏԱԿԱԶՄՈՒՄ ՊԵՏԱԿԱՆ ԾԱՌԱՅՈՒԹՅԱՆ ՄԱՍԻՆ"
  },
  {
    "orig_doc_id": "99164",
    "Title": "ՀՀ ՕՐԵՆՔԸ ՀՀ ԱՇԽԱՏԱՆՔԱՅԻՆ ՕՐԵՆՍԳՐՔՈՒՄ ԼՐԱՑՈՒՄՆԵՐ ԵՎ ՓՈՓՈԽՈՒԹՅՈՒՆՆԵՐ ԿԱՏԱՐԵԼՈՒ ՄԱՍԻՆ"
  },
  {
    "orig_doc_id": "425",
    "Title": "ՀՀ ՕՐԵՆՔԸ ՀՀ ԲՅՈՒՋԵՏԱՅԻՆ ՀԱՄԱԿԱՐԳԻ ՄԱՍԻՆ"
  },
  {
    "orig_doc_id": "114",
    "Title": "ՀՀ ՕՐԵՆՔԸ ՀՀ ԲՆԱԿՉՈՒԹՅԱՆ ՍԱՆԻՏԱՐԱՀԱՄԱՃԱՐԱԿԱՅԻՆ ԱՆՎՏԱՆԳՈՒԹՅԱՆ ԱՊԱՀՈՎՄԱՆ ՄԱՍԻՆ"
  },
  {
    "orig_doc_id": "67643",
    "Title": "ՀՀ ՕՐԵՆՔԸ ՀՀ ԳԻՏՈՒԹՅՈՒՆՆԵՐԻ ԱԶԳԱՅԻՆ ԱԿԱԴԵՄԻԱՅԻ ՄԱՍԻՆ"
  },
  {
    "orig_doc_id": "25185",
    "Title": "ՀՀ ՕՐԵՆՔԸ ՀՀ ԴՐՈՇԻ ՄԱՍԻՆ"
  },
  {
    "orig_doc_id": "95076",
    "Title": "ՀՀ ՕՐԵՆՔԸ ՀՀ ԵՎ ԵՎՐԱՍԻԱԿԱՆ ՏՆՏԵՍԱԿԱՆ ՄԻՈՒԹՅԱՆ ԱՆԴԱՄ ՊԵՏՈՒԹՅՈՒՆՆԵՐԻ ՄԻՋԵՎ ԱՆՈՒՂՂԱԿԻ ՀԱՐԿԵՐԻ ՀԱՇՎԱՐԿՄԱՆ ԵՎ ՎՃԱՐՄԱՆ ԱՌԱՆՁՆԱՀԱՏԿՈՒԹՅՈՒՆՆԵՐԻ ՄԱՍԻՆ<BR>"
  },
  {
    "orig_doc_id": "25191",
    "Title": "ՀՀ ՕՐԵՆՔԸ ՀՀ ԶԻՆԱՆՇԱՆԻ ՄԱՍԻՆ"
  },
  {
    "orig_doc_id": "75199",
    "Title": "ՀՀ ՕՐԵՆՔԸ ՀՀ ԶԻՆՎԱԾ ՈՒԺԵՐԻ ԿԱՐԳԱՊԱՀԱԿԱՆ ԿԱՆՈՆԱԳԻՐՔ"
  },
  {
    "orig_doc_id": "364",
    "Title": "ՀՀ ՕՐԵՆՔԸ ՀՀ ԶԻՆՎԱԾ ՈՒԺԵՐԻ ՆԵՐՔԻՆ ԾԱՌԱՅՈՒԹՅԱՆ ԿԱՆՈՆԱԳԻՐՔԸ ՀԱՍՏԱՏԵԼՈՒ ՄԱՍԻՆ"
  },
  {
    "orig_doc_id": "140326",
    "Title": "ՀՀ ՕՐԵՆՔԸ ՀՀ ԸՆՏԱՆԵԿԱՆ ՕՐԵՆՍԳՐՔՈՒՄ ՓՈՓՈԽՈՒԹՅՈՒՆ ԿԱՏԱՐԵԼՈՒ ՄԱՍԻՆ"
  },
  {
    "orig_doc_id": "313",
    "Title": "ՀՀ ՕՐԵՆՔԸ ՀՀ ԿԵՆՏՐՈՆԱԿԱՆ ԲԱՆԿԻ ՄԱՍԻՆ"
  },
  {
    "orig_doc_id": "123322",
    "Title": "ՀՀ ՕՐԵՆՔԸ ՀՀ ՀԱՐԿԱՅԻՆ ՕՐԵՆՍԳՐՔՈՒՄ ՓՈՓՈԽՈՒԹՅՈՒՆՆԵՐ ԵՎ ԼՐԱՑՈՒՄՆԵՐ ԿԱՏԱՐԵԼՈՒ ԵՎ 2017 ԹՎԱԿԱՆԻ ԴԵԿՏԵՄԲԵՐԻ 21-Ի «ՀՀ ՀԱՐԿԱՅԻՆ ՕՐԵՆՍԳՐՔՈՒՄ ՓՈՓՈԽՈՒԹՅՈՒՆՆԵՐ ԵՎ ԼՐԱՑՈՒՄՆԵՐ ԿԱՏԱՐԵԼՈՒ ՄԱՍԻՆ» ՀՕ-266-Ն ՕՐԵՆՔՈՒՄ ՓՈՓՈԽՈՒԹՅՈՒՆՆԵՐ ԵՎ ԼՐԱՑՈՒՄՆԵՐ ԿԱՏԱՐԵԼՈՒ ՄԱՍԻՆ"
  },
  {
    "orig_doc_id": "131962",
    "Title": "ՀՀ ՕՐԵՆՔԸ ՀՀ ՀԱՐԿԱՅԻՆ ՕՐԵՆՍԳՐՔՈՒՄ ՓՈՓՈԽՈՒԹՅՈՒՆՆԵՐ ԵՎ ԼՐԱՑՈՒՄՆԵՐ ԿԱՏԱՐԵԼՈՒ ԵՎ 2018 ԹՎԱԿԱՆԻ ՀՈՒՆԻՍԻ 21-Ի «ՀՀ ՀԱՐԿԱՅԻՆ ՕՐԵՆՍԳՐՔՈՒՄ ՓՈՓՈԽՈՒԹՅՈՒՆՆԵՐ ԵՎ ԼՐԱՑՈՒՄՆԵՐ ԿԱՏԱՐԵԼՈՒ ԵՎ 2017 ԹՎԱԿԱՆԻ ԴԵԿՏԵՄԲԵՐԻ 21-Ի «ՀՀ ՀԱՐԿԱՅԻՆ ՕՐԵՆՍԳՐՔՈՒՄ ՓՈՓՈԽՈՒԹՅՈՒՆՆԵՐ ԵՎ ԼՐԱՑՈՒՄՆԵՐ ԿԱՏԱՐԵԼՈՒ ՄԱՍԻՆ» ՀՕ-266-Ն ՕՐԵՆՔՈՒՄ ՓՈՓՈԽՈՒԹՅՈՒՆՆԵՐ ԵՎ ԼՐԱՑՈՒՄՆԵՐ ԿԱՏԱՐԵԼՈՒ ՄԱՍԻՆ» ՀՕ-338-Ն ՕՐԵՆՔՈՒՄ ՓՈՓՈԽՈՒԹՅՈՒՆ ԿԱՏԱՐԵԼՈՒ ՄԱՍԻՆ"
  },
  {
    "orig_doc_id": "118652",
    "Title": "ՀՀ ՕՐԵՆՔԸ ՀՀ ՀԱՐԿԱՅԻՆ ՕՐԵՆՍԳՐՔՈՒՄ ՓՈՓՈԽՈՒԹՅՈՒՆՆԵՐ ԵՎ ԼՐԱՑՈՒՄՆԵՐ ԿԱՏԱՐԵԼՈՒ ՄԱՍԻՆ"
  },
  {
    "orig_doc_id": "1894",
    "Title": "ՀՀ ՕՐԵՆՔԸ ՀՀ ՀՈՂԱՅԻՆ ՕՐԵՆՍԳՐՔՈՒՄ ԼՐԱՑՈՒՄՆԵՐ ԵՎ ՓՈՓՈԽՈՒԹՅՈՒՆՆԵՐ ԿԱՏԱՐԵԼՈՒ ՄԱՍԻՆ"
  },
  {
    "orig_doc_id": "1773",
    "Title": "ՀՀ ՕՐԵՆՔԸ ՀՀ ՈՍՏԻԿԱՆՈՒԹՅԱՆ ԿԱՐԳԱՊԱՀԱԿԱՆ ԿԱՆՈՆԱԳԻՐՔԸ ՀԱՍՏԱՏԵԼՈՒ ՄԱՍԻՆ"
  },
  {
    "orig_doc_id": "110528",
    "Title": "ՀՀ ՕՐԵՆՔԸ ՀՀ ՊԱՇՏՊԱՆՈՒԹՅԱՆ ԺԱՄԱՆԱԿ ԶԻՆԾԱՌԱՅՈՂՆԵՐԻ ԿՅԱՆՔԻՆ ԿԱՄ ԱՌՈՂՋՈՒԹՅԱՆԸ ՊԱՏՃԱՌՎԱԾ ՎՆԱՍՆԵՐԻ ՀԱՏՈՒՑՄԱՆ ՄԱՍԻՆ"
  },
  {
    "orig_doc_id": "91568",
    "Title": "ՀՀ ՕՐԵՆՔԸ ՀՀ ՊԵՏԱԿԱՆ ՊԱՐԳԵՎՆԵՐԻ ԵՎ ՊԱՏՎԱՎՈՐ ԿՈՉՈՒՄՆԵՐԻ ՄԱՍԻՆ"
  },
  {
    "orig_doc_id": "29587",
    "Title": "ՀՀ ՕՐԵՆՔԸ ՀՀ ՋՐԻ ԱԶԳԱՅԻՆ ԾՐԱԳՐԻ ՄԱՍԻՆ"
  },
  {
    "orig_doc_id": "914",
    "Title": "ՀՀ ՕՐԵՆՔԸ ՀՀ ՏՈՆԵՐԻ ԵՎ ՀԻՇԱՏԱԿԻ ՕՐԵՐԻ ՄԱՍԻՆ"
  },
  {
    "orig_doc_id": "172488",
    "Title": "ՀՀ ՕՐԵՆՔԸ ՀՀ ՔԱՂԱՔԱՑԻԱԿԱՆ ԴԱՏԱՎԱՐՈՒԹՅԱՆ ՕՐԵՆՍԳՐՔՈՒՄ ՓՈՓՈԽՈՒԹՅՈՒՆՆԵՐ ԵՎ ԼՐԱՑՈՒՄՆԵՐ ԿԱՏԱՐԵԼՈՒ ՄԱՍԻՆ"
  },
  {
    "orig_doc_id": "547",
    "Title": "ՀՀ ՕՐԵՆՔԸ ՀՀ ՔԱՂԱՔԱՑԻԱԿԱՆ ՕՐԵՆՍԳԻՐՔԸ ԳՈՐԾՈՂՈՒԹՅԱՆ ՄԵՋ ԴՆԵԼՈՒ ՄԱՍԻՆ"
  },
  {
    "orig_doc_id": "110836",
    "Title": "ՀՀ ՕՐԵՆՔԸ ՀՀ ՔԱՂԱՔԱՑԻԱԿԱՆ ՕՐԵՆՍԳՐՔՈՒՄ ՓՈՓՈԽՈՒԹՅՈՒՆՆԵՐ ԵՎ ԼՐԱՑՈՒՄՆԵՐ ԿԱՏԱՐԵԼՈՒ ՄԱՍԻՆ"
  },
  {
    "orig_doc_id": "238",
    "Title": "ՀՀ ՕՐԵՆՔԸ ՀՀ ՔԱՂԱՔԱՑԻՈՒԹՅԱՆ ՄԱՍԻՆ"
  },
  {
    "orig_doc_id": "73080",
    "Title": "ՀՀ ՕՐԵՆՔԸ ՀՀ ՔԱՂԱՔԱՑՈՒ ԱՆՁՆԱԳՐԻ ՄԱՍԻՆ"
  },
  {
    "orig_doc_id": "90848",
    "Title": "ՀՀ ՕՐԵՆՔԸ ՀՀ ՔՆՆՉԱԿԱՆ ԿՈՄԻՏԵԻ ՄԱՍԻՆ"
  },
  {
    "orig_doc_id": "105916",
    "Title": "ՀՀ ՕՐԵՆՔԸ ՀՀ ՔՐԵԱԿԱՆ ՕՐԵՆՍԳՐՔՈՒՄ ՓՈՓՈԽՈՒԹՅՈՒՆՆԵՐ ԵՎ ԼՐԱՑՈՒՄ ԿԱՏԱՐԵԼՈՒ ՄԱՍԻՆ"
  },
  {
    "orig_doc_id": "725",
    "Title": "ՀՀ ՕՐԵՆՔԸ ՀՀ-ՈՒՄ ՍՏՈՒԳՈՒՄՆԵՐԻ ԿԱԶՄԱԿԵՐՊՄԱՆ ԵՎ ԱՆՑԿԱՑՄԱՆ ՄԱՍԻՆ"
  },
  {
    "orig_doc_id": "297",
    "Title": "ՀՀ ՕՐԵՆՔԸ ՀՅՈՒՊԱՏՈՍԱԿԱՆ ԾԱՌԱՅՈՒԹՅԱՆ ՄԱՍԻՆ"
  },
  {
    "orig_doc_id": "1635",
    "Title": "ՀՀ ՕՐԵՆՔԸ ՀՈԳԵԲՈՒԺԱԿԱՆ ՕԳՆՈՒԹՅԱՆ ԵՎ ՍՊԱՍԱՐԿՄԱՆ ՄԱՍԻՆ"
  },
  {
    "orig_doc_id": "1635",
    "Title": "ՀՀ ՕՐԵՆՔԸ ՀՈԳԵԲՈՒԺԱԿԱՆ ՕԳՆՈՒԹՅԱՆ ՄԱՍԻՆ"
  },
  {
    "orig_doc_id": "855",
    "Title": "ՀՀ ՕՐԵՆՔԸ ՀՈՂԻ ՀԱՐԿԻ ԱՐՏՈՆՈՒԹՅՈՒՆՆԵՐԻ ՄԱՍԻՆ"
  },
  {
    "orig_doc_id": "23182",
    "Title": "ՀՀ ՕՐԵՆՔԸ ՀՈՒՂԱՐԿԱՎՈՐՈՒԹՅՈՒՆՆԵՐԻ ԿԱԶՄԱԿԵՐՊՄԱՆ ԵՎ ԳԵՐԵԶՄԱՆԱՏՆԵՐԻ ՈՒ ԴԻԱԿԻԶԱՐԱՆՆԵՐԻ ՇԱՀԱԳՈՐԾՄԱՆ ՄԱՍԻՆ"
  },
  {
    "orig_doc_id": "1381",
    "Title": "ՀՀ ՕՐԵՆՔԸ ՀՐԱՊԱՐԱԿԱՅԻՆ ՍԱԿԱՐԿՈՒԹՅՈՒՆՆԵՐԻ ՄԱՍԻՆ"
  },
  {
    "orig_doc_id": "872",
    "Title": "ՀՀ ՕՐԵՆՔԸ ՀՐԴԵՀԱՅԻՆ ԱՆՎՏԱՆԳՈՒԹՅԱՆ ՄԱՍԻՆ"
  },
  {
    "orig_doc_id": "1063",
    "Title": "ՀՀ ՕՐԵՆՔԸ ՁԵՐԲԱԿԱԼՎԱԾ ԵՎ ԿԱԼԱՆԱՎՈՐՎԱԾ ԱՆՁԱՆՑ ՊԱՀԵԼՈՒ ՄԱՍԻՆ"
  },
  {
    "orig_doc_id": "1857",
    "Title": "ՀՀ ՕՐԵՆՔԸ ՃԱՆԱՊԱՐՀԱՅԻՆ ԵՐԹԵՎԵԿՈՒԹՅԱՆ ԱՆՎՏԱՆԳՈՒԹՅԱՆ ԱՊԱՀՈՎՄԱՆ ՄԱՍԻՆ"
  },
  {
    "orig_doc_id": "118513",
    "Title": "ՀՀ ՕՐԵՆՔԸ ՃԱՐՏԱՐԱՊԵՏԱԿԱՆ ԳՈՐԾՈՒՆԵՈՒԹՅԱՆ ՄԱՍԻՆ"
  },
  {
    "orig_doc_id": "1671",
    "Title": "ՀՀ ՕՐԵՆՔԸ ՄԱՆԿԱՊԱՏԱՆԵԿԱՆ ՍՊՈՐՏԻ ՄԱՍԻՆ"
  },
  {
    "orig_doc_id": "74299",
    "Title": "ՀՀ ՕՐԵՆՔԸ ՄԱՍՆԱՎՈՐ ՊԱՀՆՈՐԴԱԿԱՆ ԳՈՐԾՈՒՆԵՈՒԹՅԱՆ ՄԱՍԻՆ"
  },
  {
    "orig_doc_id": "94984",
    "Title": "ՀՀ ՕՐԵՆՔԸ ՄԱՐԴԿԱՆՑ ԹՐԱՖԻՔԻՆԳԻ ԵՎ ՇԱՀԱԳՈՐԾՄԱՆ ԵՆԹԱՐԿՎԱԾ ԱՆՁԱՆՑ ՆՈՒՅՆԱՑՄԱՆ ԵՎ ԱՋԱԿՑՈՒԹՅԱՆ ՄԱՍԻՆ"
  },
  {
    "orig_doc_id": "72557",
    "Title": "ՀՀ ՕՐԵՆՔԸ ՄԱՐԴՈՒ ԱՐՅԱՆ ԵՎ ԴՐԱ ԲԱՂԱԴՐԱՄԱՍԵՐԻ ԴՈՆՈՐՈՒԹՅԱՆ ԵՎ ՓՈԽՆԵՐԱՐԿՈՒՄԱՅԻՆ ԲԺՇԿԱԿԱՆ ՕԳՆՈՒԹՅԱՆ ՄԱՍԻՆ"
  },
  {
    "orig_doc_id": "380",
    "Title": "ՀՀ ՕՐԵՆՔԸ ՄԱՐԴՈՒ ԻՄՈՒՆԱՅԻՆ ԱՆԲԱՎԱՐԱՐՈՒԹՅԱՆ ՎԻՐՈՒՍԻՑ ԱՌԱՋԱՑԱԾ ՀԻՎԱՆԴՈՒԹՅԱՆ ԿԱՆԽԱՐԳԵԼՄԱՆ ՄԱՍԻՆ"
  },
  {
    "orig_doc_id": "1287",
    "Title": "ՀՀ ՕՐԵՆՔԸ ՄԱՐԴՈՒ ՎԵՐԱՐՏԱԴՐՈՂԱԿԱՆ ԱՌՈՂՋՈՒԹՅԱՆ ԵՎ ՎԵՐԱՐՏԱԴՐՈՂԱԿԱՆ ԻՐԱՎՈՒՆՔՆԵՐԻ ՄԱՍԻՆ"
  },
  {
    "orig_doc_id": "1093",
    "Title": "ՀՀ ՕՐԵՆՔԸ ՄԱՐԴՈՒՆ ՕՐԳԱՆՆԵՐ ԵՎ (ԿԱՄ) ՀՅՈՒՍՎԱԾՔՆԵՐ ՓՈԽՊԱՏՎԱՍՏԵԼՈՒ ՄԱՍԻՆ"
  },
  {
    "orig_doc_id": "1202",
    "Title": "ՀՀ ՕՐԵՆՔԸ ՄԱՔՍԱՅԻՆ ԾԱՌԱՅՈՒԹՅԱՆ ՄԱՍԻՆ"
  },
  {
    "orig_doc_id": "169292",
    "Title": "ՀՀ ՕՐԵՆՔԸ ՄԱՔՍԱՅԻՆ ԿԱՐԳԱՎՈՐՄԱՆ ՄԱՍԻՆ"
  },
  {
    "orig_doc_id": "197",
    "Title": "ՀՀ ՕՐԵՆՔԸ ՄԹՆՈԼՈՐՏԱՅԻՆ ՕԴԻ ՊԱՀՊԱՆՈՒԹՅԱՆ ՄԱՍԻՆ"
  },
  {
    "orig_doc_id": "132697",
    "Title": "ՀՀ ՕՐԵՆՔԸ ՄԻՋԱԶԳԱՅԻՆ ԻՐԱՎԱԿԱՆ ՀԱՐՑԵՐՈՎ ՆԵՐԿԱՅԱՑՈՒՑՉԻ ՄԱՍԻՆ"
  },
  {
    "orig_doc_id": "1742",
    "Title": "ՀՀ ՕՐԵՆՔԸ ՄՇԱԿՈՒԹԱՅԻՆ ԱՐԺԵՔՆԵՐԻ ԱՐՏԱՀԱՆՄԱՆ ԵՎ ՆԵՐՄՈՒԾՄԱՆ ՄԱՍԻՆ"
  },
  {
    "orig_doc_id": "1278",
    "Title": "ՀՀ ՕՐԵՆՔԸ ՄՇԱԿՈՒԹԱՅԻՆ ՕՐԵՆՍԴՐՈՒԹՅԱՆ ՀԻՄՈՒՆՔՆԵՐԻ ՄԱՍԻՆ"
  },
  {
    "orig_doc_id": "21490",
    "Title": "ՀՀ ՕՐԵՆՔԸ ՆԱԽԱԴՊՐՈՑԱԿԱՆ ԿՐԹՈՒԹՅԱՆ ՄԱՍԻՆ"
  },
  {
    "orig_doc_id": "1855",
    "Title": "ՀՀ ՕՐԵՆՔԸ ՆԱԽՆԱԿԱՆ ՄԱՍՆԱԳԻՏԱԿԱՆ (ԱՐՀԵՍՏԱԳՈՐԾԱԿԱՆ) ԵՎ ՄԻՋԻՆ ՄԱՍՆԱԳԻՏԱԿԱՆ ԿՐԹՈՒԹՅԱՆ ՄԱՍԻՆ"
  },
  {
    "orig_doc_id": "64518",
    "Title": "ՀՀ ՕՐԵՆՔԸ ՆԵՐԴՐՈՒՄԱՅԻՆ ՖՈՆԴԵՐԻ ՄԱՍԻՆ"
  },
  {
    "orig_doc_id": "65056",
    "Title": "ՀՀ ՕՐԵՆՔԸ ՆԵՐՔԻՆ ԱՈՒԴԻՏԻ ՄԱՍԻՆ"
  },
  {
    "orig_doc_id": "140391",
    "Title": "ՀՀ ՕՐԵՆՔԸ ՆՅՈՒԹԱԿԱՆ ՊԱՀՈՒՍՏԻ ՄԱՍԻՆ"
  },
  {
    "orig_doc_id": "1023",
    "Title": "ՀՀ ՕՐԵՆՔԸ ՆՈՏԱՐԻԱՏԻ ՄԱՍԻՆ"
  },
  {
    "orig_doc_id": "120733",
    "Title": "ՀՀ ՕՐԵՆՔԸ ՆՈՐՄԱՏԻՎ ԻՐԱՎԱԿԱՆ ԱԿՏԵՐԻ ՄԱՍԻՆ"
  },
  {
    "orig_doc_id": "73075",
    "Title": "ՀՀ ՕՐԵՆՔԸ ՆՈՒՅՆԱԿԱՆԱՑՄԱՆ ՔԱՐՏԵՐԻ ՄԱՍԻՆ"
  },
  {
    "orig_doc_id": "1457",
    "Title": "ՀՀ ՕՐԵՆՔԸ ՆՎԱԶԱԳՈՒՅՆ ԱՄՍԱԿԱՆ ԱՇԽԱՏԱՎԱՐՁԻ ՄԱՍԻՆ"
  },
  {
    "orig_doc_id": "1349",
    "Title": "ՀՀ ՕՐԵՆՔԸ ՇԱՀՈՒՄՈՎ ԽԱՂԵՐԻ ԵՎ ԽԱՂԱՏՆԵՐԻ ՄԱՍԻՆ"
  },
  {
    "orig_doc_id": "1349",
    "Title": "ՀՀ ՕՐԵՆՔԸ ՇԱՀՈՒՄՈՎ ԽԱՂԵՐԻ, ԻՆՏԵՐՆԵՏ ՇԱՀՈՒՄՈՎ ԽԱՂԵՐԻ ԵՎ ԽԱՂԱՏՆԵՐԻ ՄԱՍԻՆ"
  },
  {
    "orig_doc_id": "95041",
    "Title": "ՀՀ ՕՐԵՆՔԸ ՇԱՐԺԱԿԱՆ ԳՈՒՅՔԻ ՆԿԱՏՄԱՄԲ ԱՊԱՀՈՎՎԱԾ ԻՐԱՎՈՒՆՔՆԵՐԻ ԳՐԱՆՑՄԱՆ ՄԱՍԻՆ"
  },
  {
    "orig_doc_id": "91594",
    "Title": "ՀՀ ՕՐԵՆՔԸ ՇՐՋԱԿԱ ՄԻՋԱՎԱՅՐԻ ՎՐԱ ԱԶԴԵՑՈՒԹՅԱՆ ԳՆԱՀԱՏՄԱՆ ԵՎ ՓՈՐՁԱՔՆՆՈՒԹՅԱՆ ՄԱՍԻՆ"
  },
  {
    "orig_doc_id": "458",
    "Title": "ՀՀ ՕՐԵՆՔԸ ՈՍՏԻԿԱՆՈՒԹՅԱՆ ԶՈՐՔԵՐԻ ՄԱՍԻՆ"
  },
  {
    "orig_doc_id": "874",
    "Title": "ՀՀ ՕՐԵՆՔԸ ՈՍՏԻԿԱՆՈՒԹՅԱՆ ՄԱՍԻՆ"
  },
  {
    "orig_doc_id": "1198",
    "Title": "ՀՀ ՕՐԵՆՔԸ ՈՍՏԻԿԱՆՈՒԹՅՈՒՆՈՒՄ ԾԱՌԱՅՈՒԹՅԱՆ ՄԱՍԻՆ"
  },
  {
    "orig_doc_id": "35409",
    "Title": "ՀՀ ՕՐԵՆՔԸ ՈՐՍԻ ԵՎ ՈՐՍՈՐԴԱԿԱՆ ՏՆՏԵՍՈՒԹՅԱՆ ՎԱՐՄԱՆ ՄԱՍԻՆ"
  },
  {
    "orig_doc_id": "74360",
    "Title": "ՀՀ ՕՐԵՆՔԸ ՉԱՓՈՒՄՆԵՐԻ ՄԻԱՍՆԱԿԱՆՈՒԹՅԱՆ ԱՊԱՀՈՎՄԱՆ ՄԱՍԻՆ"
  },
  {
    "orig_doc_id": "88713",
    "Title": "ՀՀ ՕՐԵՆՔԸ ՊԱՇՏՈՆԱՏԱՐ ԱՆՁԱՆՑ ԳՈՐԾՈՒՆԵՈՒԹՅԱՆ ԱՊԱՀՈՎՄԱՆ, ՍՊԱՍԱՐԿՄԱՆ ԵՎ ՍՈՑԻԱԼԱԿԱՆ ԵՐԱՇԽԻՔՆԵՐԻ ՄԱՍԻՆ"
  },
  {
    "orig_doc_id": "117631",
    "Title": "ՀՀ ՕՐԵՆՔԸ ՊԱՇՏՊԱՆՈՒԹՅԱՆ ՄԱՍԻՆ"
  },
  {
    "orig_doc_id": "588",
    "Title": "ՀՀ ՕՐԵՆՔԸ ՊԱՏՄՈՒԹՅԱՆ ԵՎ ՄՇԱԿՈՒՅԹԻ ԱՆՇԱՐԺ ՀՈՒՇԱՐՁԱՆՆԵՐԻ ՈՒ ՊԱՏՄԱԿԱՆ ՄԻՋԱՎԱՅՐԻ ՊԱՀՊԱՆՈՒԹՅԱՆ ԵՎ ՕԳՏԱԳՈՐԾՄԱՆ ՄԱՍԻՆ"
  },
  {
    "orig_doc_id": "120980",
    "Title": "ՀՀ ՕՐԵՆՔԸ ՊԵՏԱԿԱՆ ԱՐԱՐՈՂԱԿԱՐԳԻ ՄԱՍԻՆ"
  },
  {
    "orig_doc_id": "94427",
    "Title": "ՀՀ ՕՐԵՆՔԸ ՊԵՏԱԿԱՆ ԳՈՒՅՔԻ ԿԱՌԱՎԱՐՄԱՆ ՄԱՍԻՆ"
  },
  {
    "orig_doc_id": "495",
    "Title": "ՀՀ ՕՐԵՆՔԸ ՊԵՏԱԿԱՆ ԳՈՒՅՔԻ ՄԱՍՆԱՎՈՐԵՑՄԱՆ (ՍԵՓԱԿԱՆԱՇՆՈՐՀՄԱՆ) ՄԱՍԻՆ"
  },
  {
    "orig_doc_id": "916",
    "Title": "ՀՀ ՕՐԵՆՔԸ ՊԵՏԱԿԱՆ ԳՈՒՅՔԻ ՄԱՍՆԱՎՈՐԵՑՄԱՆ 2001-2003 ԹՎԱԿԱՆՆԵՐԻ ԾՐԱԳՐԻ ՄԱՍԻՆ"
  },
  {
    "orig_doc_id": "25078",
    "Title": "ՀՀ ՕՐԵՆՔԸ ՊԵՏԱԿԱՆ ԳՈՒՅՔԻ ՄԱՍՆԱՎՈՐԵՑՄԱՆ 2006-2007 ԹՎԱԿԱՆՆԵՐԻ ԾՐԱԳՐԻ ՄԱՍԻՆ"
  },
  {
    "orig_doc_id": "114386",
    "Title": "ՀՀ ՕՐԵՆՔԸ ՊԵՏԱԿԱՆ ԳՈՒՅՔԻ ՄԱՍՆԱՎՈՐԵՑՄԱՆ 2017-2020 ԹՎԱԿԱՆՆԵՐԻ ԾՐԱԳՐԻ ՄԱՍԻՆ"
  },
  {
    "orig_doc_id": "120920",
    "Title": "ՀՀ ՕՐԵՆՔԸ ՊԵՏԱԿԱՆ ԿԱՌԱՎԱՐՄԱՆ ՀԱՄԱԿԱՐԳԻ ՄԱՐՄԻՆՆԵՐԻ ՄԱՍԻՆ"
  },
  {
    "orig_doc_id": "982",
    "Title": "ՀՀ ՕՐԵՆՔԸ ՊԵՏԱԿԱՆ ԿԱՌԱՎԱՐՉԱԿԱՆ ՀԻՄՆԱՐԿՆԵՐԻ ՄԱՍԻՆ"
  },
  {
    "orig_doc_id": "64540",
    "Title": "ՀՀ ՕՐԵՆՔԸ ՊԵՏԱԿԱՆ ԿԵՆՍԱԹՈՇԱԿՆԵՐԻ ՄԱՍԻՆ"
  },
  {
    "orig_doc_id": "87738",
    "Title": "ՀՀ ՕՐԵՆՔԸ ՊԵՏԱԿԱՆ ՆՊԱՍՏՆԵՐԻ ՄԱՍԻՆ"
  },
  {
    "orig_doc_id": "984",
    "Title": "ՀՀ ՕՐԵՆՔԸ ՊԵՏԱԿԱՆ ՈՉ ԱՌԵՎՏՐԱՅԻՆ ԿԱԶՄԱԿԵՐՊՈՒԹՅՈՒՆՆԵՐԻ ՄԱՍԻՆ"
  },
  {
    "orig_doc_id": "87706",
    "Title": "ՀՀ ՕՐԵՆՔԸ ՊԵՏԱԿԱՆ ՊԱՇՏՈՆՆԵՐ ԵՎ ՊԵՏԱԿԱՆ ԾԱՌԱՅՈՒԹՅԱՆ ՊԱՇՏՈՆՆԵՐ ԶԲԱՂԵՑՆՈՂ ԱՆՁԱՆՑ ՎԱՐՁԱՏՐՈՒԹՅԱՆ ՄԱՍԻՆ"
  },
  {
    "orig_doc_id": "87706",
    "Title": "ՀՀ ՕՐԵՆՔԸ ՊԵՏԱԿԱՆ ՊԱՇՏՈՆՆԵՐ ԶԲԱՂԵՑՆՈՂ ԱՆՁԱՆՑ ՎԱՐՁԱՏՐՈՒԹՅԱՆ ՄԱՍԻՆ"
  },
  {
    "orig_doc_id": "88713",
    "Title": "ՀՀ ՕՐԵՆՔԸ ՊԵՏԱԿԱՆ ՊԱՇՏՈՆՆԵՐ ԶԲԱՂԵՑՐԱԾ ԱՆՁԱՆՑ ՍՈՑԻԱԼԱԿԱՆ ԵՐԱՇԽԻՔՆԵՐԻ ՄԱՍԻՆ"
  },
  {
    "orig_doc_id": "44514",
    "Title": "ՀՀ ՕՐԵՆՔԸ ՊԵՏԱԿԱՆ ՊԱՐՏՔԻ ՄԱՍԻՆ"
  },
  {
    "orig_doc_id": "1008",
    "Title": "ՀՀ ՕՐԵՆՔԸ ՊԵՏԱԿԱՆ ՍԱՀՄԱՆԻ ՄԱՍԻՆ"
  },
  {
    "orig_doc_id": "487",
    "Title": "ՀՀ ՕՐԵՆՔԸ ՊԵՏԱԿԱՆ ՏՈՒՐՔԻ ՄԱՍԻՆ"
  },
  {
    "orig_doc_id": "132596",
    "Title": "ՀՀ ՕՐԵՆՔԸ ՊԵՏՈՒԹՅՈՒՆ-ՄԱՍՆԱՎՈՐ ԳՈՐԾԸՆԿԵՐՈՒԹՅԱՆ ՄԱՍԻՆ"
  },
  {
    "orig_doc_id": "105914",
    "Title": "ՀՀ ՕՐԵՆՔԸ ՊՐՈԲԱՑԻԱՅԻ ՄԱՍԻՆ"
  },
  {
    "orig_doc_id": "1784",
    "Title": "ՀՀ ՕՐԵՆՔԸ ՋՐԻ ԱԶԳԱՅԻՆ ՔԱՂԱՔԱԿԱՆՈՒԹՅԱՆ ՀԻՄՆԱԴՐՈՒՅԹՆԵՐԻ ՄԱՍԻՆ"
  },
  {
    "orig_doc_id": "1167",
    "Title": "ՀՀ ՕՐԵՆՔԸ ՋՐՕԳՏԱԳՈՐԾՈՂՆԵՐԻ ԸՆԿԵՐՈՒԹՅՈՒՆՆԵՐԻ ԵՎ ՋՐՕԳՏԱԳՈՐԾՈՂՆԵՐԻ ԸՆԿԵՐՈՒԹՅՈՒՆՆԵՐԻ ՄԻՈՒԹՅՈՒՆՆԵՐԻ ՄԱՍԻՆ"
  },
  {
    "orig_doc_id": "30013",
    "Title": "ՀՀ ՕՐԵՆՔԸ ՌԱԶՄԱԿԱՆ ԴՐՈՒԹՅԱՆ ԻՐԱՎԱԿԱՆ ՌԵԺԻՄԻ ՄԱՍԻՆ"
  },
  {
    "orig_doc_id": "30298",
    "Title": "ՀՀ ՕՐԵՆՔԸ ՌԱԶՄԱԿԱՆ ՈՍՏԻԿԱՆՈՒԹՅԱՆ ՄԱՍԻՆ"
  },
  {
    "orig_doc_id": "97154",
    "Title": "ՀՀ ՕՐԵՆՔԸ ՌԱԶՄԱՐԴՅՈՒՆԱԲԵՐԱԿԱՆ ՀԱՄԱԼԻՐԻ ՄԱՍԻՆ"
  },
  {
    "orig_doc_id": "94419",
    "Title": "ՀՀ ՕՐԵՆՔԸ ՍԱՀՄԱՆԱՄԵՐՁ ԲՆԱԿԱՎԱՅՐԵՐՈՒՄ ԻՐԱԿԱՆԱՑՎՈՂ ԳՈՐԾՈՒՆԵՈՒԹՅՈՒՆԸ ՀԱՐԿԵՐԻՑ ԱԶԱՏԵԼՈՒ ՄԱՍԻՆ"
  },
  {
    "orig_doc_id": "94419",
    "Title": "ՀՀ ՕՐԵՆՔԸ ՍԱՀՄԱՆԱՄԵՐՁ ԳՅՈՒՂԱԿԱՆ ՀԱՄԱՅՆՔՆԵՐՈՒՄ ԻՐԱԿԱՆԱՑՎՈՂ ԳՈՐԾՈՒՆԵՈՒԹՅՈՒՆԸ ՀԱՐԿԵՐԻՑ ԱԶԱՏԵԼՈՒ ՄԱՍԻՆ"
  },
  {
    "orig_doc_id": "94686",
    "Title": "ՀՀ ՕՐԵՆՔԸ ՍԱՀՄԱՆԱՄԵՐՁ ՀԱՄԱՅՆՔՆԵՐԻ ՍՈՑԻԱԼԱԿԱՆ ԱՋԱԿՑՈՒԹՅԱՆ ՄԱՍԻՆ"
  },
  {
    "orig_doc_id": "94419",
    "Title": "ՀՀ ՕՐԵՆՔԸ ՍԱՀՄԱՆԱՄԵՐՁ ՀԱՄԱՅՆՔՆԵՐՈՒՄ ԻՐԱԿԱՆԱՑՎՈՂ ԳՈՐԾՈՒՆԵՈՒԹՅՈՒՆԸ ՀԱՐԿԵՐԻՑ ԱԶԱՏԵԼՈՒ ՄԱՍԻՆ"
  },
  {
    "orig_doc_id": "865",
    "Title": "ՀՀ ՕՐԵՆՔԸ ՍԱՀՄԱՆԱՄԵՐՁ ՏԱՐԱԾԱՇՐՋԱՆՆԵՐԻ ՄԱՍԻՆ"
  },
  {
    "orig_doc_id": "1010",
    "Title": "ՀՀ ՕՐԵՆՔԸ ՍԱՀՄԱՆԱՊԱՀ ԶՈՐՔԵՐԻ ՄԱՍԻՆ"
  },
  {
    "orig_doc_id": "991",
    "Title": "ՀՀ ՕՐԵՆՔԸ ՍԱՀՄԱՆԱՓԱԿ ՊԱՏԱՍԽԱՆԱՏՎՈՒԹՅԱՄԲ ԸՆԿԵՐՈՒԹՅՈՒՆՆԵՐԻ ՄԱՍԻՆ"
  },
  {
    "orig_doc_id": "646",
    "Title": "ՀՀ ՕՐԵՆՔԸ ՍԵԼԵԿՑԻՈՆ ՆՎԱՃՈՒՄՆԵՐԻ ՊԱՀՊԱՆՈՒԹՅԱՆ ՄԱՍԻՆ"
  },
  {
    "orig_doc_id": "1169",
    "Title": "ՀՀ ՕՐԵՆՔԸ ՍԵՅՍՄԻԿ ՊԱՇՏՊԱՆՈՒԹՅԱՆ ՄԱՍԻՆ"
  },
  {
    "orig_doc_id": "1028",
    "Title": "ՀՀ ՕՐԵՆՔԸ ՍԵՎԱՆԱ ԼՃԻ ԷԿՈՀԱՄԱԿԱՐԳԻ ՎԵՐԱԿԱՆԳՆՄԱՆ, ՊԱՀՊԱՆՄԱՆ, ՎԵՐԱՐՏԱԴՐՄԱՆ ԵՎ ՕԳՏԱԳՈՐԾՄԱՆ ՄԻՋՈՑԱՌՈՒՄՆԵՐԻ ՏԱՐԵԿԱՆ ՈՒ ՀԱՄԱԼԻՐ ԾՐԱԳՐԵՐԸ ՀԱՍՏԱՏԵԼՈՒ ՄԱՍԻՆ"
  },
  {
    "orig_doc_id": "891",
    "Title": "ՀՀ ՕՐԵՆՔԸ ՍԵՎԱՆԱ ԼՃԻ ՄԱՍԻՆ"
  },
  {
    "orig_doc_id": "30576",
    "Title": "ՀՀ ՕՐԵՆՔԸ ՍՆԱՆԿՈՒԹՅԱՆ ՄԱՍԻՆ"
  },
  {
    "orig_doc_id": "91570",
    "Title": "ՀՀ ՕՐԵՆՔԸ ՍՆՆԴԱՄԹԵՐՔԻ ԱՆՎՏԱՆԳՈՒԹՅԱՆ ՄԱՍԻՆ"
  },
  {
    "orig_doc_id": "91593",
    "Title": "ՀՀ ՕՐԵՆՔԸ ՍՆՆԴԱՄԹԵՐՔԻ ԱՆՎՏԱՆԳՈՒԹՅԱՆ ՊԵՏԱԿԱՆ ՎԵՐԱՀՍԿՈՂՈՒԹՅԱՆ ՄԱՍԻՆ"
  },
  {
    "orig_doc_id": "94972",
    "Title": "ՀՀ ՕՐԵՆՔԸ ՍՈՑԻԱԼԱԿԱՆ ԱՋԱԿՑՈՒԹՅԱՆ ՄԱՍԻՆ"
  },
  {
    "orig_doc_id": "161",
    "Title": "ՀՀ ՕՐԵՆՔԸ ՍՊԱՌՈՂԱԿԱՆ ԿՈՈՊԵՐԱՑԻԱՅԻ ՄԱՍԻՆ"
  },
  {
    "orig_doc_id": "45521",
    "Title": "ՀՀ ՕՐԵՆՔԸ ՍՊԱՌՈՂԱԿԱՆ ԿՐԵԴԻՏԱՎՈՐՄԱՆ ՄԱՍԻՆ"
  },
  {
    "orig_doc_id": "908",
    "Title": "ՀՀ ՕՐԵՆՔԸ ՍՊԱՌՈՂՆԵՐԻ ԻՐԱՎՈՒՆՔՆԵՐԻ ՊԱՇՏՊԱՆՈՒԹՅԱՆ ՄԱՍԻՆ"
  },
  {
    "orig_doc_id": "74337",
    "Title": "ՀՀ ՕՐԵՆՔԸ ՍՏԱՆԴԱՐՏԱՑՄԱՆ ՄԱՍԻՆ"
  },
  {
    "orig_doc_id": "1151",
    "Title": "ՀՀ ՕՐԵՆՔԸ ՎԱՐԿԱՅԻՆ ԿԱԶՄԱԿԵՐՊՈՒԹՅՈՒՆՆԵՐԻ ՄԱՍԻՆ"
  },
  {
    "orig_doc_id": "47818",
    "Title": "ՀՀ ՕՐԵՆՔԸ ՎԱՐԿԱՅԻՆ ՏԵՂԵԿԱՏՎՈՒԹՅԱՆ ՇՐՋԱՆԱՌՈՒԹՅԱՆ ԵՎ ՎԱՐԿԱՅԻՆ ԲՅՈՒՐՈՆԵՐԻ ԳՈՐԾՈՒՆԵՈՒԹՅԱՆ ՄԱՍԻՆ"
  },
  {
    "orig_doc_id": "150010",
    "Title": "ՀՀ ՕՐԵՆՔԸ ՎԱՐՉԱԿԱՆ ԻՐԱՎԱԽԱԽՏՈՒՄՆԵՐԻ ՎԵՐԱԲԵՐՅԱԼ ՀՀ ՕՐԵՆՍԳՐՔՈՒՄ ԼՐԱՑՈՒՄՆԵՐ ԿԱՏԱՐԵԼՈՒ ՄԱՍԻՆ"
  },
  {
    "orig_doc_id": "150889",
    "Title": "ՀՀ ՕՐԵՆՔԸ ՎԱՐՉԱԿԱՆ ԻՐԱՎԱԽԱԽՏՈՒՄՆԵՐԻ ՎԵՐԱԲԵՐՅԱԼ ՀՀ ՕՐԵՆՍԳՐՔՈՒՄ ՓՈՓՈԽՈՒԹՅՈՒՆՆԵՐ ԵՎ ԼՐԱՑՈՒՄ ԿԱՏԱՐԵԼՈՒ ՄԱՍԻՆ"
  },
  {
    "orig_doc_id": "153079",
    "Title": "ՀՀ ՕՐԵՆՔԸ ՎԱՐՉԱԿԱՆ ԻՐԱՎԱԽԱԽՏՈՒՄՆԵՐԻ ՎԵՐԱԲԵՐՅԱԼ ՀՀ ՕՐԵՆՍԳՐՔՈՒՄ ՓՈՓՈԽՈՒԹՅՈՒՆՆԵՐ ԵՎ ԼՐԱՑՈՒՄՆԵՐ ԿԱՏԱՐԵԼՈՒ ՄԱՍԻՆ"
  },
  {
    "orig_doc_id": "60760",
    "Title": "ՀՀ ՕՐԵՆՔԸ ՎԱՐՉԱԿԱՆ ԻՐԱՎԱԽԱԽՏՈՒՄՆԵՐԻ ՎԵՐԱԲԵՐՅԱԼ ՀՀ ՕՐԵՆՍԳՐՔՈՒՄ ՓՈՓՈԽՈՒԹՅՈՒՆՆԵՐ ԵՎ ԼՐԱՑՈՒՄՆԵՐ ԿԱՏԱՐԵԼՈՒ ՄԱՍԻՆ"
  },
  {
    "orig_doc_id": "21572",
    "Title": "ՀՀ ՕՐԵՆՔԸ ՎԱՐՉԱԿԱՆ ԻՐԱՎԱԽԱԽՏՈՒՄՆԵՐԻ ՎԵՐԱԲԵՐՅԱԼ ՀՀ ՕՐԵՆՍԳՐՔՈՒՄ ՓՈՓՈԽՈՒԹՅՈՒՆՆԵՐ ԵՎ ԼՐԱՑՈՒՄՆԵՐ ԿԱՏԱՐԵԼՈՒ ՄԱՍԻՆ "
  },
  {
    "orig_doc_id": "1549",
    "Title": "ՀՀ ՕՐԵՆՔԸ ՎԱՐՉԱՐԱՐՈՒԹՅԱՆ ՀԻՄՈՒՆՔՆԵՐԻ ԵՎ ՎԱՐՉԱԿԱՆ ՎԱՐՈՒՅԹԻ ՄԱՍԻՆ"
  },
  {
    "orig_doc_id": "21956",
    "Title": "ՀՀ ՕՐԵՆՔԸ ՎՃԱՐԱՀԱՇՎԱՐԿԱՅԻՆ ՀԱՄԱԿԱՐԳԵՐԻ ԵՎ ՎՃԱՐԱՀԱՇՎԱՐԿԱՅԻՆ ԿԱԶՄԱԿԵՐՊՈՒԹՅՈՒՆՆԵՐԻ ՄԱՍԻՆ"
  },
  {
    "orig_doc_id": "137110",
    "Title": "ՀՀ ՕՐԵՆՔԸ ՏԱՐԱԾՔԱՅԻՆ ԿԱՌԱՎԱՐՄԱՆ ՄԱՍԻՆ"
  },
  {
    "orig_doc_id": "21325",
    "Title": "ՀՀ ՕՐԵՆՔԸ ՏԵԽՆԻԿԱԿԱՆ ԱՆՎՏԱՆԳՈՒԹՅԱՆ ԱՊԱՀՈՎՄԱՆ ՊԵՏԱԿԱՆ ԿԱՐԳԱՎՈՐՄԱՆ ՄԱՍԻՆ"
  },
  {
    "orig_doc_id": "74370",
    "Title": "ՀՀ ՕՐԵՆՔԸ ՏԵԽՆԻԿԱԿԱՆ ԿԱՆՈՆԱԿԱՐԳՄԱՆ ՄԱՍԻՆ"
  },
  {
    "orig_doc_id": "1109",
    "Title": "ՀՀ ՕՐԵՆՔԸ ՏԵՂԱԿԱՆ ԻՆՔՆԱԿԱՌԱՎԱՐՄԱՆ ՄԱՍԻՆ"
  },
  {
    "orig_doc_id": "1109",
    "Title": "ՀՀ ՕՐԵՆՔԸ ՏԵՂԱԿԱՆ ԻՆՔՆԱԿԱՌԱՎԱՐՄԱՆ ՄԱՍԻՆ "
  },
  {
    "orig_doc_id": "123425",
    "Title": "ՀՀ ՕՐԵՆՔԸ ՏԵՂԱԿԱՆ ՀԱՆՐԱՔՎԵԻ ՄԱՍԻՆ"
  },
  {
    "orig_doc_id": "485",
    "Title": "ՀՀ ՕՐԵՆՔԸ ՏԵՂԱԿԱՆ ՏՈՒՐՔԵՐԻ ԵՎ ՎՃԱՐՆԵՐԻ ՄԱՍԻՆ"
  },
  {
    "orig_doc_id": "95017",
    "Title": "ՀՀ ՕՐԵՆՔԸ ՏԵՂԵԿԱՏՎԱԿԱՆ ՏԵԽՆՈԼՈԳԻԱՆԵՐԻ ՈԼՈՐՏԻ ՊԵՏԱԿԱՆ ԱՋԱԿՑՈՒԹՅԱՆ ՄԱՍԻՆ "
  },
  {
    "orig_doc_id": "1372",
    "Title": "ՀՀ ՕՐԵՆՔԸ ՏԵՂԵԿԱՏՎՈՒԹՅԱՆ ԱԶԱՏՈՒԹՅԱՆ ՄԱՍԻՆ"
  },
  {
    "orig_doc_id": "145079",
    "Title": "ՀՀ ՕՐԵՆՔԸ ՏԵՍԱԼՍՈՂԱԿԱՆ ՄԵԴԻԱՅԻ ՄԱՍԻՆ"
  },
  {
    "orig_doc_id": "48761",
    "Title": "ՀՀ ՕՐԵՆՔԸ ՏԵՍԱՆԿԱՐԱՀԱՆՈՂ ԿԱՄ ԼՈՒՍԱՆԿԱՐԱՀԱՆՈՂ ՍԱՐՔԵՐՈՎ ՀԱՅՏՆԱԲԵՐՎԱԾ ՃԱՆԱՊԱՐՀԱՅԻՆ ԵՐԹԵՎԵԿՈՒԹՅԱՆ ԿԱՆՈՆՆԵՐԻ ԽԱԽՏՈՒՄՆԵՐԻ ՎԵՐԱԲԵՐՅԱԼ ԳՈՐԾԵՐՈՎ ԻՐԱԿԱՆԱՑՎՈՂ ՎԱՐՉԱԿԱՆ ՎԱՐՈՒՅԹԻ ԱՌԱՆՁՆԱՀԱՏԿՈՒԹՅՈՒՆՆԵՐԻ ՄԱՍԻՆ"
  },
  {
    "orig_doc_id": "95028",
    "Title": "ՀՀ ՕՐԵՆՔԸ ՏԵՍՉԱԿԱՆ ՄԱՐՄԻՆՆԵՐԻ ՄԱՍԻՆ"
  },
  {
    "orig_doc_id": "796",
    "Title": "ՀՀ ՕՐԵՆՔԸ ՏՆՏԵՍԱԿԱՆ ՄՐՑԱԿՑՈՒԹՅԱՆ ՊԱՇՏՊԱՆՈՒԹՅԱՆ ՄԱՍԻՆ"
  },
  {
    "orig_doc_id": "1812",
    "Title": "ՀՀ ՕՐԵՆՔԸ ՏՈՀՄԱՅԻՆ ԱՆԱՍՆԱԲՈՒԾՈՒԹՅԱՆ ՄԱՍԻՆ"
  },
  {
    "orig_doc_id": "510",
    "Title": "ՀՀ ՕՐԵՆՔԸ ՏՐԱՆՍՊՈՐՏԻ ՄԱՍԻՆ"
  },
  {
    "orig_doc_id": "48710",
    "Title": "ՀՀ ՕՐԵՆՔԸ ՓԱԽՍՏԱԿԱՆՆԵՐԻ ԵՎ ԱՊԱՍՏԱՆԻ ՄԱՍԻՆ"
  },
  {
    "orig_doc_id": "1527",
    "Title": "ՀՀ ՕՐԵՆՔԸ ՓԱՍՏԱԲԱՆՈՒԹՅԱՆ ՄԱՍԻՆ"
  },
  {
    "orig_doc_id": "1881",
    "Title": "ՀՀ ՕՐԵՆՔԸ ՓԱՍՏԱԹՂԹԵՐԻ (ՎԱՎԵՐԱԳՐԵՐԻ) ՊԱՐՏԱԴԻՐ ՕՐԻՆԱԿԻ ՄԱՍԻՆ"
  },
  {
    "orig_doc_id": "34976",
    "Title": "ՀՀ ՕՐԵՆՔԸ ՓԱՍՏԱԹՂԹԵՐԻ ՀԱՏՈՒԿ ԱՌԱՔՄԱՆ ՄԱՍԻՆ"
  },
  {
    "orig_doc_id": "44673",
    "Title": "ՀՀ ՕՐԵՆՔԸ ՓՈՂԵՐԻ ԼՎԱՑՄԱՆ ԵՎ ԱՀԱԲԵԿՉՈՒԹՅԱՆ ՖԻՆԱՆՍԱՎՈՐՄԱՆ ԴԵՄ ՊԱՅՔԱՐԻ ՄԱՍԻՆ"
  },
  {
    "orig_doc_id": "1562",
    "Title": "ՀՀ ՕՐԵՆՔԸ ՓՈՍՏԱՅԻՆ ԿԱՊԻ ՄԱՍԻՆ"
  },
  {
    "orig_doc_id": "806",
    "Title": "ՀՀ ՕՐԵՆՔԸ ՓՈՔՐ ԵՎ ՄԻՋԻՆ ՁԵՌՆԱՐԿԱՏԻՐՈՒԹՅԱՆ ՊԵՏԱԿԱՆ ԱՋԱԿՑՈՒԹՅԱՆ ՄԱՍԻՆ"
  },
  {
    "orig_doc_id": "1863",
    "Title": "ՀՀ ՕՐԵՆՔԸ ՓՐԿԱՐԱՐ ԾԱՌԱՅՈՒԹՅԱՆ ՄԱՍԻՆ"
  },
  {
    "orig_doc_id": "1641",
    "Title": "ՀՀ ՕՐԵՆՔԸ ՓՐԿԱՐԱՐ ՈՒԺԵՐԻ ԵՎ ՓՐԿԱՐԱՐԻ ԿԱՐԳԱՎԻՃԱԿԻ ՄԱՍԻՆ"
  },
  {
    "orig_doc_id": "110557",
    "Title": "ՀՀ ՕՐԵՆՔԸ ՓՐԿԱՐԱՐԱԿԱՆ ԾԱՌԱՅՈՒԹՅԱՆ ԿԱՆՈՆԱԳԻՐՔԸ ՀԱՍՏԱՏԵԼՈՒ ՄԱՍԻՆ"
  },
  {
    "orig_doc_id": "957",
    "Title": "ՀՀ ՕՐԵՆՔԸ ՔԱՂԱՔԱԿԱՆ ԱՊԱՍՏԱՆԻ ՄԱՍԻՆ"
  },
  {
    "orig_doc_id": "681",
    "Title": "ՀՀ ՕՐԵՆՔԸ ՔԱՂԱՔԱՇԻՆՈՒԹՅԱՆ ԲՆԱԳԱՎԱՌՈՒՄ ԻՐԱՎԱԽԱԽՏՈՒՄՆԵՐԻ ՀԱՄԱՐ ՊԱՏԱՍԽԱՆԱՏՎՈՒԹՅԱՆ ՄԱՍԻՆ"
  },
  {
    "orig_doc_id": "528",
    "Title": "ՀՀ ՕՐԵՆՔԸ ՔԱՂԱՔԱՇԻՆՈՒԹՅԱՆ ՄԱՍԻՆ"
  },
  {
    "orig_doc_id": "120807",
    "Title": "ՀՀ ՕՐԵՆՔԸ ՔԱՂԱՔԱՑԻԱԿԱՆ ԾԱՌԱՅՈՒԹՅԱՆ ՄԱՍԻՆ"
  },
  {
    "orig_doc_id": "149999",
    "Title": "ՀՀ ՕՐԵՆՔԸ ՔԱՂԱՔԱՑԻԱԿԱՆ ԿԱՑՈՒԹՅԱՆ ԱԿՏԵՐԻ ԳՐԱՆՑՄԱՆ ՄԱՍԻՆ"
  },
  {
    "orig_doc_id": "1073",
    "Title": "ՀՀ ՕՐԵՆՔԸ ՔԱՂԱՔԱՑԻԱԿԱՆ ՊԱՇՏՊԱՆՈՒԹՅԱՆ ՄԱՍԻՆ"
  },
  {
    "orig_doc_id": "1591",
    "Title": "ՀՀ ՕՐԵՆՔԸ ՔԱՂԱՔԱՑԻԱԿԱՆ ՊԱՇՏՊԱՆՈՒԹՅԱՆ ՍՏՈՐԱԲԱԺԱՆՈՒՄՆԵՐԻ ՄԱՍԻՆ"
  },
  {
    "orig_doc_id": "1850",
    "Title": "ՀՀ ՕՐԵՆՔԸ ՔՐԵԱԿԱՏԱՐՈՂԱԿԱՆ ԾԱՌԱՅՈՒԹՅԱՆ ՄԱՍԻՆ"
  },
  {
    "orig_doc_id": "29656",
    "Title": "ՀՀ ՕՐԵՆՔԸ ՕԶՈՆԱՅԻՆ ՇԵՐՏԸ ՔԱՅՔԱՅՈՂ ՆՅՈՒԹԵՐԻ ՄԱՍԻՆ"
  },
  {
    "orig_doc_id": "29656",
    "Title": "ՀՀ ՕՐԵՆՔԸ ՕԶՈՆԱՅԻՆ ՇԵՐՏԻ ՊԱՀՊԱՆՈՒԹՅԱՆ ՄԱՍԻՆ"
  },
  {
    "orig_doc_id": "40266",
    "Title": "ՀՀ ՕՐԵՆՔԸ ՕՊԵՐԱՏԻՎ-ՀԵՏԱԽՈՒԶԱԿԱՆ ԳՈՐԾՈՒՆԵՈՒԹՅԱՆ ՄԱՍԻՆ"
  },
  {
    "orig_doc_id": "30348",
    "Title": "ՀՀ ՕՐԵՆՔԸ ՕՏԱՐԵՐԿՐԱՑԻՆԵՐԻ ՄԱՍԻՆ"
  },
  {
    "orig_doc_id": "192",
    "Title": "ՀՀ ՕՐԵՆՔԸ ՕՏԱՐԵՐԿՐՅԱ ՆԵՐԴՐՈՒՄՆԵՐԻ ՄԱՍԻՆ"
  },
  {
    "orig_doc_id": "43723",
    "Title": "ՀՀ ՕՐԵՆՔԸ ՕՐԳԱՆԱԿԱՆ ԳՅՈՒՂԱՏՆՏԵՍՈՒԹՅԱՆ ՄԱՍԻՆ"
  },
  {
    "orig_doc_id": "1703",
    "Title": "ՀՀ ՕՐԵՆՔԸ ՖԻԶԻԿԱԿԱՆ ԱՆՁԱՆՑ ԲԱՆԿԱՅԻՆ ԱՎԱՆԴՆԵՐԻ ՀԱՏՈՒՑՈՒՄԸ ԵՐԱՇԽԱՎՈՐԵԼՈՒ ՄԱՍԻՆ"
  },
  {
    "orig_doc_id": "906",
    "Title": "ՀՀ ՕՐԵՆՔԸ ՖԻԶԻԿԱԿԱՆ ԿՈՒԼՏՈՒՐԱՅԻ ԵՎ ՍՊՈՐՏԻ ՄԱՍԻՆ"
  },
  {
    "orig_doc_id": "45522",
    "Title": "ՀՀ ՕՐԵՆՔԸ ՖԻՆԱՆՍԱԿԱՆ ՀԱՄԱԿԱՐԳԻ ՀԱՇՏԱՐԱՐԻ ՄԱՍԻՆ"
  },
  {
    "orig_doc_id": "109260",
    "Title": "ՀՀ ՕՐԵՆՔԸ ՖԻՆԱՆՍԱԿԱՆ ՀԱՄԱՀԱՐԹԵՑՄԱՆ ՄԱՍԻՆ"
  },
  {
    "orig_doc_id": "117713",
    "Title": "ՀՀ ՕՐԵՆՔԸ&nbsp; ԴԱՏԱԽԱԶՈՒԹՅԱՆ ՄԱՍԻՆ"
  },
  {
    "orig_doc_id": "96299",
    "Title": "ՄԱՐԴՈՒ ԻՐԱՎՈՒՆՔՆԵՐԻ ՊԱՇՏՊԱՆԻ ՄԱՍԻՆ ՍԱՀՄԱՆԱԴՐԱԿԱՆ ՕՐԵՆՔԸ "
  }
]
