{
  "project_info": {
    "project_number": "740969046137",
    "firebase_url": "https://melvoridle-12141-default-rtdb.firebaseio.com",
    "project_id": "melvoridle-12141",
    "storage_bucket": "melvoridle-12141.appspot.com"
  },
  "client": [
    {
      "client_info": {
        "mobilesdk_app_id": "1:740969046137:android:3026c65bddd077745e74a8",
        "android_client_info": {
          "package_name": "cat.itb.melvoridle"
        }
      },
      "oauth_client": [
        {
          "client_id": "740969046137-3i3aug5gndshj8du4ougfomiqjst3uk9.apps.googleusercontent.com",
          "client_type": 1,
          "android_info": {
            "package_name": "cat.itb.melvoridle",
            "certificate_hash": "f30ec350025873cc4c387b4bffe0162a45bb2a69"
          }
        },
        {
          "client_id": "740969046137-i26pa1s5fi4s2vu6t7a8jvfq6b0g29gd.apps.googleusercontent.com",
          "client_type": 3
        }
      ],
      "api_key": [
        {
          "current_key": "AIzaSyDE217sWCzUqJ9aEAMkZUoN2HpOeqwEVhc"
        }
      ],
      "services": {
        "appinvite_service": {
          "other_platform_oauth_client": [
            {
              "client_id": "740969046137-i26pa1s5fi4s2vu6t7a8jvfq6b0g29gd.apps.googleusercontent.com",
              "client_type": 3
            }
          ]
        }
      }
    }
  ],
  "configuration_version": "1"
}