<?xml version="1.0" encoding="utf-8"?>
<!-- Generator: Adobe Illustrator 18.0.0, SVG Export Plug-In . SVG Version: 6.00 Build 0)  -->
<!DOCTYPE svg PUBLIC "-//W3C//DTD SVG 1.1//EN" "http://www.w3.org/Graphics/SVG/1.1/DTD/svg11.dtd">
<svg version="1.1" id="Camada_1" xmlns="http://www.w3.org/2000/svg" xmlns:xlink="http://www.w3.org/1999/xlink" x="0px" y="0px"
	 viewBox="0 0 65.3 66.5" enable-background="new 0 0 65.3 66.5" xml:space="preserve">
<g>
	<defs>
		<rect id="SVGID_1_" y="0" width="65.3" height="66.5"/>
	</defs>
	<clipPath id="SVGID_2_">
		<use xlink:href="#SVGID_1_"  overflow="visible"/>
	</clipPath>
	<path clip-path="url(#SVGID_2_)" fill="#D4DBDE" d="M57.2,32.8c1.2-2.8,1.9-5.9,1.9-9.2c0-12.8-10.1-23.3-22.7-23.3
		c-5,0-9.6,1.7-13.4,4.5c-6,4.3-7.3,7.6-8.4,10.5c-2,5.2-1.3,11-1.3,11L6.9,38.1l4,0.7l0.6,14.9H23l2.3,12.9h30.4l-4.9-20.3
		C52.2,43.9,53.4,41.8,57.2,32.8z"/>
	<path clip-path="url(#SVGID_2_)" fill="#FFFFFF" d="M21.9,23c0,8.2,6.5,14.9,14.5,14.9S50.9,31.2,50.9,23S44.4,8.1,36.4,8.1
		S21.9,14.8,21.9,23"/>
	<path clip-path="url(#SVGID_2_)" fill="#30241C" d="M37.9,7C37.9,7,37.9,7,37.9,7c-0.1,0-0.2,0-0.2,0c-0.2,0-0.4-0.2-0.4-0.4
		c0-0.2,0.2-0.4,0.4-0.4c0.1,0,0.1,0,0.2,0c0.2,0,0.4,0.2,0.4,0.5C38.3,6.8,38.1,7,37.9,7 M34.7,7c-0.2,0-0.4-0.2-0.4-0.4
		c0-0.2,0.1-0.4,0.4-0.5c0.1,0,0.1,0,0.2,0c0.2,0,0.4,0.1,0.4,0.4c0,0.2-0.1,0.4-0.4,0.4C34.9,7,34.8,7,34.7,7C34.8,7,34.8,7,34.7,7
		 M40.8,7.5c0,0-0.1,0-0.1,0l-0.2-0.1c-0.2-0.1-0.3-0.3-0.3-0.5c0.1-0.2,0.3-0.4,0.5-0.3c0.1,0,0.1,0,0.2,0.1
		c0.2,0.1,0.3,0.3,0.3,0.5C41.2,7.4,41,7.5,40.8,7.5 M31.8,7.6c-0.2,0-0.3-0.1-0.4-0.3c-0.1-0.2,0.1-0.4,0.3-0.5
		c0.1,0,0.1,0,0.2-0.1c0.2-0.1,0.4,0.1,0.5,0.3c0.1,0.2-0.1,0.4-0.3,0.5c-0.1,0-0.1,0-0.2,0.1C31.9,7.6,31.9,7.6,31.8,7.6 M43.6,8.6
		c-0.1,0-0.1,0-0.2,0l-0.2-0.1c-0.2-0.1-0.3-0.3-0.2-0.6c0.1-0.2,0.3-0.3,0.5-0.2l0.2,0.1C44,7.9,44.1,8.2,44,8.4
		C43.9,8.5,43.8,8.6,43.6,8.6 M29.1,8.7c-0.1,0-0.3-0.1-0.4-0.2c-0.1-0.2,0-0.5,0.2-0.6c0.1,0,0.1-0.1,0.2-0.1
		c0.2-0.1,0.4,0,0.5,0.2c0.1,0.2,0,0.5-0.2,0.6c-0.1,0-0.1,0.1-0.2,0.1C29.2,8.7,29.1,8.7,29.1,8.7 M46.1,10.2c-0.1,0-0.2,0-0.2-0.1
		c-0.1,0-0.1-0.1-0.2-0.1c-0.2-0.1-0.2-0.4-0.1-0.6c0.1-0.2,0.4-0.2,0.6-0.1c0.1,0,0.1,0.1,0.2,0.1c0.2,0.1,0.2,0.4,0.1,0.6
		C46.4,10.2,46.3,10.2,46.1,10.2 M26.5,10.3c-0.1,0-0.2-0.1-0.3-0.2c-0.1-0.2-0.1-0.4,0.1-0.6c0.1,0,0.1-0.1,0.2-0.1
		c0.2-0.1,0.4-0.1,0.6,0.1c0.1,0.2,0.1,0.4-0.1,0.6c-0.1,0-0.1,0.1-0.2,0.1C26.7,10.3,26.6,10.3,26.5,10.3 M48.3,12.3
		c-0.1,0-0.2,0-0.3-0.1c0,0-0.1-0.1-0.1-0.1c-0.2-0.2-0.1-0.4,0-0.6c0.2-0.2,0.4-0.1,0.6,0c0,0.1,0.1,0.1,0.1,0.2
		c0.1,0.2,0.1,0.4,0,0.6C48.5,12.3,48.4,12.3,48.3,12.3 M24.4,12.4c-0.1,0-0.2,0-0.3-0.1c-0.2-0.2-0.2-0.4,0-0.6
		c0-0.1,0.1-0.1,0.1-0.2c0.1-0.2,0.4-0.2,0.6,0c0.2,0.2,0.2,0.4,0,0.6c0,0-0.1,0.1-0.1,0.1C24.6,12.4,24.5,12.4,24.4,12.4
		 M50.1,14.7c-0.1,0-0.3-0.1-0.3-0.2c0-0.1-0.1-0.1-0.1-0.2c-0.1-0.2-0.1-0.4,0.1-0.6s0.4-0.1,0.6,0.1c0,0.1,0.1,0.1,0.1,0.2
		c0.1,0.2,0.1,0.4-0.1,0.6C50.3,14.7,50.2,14.7,50.1,14.7 M22.6,14.9c-0.1,0-0.1,0-0.2-0.1c-0.2-0.1-0.3-0.4-0.1-0.6
		c0-0.1,0.1-0.1,0.1-0.2c0.1-0.2,0.4-0.3,0.6-0.1c0.2,0.1,0.2,0.4,0.1,0.6c0,0.1-0.1,0.1-0.1,0.2C22.9,14.8,22.7,14.9,22.6,14.9
		 M51.4,17.5c-0.2,0-0.3-0.1-0.4-0.3c0-0.1,0-0.1-0.1-0.2c-0.1-0.2,0-0.5,0.2-0.5c0.2-0.1,0.4,0,0.5,0.2c0,0.1,0,0.1,0.1,0.2
		c0.1,0.2,0,0.5-0.2,0.5C51.5,17.5,51.5,17.5,51.4,17.5 M21.3,17.6c0,0-0.1,0-0.1,0c-0.2-0.1-0.3-0.3-0.2-0.5c0-0.1,0-0.1,0.1-0.2
		c0.1-0.2,0.3-0.3,0.5-0.2c0.2,0.1,0.3,0.3,0.2,0.5c0,0.1,0,0.1-0.1,0.2C21.6,17.5,21.5,17.6,21.3,17.6 M52.3,20.4
		c-0.2,0-0.4-0.1-0.4-0.3c0-0.1,0-0.1,0-0.2c0-0.2,0.1-0.4,0.3-0.5c0.2,0,0.4,0.1,0.5,0.3c0,0.1,0,0.1,0,0.2
		C52.7,20.1,52.5,20.3,52.3,20.4C52.3,20.4,52.3,20.4,52.3,20.4 M20.5,20.5C20.5,20.5,20.5,20.5,20.5,20.5c-0.3,0-0.4-0.3-0.4-0.5
		c0-0.1,0-0.1,0-0.2c0-0.2,0.3-0.4,0.5-0.3c0.2,0,0.4,0.3,0.3,0.5c0,0.1,0,0.1,0,0.2C20.9,20.4,20.7,20.5,20.5,20.5 M52.5,23.4
		c-0.2,0-0.4-0.2-0.4-0.4l0-0.2c0-0.2,0.2-0.4,0.4-0.4h0c0.2,0,0.4,0.2,0.4,0.4l0,0.2C52.9,23.2,52.7,23.4,52.5,23.4 M20.3,23.6
		c-0.2,0-0.4-0.2-0.4-0.4c0-0.1,0-0.1,0-0.2v0c0-0.2,0.2-0.4,0.4-0.4c0.2,0,0.4,0.2,0.4,0.4v0c0,0.1,0,0.1,0,0.2
		C20.7,23.4,20.5,23.6,20.3,23.6L20.3,23.6z M52.2,26.5C52.2,26.5,52.2,26.5,52.2,26.5c-0.3,0-0.4-0.3-0.4-0.5c0-0.1,0-0.1,0-0.2
		c0-0.2,0.2-0.4,0.5-0.3c0.2,0,0.4,0.3,0.3,0.5c0,0.1,0,0.1,0,0.2C52.6,26.3,52.4,26.5,52.2,26.5 M20.6,26.7c-0.2,0-0.4-0.1-0.4-0.3
		c0-0.1,0-0.1,0-0.2c0-0.2,0.1-0.4,0.3-0.5c0.2,0,0.4,0.1,0.5,0.3c0,0.1,0,0.1,0,0.2C21,26.4,20.9,26.6,20.6,26.7
		C20.6,26.7,20.6,26.7,20.6,26.7 M51.4,29.4c0,0-0.1,0-0.1,0c-0.2-0.1-0.3-0.3-0.2-0.5c0-0.1,0-0.1,0.1-0.2c0.1-0.2,0.3-0.3,0.5-0.2
		c0.2,0.1,0.3,0.3,0.2,0.5c0,0.1,0,0.1-0.1,0.2C51.7,29.3,51.6,29.4,51.4,29.4 M21.4,29.6c-0.2,0-0.3-0.1-0.4-0.3
		c0-0.1-0.1-0.1-0.1-0.2c-0.1-0.2,0-0.5,0.2-0.5c0.2-0.1,0.4,0,0.5,0.2c0,0.1,0,0.1,0.1,0.2c0.1,0.2,0,0.5-0.2,0.5
		C21.5,29.6,21.5,29.6,21.4,29.6 M50.1,32.1c-0.1,0-0.1,0-0.2-0.1c-0.2-0.1-0.2-0.4-0.1-0.6c0-0.1,0.1-0.1,0.1-0.2
		c0.1-0.2,0.4-0.3,0.6-0.1c0.2,0.1,0.3,0.4,0.1,0.6c0,0.1-0.1,0.1-0.1,0.2C50.4,32.1,50.2,32.1,50.1,32.1 M22.8,32.3
		c-0.1,0-0.3-0.1-0.3-0.2c0-0.1-0.1-0.1-0.1-0.2c-0.1-0.2-0.1-0.4,0.1-0.6c0.2-0.1,0.4-0.1,0.6,0.1c0,0.1,0.1,0.1,0.1,0.2
		c0.1,0.2,0.1,0.4-0.1,0.6C22.9,32.3,22.9,32.3,22.8,32.3 M48.3,34.6c-0.1,0-0.2,0-0.3-0.1c-0.2-0.2-0.2-0.4,0-0.6
		c0,0,0.1-0.1,0.1-0.1c0.1-0.2,0.4-0.2,0.6,0c0.2,0.2,0.2,0.4,0,0.6c0,0.1-0.1,0.1-0.1,0.2C48.5,34.5,48.4,34.6,48.3,34.6
		 M24.6,34.7c-0.1,0-0.2,0-0.3-0.1c0-0.1-0.1-0.1-0.1-0.2c-0.1-0.2-0.1-0.4,0-0.6c0.2-0.2,0.4-0.1,0.6,0c0,0,0.1,0.1,0.1,0.1
		c0.2,0.2,0.1,0.4,0,0.6C24.8,34.7,24.7,34.7,24.6,34.7 M46.1,36.6c-0.1,0-0.2-0.1-0.3-0.2c-0.1-0.2-0.1-0.4,0.1-0.6
		c0.1,0,0.1-0.1,0.2-0.1c0.2-0.1,0.4-0.1,0.6,0.1c0.1,0.2,0.1,0.4-0.1,0.6c-0.1,0-0.1,0.1-0.2,0.1C46.3,36.6,46.2,36.6,46.1,36.6
		 M26.8,36.7c-0.1,0-0.2,0-0.2-0.1c-0.1,0-0.1-0.1-0.2-0.1c-0.2-0.1-0.2-0.4-0.1-0.6c0.1-0.2,0.4-0.2,0.6-0.1c0.1,0,0.1,0.1,0.2,0.1
		c0.2,0.1,0.2,0.4,0.1,0.6C27.1,36.7,27,36.7,26.8,36.7 M43.6,38.2c-0.1,0-0.3-0.1-0.4-0.2c-0.1-0.2,0-0.5,0.2-0.6
		c0.1,0,0.1-0.1,0.2-0.1c0.2-0.1,0.4,0,0.5,0.2c0.1,0.2,0,0.5-0.2,0.6c-0.1,0-0.1,0.1-0.2,0.1C43.7,38.2,43.6,38.2,43.6,38.2
		 M29.4,38.3c-0.1,0-0.1,0-0.2,0c-0.1,0-0.1-0.1-0.2-0.1c-0.2-0.1-0.3-0.4-0.2-0.6c0.1-0.2,0.3-0.3,0.5-0.2c0.1,0,0.1,0.1,0.2,0.1
		c0.2,0.1,0.3,0.3,0.2,0.6C29.7,38.2,29.5,38.3,29.4,38.3 M40.8,39.3c-0.2,0-0.3-0.1-0.4-0.3c-0.1-0.2,0.1-0.4,0.3-0.5l0.2-0.1
		c0.2-0.1,0.4,0.1,0.5,0.3c0.1,0.2-0.1,0.4-0.3,0.5l-0.2,0.1C40.9,39.3,40.8,39.3,40.8,39.3 M32.2,39.4c0,0-0.1,0-0.1,0
		c-0.1,0-0.1,0-0.2-0.1c-0.2-0.1-0.3-0.3-0.3-0.5c0.1-0.2,0.3-0.3,0.5-0.3c0.1,0,0.1,0,0.2,0.1c0.2,0.1,0.3,0.3,0.3,0.5
		C32.5,39.3,32.4,39.4,32.2,39.4 M37.9,39.9c-0.2,0-0.4-0.2-0.4-0.4c0-0.2,0.1-0.4,0.4-0.5l0.2,0c0.2,0,0.4,0.1,0.4,0.4
		c0,0.2-0.1,0.4-0.4,0.5L37.9,39.9C37.9,39.9,37.9,39.9,37.9,39.9 M35.1,39.9C35.1,39.9,35.1,39.9,35.1,39.9c-0.1,0-0.2,0-0.2,0
		c-0.2,0-0.4-0.2-0.4-0.4c0-0.2,0.2-0.4,0.4-0.4c0.1,0,0.1,0,0.2,0c0.2,0,0.4,0.2,0.4,0.4C35.5,39.7,35.3,39.9,35.1,39.9"/>
	<path clip-path="url(#SVGID_2_)" fill="#30241C" d="M4.4,0.9C4.3,0.9,4.3,0.9,4.4,0.9c-0.1,0-0.2,0-0.3,0c-0.2,0-0.4-0.3-0.3-0.5
		C3.8,0.1,4,0,4.2,0c0.1,0,0.1,0,0.2,0c0.2,0.1,0.4,0.3,0.3,0.5C4.7,0.7,4.5,0.9,4.4,0.9 M1.5,1.6c-0.1,0-0.2,0-0.3-0.1
		C1,1.3,1,1.1,1.2,0.9c0.1,0,0.1-0.1,0.2-0.1c0.2-0.1,0.4-0.1,0.6,0.1C2.1,1,2.1,1.3,1.9,1.4c0,0-0.1,0.1-0.1,0.1
		C1.7,1.6,1.6,1.6,1.5,1.6 M6.5,2.7c-0.2,0-0.3-0.1-0.4-0.2c0-0.1-0.1-0.1-0.1-0.2C6,2.1,6.1,1.8,6.3,1.7c0.2-0.1,0.4,0,0.5,0.2
		c0,0.1,0.1,0.1,0.1,0.2c0.1,0.2,0,0.5-0.2,0.6C6.7,2.6,6.6,2.7,6.5,2.7 M0.4,4.3C0.2,4.3,0,4.1,0,3.9c0-0.1,0-0.1,0-0.2
		c0-0.2,0.2-0.4,0.4-0.4c0.2,0,0.4,0.2,0.4,0.4v0c0,0.1,0,0.1,0,0.2C0.8,4.1,0.7,4.3,0.4,4.3C0.4,4.3,0.4,4.3,0.4,4.3 M6.5,5.5
		c-0.1,0-0.1,0-0.2,0C6.2,5.4,6.1,5.1,6.2,4.9c0-0.1,0-0.1,0.1-0.2c0.1-0.2,0.3-0.3,0.5-0.2C7,4.6,7.1,4.9,7,5.1
		c0,0.1-0.1,0.1-0.1,0.2C6.8,5.4,6.7,5.5,6.5,5.5 M1.8,6.8c-0.1,0-0.2,0-0.2-0.1c-0.1,0-0.1-0.1-0.2-0.1C1.2,6.4,1.2,6.2,1.3,6
		c0.1-0.2,0.4-0.2,0.6-0.1C1.9,6,2,6,2,6c0.2,0.1,0.2,0.4,0.1,0.6C2,6.7,1.9,6.8,1.8,6.8 M4.3,7.3C4.2,7.3,4,7.2,3.9,7
		c0-0.2,0.1-0.4,0.3-0.5c0.1,0,0.1,0,0.2,0c0.2-0.1,0.4,0.1,0.5,0.3C5,7,4.9,7.2,4.6,7.2C4.6,7.3,4.5,7.3,4.3,7.3
		C4.4,7.3,4.4,7.3,4.3,7.3"/>
	<path clip-path="url(#SVGID_2_)" fill="#1CE5E3" d="M5.3,21.2c0,0.5,0.4,1,1,1c0.5,0,1-0.4,1-1c0-0.5-0.4-1-1-1
		C5.7,20.2,5.3,20.7,5.3,21.2"/>
	<path clip-path="url(#SVGID_2_)" fill="#1C70FF" d="M58,57.5c0,1.3,1,2.4,2.3,2.4s2.3-1.1,2.3-2.4c0-1.3-1-2.4-2.3-2.4
		S58,56.2,58,57.5"/>
	<path clip-path="url(#SVGID_2_)" fill="#30241C" d="M59.6,1.3C59.5,1.3,59.5,1.3,59.6,1.3c-0.2,0-0.2,0-0.3-0.1
		c-0.2,0-0.4-0.3-0.3-0.5c0-0.2,0.3-0.4,0.5-0.3c0.1,0,0.1,0,0.2,0C59.9,0.5,60,0.7,60,1C59.9,1.1,59.8,1.3,59.6,1.3 M56.3,1.3
		c-0.2,0-0.3-0.1-0.4-0.3c-0.1-0.2,0.1-0.4,0.3-0.5c0.1,0,0.1,0,0.2-0.1c0.2-0.1,0.4,0.1,0.5,0.3c0,0.2-0.1,0.4-0.3,0.5
		c-0.1,0-0.1,0-0.2,0C56.4,1.3,56.3,1.3,56.3,1.3 M62.3,2.6c-0.1,0-0.2,0-0.3-0.1c0,0-0.1-0.1-0.2-0.1c-0.2-0.1-0.2-0.4-0.1-0.6
		c0.1-0.2,0.4-0.2,0.6-0.1c0.1,0,0.1,0.1,0.2,0.1c0.2,0.1,0.2,0.4,0.1,0.6C62.6,2.6,62.4,2.6,62.3,2.6 M53.6,2.8
		c-0.1,0-0.2,0-0.3-0.1c-0.1-0.2-0.1-0.4,0-0.6c0.1,0,0.1-0.1,0.2-0.1c0.2-0.1,0.4-0.1,0.6,0.1s0.1,0.4-0.1,0.6c0,0-0.1,0.1-0.1,0.1
		C53.8,2.7,53.7,2.8,53.6,2.8 M64.2,5.1c-0.2,0-0.3-0.1-0.4-0.2c0-0.1-0.1-0.1-0.1-0.2c-0.1-0.2,0-0.5,0.2-0.6
		c0.2-0.1,0.4,0,0.5,0.2c0,0.1,0.1,0.1,0.1,0.2c0.1,0.2,0,0.5-0.2,0.6C64.4,5.1,64.3,5.1,64.2,5.1 M51.7,5.3c-0.1,0-0.1,0-0.2,0
		c-0.2-0.1-0.3-0.3-0.2-0.5c0-0.1,0.1-0.1,0.1-0.2c0.1-0.2,0.3-0.3,0.5-0.2c0.2,0.1,0.3,0.3,0.2,0.6c0,0.1-0.1,0.1-0.1,0.2
		C52,5.2,51.9,5.3,51.7,5.3 M64.9,8.2c-0.2,0-0.4-0.2-0.4-0.4c0,0,0,0,0,0c0,0,0-0.1,0-0.2c0-0.2,0.2-0.4,0.4-0.4
		c0.2,0,0.4,0.2,0.4,0.4c0,0.1,0,0.1,0,0.2C65.3,8,65.1,8.2,64.9,8.2 M51.1,8.4c-0.2,0-0.4-0.2-0.4-0.4c0-0.1,0-0.1,0-0.2v0
		c0-0.2,0.2-0.4,0.4-0.4c0.2,0,0.4,0.2,0.4,0.4v0c0,0.1,0,0.1,0,0.2C51.5,8.2,51.3,8.4,51.1,8.4C51.1,8.4,51.1,8.4,51.1,8.4
		 M64.2,11.3c-0.1,0-0.1,0-0.2,0c-0.2-0.1-0.3-0.3-0.2-0.6c0-0.1,0.1-0.1,0.1-0.2c0.1-0.2,0.3-0.3,0.5-0.2c0.2,0.1,0.3,0.3,0.2,0.5
		c0,0.1-0.1,0.1-0.1,0.2C64.5,11.2,64.4,11.3,64.2,11.3 M51.9,11.4c-0.1,0-0.3-0.1-0.4-0.2c0-0.1-0.1-0.1-0.1-0.2
		c-0.1-0.2,0-0.5,0.2-0.6c0.2-0.1,0.4,0,0.5,0.2c0,0.1,0.1,0.1,0.1,0.2c0.1,0.2,0,0.5-0.2,0.6C52,11.4,51.9,11.4,51.9,11.4
		 M62.3,13.7c-0.1,0-0.2-0.1-0.3-0.2c-0.1-0.2-0.1-0.4,0.1-0.6c0.1,0,0.1-0.1,0.1-0.1c0.2-0.1,0.4-0.1,0.6,0c0.1,0.2,0.1,0.4,0,0.6
		c-0.1,0-0.1,0.1-0.2,0.1C62.5,13.7,62.4,13.7,62.3,13.7 M53.9,13.8c-0.1,0-0.2,0-0.2-0.1c-0.1,0-0.1-0.1-0.2-0.1
		c-0.2-0.1-0.2-0.4-0.1-0.6c0.1-0.2,0.4-0.2,0.6-0.1c0,0,0.1,0.1,0.2,0.1c0.2,0.1,0.2,0.4,0.1,0.6C54.1,13.8,54,13.8,53.9,13.8
		 M59.5,15.1c-0.2,0-0.3-0.1-0.4-0.3c0-0.2,0.1-0.4,0.3-0.5c0.1,0,0.1,0,0.2,0c0.2-0.1,0.4,0.1,0.5,0.3c0.1,0.2-0.1,0.4-0.3,0.5
		C59.8,15,59.7,15.1,59.5,15.1C59.6,15.1,59.6,15.1,59.5,15.1 M56.7,15.1C56.6,15.1,56.6,15.1,56.7,15.1c-0.2,0-0.2,0-0.3-0.1
		c-0.2-0.1-0.4-0.3-0.3-0.5c0-0.2,0.3-0.4,0.5-0.3c0.1,0,0.1,0,0.2,0c0.2,0,0.4,0.3,0.3,0.5C57,15,56.9,15.1,56.7,15.1"/>
	<path clip-path="url(#SVGID_2_)" fill="#1CD1FF" d="M55.7,7.8c0,1.3,1,2.4,2.3,2.4c1.3,0,2.3-1.1,2.3-2.4c0-1.3-1-2.4-2.3-2.4
		C56.7,5.4,55.7,6.4,55.7,7.8"/>
	<path clip-path="url(#SVGID_2_)" fill="#1C54FF" d="M45.7,24.4v-2.7h-2.2c-0.2-1.1-0.6-2-1.2-2.9l1.5-1.6l-1.9-1.9l-1.5,1.6
		c-0.8-0.6-1.8-1-2.8-1.2v-2.2h-2.7v2.2c-1,0.2-2,0.6-2.8,1.2l-1.5-1.6l-1.9,1.9l1.5,1.6c-0.6,0.8-1,1.8-1.2,2.9h-2.1v2.7h2.1
		c0.2,1.1,0.6,2,1.2,2.9l-1.5,1.6l1.9,1.9l1.5-1.6c0.8,0.6,1.8,1,2.8,1.2v2.2h2.7v-2.2c1-0.2,2-0.6,2.8-1.2l1.5,1.6l1.9-1.9
		l-1.5-1.6c0.6-0.8,1-1.8,1.2-2.9H45.7z"/>
	<path clip-path="url(#SVGID_2_)" fill="#FFFFFF" d="M33.1,23c0,1.9,1.5,3.4,3.3,3.4c1.8,0,3.3-1.5,3.3-3.4c0-1.9-1.5-3.4-3.3-3.4
		C34.6,19.6,33.1,21.1,33.1,23"/>
	<path clip-path="url(#SVGID_2_)" fill="#1C70FF" d="M36.4,21.8c-0.6,0-1.2,0.5-1.2,1.2c0,0.7,0.5,1.2,1.2,1.2
		c0.6,0,1.2-0.5,1.2-1.2C37.6,22.3,37,21.8,36.4,21.8 M36.4,25c-1.1,0-2-0.9-2-2c0-1.1,0.9-2,2-2c1.1,0,2,0.9,2,2
		C38.4,24.1,37.5,25,36.4,25"/>
</g>
</svg>
