<?xml version="1.0" encoding="utf-8"?>
<!-- Generator: Adobe Illustrator 18.0.0, SVG Export Plug-In . SVG Version: 6.00 Build 0)  -->
<!DOCTYPE svg PUBLIC "-//W3C//DTD SVG 1.1//EN" "http://www.w3.org/Graphics/SVG/1.1/DTD/svg11.dtd">
<svg version="1.1" id="Camada_1" xmlns="http://www.w3.org/2000/svg" xmlns:xlink="http://www.w3.org/1999/xlink" x="0px" y="0px"
	 viewBox="0 0 66.7 65.9" enable-background="new 0 0 66.7 65.9" xml:space="preserve">
<g>
	<defs>
		<rect id="SVGID_1_" y="0" width="66.7" height="65.9"/>
	</defs>
	<clipPath id="SVGID_2_">
		<use xlink:href="#SVGID_1_"  overflow="visible"/>
	</clipPath>
	<path clip-path="url(#SVGID_2_)" fill="#1CB0FF" d="M66.3,33.1c0,18.1-14.7,32.8-32.8,32.8c-18.1,0-32.8-14.7-32.8-32.8
		S15.3,0.2,33.5,0.2C51.6,0.2,66.3,14.9,66.3,33.1"/>
	<path clip-path="url(#SVGID_2_)" fill="#BAC4C7" d="M20.1,65.9c0,0,6.6,0,6.6-6.6h39.6c0,0,0,6.6-6.6,6.6H20.1z"/>
	<path clip-path="url(#SVGID_2_)" fill="#D4DBDE" d="M53.1,59.3V13.2V6.6c0,0-0.1-6.6-6.6-6.6H13.6v6.6h-0.1v52.7c0,0,0,6.6,6.6,6.6
		h39.6C59.7,65.9,53.1,65.9,53.1,59.3"/>
	<path clip-path="url(#SVGID_2_)" fill="#BAC4C7" d="M46.5,0c0,0-6.6,0-6.6,6.6H0.4c0,0,0-6.6,6.6-6.6H46.5z"/>
</g>
<rect x="16.3" y="11" fill="#FFFFFF" width="34.2" height="45"/>
<rect x="24" y="15.5" fill="#30241C" width="2.6" height="0.8"/>
<rect x="27" y="22.2" fill="#30241C" width="12.9" height="0.8"/>
<rect x="24.2" y="28.8" fill="#30241C" width="18.9" height="0.8"/>
<rect x="24.2" y="32.1" fill="#30241C" width="18.9" height="0.8"/>
<rect x="24.2" y="35.4" fill="#30241C" width="18.9" height="0.8"/>
<rect x="24.2" y="38.7" fill="#30241C" width="18.9" height="0.8"/>
<g>
	<defs>
		<rect id="SVGID_3_" y="0" width="66.7" height="65.9"/>
	</defs>
	<clipPath id="SVGID_4_">
		<use xlink:href="#SVGID_3_"  overflow="visible"/>
	</clipPath>
	<path clip-path="url(#SVGID_4_)" fill="#1C54FF" d="M41.6,49.4c0,1.8-1.5,3.3-3.3,3.3c-1.8,0-3.3-1.5-3.3-3.3
		c0-1.8,1.5-3.3,3.3-3.3C40.1,46.1,41.6,47.6,41.6,49.4"/>
</g>
<rect x="39.9" y="49" fill="#30241C" width="3.3" height="0.8"/>
<g>
	<defs>
		<rect id="SVGID_5_" y="0" width="66.7" height="65.9"/>
	</defs>
	<clipPath id="SVGID_6_">
		<use xlink:href="#SVGID_5_"  overflow="visible"/>
	</clipPath>
	<path clip-path="url(#SVGID_6_)" fill="#FFFFFF" d="M66.3,17.1c0-5.4-4.4-9.8-9.8-9.8c-5.4,0-9.8,4.4-9.8,9.8S51,27,56.4,27
		C61.8,27,66.3,22.6,66.3,17.1"/>
</g>
<g>
	<defs>
		<path id="SVGID_7_" d="M46.6,17.1c0,5.4,4.4,9.8,9.8,9.8c4.7,0,8.6-3.3,9.6-7.6v-4.4c-1-4.4-4.9-7.6-9.6-7.6
			C51,7.3,46.6,11.7,46.6,17.1"/>
	</defs>
	<clipPath id="SVGID_8_">
		<use xlink:href="#SVGID_7_"  overflow="visible"/>
	</clipPath>
	<polygon clip-path="url(#SVGID_8_)" fill="#1C54FF" points="55.3,22.5 56.4,27 50.7,27 50.8,23.5 54.1,21.8 	"/>
	<path clip-path="url(#SVGID_8_)" fill="#30241C" d="M53.4,14.4c0.1,0,0.2,0,0.3,0c0.8,0,2.6-0.1,3.7-1l0.4-1.3
		c0-0.1-0.2-0.4-0.9-0.6c-0.2-0.1-0.4-0.1-0.7-0.1c-0.9,0-2,0.5-2.5,1.3C53.4,13.1,53.2,13.6,53.4,14.4 M53.6,15.2L53.6,15.2
		c-0.4,0-0.6,0-0.6,0c-0.2,0-0.3-0.1-0.4-0.3C52.3,14,52.4,13,53,12.2c0.7-1,1.9-1.6,3.1-1.6c0.4,0,0.7,0.1,1,0.2
		c1.7,0.6,1.5,1.5,1.4,1.6l-0.4,1.4c0,0.1-0.1,0.1-0.1,0.2C56.7,15,54.7,15.2,53.6,15.2"/>
	<path clip-path="url(#SVGID_8_)" fill="#30241C" d="M58.2,13.6c0.2,0.2,0.6,0.7,1.2,0.7c0-0.3,0-0.8-0.2-1.1
		c-0.2-0.2-0.4-0.4-0.8-0.5L58.2,13.6z M59.6,15.2L59.6,15.2c-1.4,0-2.2-1.2-2.2-1.3c-0.1-0.1-0.1-0.2,0-0.3l0.4-1.4
		c0.1-0.2,0.2-0.3,0.4-0.3c0.8,0.1,1.3,0.4,1.7,0.9c0.6,0.9,0.3,2,0.3,2.1c0,0.2-0.2,0.3-0.4,0.3C59.7,15.2,59.7,15.2,59.6,15.2"/>
	<path clip-path="url(#SVGID_8_)" fill="#30241C" d="M56.4,20.5C56.4,20.5,56.4,20.5,56.4,20.5c-0.2,0-2.7-0.6-3.2-2.3
		c-0.4-1.6-0.5-3.3-0.5-3.4c0-0.2,0.2-0.4,0.4-0.4c0.2,0,0.4,0.2,0.4,0.4c0,0,0.1,1.7,0.5,3.2c0.3,1.1,2,1.6,2.4,1.7
		c0.4-0.1,2.1-0.6,2.4-1.7c0.4-1.5,0.5-3.2,0.5-3.2c0-0.2,0.2-0.4,0.4-0.4c0.2,0,0.4,0.2,0.4,0.4c0,0.1-0.1,1.8-0.5,3.4
		C59.1,19.9,56.6,20.5,56.4,20.5C56.5,20.5,56.4,20.5,56.4,20.5"/>
	<path clip-path="url(#SVGID_8_)" fill="#30241C" d="M53.4,17.7c-0.1,0-0.1,0-0.2-0.1c-0.7-0.4-1.6-1.2-1.2-2.2
		c0.3-0.7,0.9-0.8,1.3-0.7l-0.3,0.8l0,0c-0.1,0-0.2,0.1-0.2,0.2c-0.2,0.5,0.7,1,0.9,1.2c0.2,0.1,0.3,0.4,0.2,0.6
		C53.7,17.7,53.5,17.7,53.4,17.7"/>
	<path clip-path="url(#SVGID_8_)" fill="#30241C" d="M59.4,17.7c-0.1,0-0.3-0.1-0.4-0.2c-0.1-0.2,0-0.5,0.2-0.6
		c0.2-0.1,1.1-0.7,0.9-1.2c-0.1-0.2-0.2-0.2-0.2-0.2c-0.2,0.1-0.5,0-0.5-0.2c-0.1-0.2,0-0.5,0.2-0.5c0.3-0.1,1,0,1.3,0.7
		c0.4,1-0.6,1.8-1.2,2.2C59.6,17.7,59.5,17.7,59.4,17.7"/>
	<path clip-path="url(#SVGID_8_)" fill="#30241C" d="M55.9,23.3c-0.1,0-0.1,0-0.2-0.1L53.6,22c-0.2-0.1-0.3-0.4-0.1-0.6
		c0.1-0.2,0.4-0.3,0.6-0.1l1.7,1l0.1-0.3l-1.4-0.5c-0.2-0.1-0.3-0.2-0.3-0.4l0.1-1.7c0-0.2,0.2-0.4,0.4-0.4c0.2,0,0.4,0.2,0.4,0.4
		L55,20.8l1.5,0.6c0.1,0,0.2,0.1,0.2,0.2c0,0.1,0,0.2,0,0.3l-0.5,1.1c0,0.1-0.1,0.2-0.3,0.2C56,23.3,56,23.3,55.9,23.3"/>
	<polygon clip-path="url(#SVGID_8_)" fill="#1C54FF" points="57.5,22.5 56.4,27 62.2,27 62,23.5 58.7,21.8 	"/>
	<path clip-path="url(#SVGID_8_)" fill="#30241C" d="M56.9,23.3c0,0-0.1,0-0.1,0c-0.1,0-0.2-0.1-0.3-0.2L56,21.9c0-0.1,0-0.2,0-0.3
		c0-0.1,0.1-0.2,0.2-0.2l1.5-0.6l-0.1-1.4c0-0.2,0.2-0.4,0.4-0.4c0.2,0,0.4,0.2,0.4,0.4l0.1,1.7c0,0.2-0.1,0.3-0.3,0.4L57,22
		l0.1,0.3l1.7-1c0.2-0.1,0.4-0.1,0.6,0.1c0.1,0.2,0.1,0.4-0.1,0.6l-2.1,1.2C57,23.3,57,23.3,56.9,23.3"/>
</g>
<g>
	<defs>
		<rect id="SVGID_9_" y="0" width="66.7" height="65.9"/>
	</defs>
	<clipPath id="SVGID_10_">
		<use xlink:href="#SVGID_9_"  overflow="visible"/>
	</clipPath>
	<path clip-path="url(#SVGID_10_)" fill="#30241C" d="M56.4,7.7c-5.2,0-9.4,4.2-9.4,9.4s4.2,9.4,9.4,9.4s9.4-4.2,9.4-9.4
		S61.6,7.7,56.4,7.7 M56.4,27.4c-5.7,0-10.3-4.6-10.3-10.3S50.8,6.9,56.4,6.9s10.3,4.6,10.3,10.3S62.1,27.4,56.4,27.4"/>
	<path clip-path="url(#SVGID_10_)" fill="#FFFFFF" d="M21.8,49.4c0-4.5-3.7-8.2-8.2-8.2s-8.2,3.7-8.2,8.2c0,4.5,3.7,8.2,8.2,8.2
		S21.8,54,21.8,49.4"/>
</g>
<g>
	<defs>
		<path id="SVGID_11_" d="M5.4,49.4c0,4.5,3.7,8.2,8.2,8.2c4.5,0,8.2-3.7,8.2-8.2c0-4.5-3.7-8.2-8.2-8.2C9.1,41.2,5.4,44.9,5.4,49.4
			"/>
	</defs>
	<clipPath id="SVGID_12_">
		<use xlink:href="#SVGID_11_"  overflow="visible"/>
	</clipPath>
	<polygon clip-path="url(#SVGID_12_)" fill="#1CE5E3" points="12.6,53.7 13.6,57.6 8.5,57.6 8.6,54.5 11.5,53.1 	"/>
	<path clip-path="url(#SVGID_12_)" fill="#30241C" d="M11.2,47.3c-0.3,0-0.5,0-0.6,0c-0.2,0-0.4-0.2-0.4-0.4c0-0.2,0.2-0.4,0.4-0.4
		c0,0,2.4,0.2,3.7-0.8l0.3-1.1c0-0.1-0.2-0.3-0.8-0.5c-0.8-0.3-2.1-0.2-2.7,0.5c-0.2,0.2-0.4,0.2-0.6,0c-0.2-0.2-0.2-0.4,0-0.6
		c0.9-1,2.5-1.1,3.6-0.7c1.6,0.6,1.3,1.4,1.3,1.5L15.1,46c0,0.1-0.1,0.1-0.1,0.2C13.9,47.2,12.1,47.3,11.2,47.3"/>
	<path clip-path="url(#SVGID_12_)" fill="#30241C" d="M15.3,45.5c0.3,0,0.6,0.1,0.9,0.3c0-0.1-0.1-0.2-0.1-0.3
		c-0.1-0.2-0.3-0.3-0.6-0.4L15.3,45.5z M16.5,47.3c-0.2,0-0.3-0.1-0.4-0.2c-0.3-0.6-0.9-0.7-1.3-0.7c-0.1,0-0.1,0-0.1,0
		c-0.1,0-0.3,0-0.4-0.1c-0.1-0.1-0.1-0.3-0.1-0.4l0.4-1.3c0.1-0.2,0.2-0.3,0.4-0.3c0.7,0.1,1.2,0.4,1.5,0.8c0.5,0.8,0.2,1.8,0.2,1.9
		C16.9,47.1,16.8,47.3,16.5,47.3C16.6,47.3,16.6,47.3,16.5,47.3"/>
	<path clip-path="url(#SVGID_12_)" fill="#30241C" d="M13.6,52C13.6,52,13.5,52,13.6,52c-0.2,0-2.4-0.5-2.9-2.1
		c-0.4-1.4-0.5-2.9-0.5-3c0-0.2,0.2-0.4,0.4-0.4c0.2,0,0.4,0.2,0.4,0.4c0,0,0.1,1.5,0.5,2.8c0.2,0.9,1.5,1.3,2.1,1.5
		c0.6-0.1,1.9-0.6,2.1-1.5c0.4-1.3,0.5-2.8,0.5-2.8c0-0.2,0.2-0.4,0.4-0.4c0.2,0,0.4,0.2,0.4,0.4c0,0.1-0.1,1.6-0.5,3
		C16,51.5,13.8,52,13.6,52C13.6,52,13.6,52,13.6,52"/>
	<path clip-path="url(#SVGID_12_)" fill="#30241C" d="M10.9,49.5c-0.1,0-0.1,0-0.2-0.1c-0.6-0.3-1.5-1.1-1.1-2
		c0.3-0.7,0.8-0.7,1.2-0.6l-0.3,0.8c0,0,0,0,0,0c-0.1,0-0.1,0.1-0.1,0.2c-0.1,0.4,0.6,0.9,0.8,1c0.2,0.1,0.3,0.4,0.2,0.6
		C11.2,49.5,11.1,49.5,10.9,49.5"/>
	<path clip-path="url(#SVGID_12_)" fill="#30241C" d="M16.3,49.5c-0.1,0-0.3-0.1-0.4-0.2c-0.1-0.2,0-0.4,0.2-0.6
		c0.3-0.2,0.9-0.6,0.8-1c-0.1-0.1-0.1-0.2-0.1-0.2c-0.2,0.1-0.5,0-0.5-0.2c-0.1-0.2,0-0.5,0.2-0.5c0.3-0.1,0.9,0,1.2,0.6
		c0.4,0.9-0.5,1.7-1.1,2C16.4,49.5,16.3,49.5,16.3,49.5"/>
	<path clip-path="url(#SVGID_12_)" fill="#30241C" d="M12.1,52.9l0.9,0.5l0.1-0.2L12.1,52.9z M13.2,54.5c-0.1,0-0.1,0-0.2-0.1
		l-1.8-1.1c-0.2-0.1-0.3-0.4-0.1-0.6c0.1-0.2,0.4-0.3,0.6-0.1l0.1,0.1c0-0.1-0.1-0.1-0.1-0.2l0.1-1.5c0-0.2,0.2-0.4,0.4-0.4
		c0.2,0,0.4,0.2,0.4,0.4l-0.1,1.2l1.3,0.5c0.1,0,0.2,0.1,0.2,0.2c0,0.1,0,0.2,0,0.3l-0.4,1c0,0.1-0.1,0.2-0.3,0.2
		C13.2,54.5,13.2,54.5,13.2,54.5"/>
	<polygon clip-path="url(#SVGID_12_)" fill="#1CE5E3" points="14.6,53.7 13.6,57.6 18.7,57.6 18.6,54.5 15.6,53.1 	"/>
	<path clip-path="url(#SVGID_12_)" fill="#30241C" d="M14.1,53.3l0.1,0.2l0.9-0.5L14.1,53.3z M14,54.5c0,0-0.1,0-0.1,0
		c-0.1,0-0.2-0.1-0.3-0.2l-0.4-1c0-0.1,0-0.2,0-0.3s0.1-0.2,0.2-0.2l1.3-0.5L14.7,51c0-0.2,0.2-0.4,0.4-0.4c0.2,0,0.4,0.2,0.4,0.4
		l0.1,1.5c0,0.1,0,0.2-0.1,0.2l0.1-0.1c0.2-0.1,0.4,0,0.6,0.1c0.1,0.2,0.1,0.4-0.1,0.6l-1.8,1.1C14.2,54.4,14.1,54.5,14,54.5"/>
	<path clip-path="url(#SVGID_12_)" fill="#30241C" d="M12,52.4H9.5c-0.2,0-0.3-0.1-0.4-0.3c0,0-0.3-0.8-0.3-2.4
		c-0.1-2.6,0.6-4.5,1.9-5.8c0.2-0.2,0.4-0.2,0.6,0c0.2,0.2,0.2,0.4,0,0.6c-1.2,1.1-1.7,2.9-1.7,5.2c0,1,0.1,1.6,0.2,1.9H12
		c0.2,0,0.4,0.2,0.4,0.4C12.4,52.3,12.2,52.4,12,52.4"/>
	<path clip-path="url(#SVGID_12_)" fill="#30241C" d="M16.9,52.4h-1.6c-0.2,0-0.4-0.2-0.4-0.4c0-0.2,0.2-0.4,0.4-0.4h1.3
		c0-0.2,0.1-0.5,0.1-1c0-0.7-0.1-1.3-0.2-1.8c-0.1-0.2,0.1-0.4,0.3-0.5c0.2-0.1,0.4,0.1,0.5,0.3c0.2,0.6,0.3,1.3,0.2,2.1
		c0,1.1-0.2,1.5-0.2,1.6C17.3,52.3,17.1,52.4,16.9,52.4"/>
</g>
<g>
	<defs>
		<rect id="SVGID_13_" y="0" width="66.7" height="65.9"/>
	</defs>
	<clipPath id="SVGID_14_">
		<use xlink:href="#SVGID_13_"  overflow="visible"/>
	</clipPath>
	<path clip-path="url(#SVGID_14_)" fill="#30241C" d="M13.6,41.6c-4.3,0-7.8,3.5-7.8,7.8c0,4.3,3.5,7.8,7.8,7.8
		c4.3,0,7.8-3.5,7.8-7.8C21.4,45.1,17.9,41.6,13.6,41.6 M13.6,58.1c-4.8,0-8.6-3.9-8.6-8.6c0-4.8,3.9-8.6,8.6-8.6
		c4.8,0,8.6,3.9,8.6,8.6C22.2,54.2,18.3,58.1,13.6,58.1"/>
	<path clip-path="url(#SVGID_14_)" fill="#30241C" d="M3.7,30c-1.6,0-2.9,1.3-2.9,2.9c0,1.6,1.3,2.9,2.9,2.9s2.9-1.3,2.9-2.9
		C6.6,31.3,5.3,30,3.7,30 M3.7,36.6c-2,0-3.7-1.7-3.7-3.7c0-2,1.7-3.7,3.7-3.7s3.7,1.7,3.7,3.7C7.4,34.9,5.7,36.6,3.7,36.6"/>
	<path clip-path="url(#SVGID_14_)" fill="#30241C" d="M8.6,20c-0.7,0-1.2,0.6-1.2,1.2s0.6,1.2,1.2,1.2s1.2-0.6,1.2-1.2
		S9.3,20,8.6,20 M8.6,23.3c-1.1,0-2.1-0.9-2.1-2.1c0-1.1,0.9-2.1,2.1-2.1s2.1,0.9,2.1,2.1C10.7,22.4,9.8,23.3,8.6,23.3"/>
	<path clip-path="url(#SVGID_14_)" fill="#30241C" d="M63,33.4c-1.6,0-2.9,1.3-2.9,2.9c0,1.6,1.3,2.9,2.9,2.9c1.6,0,2.9-1.3,2.9-2.9
		C65.9,34.6,64.6,33.4,63,33.4 M63,39.9c-2,0-3.7-1.7-3.7-3.7c0-2,1.7-3.7,3.7-3.7c2,0,3.7,1.7,3.7,3.7C66.7,38.3,65,39.9,63,39.9"
		/>
	<path clip-path="url(#SVGID_14_)" fill="#30241C" d="M58.1,46.5c-0.7,0-1.2,0.6-1.2,1.2c0,0.7,0.6,1.2,1.2,1.2
		c0.7,0,1.2-0.6,1.2-1.2C59.3,47.1,58.7,46.5,58.1,46.5 M58.1,49.8c-1.1,0-2.1-0.9-2.1-2.1c0-1.1,0.9-2.1,2.1-2.1
		c1.1,0,2.1,0.9,2.1,2.1C60.1,48.9,59.2,49.8,58.1,49.8"/>
</g>
<rect x="3.2" y="38.8" transform="matrix(0.4928 0.8701 -0.8701 0.4928 37.7327 13.6941)" fill="#30241C" width="7.8" height="0.8"/>
<rect x="5.4" y="22.1" transform="matrix(0.8559 0.5172 -0.5172 0.8559 14.3599 0.781)" fill="#30241C" width="0.8" height="8"/>
<rect x="57.8" y="29.2" transform="matrix(0.3539 0.9353 -0.9353 0.3539 67.3707 -38.3208)" fill="#30241C" width="7.2" height="0.8"/>
<rect x="60" y="39" transform="matrix(0.8947 0.4467 -0.4467 0.8947 25.4942 -22.4733)" fill="#30241C" width="0.8" height="7.6"/>
</svg>
