{
  "PRIVACY_POLICY_TITLE": "Datenschutzerklärung",
  "OK_LABEL": "OK",
  "CLOSE_LABEL": "Schließen",
  "LOADING_LABEL": "Wird geladen",
  "ERROR_LOADING_PRIVACY_POLICY": "Fehler beim Laden der Daten der Datenschutzerklärung",
  "UNKNOWNSCREEN_TITLE": "Schnell der Blutmond erscheint!",
  "UNKNOWNSCREEN_SUBTITLE": "Die gesuchte Seite existiert nicht",
  "UNKNOWNSCREEN_BUTTON_LABEL": "Zum Startbildschirm",
  "EN_GB_LABEL": "English (Great Britian)",
  "EN_US_LABEL": "English (USA)",
  "DE_DE_LABEL": "Deutsch",
  "APP_LANGUAGE_LABEL": "App Sprache",
  "APP_THEME_LABEL": "App Theme",
  "APP_THEME_LIGHT": "Hell",
  "APP_THEME_DARK": "Dunkel",
  "APP_THEME_AUTO": "Auto",
  "NO_RESULTS_FOR_LABEL": "Keine Ergebnisse für",
  "SEARCH_HINT": "Suchen",
  "LANG_CHANGE_TITLE_PRE": "Soll ",
  "LANG_CHANGE_TITLE_POST": " als App-Sprache verwendet werden?",
  "LANG_CHANGE_USE": "verwenden",
  "SETTINGS_LABEL": "Einstellungen",
  "START_GAME_LABEL": "Spiel starten",
  "EXIT_GAME_LABEL": "Beenden",
  "NUMBER_OF_FIELDS_LABEL": "Anzahl der Felder",
  "WIN_LABEL": "Gewonnen",
  "GAME_OVER_LABEL": "Verloren"
}