ISO-10303-21;
HEADER;
FILE_DESCRIPTION (( 'STEP AP214' ),
    '1' );
FILE_NAME ('mill-max-$PARTNUMBER.STEP',
    '2018-12-19T08:04:44',
    ( '' ),
    ( '' ),
    'SwSTEP 2.0',
    'SolidWorks 2018',
    '' );
FILE_SCHEMA (( 'AUTOMOTIVE_DESIGN' ));
ENDSEC;

DATA;
#1 = CIRCLE ( 'NONE', #564, 0.03049999999999957953 ) ;
#2 = DIRECTION ( 'NONE',  ( -1.000000000000000000, -0.0000000000000000000, -0.0000000000000000000 ) ) ;
#3 = VERTEX_POINT ( 'NONE', #492 ) ;
#4 = ORIENTED_EDGE ( 'NONE', *, *, #681, .T. ) ;
#5 = CARTESIAN_POINT ( 'NONE',  ( 0.1293987993997751385, -0.03242294869024800463, -0.04365099290345567096 ) ) ;
#6 = CARTESIAN_POINT ( 'NONE',  ( 0.07606867238085757155, -0.03242294869024800463, -0.007650992903455674544 ) ) ;
#7 = CIRCLE ( 'NONE', #372, 0.008500000000000000611 ) ;
#8 = EDGE_CURVE ( 'NONE', #528, #66, #648, .T. ) ;
#9 = CARTESIAN_POINT ( 'NONE',  ( 0.07306867238085860972, -0.03242294869024801851, -0.04365099290345567096 ) ) ;
#10 = DIRECTION ( 'NONE',  ( 0.0000000000000000000, -0.1396333460903128321, 0.9902032764334921522 ) ) ;
#11 = AXIS2_PLACEMENT_3D ( 'NONE', #104, #109, #496 ) ;
#12 = DIRECTION ( 'NONE',  ( 0.0000000000000000000, 0.0000000000000000000, 1.000000000000000000 ) ) ;
#13 = DIMENSIONAL_EXPONENTS ( 1.000000000000000000, 0.0000000000000000000, 0.0000000000000000000, 0.0000000000000000000, 0.0000000000000000000, 0.0000000000000000000, 0.0000000000000000000 ) ;
#14 = CARTESIAN_POINT ( 'NONE',  ( 0.007068672380858122620, -0.03242294869024800463, -0.04365099290345567096 ) ) ;
#15 = FACE_OUTER_BOUND ( 'NONE', #81, .T. ) ;
#16 = ORIENTED_EDGE ( 'NONE', *, *, #394, .F. ) ;
#17 = DIRECTION ( 'NONE',  ( 0.0000000000000000000, 0.0000000000000000000, 1.000000000000000000 ) ) ;
#18 = ORIENTED_EDGE ( 'NONE', *, *, #696, .F. ) ;
#19 = ADVANCED_FACE ( 'NONE', ( #363 ), #704, .T. ) ;
#20 = AXIS2_PLACEMENT_3D ( 'NONE', #399, #284, #632 ) ;
#21 = CARTESIAN_POINT ( 'NONE',  ( 0.07606867238085855687, -0.03242294869024801851, -0.04365099290345567096 ) ) ;
#22 = LINE ( 'NONE', #130, #463 ) ;
#23 = EDGE_CURVE ( 'NONE', #177, #255, #299, .T. ) ;
#24 = CARTESIAN_POINT ( 'NONE',  ( 0.07606867238085758542, -0.03242294869024800463, -0.01415099290345643752 ) ) ;
#25 = CARTESIAN_POINT ( 'NONE',  ( 0.07606867238085757155, -0.03242294869024801157, -0.02190099290345899966 ) ) ;
#26 = ORIENTED_EDGE ( 'NONE', *, *, #414, .T. ) ;
#27 = VECTOR ( 'NONE', #382, 39.37007874015748143 ) ;
#28 = AXIS2_PLACEMENT_3D ( 'NONE', #644, #359, #139 ) ;
#29 = DIRECTION ( 'NONE',  ( 0.0000000000000000000, 0.0000000000000000000, -1.000000000000000000 ) ) ;
#30 = DIRECTION ( 'NONE',  ( -2.510889700059065386E-16, -1.000000000000000000, 0.0000000000000000000 ) ) ;
#31 = AXIS2_PLACEMENT_3D ( 'NONE', #624, #504, #293 ) ;
#32 = DIRECTION ( 'NONE',  ( -2.249639673992718810E-32, -1.224646799147353207E-16, 1.000000000000000000 ) ) ;
#33 = ORIENTED_EDGE ( 'NONE', *, *, #458, .T. ) ;
#34 = EDGE_CURVE ( 'NONE', #452, #302, #408, .T. ) ;
#35 = EDGE_LOOP ( 'NONE', ( #582, #133 ) ) ;
#36 = DIRECTION ( 'NONE',  ( -1.000000000000000000, -0.0000000000000000000, -0.0000000000000000000 ) ) ;
#37 = CIRCLE ( 'NONE', #286, 0.03599999999999999728 ) ;
#38 = DIRECTION ( 'NONE',  ( -1.000000000000000000, 0.0000000000000000000, -0.0000000000000000000 ) ) ;
#39 = DIRECTION ( 'NONE',  ( -0.9659258262890096924, 3.169619151434444603E-17, -0.2588190451027395644 ) ) ;
#40 = AXIS2_PLACEMENT_3D ( 'NONE', #668, #165, #341 ) ;
#41 = PLANE ( 'NONE',  #321 ) ;
#42 = EDGE_LOOP ( 'NONE', ( #304, #33 ) ) ;
#43 = ADVANCED_FACE ( 'NONE', ( #488 ), #105, .T. ) ;
#44 = ORIENTED_EDGE ( 'NONE', *, *, #472, .F. ) ;
#45 = VECTOR ( 'NONE', #86, 39.37007874015748143 ) ;
#46 = CARTESIAN_POINT ( 'NONE',  ( 0.2740686723808580250, -0.03242294869024800463, -0.04365099290345567096 ) ) ;
#47 = ADVANCED_FACE ( 'NONE', ( #114 ), #606, .F. ) ;
#48 = EDGE_CURVE ( 'NONE', #666, #722, #1, .T. ) ;
#49 = DIRECTION ( 'NONE',  ( 1.836970198720974467E-16, 1.000000000000000000, 0.0000000000000000000 ) ) ;
#50 =( CONVERSION_BASED_UNIT ( 'INCH', #275 ) LENGTH_UNIT ( ) NAMED_UNIT ( #565 ) );
#51 = DIRECTION ( 'NONE',  ( 0.0000000000000000000, 0.0000000000000000000, 1.000000000000000000 ) ) ;
#52 = VERTEX_POINT ( 'NONE', #401 ) ;
#53 = SURFACE_STYLE_USAGE ( .BOTH. , #381 ) ;
#54 = VECTOR ( 'NONE', #249, 39.37007874015748143 ) ;
#55 = CARTESIAN_POINT ( 'NONE',  ( 0.5070686723808585095, -0.03207386532502222443, -0.04612650109453939745 ) ) ;
#56 = EDGE_CURVE ( 'NONE', #443, #77, #694, .T. ) ;
#57 = EDGE_LOOP ( 'NONE', ( #467, #140, #553, #176 ) ) ;
#58 = VERTEX_POINT ( 'NONE', #6 ) ;
#59 = DIRECTION ( 'NONE',  ( 1.000000000000000000, 0.0000000000000000000, 0.0000000000000000000 ) ) ;
#60 = FACE_BOUND ( 'NONE', #327, .T. ) ;
#61 = CARTESIAN_POINT ( 'NONE',  ( 0.09206867238085872374, -0.03242294869024800463, -0.04365099290345567096 ) ) ;
#62 = APPLICATION_CONTEXT ( 'automotive_design' ) ;
#63 = CARTESIAN_POINT ( 'NONE',  ( 0.4826510476630430646, -0.02950461175696050473, -0.06434624138091538104 ) ) ;
#64 = AXIS2_PLACEMENT_3D ( 'NONE', #46, #424, #427 ) ;
#65 = ADVANCED_FACE ( 'NONE', ( #15 ), #586, .T. ) ;
#66 = VERTEX_POINT ( 'NONE', #216 ) ;
#67 = AXIS2_PLACEMENT_3D ( 'NONE', #122, #59, #112 ) ;
#68 = SURFACE_SIDE_STYLE ('',( #129 ) ) ;
#69 = ORIENTED_EDGE ( 'NONE', *, *, #708, .T. ) ;
#70 = DIRECTION ( 'NONE',  ( 0.0000000000000000000, 0.0000000000000000000, 1.000000000000000000 ) ) ;
#71 = EDGE_CURVE ( 'NONE', #482, #3, #261, .T. ) ;
#72 =( NAMED_UNIT ( * ) SI_UNIT ( $, .STERADIAN. ) SOLID_ANGLE_UNIT ( ) );
#73 = LINE ( 'NONE', #24, #172 ) ;
#74 = DIRECTION ( 'NONE',  ( 0.0000000000000000000, -0.1396333460903131096, 0.9902032764334921522 ) ) ;
#75 = CYLINDRICAL_SURFACE ( 'NONE', #204, 0.02089999999999972782 ) ;
#76 = DIRECTION ( 'NONE',  ( -1.000000000000000000, 1.836970198720974467E-16, -0.0000000000000000000 ) ) ;
#77 = VERTEX_POINT ( 'NONE', #14 ) ;
#78 = AXIS2_PLACEMENT_3D ( 'NONE', #706, #587, #702 ) ;
#79 = CIRCLE ( 'NONE', #549, 0.03200000000000029904 ) ;
#80 = DIRECTION ( 'NONE',  ( 0.0000000000000000000, 0.0000000000000000000, 1.000000000000000000 ) ) ;
#81 = EDGE_LOOP ( 'NONE', ( #349, #534, #629, #316 ) ) ;
#82 = VERTEX_POINT ( 'NONE', #562 ) ;
#83 = FACE_OUTER_BOUND ( 'NONE', #545, .T. ) ;
#84 = AXIS2_PLACEMENT_3D ( 'NONE', #535, #655, #362 ) ;
#85 = DIRECTION ( 'NONE',  ( 0.0000000000000000000, -0.1396333460903131096, 0.9902032764334921522 ) ) ;
#86 = DIRECTION ( 'NONE',  ( -0.9659258262890096924, 0.0000000000000000000, 0.2588190451027395644 ) ) ;
#87 =( GEOMETRIC_REPRESENTATION_CONTEXT ( 3 ) GLOBAL_UNCERTAINTY_ASSIGNED_CONTEXT ( ( #297 ) ) GLOBAL_UNIT_ASSIGNED_CONTEXT ( ( #220, #228, #334 ) ) REPRESENTATION_CONTEXT ( 'NONE', 'WORKASPACE' ) );
#88 = DIRECTION ( 'NONE',  ( -1.000000000000000000, -0.0000000000000000000, -0.0000000000000000000 ) ) ;
#89 = EDGE_CURVE ( 'NONE', #608, #3, #202, .T. ) ;
#90 = EDGE_LOOP ( 'NONE', ( #510, #26, #91, #308 ) ) ;
#91 = ORIENTED_EDGE ( 'NONE', *, *, #592, .F. ) ;
#92 = CARTESIAN_POINT ( 'NONE',  ( 0.07606867238085758542, -0.03242294869024800463, -0.04365099290345567096 ) ) ;
#93 = FACE_OUTER_BOUND ( 'NONE', #536, .T. ) ;
#94 = EDGE_CURVE ( 'NONE', #687, #102, #307, .T. ) ;
#95 = CARTESIAN_POINT ( 'NONE',  ( 0.09206867238085872374, -0.03242294869024800463, -0.01315099290345609316 ) ) ;
#96 = PRODUCT_DEFINITION_CONTEXT ( 'detailed design', #135, 'design' ) ;
#97 = VECTOR ( 'NONE', #725, 39.37007874015748143 ) ;
#98 = AXIS2_PLACEMENT_3D ( 'NONE', #148, #378, #51 ) ;
#99 = ADVANCED_BREP_SHAPE_REPRESENTATION ( 'mill-max-$PARTNUMBER', ( #558, #152 ), #87 ) ;
#100 = CARTESIAN_POINT ( 'NONE',  ( 0.01556867238085812323, -0.03242294869024800463, -0.04365099290345567096 ) ) ;
#101 = ORIENTED_EDGE ( 'NONE', *, *, #306, .T. ) ;
#102 = VERTEX_POINT ( 'NONE', #63 ) ;
#103 = FACE_OUTER_BOUND ( 'NONE', #262, .T. ) ;
#104 = CARTESIAN_POINT ( 'NONE',  ( 0.1200686723808574441, -0.03242294869024800463, -0.04365099290345567096 ) ) ;
#105 = CONICAL_SURFACE ( 'NONE', #187, 0.02776794919243009974, 0.5235987755985291869 ) ;
#106 = ORIENTED_EDGE ( 'NONE', *, *, #223, .T. ) ;
#107 = ORIENTED_EDGE ( 'NONE', *, *, #422, .F. ) ;
#108 = CARTESIAN_POINT ( 'NONE',  ( 0.1293987993997751385, -0.03242294869024800463, -0.04365099290345567096 ) ) ;
#109 = DIRECTION ( 'NONE',  ( -1.000000000000000000, -0.0000000000000000000, -0.0000000000000000000 ) ) ;
#110 = AXIS2_PLACEMENT_3D ( 'NONE', #337, #226, #672 ) ;
#111 = CIRCLE ( 'NONE', #67, 0.02174999999999667477 ) ;
#112 = DIRECTION ( 'NONE',  ( 0.0000000000000000000, 0.0000000000000000000, -1.000000000000000000 ) ) ;
#113 = DIRECTION ( 'NONE',  ( 0.0000000000000000000, 0.0000000000000000000, 1.000000000000000000 ) ) ;
#114 = FACE_OUTER_BOUND ( 'NONE', #468, .T. ) ;
#115 = ORIENTED_EDGE ( 'NONE', *, *, #23, .T. ) ;
#116 = EDGE_CURVE ( 'NONE', #620, #687, #684, .T. ) ;
#117 = CIRCLE ( 'NONE', #650, 0.002999999999999936311 ) ;
#118 = DIRECTION ( 'NONE',  ( 0.0000000000000000000, 0.0000000000000000000, 1.000000000000000000 ) ) ;
#119 = SURFACE_STYLE_USAGE ( .BOTH. , #68 ) ;
#120 = CONICAL_SURFACE ( 'NONE', #537, 0.02949999999999923517, 0.2617993877993759488 ) ;
#121 = AXIS2_PLACEMENT_3D ( 'NONE', #640, #354, #641 ) ;
#122 = CARTESIAN_POINT ( 'NONE',  ( 0.07606867238085757155, -0.03242294869024801851, -0.04365099290345567096 ) ) ;
#123 = EDGE_LOOP ( 'NONE', ( #18, #145, #665, #493 ) ) ;
#124 = ORIENTED_EDGE ( 'NONE', *, *, #116, .F. ) ;
#125 = CARTESIAN_POINT ( 'NONE',  ( 0.1550686723808585576, -0.03242294869024800463, -0.04365099290345567096 ) ) ;
#126 = VECTOR ( 'NONE', #277, 39.37007874015748143 ) ;
#127 = EDGE_CURVE ( 'NONE', #302, #452, #396, .T. ) ;
#128 = DIRECTION ( 'NONE',  ( 2.249639673992718810E-32, 1.224646799147353207E-16, -1.000000000000000000 ) ) ;
#129 = SURFACE_STYLE_FILL_AREA ( #679 ) ;
#130 = CARTESIAN_POINT ( 'NONE',  ( 0.007068672380858124354, -0.02392294869024799708, -0.04365099290345567096 ) ) ;
#131 = EDGE_CURVE ( 'NONE', #620, #271, #674, .T. ) ;
#132 = DIRECTION ( 'NONE',  ( -1.000000000000000000, 0.0000000000000000000, -0.0000000000000000000 ) ) ;
#133 = ORIENTED_EDGE ( 'NONE', *, *, #127, .T. ) ;
#134 = ORIENTED_EDGE ( 'NONE', *, *, #48, .F. ) ;
#135 = APPLICATION_CONTEXT ( 'automotive_design' ) ;
#136 = AXIS2_PLACEMENT_3D ( 'NONE', #460, #230, #312 ) ;
#137 = CARTESIAN_POINT ( 'NONE',  ( 0.07606867238085758542, -0.03242294869024800463, -0.04365099290345567096 ) ) ;
#138 = DIRECTION ( 'NONE',  ( -1.000000000000000000, -0.0000000000000000000, -0.0000000000000000000 ) ) ;
#139 = DIRECTION ( 'NONE',  ( 0.0000000000000000000, 0.0000000000000000000, -1.000000000000000000 ) ) ;
#140 = ORIENTED_EDGE ( 'NONE', *, *, #325, .T. ) ;
#141 = CARTESIAN_POINT ( 'NONE',  ( 0.2740686723808580250, -0.03242294869024800463, -0.07141894209588577069 ) ) ;
#142 = AXIS2_PLACEMENT_3D ( 'NONE', #318, #542, #555 ) ;
#143 = DIRECTION ( 'NONE',  ( 0.0000000000000000000, 0.0000000000000000000, 1.000000000000000000 ) ) ;
#144 = ORIENTED_EDGE ( 'NONE', *, *, #56, .T. ) ;
#145 = ORIENTED_EDGE ( 'NONE', *, *, #339, .T. ) ;
#146 = ORIENTED_EDGE ( 'NONE', *, *, #532, .T. ) ;
#147 = DIRECTION ( 'NONE',  ( -1.000000000000000000, -0.0000000000000000000, -0.0000000000000000000 ) ) ;
#148 = CARTESIAN_POINT ( 'NONE',  ( 0.07606867238085758542, -0.03242294869024800463, -0.04365099290345567096 ) ) ;
#149 = CARTESIAN_POINT ( 'NONE',  ( 0.5070686723808585095, -0.03242294869024800463, -0.04365099290345567096 ) ) ;
#150 = DIRECTION ( 'NONE',  ( -1.000000000000000000, 0.0000000000000000000, -0.0000000000000000000 ) ) ;
#151 = ORIENTED_EDGE ( 'NONE', *, *, #368, .F. ) ;
#152 = AXIS2_PLACEMENT_3D ( 'NONE', #451, #280, #239 ) ;
#153 = AXIS2_PLACEMENT_3D ( 'NONE', #149, #669, #718 ) ;
#154 = DIRECTION ( 'NONE',  ( -1.000000000000000000, -0.0000000000000000000, -0.0000000000000000000 ) ) ;
#155 = CARTESIAN_POINT ( 'NONE',  ( 0.07606867238085758542, -0.03242294869024800463, -0.07965099290345567518 ) ) ;
#156 = ORIENTED_EDGE ( 'NONE', *, *, #89, .F. ) ;
#157 = EDGE_CURVE ( 'NONE', #500, #635, #596, .T. ) ;
#158 = ORIENTED_EDGE ( 'NONE', *, *, #339, .F. ) ;
#159 = DIRECTION ( 'NONE',  ( 0.0000000000000000000, -0.1396333460903127766, 0.9902032764334921522 ) ) ;
#160 = ORIENTED_EDGE ( 'NONE', *, *, #127, .F. ) ;
#161 = CARTESIAN_POINT ( 'NONE',  ( 0.09206867238085872374, -0.03242294869024800463, -0.04365099290345567096 ) ) ;
#162 = CIRCLE ( 'NONE', #84, 0.008500000000000012754 ) ;
#163 = DIRECTION ( 'NONE',  ( -1.000000000000000000, 0.0000000000000000000, 0.0000000000000000000 ) ) ;
#164 = AXIS2_PLACEMENT_3D ( 'NONE', #137, #138, #80 ) ;
#165 = DIRECTION ( 'NONE',  ( -1.000000000000000000, 1.836970198720974467E-16, -0.0000000000000000000 ) ) ;
#166 = CARTESIAN_POINT ( 'NONE',  ( 0.07606867238085758542, -0.03242294869024800463, -0.07315099290345490612 ) ) ;
#167 = DIRECTION ( 'NONE',  ( -1.000000000000000000, -0.0000000000000000000, -0.0000000000000000000 ) ) ;
#168 = VERTEX_POINT ( 'NONE', #409 ) ;
#169 = EDGE_CURVE ( 'NONE', #3, #608, #466, .T. ) ;
#170 = CIRCLE ( 'NONE', #300, 0.02949999999999923517 ) ;
#171 = DIRECTION ( 'NONE',  ( 0.0000000000000000000, -0.1396333460903128321, 0.9902032764334921522 ) ) ;
#172 = VECTOR ( 'NONE', #631, 39.37007874015748143 ) ;
#173 = ADVANCED_FACE ( 'NONE', ( #543 ), #383, .T. ) ;
#174 = DIRECTION ( 'NONE',  ( 0.0000000000000000000, 0.0000000000000000000, 1.000000000000000000 ) ) ;
#175 = DIRECTION ( 'NONE',  ( -1.000000000000000000, 0.0000000000000000000, -0.0000000000000000000 ) ) ;
#176 = ORIENTED_EDGE ( 'NONE', *, *, #458, .F. ) ;
#177 = VERTEX_POINT ( 'NONE', #634 ) ;
#178 = CARTESIAN_POINT ( 'NONE',  ( 0.5070686723808585095, -0.03207386532502222443, -0.04612650109453939745 ) ) ;
#179 = EDGE_LOOP ( 'NONE', ( #657, #4, #364, #491 ) ) ;
#180 = VECTOR ( 'NONE', #147, 39.37007874015748143 ) ;
#181 = DIRECTION ( 'NONE',  ( 0.0000000000000000000, 0.0000000000000000000, 1.000000000000000000 ) ) ;
#182 = PLANE ( 'NONE',  #28 ) ;
#183 = EDGE_CURVE ( 'NONE', #538, #186, #526, .T. ) ;
#184 = CARTESIAN_POINT ( 'NONE',  ( 0.07606867238085758542, -0.03242294869024800463, -0.04365099290345567096 ) ) ;
#185 = ORIENTED_EDGE ( 'NONE', *, *, #368, .T. ) ;
#186 = VERTEX_POINT ( 'NONE', #242 ) ;
#187 = AXIS2_PLACEMENT_3D ( 'NONE', #278, #393, #502 ) ;
#188 = CIRCLE ( 'NONE', #425, 0.02776794919243009974 ) ;
#189 = PRODUCT_RELATED_PRODUCT_CATEGORY ( 'part', '', ( #638 ) ) ;
#190 = STYLED_ITEM ( 'NONE', ( #296 ), #558 ) ;
#191 = DIRECTION ( 'NONE',  ( 1.000000000000000000, 0.0000000000000000000, 0.0000000000000000000 ) ) ;
#192 = LINE ( 'NONE', #210, #97 ) ;
#193 = DIRECTION ( 'NONE',  ( -1.000000000000000000, -0.0000000000000000000, -0.0000000000000000000 ) ) ;
#194 = ORIENTED_EDGE ( 'NONE', *, *, #360, .T. ) ;
#195 = ORIENTED_EDGE ( 'NONE', *, *, #604, .F. ) ;
#196 = CIRCLE ( 'NONE', #64, 0.02776794919243009974 ) ;
#197 = EDGE_CURVE ( 'NONE', #186, #77, #245, .T. ) ;
#198 = SHAPE_DEFINITION_REPRESENTATION ( #579, #99 ) ;
#199 = CARTESIAN_POINT ( 'NONE',  ( 0.2740686723808585801, -0.02950461175696050473, -0.06434624138091538104 ) ) ;
#200 = AXIS2_PLACEMENT_3D ( 'NONE', #597, #322, #710 ) ;
#201 = CARTESIAN_POINT ( 'NONE',  ( 0.01556867238085831925, -0.03242294869024800463, -0.04365099290345567096 ) ) ;
#202 = CIRCLE ( 'NONE', #578, 0.02949999999999923517 ) ;
#203 = ORIENTED_EDGE ( 'NONE', *, *, #205, .F. ) ;
#204 = AXIS2_PLACEMENT_3D ( 'NONE', #268, #150, #671 ) ;
#205 = EDGE_CURVE ( 'NONE', #350, #58, #37, .T. ) ;
#206 = DIRECTION ( 'NONE',  ( -0.0000000000000000000, 0.0000000000000000000, 1.000000000000000000 ) ) ;
#207 = FACE_OUTER_BOUND ( 'NONE', #90, .T. ) ;
#208 = CARTESIAN_POINT ( 'NONE',  ( 0.2740686723808585801, -0.004654999497817905764, -0.04365099290345567096 ) ) ;
#209 = AXIS2_PLACEMENT_3D ( 'NONE', #724, #609, #386 ) ;
#210 = CARTESIAN_POINT ( 'NONE',  ( 0.07606867238085758542, -0.03242294869024800463, -0.007650992903455674544 ) ) ;
#211 = ORIENTED_EDGE ( 'NONE', *, *, #197, .F. ) ;
#212 = ADVANCED_FACE ( 'NONE', ( #450 ), #229, .T. ) ;
#213 = EDGE_LOOP ( 'NONE', ( #281, #107 ) ) ;
#214 = FACE_BOUND ( 'NONE', #461, .T. ) ;
#215 = LINE ( 'NONE', #365, #379 ) ;
#216 = CARTESIAN_POINT ( 'NONE',  ( 0.09206867238085761351, -0.03242294869024800463, -0.07965099290345567518 ) ) ;
#217 = AXIS2_PLACEMENT_3D ( 'NONE', #685, #682, #174 ) ;
#218 = CARTESIAN_POINT ( 'NONE',  ( 0.07606867238085757155, -0.03242294869024801851, -0.04365099290345567096 ) ) ;
#219 = PRODUCT_DEFINITION ( 'UNKNOWN', '', #329, #96 ) ;
#220 =( CONVERSION_BASED_UNIT ( 'INCH', #447 ) LENGTH_UNIT ( ) NAMED_UNIT ( #291 ) );
#221 = UNCERTAINTY_MEASURE_WITH_UNIT (LENGTH_MEASURE( 1.000000000000000082E-05 ), #50, 'distance_accuracy_value', 'NONE');
#222 = DIRECTION ( 'NONE',  ( -1.000000000000000000, 0.0000000000000000000, -0.0000000000000000000 ) ) ;
#223 = EDGE_CURVE ( 'NONE', #66, #528, #717, .T. ) ;
#224 = ORIENTED_EDGE ( 'NONE', *, *, #116, .T. ) ;
#225 =( LENGTH_UNIT ( ) NAMED_UNIT ( * ) SI_UNIT ( $, .METRE. ) );
#226 = DIRECTION ( 'NONE',  ( 0.0000000000000000000, 0.0000000000000000000, 1.000000000000000000 ) ) ;
#227 = LINE ( 'NONE', #594, #351 ) ;
#228 =( NAMED_UNIT ( * ) PLANE_ANGLE_UNIT ( ) SI_UNIT ( $, .RADIAN. ) );
#229 = CONICAL_SURFACE ( 'NONE', #524, 0.02776794919243009974, 0.5235987755985291869 ) ;
#230 = DIRECTION ( 'NONE',  ( 0.0000000000000000000, 0.0000000000000000000, -1.000000000000000000 ) ) ;
#231 = AXIS2_PLACEMENT_3D ( 'NONE', #498, #505, #330 ) ;
#232 = DIRECTION ( 'NONE',  ( -1.000000000000000000, 1.836970198720974467E-16, -0.0000000000000000000 ) ) ;
#233 = DIRECTION ( 'NONE',  ( 0.0000000000000000000, -1.000000000000000000, 0.0000000000000000000 ) ) ;
#234 = ORIENTED_EDGE ( 'NONE', *, *, #663, .T. ) ;
#235 = AXIS2_PLACEMENT_3D ( 'NONE', #455, #222, #10 ) ;
#236 = DIRECTION ( 'NONE',  ( -1.000000000000000000, 1.836970198720974467E-16, -0.0000000000000000000 ) ) ;
#237 = ORIENTED_EDGE ( 'NONE', *, *, #23, .F. ) ;
#238 = ORIENTED_EDGE ( 'NONE', *, *, #407, .F. ) ;
#239 = DIRECTION ( 'NONE',  ( 1.000000000000000000, 0.0000000000000000000, 0.0000000000000000000 ) ) ;
#240 = CARTESIAN_POINT ( 'NONE',  ( 0.2740686723808580250, -0.03242294869024800463, -0.04365099290345567096 ) ) ;
#241 = CIRCLE ( 'NONE', #511, 0.02089999999999972088 ) ;
#242 = CARTESIAN_POINT ( 'NONE',  ( 0.01556867238085831752, -0.04092294869024800524, -0.04365099290345567096 ) ) ;
#243 = APPLICATION_PROTOCOL_DEFINITION ( 'draft international standard', 'automotive_design', 1998, #135 ) ;
#244 = CARTESIAN_POINT ( 'NONE',  ( 0.09206867238085872374, -0.03242294869024800463, -0.07415099290345525396 ) ) ;
#245 = CIRCLE ( 'NONE', #499, 0.008500000000000000611 ) ;
#246 = ORIENTED_EDGE ( 'NONE', *, *, #489, .F. ) ;
#247 = ORIENTED_EDGE ( 'NONE', *, *, #518, .T. ) ;
#248 = VECTOR ( 'NONE', #279, 39.37007874015748143 ) ;
#249 = DIRECTION ( 'NONE',  ( -1.000000000000000000, 0.0000000000000000000, -0.0000000000000000000 ) ) ;
#250 = UNCERTAINTY_MEASURE_WITH_UNIT (LENGTH_MEASURE( 1.000000000000000082E-05 ), #628, 'distance_accuracy_value', 'NONE');
#251 = CARTESIAN_POINT ( 'NONE',  ( 0.07606867238085757155, -0.03242294869024800463, -0.07965099290345567518 ) ) ;
#252 = EDGE_CURVE ( 'NONE', #608, #82, #73, .T. ) ;
#253 = VECTOR ( 'NONE', #618, 39.37007874015748143 ) ;
#254 = CARTESIAN_POINT ( 'NONE',  ( 0.1293987993997751385, -0.03242294869024800463, -0.07315099290345490612 ) ) ;
#255 = VERTEX_POINT ( 'NONE', #25 ) ;
#256 = ORIENTED_EDGE ( 'NONE', *, *, #157, .F. ) ;
#257 = DIRECTION ( 'NONE',  ( -2.510889700059065386E-16, -1.000000000000000000, 0.0000000000000000000 ) ) ;
#258 = AXIS2_PLACEMENT_3D ( 'NONE', #580, #352, #70 ) ;
#259 = ADVANCED_FACE ( 'NONE', ( #593 ), #700, .T. ) ;
#260 = DIRECTION ( 'NONE',  ( 0.0000000000000000000, 0.0000000000000000000, 1.000000000000000000 ) ) ;
#261 = LINE ( 'NONE', #507, #253 ) ;
#262 = EDGE_LOOP ( 'NONE', ( #101, #521 ) ) ;
#263 = ORIENTED_EDGE ( 'NONE', *, *, #643, .T. ) ;
#264 = ORIENTED_EDGE ( 'NONE', *, *, #681, .F. ) ;
#265 = CIRCLE ( 'NONE', #121, 0.02089999999999972088 ) ;
#266 = EDGE_CURVE ( 'NONE', #581, #482, #188, .T. ) ;
#267 = DIRECTION ( 'NONE',  ( -1.000000000000000000, -0.0000000000000000000, -0.0000000000000000000 ) ) ;
#268 = CARTESIAN_POINT ( 'NONE',  ( 0.1550686723808585576, -0.03242294869024800463, -0.04365099290345567096 ) ) ;
#269 = PRESENTATION_STYLE_ASSIGNMENT (( #119 ) ) ;
#270 = AXIS2_PLACEMENT_3D ( 'NONE', #100, #652, #540 ) ;
#271 = VERTEX_POINT ( 'NONE', #178 ) ;
#272 = VERTEX_POINT ( 'NONE', #301 ) ;
#273 = CARTESIAN_POINT ( 'NONE',  ( 0.2710686723808591880, -0.03242294869024800463, -0.01415099290345643752 ) ) ;
#274 = AXIS2_PLACEMENT_3D ( 'NONE', #92, #193, #371 ) ;
#275 = LENGTH_MEASURE_WITH_UNIT ( LENGTH_MEASURE( 0.02539999999999999897 ), #377 );
#276 = EDGE_CURVE ( 'NONE', #52, #443, #22, .T. ) ;
#277 = DIRECTION ( 'NONE',  ( -0.7986355100472961599, 0.08403344541013901825, -0.5959192077320518699 ) ) ;
#278 = CARTESIAN_POINT ( 'NONE',  ( 0.2740686723808580250, -0.03242294869024800463, -0.04365099290345567096 ) ) ;
#279 = DIRECTION ( 'NONE',  ( -0.8660254037843234665, 0.0000000000000000000, 0.5000000000001995071 ) ) ;
#280 = DIRECTION ( 'NONE',  ( 0.0000000000000000000, 0.0000000000000000000, 1.000000000000000000 ) ) ;
#281 = ORIENTED_EDGE ( 'NONE', *, *, #266, .F. ) ;
#282 = EDGE_LOOP ( 'NONE', ( #317, #303, #348, #619 ) ) ;
#283 = ORIENTED_EDGE ( 'NONE', *, *, #572, .F. ) ;
#284 = DIRECTION ( 'NONE',  ( -1.000000000000000000, 1.836970198720974467E-16, -0.0000000000000000000 ) ) ;
#285 = CIRCLE ( 'NONE', #355, 0.002999999999999931975 ) ;
#286 = AXIS2_PLACEMENT_3D ( 'NONE', #412, #693, #344 ) ;
#287 = FILL_AREA_STYLE_COLOUR ( '', #426 ) ;
#288 = ADVANCED_FACE ( 'NONE', ( #571 ), #421, .T. ) ;
#289 =( NAMED_UNIT ( * ) PLANE_ANGLE_UNIT ( ) SI_UNIT ( $, .RADIAN. ) );
#290 = CARTESIAN_POINT ( 'NONE',  ( 0.007068672380858122620, -0.04092294869024801218, -0.04365099290345567096 ) ) ;
#291 = DIMENSIONAL_EXPONENTS ( 1.000000000000000000, 0.0000000000000000000, 0.0000000000000000000, 0.0000000000000000000, 0.0000000000000000000, 0.0000000000000000000, 0.0000000000000000000 ) ;
#292 = EDGE_CURVE ( 'NONE', #687, #168, #358, .T. ) ;
#293 = DIRECTION ( 'NONE',  ( -1.836970198720974467E-16, -1.000000000000000000, 0.0000000000000000000 ) ) ;
#294 = EDGE_LOOP ( 'NONE', ( #211, #194, #144 ) ) ;
#295 = DIRECTION ( 'NONE',  ( -1.000000000000000000, 0.0000000000000000000, -0.0000000000000000000 ) ) ;
#296 = PRESENTATION_STYLE_ASSIGNMENT (( #53 ) ) ;
#297 = UNCERTAINTY_MEASURE_WITH_UNIT (LENGTH_MEASURE( 1.000000000000000082E-05 ), #220, 'distance_accuracy_value', 'NONE');
#298 = TOROIDAL_SURFACE ( 'NONE', #31, 0.01149999999999995297, 0.002999999999999935878 ) ;
#299 = CIRCLE ( 'NONE', #626, 0.02174999999999667477 ) ;
#300 = AXIS2_PLACEMENT_3D ( 'NONE', #417, #695, #525 ) ;
#301 = CARTESIAN_POINT ( 'NONE',  ( 0.1200686723808574441, -0.03242294869024800463, -0.01165099290345537018 ) ) ;
#302 = VERTEX_POINT ( 'NONE', #244 ) ;
#303 = ORIENTED_EDGE ( 'NONE', *, *, #472, .T. ) ;
#304 = ORIENTED_EDGE ( 'NONE', *, *, #592, .T. ) ;
#305 = CIRCLE ( 'NONE', #153, 0.002499999999999998751 ) ;
#306 = EDGE_CURVE ( 'NONE', #58, #350, #550, .T. ) ;
#307 = CIRCLE ( 'NONE', #235, 0.02089999999999972782 ) ;
#308 = ORIENTED_EDGE ( 'NONE', *, *, #353, .F. ) ;
#309 = AXIS2_PLACEMENT_3D ( 'NONE', #486, #88, #143 ) ;
#310 = DIRECTION ( 'NONE',  ( -1.000000000000000000, 1.836970198720974467E-16, -0.0000000000000000000 ) ) ;
#311 = VERTEX_POINT ( 'NONE', #591 ) ;
#312 = DIRECTION ( 'NONE',  ( 2.510889700059065386E-16, 1.000000000000000000, 0.0000000000000000000 ) ) ;
#313 = PRESENTATION_LAYER_ASSIGNMENT (  '', '', ( #190 ) ) ;
#314 = CARTESIAN_POINT ( 'NONE',  ( 0.07606867238085758542, -0.03242294869024800463, -0.01315099290345609316 ) ) ;
#315 = EDGE_LOOP ( 'NONE', ( #366, #469, #432, #590 ) ) ;
#316 = ORIENTED_EDGE ( 'NONE', *, *, #183, .F. ) ;
#317 = ORIENTED_EDGE ( 'NONE', *, *, #94, .T. ) ;
#318 = CARTESIAN_POINT ( 'NONE',  ( 0.07606867238085758542, -0.03242294869024800463, -0.04365099290345567096 ) ) ;
#319 = LINE ( 'NONE', #155, #27 ) ;
#320 = ADVANCED_FACE ( 'NONE', ( #503 ), #680, .T. ) ;
#321 = AXIS2_PLACEMENT_3D ( 'NONE', #431, #374, #49 ) ;
#322 = DIRECTION ( 'NONE',  ( -1.000000000000000000, 1.836970198720974467E-16, -0.0000000000000000000 ) ) ;
#323 = STYLED_ITEM ( 'NONE', ( #269 ), #99 ) ;
#324 = EDGE_LOOP ( 'NONE', ( #476, #588, #156, #707 ) ) ;
#325 = EDGE_CURVE ( 'NONE', #342, #82, #170, .T. ) ;
#326 = PLANE ( 'NONE',  #645 ) ;
#327 = EDGE_LOOP ( 'NONE', ( #115, #234 ) ) ;
#328 = EDGE_LOOP ( 'NONE', ( #44, #69, #376, #185 ) ) ;
#329 = PRODUCT_DEFINITION_FORMATION_WITH_SPECIFIED_SOURCE ( 'ANY', '', #638, .NOT_KNOWN. ) ;
#330 = DIRECTION ( 'NONE',  ( -1.836970198720974467E-16, -1.000000000000000000, 0.0000000000000000000 ) ) ;
#331 = AXIS2_PLACEMENT_3D ( 'NONE', #690, #406, #74 ) ;
#332 = FACE_OUTER_BOUND ( 'NONE', #213, .T. ) ;
#333 = CYLINDRICAL_SURFACE ( 'NONE', #309, 0.03049999999999957953 ) ;
#334 =( NAMED_UNIT ( * ) SI_UNIT ( $, .STERADIAN. ) SOLID_ANGLE_UNIT ( ) );
#335 = AXIS2_PLACEMENT_3D ( 'NONE', #390, #719, #494 ) ;
#336 = DIRECTION ( 'NONE',  ( -1.000000000000000000, -0.0000000000000000000, -0.0000000000000000000 ) ) ;
#337 = CARTESIAN_POINT ( 'NONE',  ( 0.01556867238085812323, -0.03242294869024800463, -0.04365099290345567096 ) ) ;
#338 = ADVANCED_FACE ( 'NONE', ( #420 ), #622, .T. ) ;
#339 = EDGE_CURVE ( 'NONE', #52, #635, #117, .T. ) ;
#340 = CARTESIAN_POINT ( 'NONE',  ( 0.5070686723808585095, -0.03242294869024800463, -0.04365099290345567096 ) ) ;
#341 = DIRECTION ( 'NONE',  ( -1.255444850029531707E-16, -1.000000000000000000, 0.0000000000000000000 ) ) ;
#342 = VERTEX_POINT ( 'NONE', #254 ) ;
#343 = CARTESIAN_POINT ( 'NONE',  ( 0.07606867238085758542, -0.03242294869024800463, -0.07415099290345525396 ) ) ;
#344 = DIRECTION ( 'NONE',  ( 0.0000000000000000000, 0.0000000000000000000, 1.000000000000000000 ) ) ;
#345 = LINE ( 'NONE', #343, #361 ) ;
#346 = CARTESIAN_POINT ( 'NONE',  ( 0.01556867238085812323, -0.03242294869024800463, -0.04365099290345567096 ) ) ;
#347 = ADVANCED_FACE ( 'NONE', ( #637 ), #531, .T. ) ;
#348 = ORIENTED_EDGE ( 'NONE', *, *, #478, .T. ) ;
#349 = ORIENTED_EDGE ( 'NONE', *, *, #394, .T. ) ;
#350 = VERTEX_POINT ( 'NONE', #251 ) ;
#351 = VECTOR ( 'NONE', #39, 39.37007874015748143 ) ;
#352 = DIRECTION ( 'NONE',  ( -1.000000000000000000, -0.0000000000000000000, -0.0000000000000000000 ) ) ;
#353 = EDGE_CURVE ( 'NONE', #82, #272, #370, .T. ) ;
#354 = DIRECTION ( 'NONE',  ( 1.000000000000000000, 0.0000000000000000000, 0.0000000000000000000 ) ) ;
#355 = AXIS2_PLACEMENT_3D ( 'NONE', #435, #480, #647 ) ;
#356 = DIRECTION ( 'NONE',  ( 1.000000000000000000, 0.0000000000000000000, 0.0000000000000000000 ) ) ;
#357 = ORIENTED_EDGE ( 'NONE', *, *, #169, .F. ) ;
#358 = LINE ( 'NONE', #473, #54 ) ;
#359 = DIRECTION ( 'NONE',  ( 1.000000000000000000, 0.0000000000000000000, 0.0000000000000000000 ) ) ;
#360 = EDGE_CURVE ( 'NONE', #186, #443, #7, .T. ) ;
#361 = VECTOR ( 'NONE', #621, 39.37007874015748143 ) ;
#362 = DIRECTION ( 'NONE',  ( 0.0000000000000000000, -1.000000000000000000, 0.0000000000000000000 ) ) ;
#363 = FACE_OUTER_BOUND ( 'NONE', #713, .T. ) ;
#364 = ORIENTED_EDGE ( 'NONE', *, *, #554, .F. ) ;
#365 = CARTESIAN_POINT ( 'NONE',  ( 0.1550686723808585576, -0.02950461175696050473, -0.06434624138091538104 ) ) ;
#366 = ORIENTED_EDGE ( 'NONE', *, *, #8, .T. ) ;
#367 = FACE_BOUND ( 'NONE', #35, .T. ) ;
#368 = EDGE_CURVE ( 'NONE', #168, #429, #265, .T. ) ;
#369 = CONICAL_SURFACE ( 'NONE', #209, 0.02949999999999923517, 0.2617993877993759488 ) ;
#370 = LINE ( 'NONE', #530, #45 ) ;
#371 = DIRECTION ( 'NONE',  ( 0.0000000000000000000, 0.0000000000000000000, 1.000000000000000000 ) ) ;
#372 = AXIS2_PLACEMENT_3D ( 'NONE', #703, #310, #30 ) ;
#373 = ADVANCED_FACE ( 'NONE', ( #402, #485 ), #475, .F. ) ;
#374 = DIRECTION ( 'NONE',  ( 1.000000000000000000, -1.836970198720974467E-16, 0.0000000000000000000 ) ) ;
#375 = ORIENTED_EDGE ( 'NONE', *, *, #449, .T. ) ;
#376 = ORIENTED_EDGE ( 'NONE', *, *, #292, .T. ) ;
#377 =( LENGTH_UNIT ( ) NAMED_UNIT ( * ) SI_UNIT ( $, .METRE. ) );
#378 = DIRECTION ( 'NONE',  ( -1.000000000000000000, -0.0000000000000000000, -0.0000000000000000000 ) ) ;
#379 = VECTOR ( 'NONE', #38, 39.37007874015748143 ) ;
#380 = VECTOR ( 'NONE', #236, 39.37007874015748143 ) ;
#381 = SURFACE_SIDE_STYLE ('',( #445 ) ) ;
#382 = DIRECTION ( 'NONE',  ( -1.000000000000000000, -0.0000000000000000000, -0.0000000000000000000 ) ) ;
#383 = CYLINDRICAL_SURFACE ( 'NONE', #639, 0.02089999999999972782 ) ;
#384 = ADVANCED_FACE ( 'NONE', ( #60, #103 ), #182, .F. ) ;
#385 = EDGE_LOOP ( 'NONE', ( #195, #134 ) ) ;
#386 = DIRECTION ( 'NONE',  ( 0.0000000000000000000, 0.0000000000000000000, 1.000000000000000000 ) ) ;
#387 = EDGE_LOOP ( 'NONE', ( #264, #411, #598, #649 ) ) ;
#388 = ORIENTED_EDGE ( 'NONE', *, *, #48, .T. ) ;
#389 = MECHANICAL_DESIGN_GEOMETRIC_PRESENTATION_REPRESENTATION (  '', ( #190 ), #539 ) ;
#390 = CARTESIAN_POINT ( 'NONE',  ( 0.09206867238085815475, 0.003577051309751990479, -0.04365099290345567096 ) ) ;
#391 = DIRECTION ( 'NONE',  ( -0.7986355100472961599, -0.08403344541013894886, 0.5959192077320518699 ) ) ;
#392 = DIRECTION ( 'NONE',  ( 0.0000000000000000000, -0.1396333460903128321, 0.9902032764334921522 ) ) ;
#393 = DIRECTION ( 'NONE',  ( -1.000000000000000000, -0.0000000000000000000, -0.0000000000000000000 ) ) ;
#394 = EDGE_CURVE ( 'NONE', #538, #52, #162, .T. ) ;
#395 = CARTESIAN_POINT ( 'NONE',  ( 0.4826510476630430646, -0.03534128562353550801, -0.02295574442599595741 ) ) ;
#396 = CIRCLE ( 'NONE', #714, 0.03049999999999957953 ) ;
#397 = DIRECTION ( 'NONE',  ( -1.000000000000000000, -0.0000000000000000000, -0.0000000000000000000 ) ) ;
#398 = ORIENTED_EDGE ( 'NONE', *, *, #532, .F. ) ;
#399 = CARTESIAN_POINT ( 'NONE',  ( 0.007068672380858123487, -0.03242294869024800463, -0.04365099290345567096 ) ) ;
#400 = ORIENTED_EDGE ( 'NONE', *, *, #131, .F. ) ;
#401 = CARTESIAN_POINT ( 'NONE',  ( 0.07306867238085860972, -0.02392294869024800749, -0.04365099290345567096 ) ) ;
#402 = FACE_BOUND ( 'NONE', #385, .T. ) ;
#403 = APPLICATION_PROTOCOL_DEFINITION ( 'draft international standard', 'automotive_design', 1998, #62 ) ;
#404 = DIRECTION ( 'NONE',  ( 0.0000000000000000000, 1.000000000000000000, 0.0000000000000000000 ) ) ;
#405 = DIRECTION ( 'NONE',  ( 0.0000000000000000000, -1.000000000000000000, 0.0000000000000000000 ) ) ;
#406 = DIRECTION ( 'NONE',  ( -1.000000000000000000, 0.0000000000000000000, -0.0000000000000000000 ) ) ;
#407 = EDGE_CURVE ( 'NONE', #635, #500, #709, .T. ) ;
#408 = CIRCLE ( 'NONE', #701, 0.03049999999999957953 ) ;
#409 = CARTESIAN_POINT ( 'NONE',  ( 0.2740686723808585801, -0.03534128562353550801, -0.02295574442599596088 ) ) ;
#410 = ORIENTED_EDGE ( 'NONE', *, *, #131, .T. ) ;
#411 = ORIENTED_EDGE ( 'NONE', *, *, #169, .T. ) ;
#412 = CARTESIAN_POINT ( 'NONE',  ( 0.07606867238085757155, -0.03242294869024800463, -0.04365099290345567096 ) ) ;
#413 = FACE_OUTER_BOUND ( 'NONE', #387, .T. ) ;
#414 = EDGE_CURVE ( 'NONE', #342, #311, #227, .T. ) ;
#415 = CARTESIAN_POINT ( 'NONE',  ( 0.5070686723808585095, -0.03242294869024800463, -0.04365099290345567096 ) ) ;
#416 = AXIS2_PLACEMENT_3D ( 'NONE', #533, #356, #29 ) ;
#417 = CARTESIAN_POINT ( 'NONE',  ( 0.1293987993997751385, -0.03242294869024800463, -0.04365099290345567096 ) ) ;
#418 = ORIENTED_EDGE ( 'NONE', *, *, #183, .T. ) ;
#419 = ORIENTED_EDGE ( 'NONE', *, *, #157, .T. ) ;
#420 = FACE_OUTER_BOUND ( 'NONE', #179, .T. ) ;
#421 = SPHERICAL_SURFACE ( 'NONE', #136, 0.008500000000000000611 ) ;
#422 = EDGE_CURVE ( 'NONE', #482, #581, #196, .T. ) ;
#423 = ORIENTED_EDGE ( 'NONE', *, *, #441, .T. ) ;
#424 = DIRECTION ( 'NONE',  ( -1.000000000000000000, -0.0000000000000000000, -0.0000000000000000000 ) ) ;
#425 = AXIS2_PLACEMENT_3D ( 'NONE', #515, #167, #573 ) ;
#426 = COLOUR_RGB ( '',1.000000000000000000, 0.8588235294117646523, 0.5568627450980392357 ) ;
#427 = DIRECTION ( 'NONE',  ( 0.0000000000000000000, 0.0000000000000000000, 1.000000000000000000 ) ) ;
#428 = ADVANCED_FACE ( 'NONE', ( #559, #83 ), #41, .F. ) ;
#429 = VERTEX_POINT ( 'NONE', #199 ) ;
#430 = AXIS2_PLACEMENT_3D ( 'NONE', #607, #2, #118 ) ;
#431 = CARTESIAN_POINT ( 'NONE',  ( 0.07606867238085855687, -0.02092294869024806728, -0.04365099290345567096 ) ) ;
#432 = ORIENTED_EDGE ( 'NONE', *, *, #306, .F. ) ;
#433 = ORIENTED_EDGE ( 'NONE', *, *, #663, .F. ) ;
#434 = COLOUR_RGB ( '',1.000000000000000000, 0.8588235294117646523, 0.5568627450980392357 ) ;
#435 = CARTESIAN_POINT ( 'NONE',  ( 0.07306867238085862359, -0.04392294869024797321, -0.04365099290345567096 ) ) ;
#436 = AXIS2_PLACEMENT_3D ( 'NONE', #21, #76, #233 ) ;
#437 =( NAMED_UNIT ( * ) PLANE_ANGLE_UNIT ( ) SI_UNIT ( $, .RADIAN. ) );
#438 = AXIS2_PLACEMENT_3D ( 'NONE', #340, #163, #159 ) ;
#439 = ORIENTED_EDGE ( 'NONE', *, *, #276, .F. ) ;
#440 = ORIENTED_EDGE ( 'NONE', *, *, #691, .T. ) ;
#441 = EDGE_CURVE ( 'NONE', #538, #500, #285, .T. ) ;
#442 = CARTESIAN_POINT ( 'NONE',  ( 0.2740686723808580250, -0.03242294869024800463, -0.01588304371102557122 ) ) ;
#443 = VERTEX_POINT ( 'NONE', #602 ) ;
#444 = LINE ( 'NONE', #55, #126 ) ;
#445 = SURFACE_STYLE_FILL_AREA ( #617 ) ;
#446 = CARTESIAN_POINT ( 'NONE',  ( 0.2710686723808591880, -0.03242294869024800463, -0.04365099290345567096 ) ) ;
#447 = LENGTH_MEASURE_WITH_UNIT ( LENGTH_MEASURE( 0.02539999999999999897 ), #225 );
#448 = DIRECTION ( 'NONE',  ( 0.0000000000000000000, 0.0000000000000000000, 1.000000000000000000 ) ) ;
#449 = EDGE_CURVE ( 'NONE', #443, #186, #548, .T. ) ;
#450 = FACE_OUTER_BOUND ( 'NONE', #712, .T. ) ;
#451 = CARTESIAN_POINT ( 'NONE',  ( 0.0000000000000000000, 0.0000000000000000000, 0.0000000000000000000 ) ) ;
#452 = VERTEX_POINT ( 'NONE', #95 ) ;
#453 = EDGE_LOOP ( 'NONE', ( #678, #388, #575, #160 ) ) ;
#454 = CYLINDRICAL_SURFACE ( 'NONE', #142, 0.02949999999999923517 ) ;
#455 = CARTESIAN_POINT ( 'NONE',  ( 0.4826510476630430646, -0.03242294869024800463, -0.04365099290345567096 ) ) ;
#456 = LENGTH_MEASURE_WITH_UNIT ( LENGTH_MEASURE( 0.02539999999999999897 ), #513 );
#457 = DIRECTION ( 'NONE',  ( -1.000000000000000000, -0.0000000000000000000, -0.0000000000000000000 ) ) ;
#458 = EDGE_CURVE ( 'NONE', #311, #272, #79, .T. ) ;
#459 = ADVANCED_FACE ( 'NONE', ( #716 ), #333, .T. ) ;
#460 = CARTESIAN_POINT ( 'NONE',  ( 0.01556867238085812323, -0.03242294869024800463, -0.04365099290345567096 ) ) ;
#461 = EDGE_LOOP ( 'NONE', ( #151, #636 ) ) ;
#462 = EDGE_LOOP ( 'NONE', ( #439, #556, #418, #566 ) ) ;
#463 = VECTOR ( 'NONE', #574, 39.37007874015748143 ) ;
#464 = CIRCLE ( 'NONE', #614, 0.008500000000000012754 ) ;
#465 = AXIS2_PLACEMENT_3D ( 'NONE', #613, #154, #448 ) ;
#466 = CIRCLE ( 'NONE', #217, 0.02949999999999923517 ) ;
#467 = ORIENTED_EDGE ( 'NONE', *, *, #414, .F. ) ;
#468 = EDGE_LOOP ( 'NONE', ( #158, #16, #423, #419 ) ) ;
#469 = ORIENTED_EDGE ( 'NONE', *, *, #523, .T. ) ;
#470 = CARTESIAN_POINT ( 'NONE',  ( 0.5070686723808585095, -0.03242294869024800463, -0.04365099290345567096 ) ) ;
#471 = CIRCLE ( 'NONE', #615, 0.02949999999999923517 ) ;
#472 = EDGE_CURVE ( 'NONE', #102, #429, #215, .T. ) ;
#473 = CARTESIAN_POINT ( 'NONE',  ( 0.1550686723808585576, -0.03534128562353550801, -0.02295574442599595741 ) ) ;
#474 = AXIS2_PLACEMENT_3D ( 'NONE', #201, #487, #257 ) ;
#475 = PLANE ( 'NONE',  #416 ) ;
#476 = ORIENTED_EDGE ( 'NONE', *, *, #266, .T. ) ;
#477 = PRESENTATION_LAYER_ASSIGNMENT (  '', '', ( #323 ) ) ;
#478 = EDGE_CURVE ( 'NONE', #429, #168, #241, .T. ) ;
#479 = CYLINDRICAL_SURFACE ( 'NONE', #20, 0.008500000000000007550 ) ;
#480 = DIRECTION ( 'NONE',  ( 0.0000000000000000000, -0.0000000000000000000, -1.000000000000000000 ) ) ;
#481 = ORIENTED_EDGE ( 'NONE', *, *, #572, .T. ) ;
#482 = VERTEX_POINT ( 'NONE', #141 ) ;
#483 = CARTESIAN_POINT ( 'NONE',  ( 0.1200686723808574441, -0.03242294869024800463, -0.04365099290345567096 ) ) ;
#484 = ADVANCED_FACE ( 'NONE', ( #93 ), #600, .T. ) ;
#485 = FACE_OUTER_BOUND ( 'NONE', #42, .T. ) ;
#486 = CARTESIAN_POINT ( 'NONE',  ( 0.07606867238085758542, -0.03242294869024800463, -0.04365099290345567096 ) ) ;
#487 = DIRECTION ( 'NONE',  ( -1.000000000000000000, 1.836970198720974467E-16, -0.0000000000000000000 ) ) ;
#488 = FACE_OUTER_BOUND ( 'NONE', #324, .T. ) ;
#489 = EDGE_CURVE ( 'NONE', #722, #452, #651, .T. ) ;
#490 = CARTESIAN_POINT ( 'NONE',  ( 0.5070686723808585095, -0.03277203205547379178, -0.04117548471237194446 ) ) ;
#491 = ORIENTED_EDGE ( 'NONE', *, *, #252, .F. ) ;
#492 = CARTESIAN_POINT ( 'NONE',  ( 0.2710686723808591880, -0.03242294869024800463, -0.07315099290345490612 ) ) ;
#493 = ORIENTED_EDGE ( 'NONE', *, *, #441, .F. ) ;
#494 = DIRECTION ( 'NONE',  ( -0.0000000000000000000, 0.0000000000000000000, 1.000000000000000000 ) ) ;
#495 = ADVANCED_FACE ( 'NONE', ( #699 ), #569, .T. ) ;
#496 = DIRECTION ( 'NONE',  ( 0.0000000000000000000, 0.0000000000000000000, 1.000000000000000000 ) ) ;
#497 = PLANE ( 'NONE',  #335 ) ;
#498 = CARTESIAN_POINT ( 'NONE',  ( 0.07306867238085862359, -0.03242294869024801851, -0.04365099290345567096 ) ) ;
#499 = AXIS2_PLACEMENT_3D ( 'NONE', #346, #128, #404 ) ;
#500 = VERTEX_POINT ( 'NONE', #654 ) ;
#501 = DIRECTION ( 'NONE',  ( 0.0000000000000000000, 0.0000000000000000000, 1.000000000000000000 ) ) ;
#502 = DIRECTION ( 'NONE',  ( 0.0000000000000000000, 0.0000000000000000000, 1.000000000000000000 ) ) ;
#503 = FACE_OUTER_BOUND ( 'NONE', #576, .T. ) ;
#504 = DIRECTION ( 'NONE',  ( -1.000000000000000000, 1.836970198720974467E-16, -0.0000000000000000000 ) ) ;
#505 = DIRECTION ( 'NONE',  ( -1.000000000000000000, 1.836970198720974467E-16, -0.0000000000000000000 ) ) ;
#506 = DIRECTION ( 'NONE',  ( -1.000000000000000000, 0.0000000000000000000, -0.0000000000000000000 ) ) ;
#507 = CARTESIAN_POINT ( 'NONE',  ( 0.2740686723808580250, -0.03242294869024800463, -0.07141894209588577069 ) ) ;
#508 = DIRECTION ( 'NONE',  ( -1.000000000000000000, -0.0000000000000000000, -0.0000000000000000000 ) ) ;
#509 = DIRECTION ( 'NONE',  ( 0.0000000000000000000, 0.0000000000000000000, 1.000000000000000000 ) ) ;
#510 = ORIENTED_EDGE ( 'NONE', *, *, #554, .T. ) ;
#511 = AXIS2_PLACEMENT_3D ( 'NONE', #601, #191, #260 ) ;
#512 = ADVANCED_FACE ( 'NONE', ( #413 ), #454, .T. ) ;
#513 =( LENGTH_UNIT ( ) NAMED_UNIT ( * ) SI_UNIT ( $, .METRE. ) );
#514 = FACE_OUTER_BOUND ( 'NONE', #697, .T. ) ;
#515 = CARTESIAN_POINT ( 'NONE',  ( 0.2740686723808580250, -0.03242294869024800463, -0.04365099290345567096 ) ) ;
#516 = MECHANICAL_DESIGN_GEOMETRIC_PRESENTATION_REPRESENTATION (  '', ( #323 ), #603 ) ;
#517 = DIRECTION ( 'NONE',  ( -1.000000000000000000, -0.0000000000000000000, -0.0000000000000000000 ) ) ;
#518 = EDGE_CURVE ( 'NONE', #581, #608, #658, .T. ) ;
#519 = ORIENTED_EDGE ( 'NONE', *, *, #604, .T. ) ;
#520 = ORIENTED_EDGE ( 'NONE', *, *, #197, .T. ) ;
#521 = ORIENTED_EDGE ( 'NONE', *, *, #205, .T. ) ;
#522 = DIRECTION ( 'NONE',  ( 0.0000000000000000000, 0.0000000000000000000, 1.000000000000000000 ) ) ;
#523 = EDGE_CURVE ( 'NONE', #66, #350, #319, .T. ) ;
#524 = AXIS2_PLACEMENT_3D ( 'NONE', #240, #688, #17 ) ;
#525 = DIRECTION ( 'NONE',  ( 0.0000000000000000000, 0.0000000000000000000, 1.000000000000000000 ) ) ;
#526 = LINE ( 'NONE', #290, #380 ) ;
#527 = DIRECTION ( 'NONE',  ( 0.0000000000000000000, -1.000000000000000000, 0.0000000000000000000 ) ) ;
#528 = VERTEX_POINT ( 'NONE', #711 ) ;
#529 = EDGE_LOOP ( 'NONE', ( #519, #440, #547, #246 ) ) ;
#530 = CARTESIAN_POINT ( 'NONE',  ( 0.1293987993997751385, -0.03242294869024800463, -0.01415099290345643752 ) ) ;
#531 = CYLINDRICAL_SURFACE ( 'NONE', #164, 0.03049999999999957953 ) ;
#532 = EDGE_CURVE ( 'NONE', #271, #620, #305, .T. ) ;
#533 = CARTESIAN_POINT ( 'NONE',  ( 0.1200686723808574441, -0.001922948690248427054, -0.04365099290345567096 ) ) ;
#534 = ORIENTED_EDGE ( 'NONE', *, *, #276, .T. ) ;
#535 = CARTESIAN_POINT ( 'NONE',  ( 0.07306867238085860972, -0.03242294869024801851, -0.04365099290345567096 ) ) ;
#536 = EDGE_LOOP ( 'NONE', ( #375, #520, #664 ) ) ;
#537 = AXIS2_PLACEMENT_3D ( 'NONE', #5, #336, #12 ) ;
#538 = VERTEX_POINT ( 'NONE', #660 ) ;
#539 =( GEOMETRIC_REPRESENTATION_CONTEXT ( 3 ) GLOBAL_UNCERTAINTY_ASSIGNED_CONTEXT ( ( #221 ) ) GLOBAL_UNIT_ASSIGNED_CONTEXT ( ( #50, #437, #720 ) ) REPRESENTATION_CONTEXT ( 'NONE', 'WORKASPACE' ) );
#540 = DIRECTION ( 'NONE',  ( 2.510889700059065386E-16, 1.000000000000000000, 0.0000000000000000000 ) ) ;
#541 = VECTOR ( 'NONE', #508, 39.37007874015748143 ) ;
#542 = DIRECTION ( 'NONE',  ( -1.000000000000000000, -0.0000000000000000000, -0.0000000000000000000 ) ) ;
#543 = FACE_OUTER_BOUND ( 'NONE', #282, .T. ) ;
#544 = ORIENTED_EDGE ( 'NONE', *, *, #223, .F. ) ;
#545 = EDGE_LOOP ( 'NONE', ( #237, #433 ) ) ;
#546 = DIRECTION ( 'NONE',  ( 0.0000000000000000000, 0.0000000000000000000, 1.000000000000000000 ) ) ;
#547 = ORIENTED_EDGE ( 'NONE', *, *, #34, .F. ) ;
#548 = CIRCLE ( 'NONE', #474, 0.008500000000000000611 ) ;
#549 = AXIS2_PLACEMENT_3D ( 'NONE', #483, #267, #546 ) ;
#550 = CIRCLE ( 'NONE', #78, 0.03599999999999999728 ) ;
#551 = CARTESIAN_POINT ( 'NONE',  ( 0.2740686723808580250, -0.03242294869024800463, -0.01588304371102557122 ) ) ;
#552 = FACE_OUTER_BOUND ( 'NONE', #328, .T. ) ;
#553 = ORIENTED_EDGE ( 'NONE', *, *, #353, .T. ) ;
#554 = EDGE_CURVE ( 'NONE', #82, #342, #471, .T. ) ;
#555 = DIRECTION ( 'NONE',  ( 0.0000000000000000000, 0.0000000000000000000, 1.000000000000000000 ) ) ;
#556 = ORIENTED_EDGE ( 'NONE', *, *, #696, .T. ) ;
#557 = EDGE_LOOP ( 'NONE', ( #256, #238 ) ) ;
#558 = MANIFOLD_SOLID_BREP ( 'Imported1', #642 ) ;
#559 = FACE_BOUND ( 'NONE', #557, .T. ) ;
#560 = DIRECTION ( 'NONE',  ( 0.0000000000000000000, 0.0000000000000000000, 1.000000000000000000 ) ) ;
#561 = DIRECTION ( 'NONE',  ( -1.000000000000000000, -0.0000000000000000000, -0.0000000000000000000 ) ) ;
#562 = CARTESIAN_POINT ( 'NONE',  ( 0.1293987993997751385, -0.03242294869024800463, -0.01415099290345643752 ) ) ;
#563 = DIRECTION ( 'NONE',  ( -1.000000000000000000, -0.0000000000000000000, -0.0000000000000000000 ) ) ;
#564 = AXIS2_PLACEMENT_3D ( 'NONE', #625, #457, #509 ) ;
#565 = DIMENSIONAL_EXPONENTS ( 1.000000000000000000, 0.0000000000000000000, 0.0000000000000000000, 0.0000000000000000000, 0.0000000000000000000, 0.0000000000000000000, 0.0000000000000000000 ) ;
#566 = ORIENTED_EDGE ( 'NONE', *, *, #449, .F. ) ;
#567 = CARTESIAN_POINT ( 'NONE',  ( 0.1200686723808574441, -0.03242294869024800463, -0.01315099290345609316 ) ) ;
#568 = DIRECTION ( 'NONE',  ( 0.0000000000000000000, 0.0000000000000000000, -1.000000000000000000 ) ) ;
#569 = CYLINDRICAL_SURFACE ( 'NONE', #274, 0.03599999999999999728 ) ;
#570 = PLANE ( 'NONE',  #438 ) ;
#571 = FACE_OUTER_BOUND ( 'NONE', #294, .T. ) ;
#572 = EDGE_CURVE ( 'NONE', #271, #102, #444, .T. ) ;
#573 = DIRECTION ( 'NONE',  ( 0.0000000000000000000, 0.0000000000000000000, 1.000000000000000000 ) ) ;
#574 = DIRECTION ( 'NONE',  ( -1.000000000000000000, 1.836970198720974467E-16, -0.0000000000000000000 ) ) ;
#575 = ORIENTED_EDGE ( 'NONE', *, *, #489, .T. ) ;
#576 = EDGE_LOOP ( 'NONE', ( #410, #481, #589, #124 ) ) ;
#577 = AXIS2_PLACEMENT_3D ( 'NONE', #727, #506, #392 ) ;
#578 = AXIS2_PLACEMENT_3D ( 'NONE', #446, #397, #560 ) ;
#579 = PRODUCT_DEFINITION_SHAPE ( 'NONE', 'NONE',  #219 ) ;
#580 = CARTESIAN_POINT ( 'NONE',  ( 0.09206867238085761351, -0.03242294869024800463, -0.04365099290345567096 ) ) ;
#581 = VERTEX_POINT ( 'NONE', #442 ) ;
#582 = ORIENTED_EDGE ( 'NONE', *, *, #34, .T. ) ;
#583 = ORIENTED_EDGE ( 'NONE', *, *, #8, .F. ) ;
#584 = PRODUCT_CONTEXT ( 'NONE', #62, 'mechanical' ) ;
#585 = AXIS2_PLACEMENT_3D ( 'NONE', #470, #132, #85 ) ;
#586 = CYLINDRICAL_SURFACE ( 'NONE', #40, 0.008500000000000007550 ) ;
#587 = DIRECTION ( 'NONE',  ( -1.000000000000000000, -0.0000000000000000000, -0.0000000000000000000 ) ) ;
#588 = ORIENTED_EDGE ( 'NONE', *, *, #71, .T. ) ;
#589 = ORIENTED_EDGE ( 'NONE', *, *, #94, .F. ) ;
#590 = ORIENTED_EDGE ( 'NONE', *, *, #643, .F. ) ;
#591 = CARTESIAN_POINT ( 'NONE',  ( 0.1200686723808574441, -0.03242294869024800463, -0.07565099290345597693 ) ) ;
#592 = EDGE_CURVE ( 'NONE', #272, #311, #689, .T. ) ;
#593 = FACE_OUTER_BOUND ( 'NONE', #627, .T. ) ;
#594 = CARTESIAN_POINT ( 'NONE',  ( 0.1293987993997751385, -0.03242294869024800463, -0.07315099290345490612 ) ) ;
#595 = FACE_OUTER_BOUND ( 'NONE', #123, .T. ) ;
#596 = CIRCLE ( 'NONE', #436, 0.01149999999999995297 ) ;
#597 = CARTESIAN_POINT ( 'NONE',  ( 0.07606867238085855687, -0.03242294869024801851, -0.04365099290345567096 ) ) ;
#598 = ORIENTED_EDGE ( 'NONE', *, *, #252, .T. ) ;
#599 = AXIS2_PLACEMENT_3D ( 'NONE', #415, #295, #633 ) ;
#600 = SPHERICAL_SURFACE ( 'NONE', #270, 0.008500000000000000611 ) ;
#601 = CARTESIAN_POINT ( 'NONE',  ( 0.2740686723808585801, -0.03242294869024800463, -0.04365099290345567096 ) ) ;
#602 = CARTESIAN_POINT ( 'NONE',  ( 0.01556867238085832272, -0.02392294869024800749, -0.04365099290345567096 ) ) ;
#603 =( GEOMETRIC_REPRESENTATION_CONTEXT ( 3 ) GLOBAL_UNCERTAINTY_ASSIGNED_CONTEXT ( ( #250 ) ) GLOBAL_UNIT_ASSIGNED_CONTEXT ( ( #628, #289, #72 ) ) REPRESENTATION_CONTEXT ( 'NONE', 'WORKASPACE' ) );
#604 = EDGE_CURVE ( 'NONE', #722, #666, #723, .T. ) ;
#605 = FILL_AREA_STYLE_COLOUR ( '', #434 ) ;
#606 = TOROIDAL_SURFACE ( 'NONE', #231, 0.01149999999999995297, 0.002999999999999935878 ) ;
#607 = CARTESIAN_POINT ( 'NONE',  ( 0.09206867238085761351, -0.03242294869024800463, -0.04365099290345567096 ) ) ;
#608 = VERTEX_POINT ( 'NONE', #273 ) ;
#609 = DIRECTION ( 'NONE',  ( -1.000000000000000000, -0.0000000000000000000, -0.0000000000000000000 ) ) ;
#610 = FACE_OUTER_BOUND ( 'NONE', #57, .T. ) ;
#611 = DIRECTION ( 'NONE',  ( -1.000000000000000000, 0.0000000000000000000, -0.0000000000000000000 ) ) ;
#612 = FACE_OUTER_BOUND ( 'NONE', #462, .T. ) ;
#613 = CARTESIAN_POINT ( 'NONE',  ( 0.1200686723808574441, -0.03242294869024800463, -0.04365099290345567096 ) ) ;
#614 = AXIS2_PLACEMENT_3D ( 'NONE', #9, #232, #405 ) ;
#615 = AXIS2_PLACEMENT_3D ( 'NONE', #108, #561, #501 ) ;
#616 = VECTOR ( 'NONE', #391, 39.37007874015748143 ) ;
#617 = FILL_AREA_STYLE ('',( #605 ) ) ;
#618 = DIRECTION ( 'NONE',  ( -0.8660254037843234665, 6.123233995739209039E-17, -0.5000000000001995071 ) ) ;
#619 = ORIENTED_EDGE ( 'NONE', *, *, #292, .F. ) ;
#620 = VERTEX_POINT ( 'NONE', #490 ) ;
#621 = DIRECTION ( 'NONE',  ( -1.000000000000000000, -0.0000000000000000000, -0.0000000000000000000 ) ) ;
#622 = CYLINDRICAL_SURFACE ( 'NONE', #673, 0.02949999999999923517 ) ;
#623 = ADVANCED_FACE ( 'NONE', ( #214, #332 ), #326, .F. ) ;
#624 = CARTESIAN_POINT ( 'NONE',  ( 0.07306867238085862359, -0.03242294869024801851, -0.04365099290345567096 ) ) ;
#625 = CARTESIAN_POINT ( 'NONE',  ( 0.1200686723808574441, -0.03242294869024800463, -0.04365099290345567096 ) ) ;
#626 = AXIS2_PLACEMENT_3D ( 'NONE', #218, #676, #568 ) ;
#627 = EDGE_LOOP ( 'NONE', ( #283, #146, #224, #705 ) ) ;
#628 =( CONVERSION_BASED_UNIT ( 'INCH', #456 ) LENGTH_UNIT ( ) NAMED_UNIT ( #13 ) );
#629 = ORIENTED_EDGE ( 'NONE', *, *, #360, .F. ) ;
#630 = ADVANCED_FACE ( 'NONE', ( #610 ), #369, .T. ) ;
#631 = DIRECTION ( 'NONE',  ( -1.000000000000000000, -0.0000000000000000000, -0.0000000000000000000 ) ) ;
#632 = DIRECTION ( 'NONE',  ( -1.255444850029531707E-16, -1.000000000000000000, 0.0000000000000000000 ) ) ;
#633 = DIRECTION ( 'NONE',  ( 0.0000000000000000000, -0.1396333460903131096, 0.9902032764334921522 ) ) ;
#634 = CARTESIAN_POINT ( 'NONE',  ( 0.07606867238085757155, -0.03242294869024801851, -0.06540099290345234573 ) ) ;
#635 = VERTEX_POINT ( 'NONE', #659 ) ;
#636 = ORIENTED_EDGE ( 'NONE', *, *, #478, .F. ) ;
#637 = FACE_OUTER_BOUND ( 'NONE', #529, .T. ) ;
#638 = PRODUCT ( 'mill-max-$PARTNUMBER', 'mill-max-$PARTNUMBER', '', ( #584 ) ) ;
#639 = AXIS2_PLACEMENT_3D ( 'NONE', #125, #175, #171 ) ;
#640 = CARTESIAN_POINT ( 'NONE',  ( 0.2740686723808585801, -0.03242294869024800463, -0.04365099290345567096 ) ) ;
#641 = DIRECTION ( 'NONE',  ( 0.0000000000000000000, 0.0000000000000000000, 1.000000000000000000 ) ) ;
#642 = CLOSED_SHELL ( 'NONE', ( #484, #65, #683, #320, #173, #495, #347, #667, #338, #43, #623, #212, #512, #630, #373, #459, #653, #19, #384, #662, #670, #259, #47, #721, #288, #428 ) ) ;
#643 = EDGE_CURVE ( 'NONE', #528, #58, #192, .T. ) ;
#644 = CARTESIAN_POINT ( 'NONE',  ( 0.07606867238085757155, -0.03242294869024800463, -0.04365099290345567096 ) ) ;
#645 = AXIS2_PLACEMENT_3D ( 'NONE', #208, #611, #206 ) ;
#646 = FACE_OUTER_BOUND ( 'NONE', #715, .T. ) ;
#647 = DIRECTION ( 'NONE',  ( -1.000000000000000000, 0.0000000000000000000, 0.0000000000000000000 ) ) ;
#648 = CIRCLE ( 'NONE', #430, 0.03599999999999999728 ) ;
#649 = ORIENTED_EDGE ( 'NONE', *, *, #325, .F. ) ;
#650 = AXIS2_PLACEMENT_3D ( 'NONE', #698, #32, #527 ) ;
#651 = LINE ( 'NONE', #314, #180 ) ;
#652 = DIRECTION ( 'NONE',  ( 0.0000000000000000000, 0.0000000000000000000, -1.000000000000000000 ) ) ;
#653 = ADVANCED_FACE ( 'NONE', ( #514, #367 ), #497, .F. ) ;
#654 = CARTESIAN_POINT ( 'NONE',  ( 0.07606867238085855687, -0.04392294869024797321, -0.04365099290345567096 ) ) ;
#655 = DIRECTION ( 'NONE',  ( -1.000000000000000000, 1.836970198720974467E-16, -0.0000000000000000000 ) ) ;
#656 = ORIENTED_EDGE ( 'NONE', *, *, #71, .F. ) ;
#657 = ORIENTED_EDGE ( 'NONE', *, *, #89, .T. ) ;
#658 = LINE ( 'NONE', #551, #248 ) ;
#659 = CARTESIAN_POINT ( 'NONE',  ( 0.07606867238085855687, -0.02092294869024806728, -0.04365099290345567096 ) ) ;
#660 = CARTESIAN_POINT ( 'NONE',  ( 0.07306867238085860972, -0.04092294869024803300, -0.04365099290345567096 ) ) ;
#661 = LINE ( 'NONE', #166, #541 ) ;
#662 = ADVANCED_FACE ( 'NONE', ( #552 ), #75, .T. ) ;
#663 = EDGE_CURVE ( 'NONE', #255, #177, #111, .T. ) ;
#664 = ORIENTED_EDGE ( 'NONE', *, *, #56, .F. ) ;
#665 = ORIENTED_EDGE ( 'NONE', *, *, #407, .T. ) ;
#666 = VERTEX_POINT ( 'NONE', #675 ) ;
#667 = ADVANCED_FACE ( 'NONE', ( #207 ), #120, .T. ) ;
#668 = CARTESIAN_POINT ( 'NONE',  ( 0.007068672380858123487, -0.03242294869024800463, -0.04365099290345567096 ) ) ;
#669 = DIRECTION ( 'NONE',  ( -1.000000000000000000, 0.0000000000000000000, -0.0000000000000000000 ) ) ;
#670 = ADVANCED_FACE ( 'NONE', ( #646 ), #570, .F. ) ;
#671 = DIRECTION ( 'NONE',  ( 0.0000000000000000000, -0.1396333460903128321, 0.9902032764334921522 ) ) ;
#672 = DIRECTION ( 'NONE',  ( 1.000000000000000000, 0.0000000000000000000, 0.0000000000000000000 ) ) ;
#673 = AXIS2_PLACEMENT_3D ( 'NONE', #184, #36, #181 ) ;
#674 = CIRCLE ( 'NONE', #599, 0.002499999999999998751 ) ;
#675 = CARTESIAN_POINT ( 'NONE',  ( 0.1200686723808574441, -0.03242294869024800463, -0.07415099290345525396 ) ) ;
#676 = DIRECTION ( 'NONE',  ( 1.000000000000000000, 0.0000000000000000000, 0.0000000000000000000 ) ) ;
#677 = ORIENTED_EDGE ( 'NONE', *, *, #523, .F. ) ;
#678 = ORIENTED_EDGE ( 'NONE', *, *, #691, .F. ) ;
#679 = FILL_AREA_STYLE ('',( #287 ) ) ;
#680 = CONICAL_SURFACE ( 'NONE', #585, 0.002499999999999998751, 0.6457718232378963918 ) ;
#681 = EDGE_CURVE ( 'NONE', #3, #342, #661, .T. ) ;
#682 = DIRECTION ( 'NONE',  ( -1.000000000000000000, -0.0000000000000000000, -0.0000000000000000000 ) ) ;
#683 = ADVANCED_FACE ( 'NONE', ( #595 ), #298, .F. ) ;
#684 = LINE ( 'NONE', #726, #616 ) ;
#685 = CARTESIAN_POINT ( 'NONE',  ( 0.2710686723808591880, -0.03242294869024800463, -0.04365099290345567096 ) ) ;
#686 = ORIENTED_EDGE ( 'NONE', *, *, #422, .T. ) ;
#687 = VERTEX_POINT ( 'NONE', #395 ) ;
#688 = DIRECTION ( 'NONE',  ( -1.000000000000000000, -0.0000000000000000000, -0.0000000000000000000 ) ) ;
#689 = CIRCLE ( 'NONE', #465, 0.03200000000000029904 ) ;
#690 = CARTESIAN_POINT ( 'NONE',  ( 0.5070686723808585095, -0.03242294869024800463, -0.04365099290345567096 ) ) ;
#691 = EDGE_CURVE ( 'NONE', #666, #302, #345, .T. ) ;
#692 = CIRCLE ( 'NONE', #577, 0.02089999999999972782 ) ;
#693 = DIRECTION ( 'NONE',  ( -1.000000000000000000, -0.0000000000000000000, -0.0000000000000000000 ) ) ;
#694 = CIRCLE ( 'NONE', #110, 0.008500000000000000611 ) ;
#695 = DIRECTION ( 'NONE',  ( -1.000000000000000000, -0.0000000000000000000, -0.0000000000000000000 ) ) ;
#696 = EDGE_CURVE ( 'NONE', #52, #538, #464, .T. ) ;
#697 = EDGE_LOOP ( 'NONE', ( #583, #544 ) ) ;
#698 = CARTESIAN_POINT ( 'NONE',  ( 0.07306867238085862359, -0.02092294869024806728, -0.04365099290345567096 ) ) ;
#699 = FACE_OUTER_BOUND ( 'NONE', #315, .T. ) ;
#700 = CONICAL_SURFACE ( 'NONE', #331, 0.002499999999999998751, 0.6457718232378963918 ) ;
#701 = AXIS2_PLACEMENT_3D ( 'NONE', #161, #563, #113 ) ;
#702 = DIRECTION ( 'NONE',  ( 0.0000000000000000000, 0.0000000000000000000, 1.000000000000000000 ) ) ;
#703 = CARTESIAN_POINT ( 'NONE',  ( 0.01556867238085831925, -0.03242294869024800463, -0.04365099290345567096 ) ) ;
#704 = CYLINDRICAL_SURFACE ( 'NONE', #98, 0.03599999999999999728 ) ;
#705 = ORIENTED_EDGE ( 'NONE', *, *, #708, .F. ) ;
#706 = CARTESIAN_POINT ( 'NONE',  ( 0.07606867238085757155, -0.03242294869024800463, -0.04365099290345567096 ) ) ;
#707 = ORIENTED_EDGE ( 'NONE', *, *, #518, .F. ) ;
#708 = EDGE_CURVE ( 'NONE', #102, #687, #692, .T. ) ;
#709 = CIRCLE ( 'NONE', #200, 0.01149999999999995297 ) ;
#710 = DIRECTION ( 'NONE',  ( 0.0000000000000000000, -1.000000000000000000, 0.0000000000000000000 ) ) ;
#711 = CARTESIAN_POINT ( 'NONE',  ( 0.09206867238085761351, -0.03242294869024800463, -0.007650992903455674544 ) ) ;
#712 = EDGE_LOOP ( 'NONE', ( #656, #686, #247, #357 ) ) ;
#713 = EDGE_LOOP ( 'NONE', ( #677, #106, #263, #203 ) ) ;
#714 = AXIS2_PLACEMENT_3D ( 'NONE', #61, #517, #522 ) ;
#715 = EDGE_LOOP ( 'NONE', ( #400, #398 ) ) ;
#716 = FACE_OUTER_BOUND ( 'NONE', #453, .T. ) ;
#717 = CIRCLE ( 'NONE', #258, 0.03599999999999999728 ) ;
#718 = DIRECTION ( 'NONE',  ( 0.0000000000000000000, -0.1396333460903131096, 0.9902032764334921522 ) ) ;
#719 = DIRECTION ( 'NONE',  ( -1.000000000000000000, 0.0000000000000000000, -0.0000000000000000000 ) ) ;
#720 =( NAMED_UNIT ( * ) SI_UNIT ( $, .STERADIAN. ) SOLID_ANGLE_UNIT ( ) );
#721 = ADVANCED_FACE ( 'NONE', ( #612 ), #479, .T. ) ;
#722 = VERTEX_POINT ( 'NONE', #567 ) ;
#723 = CIRCLE ( 'NONE', #11, 0.03049999999999957953 ) ;
#724 = CARTESIAN_POINT ( 'NONE',  ( 0.1293987993997751385, -0.03242294869024800463, -0.04365099290345567096 ) ) ;
#725 = DIRECTION ( 'NONE',  ( -1.000000000000000000, -0.0000000000000000000, -0.0000000000000000000 ) ) ;
#726 = CARTESIAN_POINT ( 'NONE',  ( 0.5070686723808585095, -0.03277203205547379178, -0.04117548471237194446 ) ) ;
#727 = CARTESIAN_POINT ( 'NONE',  ( 0.4826510476630430646, -0.03242294869024800463, -0.04365099290345567096 ) ) ;
ENDSEC;
END-ISO-10303-21;
