ISO-10303-21;
HEADER;
FILE_DESCRIPTION(('STEP AP214'),'1');
FILE_NAME('LGA-16_3x3x1mm_STM','2023-04-02T15:20:00',(''),(''),'','','');
FILE_SCHEMA(('AUTOMOTIVE_DESIGN'));
ENDSEC;
DATA;
#1=SHAPE_DEFINITION_REPRESENTATION(#2,#3);
#2=PRODUCT_DEFINITION_SHAPE('',$,#4);
#3=SHAPE_REPRESENTATION('',(#71,#127,#423,#719,#1015,#1311,#1607,#1903,#2199,#2495,#2791,#3087,#3383,#3679,#3975,#4271,#4567,#4863,#19),#11);
#4=PRODUCT_DEFINITION('design','example product_definition',#6,#5);
#5=PRODUCT_DEFINITION_CONTEXT('3D Mechanical Parts',#10,'design');
#6=PRODUCT_DEFINITION_FORMATION('1.0','first version',#8);
#7=APPLICATION_PROTOCOL_DEFINITION('international standard','automotive_design',2003,#10);
#8=PRODUCT('product','part','',(#9));
#9=PRODUCT_CONTEXT('3D Mechanical Parts',#10,'mechanical');
#10=APPLICATION_CONTEXT('Core Data for Automotive Mechanical Design Process');
#11=(GEOMETRIC_REPRESENTATION_CONTEXT(3) GLOBAL_UNCERTAINTY_ASSIGNED_CONTEXT((#12)) GLOBAL_UNIT_ASSIGNED_CONTEXT((#13,#14,#18)) REPRESENTATION_CONTEXT('ID1','3D'));
#12=UNCERTAINTY_MEASURE_WITH_UNIT(LENGTH_MEASURE(1.E-005),#13,'DISTANCE_ACCURACY_VALUE','Maximum model space distance between geometric entities at asserted connectivities');
#13=(LENGTH_UNIT() NAMED_UNIT(*) SI_UNIT(.MILLI.,.METRE.));
#14=(CONVERSION_BASED_UNIT('degree',#16) NAMED_UNIT(#15) PLANE_ANGLE_UNIT());
#15=DIMENSIONAL_EXPONENTS(0.,0.,0.,0.,0.,0.,0.);
#16=MEASURE_WITH_UNIT(PLANE_ANGLE_MEASURE(0.01745329252),#17);
#17=(NAMED_UNIT(*) PLANE_ANGLE_UNIT() SI_UNIT($,.RADIAN.));
#18=(NAMED_UNIT(*) SI_UNIT($,.STERADIAN.) SOLID_ANGLE_UNIT());
#19=AXIS2_PLACEMENT_3D('',#20,#21,#22);
#20=CARTESIAN_POINT('',(0.0,0.0,0.0));
#21=DIRECTION('',(0.0,0.0,1.0));
#22=DIRECTION('',(1.0,0.0,0.0));
#25=MECHANICAL_DESIGN_GEOMETRIC_PRESENTATION_REPRESENTATION($,(#123,#124,#125,#129,#178,#227,#276,#325,#374,#425,#474,#523,#572,#621,#670,#721,#770,#819,#868,#917,#966,#1017,#1066,#1115,#1164,#1213,#1262,#1313,#1362,#1411,#1460,#1509,#1558,#1609,#1658,#1707,#1756,#1805,#1854,#1905,#1954,#2003,#2052,#2101,#2150,#2201,#2250,#2299,#2348,#2397,#2446,#2497,#2546,#2595,#2644,#2693,#2742,#2793,#2842,#2891,#2940,#2989,#3038,#3089,#3138,#3187,#3236,#3285,#3334,#3385,#3434,#3483,#3532,#3581,#3630,#3681,#3730,#3779,#3828,#3877,#3926,#3977,#4026,#4075,#4124,#4173,#4222,#4273,#4322,#4371,#4420,#4469,#4518,#4569,#4618,#4667,#4716,#4765,#4814,#4865,#4914,#4963,#5012,#5061,#5110),#11);
#26=PRODUCT_CATEGORY_RELATIONSHIP('','',#27,#28);
#27=PRODUCT_CATEGORY('part','');
#28=PRODUCT_RELATED_PRODUCT_CATEGORY('','',(#8));
#34=PRESENTATION_STYLE_ASSIGNMENT((#35,#40));
#35=SURFACE_STYLE_USAGE(.BOTH.,#36);
#36=SURFACE_SIDE_STYLE('',(#37));
#37=SURFACE_STYLE_FILL_AREA(#38);
#38=FILL_AREA_STYLE('',(#39));
#39=FILL_AREA_STYLE_COLOUR('',#41);
#40=CURVE_STYLE('',#42,POSITIVE_LENGTH_MEASURE(0.1),#41);
#41=COLOUR_RGB('Aluminum',0.725,0.725,0.725);
#42=DRAUGHTING_PRE_DEFINED_CURVE_FONT('continuous');
#43=PRESENTATION_STYLE_ASSIGNMENT((#44,#49));
#44=SURFACE_STYLE_USAGE(.BOTH.,#45);
#45=SURFACE_SIDE_STYLE('',(#46));
#46=SURFACE_STYLE_FILL_AREA(#47);
#47=FILL_AREA_STYLE('',(#48));
#48=FILL_AREA_STYLE_COLOUR('',#50);
#49=CURVE_STYLE('',#51,POSITIVE_LENGTH_MEASURE(0.1),#50);
#50=COLOUR_RGB('Black',0.196,0.196,0.196);
#51=DRAUGHTING_PRE_DEFINED_CURVE_FONT('continuous');
#52=PRESENTATION_STYLE_ASSIGNMENT((#53,#58));
#53=SURFACE_STYLE_USAGE(.BOTH.,#54);
#54=SURFACE_SIDE_STYLE('',(#55));
#55=SURFACE_STYLE_FILL_AREA(#56);
#56=FILL_AREA_STYLE('',(#57));
#57=FILL_AREA_STYLE_COLOUR('',#59);
#58=CURVE_STYLE('',#60,POSITIVE_LENGTH_MEASURE(0.1),#59);
#59=COLOUR_RGB('Pin1',0.588,0.588,0.588);
#60=DRAUGHTING_PRE_DEFINED_CURVE_FONT('continuous');
#61=PRESENTATION_STYLE_ASSIGNMENT((#62,#67));
#62=SURFACE_STYLE_USAGE(.BOTH.,#63);
#63=SURFACE_SIDE_STYLE('',(#64));
#64=SURFACE_STYLE_FILL_AREA(#65);
#65=FILL_AREA_STYLE('',(#66));
#66=FILL_AREA_STYLE_COLOUR('',#68);
#67=CURVE_STYLE('',#69,POSITIVE_LENGTH_MEASURE(0.1),#68);
#68=COLOUR_RGB('HeatTab',0.588,0.588,0.588);
#69=DRAUGHTING_PRE_DEFINED_CURVE_FONT('continuous');
#71=MANIFOLD_SOLID_BREP($,#72);
#72=CLOSED_SHELL('',(#73,#74,#75));
#73=ADVANCED_FACE($,(#79,#78),#96,.T.);
#74=ADVANCED_FACE($,(#80),#76,.F.);
#75=ADVANCED_FACE($,(#81),#77,.T.);
#76=PLANE($,#101);
#77=PLANE($,#102);
#78=FACE_BOUND($,#83,.T.);
#79=FACE_OUTER_BOUND($,#82,.T.);
#80=FACE_OUTER_BOUND($,#84,.T.);
#81=FACE_OUTER_BOUND($,#85,.T.);
#82=EDGE_LOOP($,(#92));
#83=EDGE_LOOP($,(#93));
#84=EDGE_LOOP($,(#94));
#85=EDGE_LOOP($,(#95));
#86=CIRCLE($,#99,0.07874);
#87=CIRCLE($,#100,0.07874);
#88=VERTEX_POINT('',#117);
#89=VERTEX_POINT('',#119);
#90=EDGE_CURVE($,#88,#88,#86,.T.);
#91=EDGE_CURVE($,#89,#89,#87,.T.);
#92=ORIENTED_EDGE($,*,*,#90,.F.);
#93=ORIENTED_EDGE($,*,*,#91,.F.);
#94=ORIENTED_EDGE($,*,*,#91,.T.);
#95=ORIENTED_EDGE($,*,*,#90,.T.);
#96=CYLINDRICAL_SURFACE($,#98,0.07874);
#97=AXIS2_PLACEMENT_3D('placement',#115,#103,#104);
#98=AXIS2_PLACEMENT_3D($,#116,#105,#106);
#99=AXIS2_PLACEMENT_3D($,#118,#107,#108);
#100=AXIS2_PLACEMENT_3D($,#120,#109,#110);
#101=AXIS2_PLACEMENT_3D($,#121,#111,#112);
#102=AXIS2_PLACEMENT_3D($,#122,#113,#114);
#103=DIRECTION('axis',(0.,1.,0.));
#104=DIRECTION('refdir',(1.,0.,0.));
#105=DIRECTION('',(0.,0.,1.));
#106=DIRECTION('',(1.,0.,0.));
#107=DIRECTION('',(0.,0.,1.));
#108=DIRECTION('',(1.,0.,0.));
#109=DIRECTION('',(0.,0.,-1.));
#110=DIRECTION('',(1.,0.,0.));
#111=DIRECTION('',(0.,0.,1.));
#112=DIRECTION('',(0.,1.,0.));
#113=DIRECTION('',(0.,0.,1.));
#114=DIRECTION('',(0.,1.,0.));
#115=CARTESIAN_POINT('',(0.,0.,0.));
#116=CARTESIAN_POINT('',(-1.26,1.0,0.991));
#117=CARTESIAN_POINT('',(-1.339,1.0,0.993));
#118=CARTESIAN_POINT('',(-1.26,1.0,0.993));
#119=CARTESIAN_POINT('',(-1.339,1.0,0.991));
#120=CARTESIAN_POINT('',(-1.26,1.0,0.991));
#121=CARTESIAN_POINT('',(-1.26,1.0,0.991));
#122=CARTESIAN_POINT('',(-1.26,1.0,0.993));
#123=STYLED_ITEM('color',(#52),#73);
#124=STYLED_ITEM('color',(#52),#74);
#125=STYLED_ITEM('color',(#52),#75);
#127=MANIFOLD_SOLID_BREP($,#128);
#128=CLOSED_SHELL('',(#130,#179,#228,#277,#326,#375));
#129=STYLED_ITEM('',(#43),#130);
#130=ADVANCED_FACE('',(#136),#131,.T.);
#131=PLANE('',#132);
#132=AXIS2_PLACEMENT_3D('',#133,#134,#135);
#133=CARTESIAN_POINT('',(-1.575,-1.575,0.051));
#134=DIRECTION('',(0.0,-1.0,0.0));
#135=DIRECTION('',(0.,0.,1.));
#136=FACE_OUTER_BOUND('',#137,.T.);
#137=EDGE_LOOP('',(#138,#148,#158,#168));
#141=CARTESIAN_POINT('',(1.575,-1.575,0.051));
#140=VERTEX_POINT('',#141);
#143=CARTESIAN_POINT('',(-1.575,-1.575,0.051));
#142=VERTEX_POINT('',#143);
#139=EDGE_CURVE('',#140,#142,#144,.T.);
#144=LINE('',#141,#146);
#146=VECTOR('',#147,3.1496);
#147=DIRECTION('',(-1.0,0.0,0.0));
#138=ORIENTED_EDGE('',*,*,#139,.F.);
#151=CARTESIAN_POINT('',(1.575,-1.575,0.991));
#150=VERTEX_POINT('',#151);
#149=EDGE_CURVE('',#150,#140,#154,.T.);
#154=LINE('',#151,#156);
#156=VECTOR('',#157,0.9397746);
#157=DIRECTION('',(0.0,0.0,-1.0));
#148=ORIENTED_EDGE('',*,*,#149,.F.);
#161=CARTESIAN_POINT('',(-1.575,-1.575,0.991));
#160=VERTEX_POINT('',#161);
#159=EDGE_CURVE('',#160,#150,#164,.T.);
#164=LINE('',#161,#166);
#166=VECTOR('',#167,3.1496);
#167=DIRECTION('',(1.0,0.0,0.0));
#158=ORIENTED_EDGE('',*,*,#159,.F.);
#169=EDGE_CURVE('',#142,#160,#174,.T.);
#174=LINE('',#143,#176);
#176=VECTOR('',#177,0.9397746);
#177=DIRECTION('',(0.0,0.0,1.0));
#168=ORIENTED_EDGE('',*,*,#169,.F.);
#178=STYLED_ITEM('',(#43),#179);
#179=ADVANCED_FACE('',(#185),#180,.T.);
#180=PLANE('',#181);
#181=AXIS2_PLACEMENT_3D('',#182,#183,#184);
#182=CARTESIAN_POINT('',(1.575,-1.575,0.051));
#183=DIRECTION('',(1.0,0.0,0.0));
#184=DIRECTION('',(0.,0.,1.));
#185=FACE_OUTER_BOUND('',#186,.T.);
#186=EDGE_LOOP('',(#187,#197,#207,#217));
#190=CARTESIAN_POINT('',(1.575,1.575,0.051));
#189=VERTEX_POINT('',#190);
#188=EDGE_CURVE('',#189,#140,#193,.T.);
#193=LINE('',#190,#195);
#195=VECTOR('',#196,3.1496);
#196=DIRECTION('',(0.0,-1.0,0.0));
#187=ORIENTED_EDGE('',*,*,#188,.F.);
#200=CARTESIAN_POINT('',(1.575,1.575,0.991));
#199=VERTEX_POINT('',#200);
#198=EDGE_CURVE('',#199,#189,#203,.T.);
#203=LINE('',#200,#205);
#205=VECTOR('',#206,0.9397746);
#206=DIRECTION('',(0.0,0.0,-1.0));
#197=ORIENTED_EDGE('',*,*,#198,.F.);
#208=EDGE_CURVE('',#150,#199,#213,.T.);
#213=LINE('',#151,#215);
#215=VECTOR('',#216,3.1496);
#216=DIRECTION('',(0.0,1.0,0.0));
#207=ORIENTED_EDGE('',*,*,#208,.F.);
#217=ORIENTED_EDGE('',*,*,#149,.T.);
#227=STYLED_ITEM('',(#43),#228);
#228=ADVANCED_FACE('',(#234),#229,.T.);
#229=PLANE('',#230);
#230=AXIS2_PLACEMENT_3D('',#231,#232,#233);
#231=CARTESIAN_POINT('',(1.575,1.575,0.051));
#232=DIRECTION('',(0.0,1.0,0.0));
#233=DIRECTION('',(0.,0.,1.));
#234=FACE_OUTER_BOUND('',#235,.T.);
#235=EDGE_LOOP('',(#236,#246,#256,#266));
#239=CARTESIAN_POINT('',(-1.575,1.575,0.051));
#238=VERTEX_POINT('',#239);
#237=EDGE_CURVE('',#238,#189,#242,.T.);
#242=LINE('',#239,#244);
#244=VECTOR('',#245,3.1496);
#245=DIRECTION('',(1.0,0.0,0.0));
#236=ORIENTED_EDGE('',*,*,#237,.F.);
#249=CARTESIAN_POINT('',(-1.575,1.575,0.991));
#248=VERTEX_POINT('',#249);
#247=EDGE_CURVE('',#248,#238,#252,.T.);
#252=LINE('',#249,#254);
#254=VECTOR('',#255,0.9397746);
#255=DIRECTION('',(0.0,0.0,-1.0));
#246=ORIENTED_EDGE('',*,*,#247,.F.);
#257=EDGE_CURVE('',#199,#248,#262,.T.);
#262=LINE('',#200,#264);
#264=VECTOR('',#265,3.1496);
#265=DIRECTION('',(-1.0,0.0,0.0));
#256=ORIENTED_EDGE('',*,*,#257,.F.);
#266=ORIENTED_EDGE('',*,*,#198,.T.);
#276=STYLED_ITEM('',(#43),#277);
#277=ADVANCED_FACE('',(#283),#278,.T.);
#278=PLANE('',#279);
#279=AXIS2_PLACEMENT_3D('',#280,#281,#282);
#280=CARTESIAN_POINT('',(-1.575,1.575,0.051));
#281=DIRECTION('',(-1.0,0.0,0.0));
#282=DIRECTION('',(0.,0.,1.));
#283=FACE_OUTER_BOUND('',#284,.T.);
#284=EDGE_LOOP('',(#285,#295,#305,#315));
#286=EDGE_CURVE('',#142,#238,#291,.T.);
#291=LINE('',#143,#293);
#293=VECTOR('',#294,3.1496);
#294=DIRECTION('',(0.0,1.0,0.0));
#285=ORIENTED_EDGE('',*,*,#286,.F.);
#295=ORIENTED_EDGE('',*,*,#169,.T.);
#306=EDGE_CURVE('',#248,#160,#311,.T.);
#311=LINE('',#249,#313);
#313=VECTOR('',#314,3.1496);
#314=DIRECTION('',(0.0,-1.0,0.0));
#305=ORIENTED_EDGE('',*,*,#306,.F.);
#315=ORIENTED_EDGE('',*,*,#247,.T.);
#325=STYLED_ITEM('',(#43),#326);
#326=ADVANCED_FACE('',(#332),#327,.T.);
#327=PLANE('',#328);
#328=AXIS2_PLACEMENT_3D('',#329,#330,#331);
#329=CARTESIAN_POINT('',(-1.575,1.575,0.051));
#330=DIRECTION('',(0.0,0.0,-1.0));
#331=DIRECTION('',(0.,1.,0.));
#332=FACE_OUTER_BOUND('',#333,.T.);
#333=EDGE_LOOP('',(#334,#344,#354,#364));
#334=ORIENTED_EDGE('',*,*,#237,.T.);
#344=ORIENTED_EDGE('',*,*,#188,.T.);
#354=ORIENTED_EDGE('',*,*,#139,.T.);
#364=ORIENTED_EDGE('',*,*,#286,.T.);
#374=STYLED_ITEM('',(#43),#375);
#375=ADVANCED_FACE('',(#381),#376,.T.);
#376=PLANE('',#377);
#377=AXIS2_PLACEMENT_3D('',#378,#379,#380);
#378=CARTESIAN_POINT('',(-1.575,-1.575,0.991));
#379=DIRECTION('',(0.0,0.0,1.0));
#380=DIRECTION('',(0.,1.,0.));
#381=FACE_OUTER_BOUND('',#382,.T.);
#382=EDGE_LOOP('',(#383,#393,#403,#413));
#383=ORIENTED_EDGE('',*,*,#159,.T.);
#393=ORIENTED_EDGE('',*,*,#208,.T.);
#403=ORIENTED_EDGE('',*,*,#257,.T.);
#413=ORIENTED_EDGE('',*,*,#306,.T.);
#423=MANIFOLD_SOLID_BREP($,#424);
#424=CLOSED_SHELL('',(#426,#475,#524,#573,#622,#671));
#425=STYLED_ITEM('',(#34),#426);
#426=ADVANCED_FACE('',(#432),#427,.T.);
#427=PLANE('',#428);
#428=AXIS2_PLACEMENT_3D('',#429,#430,#431);
#429=CARTESIAN_POINT('',(1.168,0.873,0.0));
#430=DIRECTION('',(0.0,-1.0,0.0));
#431=DIRECTION('',(0.,0.,1.));
#432=FACE_OUTER_BOUND('',#433,.T.);
#433=EDGE_LOOP('',(#434,#444,#454,#464));
#437=CARTESIAN_POINT('',(1.524,0.873,0.0));
#436=VERTEX_POINT('',#437);
#439=CARTESIAN_POINT('',(1.168,0.873,0.0));
#438=VERTEX_POINT('',#439);
#435=EDGE_CURVE('',#436,#438,#440,.T.);
#440=LINE('',#437,#442);
#442=VECTOR('',#443,0.3556);
#443=DIRECTION('',(-1.0,0.0,0.0));
#434=ORIENTED_EDGE('',*,*,#435,.F.);
#447=CARTESIAN_POINT('',(1.524,0.873,0.051));
#446=VERTEX_POINT('',#447);
#445=EDGE_CURVE('',#446,#436,#450,.T.);
#450=LINE('',#447,#452);
#452=VECTOR('',#453,0.0508);
#453=DIRECTION('',(0.0,0.0,-1.0));
#444=ORIENTED_EDGE('',*,*,#445,.F.);
#457=CARTESIAN_POINT('',(1.168,0.873,0.051));
#456=VERTEX_POINT('',#457);
#455=EDGE_CURVE('',#456,#446,#460,.T.);
#460=LINE('',#457,#462);
#462=VECTOR('',#463,0.3556);
#463=DIRECTION('',(1.0,0.0,0.0));
#454=ORIENTED_EDGE('',*,*,#455,.F.);
#465=EDGE_CURVE('',#438,#456,#470,.T.);
#470=LINE('',#439,#472);
#472=VECTOR('',#473,0.0508);
#473=DIRECTION('',(0.0,0.0,1.0));
#464=ORIENTED_EDGE('',*,*,#465,.F.);
#474=STYLED_ITEM('',(#34),#475);
#475=ADVANCED_FACE('',(#481),#476,.T.);
#476=PLANE('',#477);
#477=AXIS2_PLACEMENT_3D('',#478,#479,#480);
#478=CARTESIAN_POINT('',(1.524,0.873,0.0));
#479=DIRECTION('',(1.0,0.0,0.0));
#480=DIRECTION('',(0.,0.,1.));
#481=FACE_OUTER_BOUND('',#482,.T.);
#482=EDGE_LOOP('',(#483,#493,#503,#513));
#486=CARTESIAN_POINT('',(1.524,1.127,0.0));
#485=VERTEX_POINT('',#486);
#484=EDGE_CURVE('',#485,#436,#489,.T.);
#489=LINE('',#486,#491);
#491=VECTOR('',#492,0.254);
#492=DIRECTION('',(0.0,-1.0,0.0));
#483=ORIENTED_EDGE('',*,*,#484,.F.);
#496=CARTESIAN_POINT('',(1.524,1.127,0.051));
#495=VERTEX_POINT('',#496);
#494=EDGE_CURVE('',#495,#485,#499,.T.);
#499=LINE('',#496,#501);
#501=VECTOR('',#502,0.0508);
#502=DIRECTION('',(0.0,0.0,-1.0));
#493=ORIENTED_EDGE('',*,*,#494,.F.);
#504=EDGE_CURVE('',#446,#495,#509,.T.);
#509=LINE('',#447,#511);
#511=VECTOR('',#512,0.254);
#512=DIRECTION('',(0.0,1.0,0.0));
#503=ORIENTED_EDGE('',*,*,#504,.F.);
#513=ORIENTED_EDGE('',*,*,#445,.T.);
#523=STYLED_ITEM('',(#34),#524);
#524=ADVANCED_FACE('',(#530),#525,.T.);
#525=PLANE('',#526);
#526=AXIS2_PLACEMENT_3D('',#527,#528,#529);
#527=CARTESIAN_POINT('',(1.524,1.127,0.0));
#528=DIRECTION('',(0.0,1.0,0.0));
#529=DIRECTION('',(0.,0.,1.));
#530=FACE_OUTER_BOUND('',#531,.T.);
#531=EDGE_LOOP('',(#532,#542,#552,#562));
#535=CARTESIAN_POINT('',(1.168,1.127,0.0));
#534=VERTEX_POINT('',#535);
#533=EDGE_CURVE('',#534,#485,#538,.T.);
#538=LINE('',#535,#540);
#540=VECTOR('',#541,0.3556);
#541=DIRECTION('',(1.0,0.0,0.0));
#532=ORIENTED_EDGE('',*,*,#533,.F.);
#545=CARTESIAN_POINT('',(1.168,1.127,0.051));
#544=VERTEX_POINT('',#545);
#543=EDGE_CURVE('',#544,#534,#548,.T.);
#548=LINE('',#545,#550);
#550=VECTOR('',#551,0.0508);
#551=DIRECTION('',(0.0,0.0,-1.0));
#542=ORIENTED_EDGE('',*,*,#543,.F.);
#553=EDGE_CURVE('',#495,#544,#558,.T.);
#558=LINE('',#496,#560);
#560=VECTOR('',#561,0.3556);
#561=DIRECTION('',(-1.0,0.0,0.0));
#552=ORIENTED_EDGE('',*,*,#553,.F.);
#562=ORIENTED_EDGE('',*,*,#494,.T.);
#572=STYLED_ITEM('',(#34),#573);
#573=ADVANCED_FACE('',(#579),#574,.T.);
#574=PLANE('',#575);
#575=AXIS2_PLACEMENT_3D('',#576,#577,#578);
#576=CARTESIAN_POINT('',(1.168,1.127,0.0));
#577=DIRECTION('',(-1.0,0.0,0.0));
#578=DIRECTION('',(0.,0.,1.));
#579=FACE_OUTER_BOUND('',#580,.T.);
#580=EDGE_LOOP('',(#581,#591,#601,#611));
#582=EDGE_CURVE('',#438,#534,#587,.T.);
#587=LINE('',#439,#589);
#589=VECTOR('',#590,0.254);
#590=DIRECTION('',(0.0,1.0,0.0));
#581=ORIENTED_EDGE('',*,*,#582,.F.);
#591=ORIENTED_EDGE('',*,*,#465,.T.);
#602=EDGE_CURVE('',#544,#456,#607,.T.);
#607=LINE('',#545,#609);
#609=VECTOR('',#610,0.254);
#610=DIRECTION('',(0.0,-1.0,0.0));
#601=ORIENTED_EDGE('',*,*,#602,.F.);
#611=ORIENTED_EDGE('',*,*,#543,.T.);
#621=STYLED_ITEM('',(#34),#622);
#622=ADVANCED_FACE('',(#628),#623,.T.);
#623=PLANE('',#624);
#624=AXIS2_PLACEMENT_3D('',#625,#626,#627);
#625=CARTESIAN_POINT('',(1.168,1.127,0.0));
#626=DIRECTION('',(0.0,0.0,-1.0));
#627=DIRECTION('',(0.,1.,0.));
#628=FACE_OUTER_BOUND('',#629,.T.);
#629=EDGE_LOOP('',(#630,#640,#650,#660));
#630=ORIENTED_EDGE('',*,*,#533,.T.);
#640=ORIENTED_EDGE('',*,*,#484,.T.);
#650=ORIENTED_EDGE('',*,*,#435,.T.);
#660=ORIENTED_EDGE('',*,*,#582,.T.);
#670=STYLED_ITEM('',(#34),#671);
#671=ADVANCED_FACE('',(#677),#672,.T.);
#672=PLANE('',#673);
#673=AXIS2_PLACEMENT_3D('',#674,#675,#676);
#674=CARTESIAN_POINT('',(1.168,0.873,0.051));
#675=DIRECTION('',(0.0,0.0,1.0));
#676=DIRECTION('',(0.,1.,0.));
#677=FACE_OUTER_BOUND('',#678,.T.);
#678=EDGE_LOOP('',(#679,#689,#699,#709));
#679=ORIENTED_EDGE('',*,*,#455,.T.);
#689=ORIENTED_EDGE('',*,*,#504,.T.);
#699=ORIENTED_EDGE('',*,*,#553,.T.);
#709=ORIENTED_EDGE('',*,*,#602,.T.);
#719=MANIFOLD_SOLID_BREP($,#720);
#720=CLOSED_SHELL('',(#722,#771,#820,#869,#918,#967));
#721=STYLED_ITEM('',(#34),#722);
#722=ADVANCED_FACE('',(#728),#723,.T.);
#723=PLANE('',#724);
#724=AXIS2_PLACEMENT_3D('',#725,#726,#727);
#725=CARTESIAN_POINT('',(1.168,0.373,0.0));
#726=DIRECTION('',(0.0,-1.0,0.0));
#727=DIRECTION('',(0.,0.,1.));
#728=FACE_OUTER_BOUND('',#729,.T.);
#729=EDGE_LOOP('',(#730,#740,#750,#760));
#733=CARTESIAN_POINT('',(1.524,0.373,0.0));
#732=VERTEX_POINT('',#733);
#735=CARTESIAN_POINT('',(1.168,0.373,0.0));
#734=VERTEX_POINT('',#735);
#731=EDGE_CURVE('',#732,#734,#736,.T.);
#736=LINE('',#733,#738);
#738=VECTOR('',#739,0.3556);
#739=DIRECTION('',(-1.0,0.0,0.0));
#730=ORIENTED_EDGE('',*,*,#731,.F.);
#743=CARTESIAN_POINT('',(1.524,0.373,0.051));
#742=VERTEX_POINT('',#743);
#741=EDGE_CURVE('',#742,#732,#746,.T.);
#746=LINE('',#743,#748);
#748=VECTOR('',#749,0.0508);
#749=DIRECTION('',(0.0,0.0,-1.0));
#740=ORIENTED_EDGE('',*,*,#741,.F.);
#753=CARTESIAN_POINT('',(1.168,0.373,0.051));
#752=VERTEX_POINT('',#753);
#751=EDGE_CURVE('',#752,#742,#756,.T.);
#756=LINE('',#753,#758);
#758=VECTOR('',#759,0.3556);
#759=DIRECTION('',(1.0,0.0,0.0));
#750=ORIENTED_EDGE('',*,*,#751,.F.);
#761=EDGE_CURVE('',#734,#752,#766,.T.);
#766=LINE('',#735,#768);
#768=VECTOR('',#769,0.0508);
#769=DIRECTION('',(0.0,0.0,1.0));
#760=ORIENTED_EDGE('',*,*,#761,.F.);
#770=STYLED_ITEM('',(#34),#771);
#771=ADVANCED_FACE('',(#777),#772,.T.);
#772=PLANE('',#773);
#773=AXIS2_PLACEMENT_3D('',#774,#775,#776);
#774=CARTESIAN_POINT('',(1.524,0.373,0.0));
#775=DIRECTION('',(1.0,0.0,0.0));
#776=DIRECTION('',(0.,0.,1.));
#777=FACE_OUTER_BOUND('',#778,.T.);
#778=EDGE_LOOP('',(#779,#789,#799,#809));
#782=CARTESIAN_POINT('',(1.524,0.627,0.0));
#781=VERTEX_POINT('',#782);
#780=EDGE_CURVE('',#781,#732,#785,.T.);
#785=LINE('',#782,#787);
#787=VECTOR('',#788,0.254);
#788=DIRECTION('',(0.0,-1.0,0.0));
#779=ORIENTED_EDGE('',*,*,#780,.F.);
#792=CARTESIAN_POINT('',(1.524,0.627,0.051));
#791=VERTEX_POINT('',#792);
#790=EDGE_CURVE('',#791,#781,#795,.T.);
#795=LINE('',#792,#797);
#797=VECTOR('',#798,0.0508);
#798=DIRECTION('',(0.0,0.0,-1.0));
#789=ORIENTED_EDGE('',*,*,#790,.F.);
#800=EDGE_CURVE('',#742,#791,#805,.T.);
#805=LINE('',#743,#807);
#807=VECTOR('',#808,0.254);
#808=DIRECTION('',(0.0,1.0,0.0));
#799=ORIENTED_EDGE('',*,*,#800,.F.);
#809=ORIENTED_EDGE('',*,*,#741,.T.);
#819=STYLED_ITEM('',(#34),#820);
#820=ADVANCED_FACE('',(#826),#821,.T.);
#821=PLANE('',#822);
#822=AXIS2_PLACEMENT_3D('',#823,#824,#825);
#823=CARTESIAN_POINT('',(1.524,0.627,0.0));
#824=DIRECTION('',(0.0,1.0,0.0));
#825=DIRECTION('',(0.,0.,1.));
#826=FACE_OUTER_BOUND('',#827,.T.);
#827=EDGE_LOOP('',(#828,#838,#848,#858));
#831=CARTESIAN_POINT('',(1.168,0.627,0.0));
#830=VERTEX_POINT('',#831);
#829=EDGE_CURVE('',#830,#781,#834,.T.);
#834=LINE('',#831,#836);
#836=VECTOR('',#837,0.3556);
#837=DIRECTION('',(1.0,0.0,0.0));
#828=ORIENTED_EDGE('',*,*,#829,.F.);
#841=CARTESIAN_POINT('',(1.168,0.627,0.051));
#840=VERTEX_POINT('',#841);
#839=EDGE_CURVE('',#840,#830,#844,.T.);
#844=LINE('',#841,#846);
#846=VECTOR('',#847,0.0508);
#847=DIRECTION('',(0.0,0.0,-1.0));
#838=ORIENTED_EDGE('',*,*,#839,.F.);
#849=EDGE_CURVE('',#791,#840,#854,.T.);
#854=LINE('',#792,#856);
#856=VECTOR('',#857,0.3556);
#857=DIRECTION('',(-1.0,0.0,0.0));
#848=ORIENTED_EDGE('',*,*,#849,.F.);
#858=ORIENTED_EDGE('',*,*,#790,.T.);
#868=STYLED_ITEM('',(#34),#869);
#869=ADVANCED_FACE('',(#875),#870,.T.);
#870=PLANE('',#871);
#871=AXIS2_PLACEMENT_3D('',#872,#873,#874);
#872=CARTESIAN_POINT('',(1.168,0.627,0.0));
#873=DIRECTION('',(-1.0,0.0,0.0));
#874=DIRECTION('',(0.,0.,1.));
#875=FACE_OUTER_BOUND('',#876,.T.);
#876=EDGE_LOOP('',(#877,#887,#897,#907));
#878=EDGE_CURVE('',#734,#830,#883,.T.);
#883=LINE('',#735,#885);
#885=VECTOR('',#886,0.254);
#886=DIRECTION('',(0.0,1.0,0.0));
#877=ORIENTED_EDGE('',*,*,#878,.F.);
#887=ORIENTED_EDGE('',*,*,#761,.T.);
#898=EDGE_CURVE('',#840,#752,#903,.T.);
#903=LINE('',#841,#905);
#905=VECTOR('',#906,0.254);
#906=DIRECTION('',(0.0,-1.0,0.0));
#897=ORIENTED_EDGE('',*,*,#898,.F.);
#907=ORIENTED_EDGE('',*,*,#839,.T.);
#917=STYLED_ITEM('',(#34),#918);
#918=ADVANCED_FACE('',(#924),#919,.T.);
#919=PLANE('',#920);
#920=AXIS2_PLACEMENT_3D('',#921,#922,#923);
#921=CARTESIAN_POINT('',(1.168,0.627,0.0));
#922=DIRECTION('',(0.0,0.0,-1.0));
#923=DIRECTION('',(0.,1.,0.));
#924=FACE_OUTER_BOUND('',#925,.T.);
#925=EDGE_LOOP('',(#926,#936,#946,#956));
#926=ORIENTED_EDGE('',*,*,#829,.T.);
#936=ORIENTED_EDGE('',*,*,#780,.T.);
#946=ORIENTED_EDGE('',*,*,#731,.T.);
#956=ORIENTED_EDGE('',*,*,#878,.T.);
#966=STYLED_ITEM('',(#34),#967);
#967=ADVANCED_FACE('',(#973),#968,.T.);
#968=PLANE('',#969);
#969=AXIS2_PLACEMENT_3D('',#970,#971,#972);
#970=CARTESIAN_POINT('',(1.168,0.373,0.051));
#971=DIRECTION('',(0.0,0.0,1.0));
#972=DIRECTION('',(0.,1.,0.));
#973=FACE_OUTER_BOUND('',#974,.T.);
#974=EDGE_LOOP('',(#975,#985,#995,#1005));
#975=ORIENTED_EDGE('',*,*,#751,.T.);
#985=ORIENTED_EDGE('',*,*,#800,.T.);
#995=ORIENTED_EDGE('',*,*,#849,.T.);
#1005=ORIENTED_EDGE('',*,*,#898,.T.);
#1015=MANIFOLD_SOLID_BREP($,#1016);
#1016=CLOSED_SHELL('',(#1018,#1067,#1116,#1165,#1214,#1263));
#1017=STYLED_ITEM('',(#34),#1018);
#1018=ADVANCED_FACE('',(#1024),#1019,.T.);
#1019=PLANE('',#1020);
#1020=AXIS2_PLACEMENT_3D('',#1021,#1022,#1023);
#1021=CARTESIAN_POINT('',(1.168,-0.127,0.0));
#1022=DIRECTION('',(0.0,-1.0,0.0));
#1023=DIRECTION('',(0.,0.,1.));
#1024=FACE_OUTER_BOUND('',#1025,.T.);
#1025=EDGE_LOOP('',(#1026,#1036,#1046,#1056));
#1029=CARTESIAN_POINT('',(1.524,-0.127,0.0));
#1028=VERTEX_POINT('',#1029);
#1031=CARTESIAN_POINT('',(1.168,-0.127,0.0));
#1030=VERTEX_POINT('',#1031);
#1027=EDGE_CURVE('',#1028,#1030,#1032,.T.);
#1032=LINE('',#1029,#1034);
#1034=VECTOR('',#1035,0.3556);
#1035=DIRECTION('',(-1.0,0.0,0.0));
#1026=ORIENTED_EDGE('',*,*,#1027,.F.);
#1039=CARTESIAN_POINT('',(1.524,-0.127,0.051));
#1038=VERTEX_POINT('',#1039);
#1037=EDGE_CURVE('',#1038,#1028,#1042,.T.);
#1042=LINE('',#1039,#1044);
#1044=VECTOR('',#1045,0.0508);
#1045=DIRECTION('',(0.0,0.0,-1.0));
#1036=ORIENTED_EDGE('',*,*,#1037,.F.);
#1049=CARTESIAN_POINT('',(1.168,-0.127,0.051));
#1048=VERTEX_POINT('',#1049);
#1047=EDGE_CURVE('',#1048,#1038,#1052,.T.);
#1052=LINE('',#1049,#1054);
#1054=VECTOR('',#1055,0.3556);
#1055=DIRECTION('',(1.0,0.0,0.0));
#1046=ORIENTED_EDGE('',*,*,#1047,.F.);
#1057=EDGE_CURVE('',#1030,#1048,#1062,.T.);
#1062=LINE('',#1031,#1064);
#1064=VECTOR('',#1065,0.0508);
#1065=DIRECTION('',(0.0,0.0,1.0));
#1056=ORIENTED_EDGE('',*,*,#1057,.F.);
#1066=STYLED_ITEM('',(#34),#1067);
#1067=ADVANCED_FACE('',(#1073),#1068,.T.);
#1068=PLANE('',#1069);
#1069=AXIS2_PLACEMENT_3D('',#1070,#1071,#1072);
#1070=CARTESIAN_POINT('',(1.524,-0.127,0.0));
#1071=DIRECTION('',(1.0,0.0,0.0));
#1072=DIRECTION('',(0.,0.,1.));
#1073=FACE_OUTER_BOUND('',#1074,.T.);
#1074=EDGE_LOOP('',(#1075,#1085,#1095,#1105));
#1078=CARTESIAN_POINT('',(1.524,0.127,0.0));
#1077=VERTEX_POINT('',#1078);
#1076=EDGE_CURVE('',#1077,#1028,#1081,.T.);
#1081=LINE('',#1078,#1083);
#1083=VECTOR('',#1084,0.254);
#1084=DIRECTION('',(0.0,-1.0,0.0));
#1075=ORIENTED_EDGE('',*,*,#1076,.F.);
#1088=CARTESIAN_POINT('',(1.524,0.127,0.051));
#1087=VERTEX_POINT('',#1088);
#1086=EDGE_CURVE('',#1087,#1077,#1091,.T.);
#1091=LINE('',#1088,#1093);
#1093=VECTOR('',#1094,0.0508);
#1094=DIRECTION('',(0.0,0.0,-1.0));
#1085=ORIENTED_EDGE('',*,*,#1086,.F.);
#1096=EDGE_CURVE('',#1038,#1087,#1101,.T.);
#1101=LINE('',#1039,#1103);
#1103=VECTOR('',#1104,0.254);
#1104=DIRECTION('',(0.0,1.0,0.0));
#1095=ORIENTED_EDGE('',*,*,#1096,.F.);
#1105=ORIENTED_EDGE('',*,*,#1037,.T.);
#1115=STYLED_ITEM('',(#34),#1116);
#1116=ADVANCED_FACE('',(#1122),#1117,.T.);
#1117=PLANE('',#1118);
#1118=AXIS2_PLACEMENT_3D('',#1119,#1120,#1121);
#1119=CARTESIAN_POINT('',(1.524,0.127,0.0));
#1120=DIRECTION('',(0.0,1.0,0.0));
#1121=DIRECTION('',(0.,0.,1.));
#1122=FACE_OUTER_BOUND('',#1123,.T.);
#1123=EDGE_LOOP('',(#1124,#1134,#1144,#1154));
#1127=CARTESIAN_POINT('',(1.168,0.127,0.0));
#1126=VERTEX_POINT('',#1127);
#1125=EDGE_CURVE('',#1126,#1077,#1130,.T.);
#1130=LINE('',#1127,#1132);
#1132=VECTOR('',#1133,0.3556);
#1133=DIRECTION('',(1.0,0.0,0.0));
#1124=ORIENTED_EDGE('',*,*,#1125,.F.);
#1137=CARTESIAN_POINT('',(1.168,0.127,0.051));
#1136=VERTEX_POINT('',#1137);
#1135=EDGE_CURVE('',#1136,#1126,#1140,.T.);
#1140=LINE('',#1137,#1142);
#1142=VECTOR('',#1143,0.0508);
#1143=DIRECTION('',(0.0,0.0,-1.0));
#1134=ORIENTED_EDGE('',*,*,#1135,.F.);
#1145=EDGE_CURVE('',#1087,#1136,#1150,.T.);
#1150=LINE('',#1088,#1152);
#1152=VECTOR('',#1153,0.3556);
#1153=DIRECTION('',(-1.0,0.0,0.0));
#1144=ORIENTED_EDGE('',*,*,#1145,.F.);
#1154=ORIENTED_EDGE('',*,*,#1086,.T.);
#1164=STYLED_ITEM('',(#34),#1165);
#1165=ADVANCED_FACE('',(#1171),#1166,.T.);
#1166=PLANE('',#1167);
#1167=AXIS2_PLACEMENT_3D('',#1168,#1169,#1170);
#1168=CARTESIAN_POINT('',(1.168,0.127,0.0));
#1169=DIRECTION('',(-1.0,0.0,0.0));
#1170=DIRECTION('',(0.,0.,1.));
#1171=FACE_OUTER_BOUND('',#1172,.T.);
#1172=EDGE_LOOP('',(#1173,#1183,#1193,#1203));
#1174=EDGE_CURVE('',#1030,#1126,#1179,.T.);
#1179=LINE('',#1031,#1181);
#1181=VECTOR('',#1182,0.254);
#1182=DIRECTION('',(0.0,1.0,0.0));
#1173=ORIENTED_EDGE('',*,*,#1174,.F.);
#1183=ORIENTED_EDGE('',*,*,#1057,.T.);
#1194=EDGE_CURVE('',#1136,#1048,#1199,.T.);
#1199=LINE('',#1137,#1201);
#1201=VECTOR('',#1202,0.254);
#1202=DIRECTION('',(0.0,-1.0,0.0));
#1193=ORIENTED_EDGE('',*,*,#1194,.F.);
#1203=ORIENTED_EDGE('',*,*,#1135,.T.);
#1213=STYLED_ITEM('',(#34),#1214);
#1214=ADVANCED_FACE('',(#1220),#1215,.T.);
#1215=PLANE('',#1216);
#1216=AXIS2_PLACEMENT_3D('',#1217,#1218,#1219);
#1217=CARTESIAN_POINT('',(1.168,0.127,0.0));
#1218=DIRECTION('',(0.0,0.0,-1.0));
#1219=DIRECTION('',(0.,1.,0.));
#1220=FACE_OUTER_BOUND('',#1221,.T.);
#1221=EDGE_LOOP('',(#1222,#1232,#1242,#1252));
#1222=ORIENTED_EDGE('',*,*,#1125,.T.);
#1232=ORIENTED_EDGE('',*,*,#1076,.T.);
#1242=ORIENTED_EDGE('',*,*,#1027,.T.);
#1252=ORIENTED_EDGE('',*,*,#1174,.T.);
#1262=STYLED_ITEM('',(#34),#1263);
#1263=ADVANCED_FACE('',(#1269),#1264,.T.);
#1264=PLANE('',#1265);
#1265=AXIS2_PLACEMENT_3D('',#1266,#1267,#1268);
#1266=CARTESIAN_POINT('',(1.168,-0.127,0.051));
#1267=DIRECTION('',(0.0,0.0,1.0));
#1268=DIRECTION('',(0.,1.,0.));
#1269=FACE_OUTER_BOUND('',#1270,.T.);
#1270=EDGE_LOOP('',(#1271,#1281,#1291,#1301));
#1271=ORIENTED_EDGE('',*,*,#1047,.T.);
#1281=ORIENTED_EDGE('',*,*,#1096,.T.);
#1291=ORIENTED_EDGE('',*,*,#1145,.T.);
#1301=ORIENTED_EDGE('',*,*,#1194,.T.);
#1311=MANIFOLD_SOLID_BREP($,#1312);
#1312=CLOSED_SHELL('',(#1314,#1363,#1412,#1461,#1510,#1559));
#1313=STYLED_ITEM('',(#34),#1314);
#1314=ADVANCED_FACE('',(#1320),#1315,.T.);
#1315=PLANE('',#1316);
#1316=AXIS2_PLACEMENT_3D('',#1317,#1318,#1319);
#1317=CARTESIAN_POINT('',(1.168,-0.627,0.0));
#1318=DIRECTION('',(0.0,-1.0,0.0));
#1319=DIRECTION('',(0.,0.,1.));
#1320=FACE_OUTER_BOUND('',#1321,.T.);
#1321=EDGE_LOOP('',(#1322,#1332,#1342,#1352));
#1325=CARTESIAN_POINT('',(1.524,-0.627,0.0));
#1324=VERTEX_POINT('',#1325);
#1327=CARTESIAN_POINT('',(1.168,-0.627,0.0));
#1326=VERTEX_POINT('',#1327);
#1323=EDGE_CURVE('',#1324,#1326,#1328,.T.);
#1328=LINE('',#1325,#1330);
#1330=VECTOR('',#1331,0.3556);
#1331=DIRECTION('',(-1.0,0.0,0.0));
#1322=ORIENTED_EDGE('',*,*,#1323,.F.);
#1335=CARTESIAN_POINT('',(1.524,-0.627,0.051));
#1334=VERTEX_POINT('',#1335);
#1333=EDGE_CURVE('',#1334,#1324,#1338,.T.);
#1338=LINE('',#1335,#1340);
#1340=VECTOR('',#1341,0.0508);
#1341=DIRECTION('',(0.0,0.0,-1.0));
#1332=ORIENTED_EDGE('',*,*,#1333,.F.);
#1345=CARTESIAN_POINT('',(1.168,-0.627,0.051));
#1344=VERTEX_POINT('',#1345);
#1343=EDGE_CURVE('',#1344,#1334,#1348,.T.);
#1348=LINE('',#1345,#1350);
#1350=VECTOR('',#1351,0.3556);
#1351=DIRECTION('',(1.0,0.0,0.0));
#1342=ORIENTED_EDGE('',*,*,#1343,.F.);
#1353=EDGE_CURVE('',#1326,#1344,#1358,.T.);
#1358=LINE('',#1327,#1360);
#1360=VECTOR('',#1361,0.0508);
#1361=DIRECTION('',(0.0,0.0,1.0));
#1352=ORIENTED_EDGE('',*,*,#1353,.F.);
#1362=STYLED_ITEM('',(#34),#1363);
#1363=ADVANCED_FACE('',(#1369),#1364,.T.);
#1364=PLANE('',#1365);
#1365=AXIS2_PLACEMENT_3D('',#1366,#1367,#1368);
#1366=CARTESIAN_POINT('',(1.524,-0.627,0.0));
#1367=DIRECTION('',(1.0,0.0,0.0));
#1368=DIRECTION('',(0.,0.,1.));
#1369=FACE_OUTER_BOUND('',#1370,.T.);
#1370=EDGE_LOOP('',(#1371,#1381,#1391,#1401));
#1374=CARTESIAN_POINT('',(1.524,-0.373,0.0));
#1373=VERTEX_POINT('',#1374);
#1372=EDGE_CURVE('',#1373,#1324,#1377,.T.);
#1377=LINE('',#1374,#1379);
#1379=VECTOR('',#1380,0.254);
#1380=DIRECTION('',(0.0,-1.0,0.0));
#1371=ORIENTED_EDGE('',*,*,#1372,.F.);
#1384=CARTESIAN_POINT('',(1.524,-0.373,0.051));
#1383=VERTEX_POINT('',#1384);
#1382=EDGE_CURVE('',#1383,#1373,#1387,.T.);
#1387=LINE('',#1384,#1389);
#1389=VECTOR('',#1390,0.0508);
#1390=DIRECTION('',(0.0,0.0,-1.0));
#1381=ORIENTED_EDGE('',*,*,#1382,.F.);
#1392=EDGE_CURVE('',#1334,#1383,#1397,.T.);
#1397=LINE('',#1335,#1399);
#1399=VECTOR('',#1400,0.254);
#1400=DIRECTION('',(0.0,1.0,0.0));
#1391=ORIENTED_EDGE('',*,*,#1392,.F.);
#1401=ORIENTED_EDGE('',*,*,#1333,.T.);
#1411=STYLED_ITEM('',(#34),#1412);
#1412=ADVANCED_FACE('',(#1418),#1413,.T.);
#1413=PLANE('',#1414);
#1414=AXIS2_PLACEMENT_3D('',#1415,#1416,#1417);
#1415=CARTESIAN_POINT('',(1.524,-0.373,0.0));
#1416=DIRECTION('',(0.0,1.0,0.0));
#1417=DIRECTION('',(0.,0.,1.));
#1418=FACE_OUTER_BOUND('',#1419,.T.);
#1419=EDGE_LOOP('',(#1420,#1430,#1440,#1450));
#1423=CARTESIAN_POINT('',(1.168,-0.373,0.0));
#1422=VERTEX_POINT('',#1423);
#1421=EDGE_CURVE('',#1422,#1373,#1426,.T.);
#1426=LINE('',#1423,#1428);
#1428=VECTOR('',#1429,0.3556);
#1429=DIRECTION('',(1.0,0.0,0.0));
#1420=ORIENTED_EDGE('',*,*,#1421,.F.);
#1433=CARTESIAN_POINT('',(1.168,-0.373,0.051));
#1432=VERTEX_POINT('',#1433);
#1431=EDGE_CURVE('',#1432,#1422,#1436,.T.);
#1436=LINE('',#1433,#1438);
#1438=VECTOR('',#1439,0.0508);
#1439=DIRECTION('',(0.0,0.0,-1.0));
#1430=ORIENTED_EDGE('',*,*,#1431,.F.);
#1441=EDGE_CURVE('',#1383,#1432,#1446,.T.);
#1446=LINE('',#1384,#1448);
#1448=VECTOR('',#1449,0.3556);
#1449=DIRECTION('',(-1.0,0.0,0.0));
#1440=ORIENTED_EDGE('',*,*,#1441,.F.);
#1450=ORIENTED_EDGE('',*,*,#1382,.T.);
#1460=STYLED_ITEM('',(#34),#1461);
#1461=ADVANCED_FACE('',(#1467),#1462,.T.);
#1462=PLANE('',#1463);
#1463=AXIS2_PLACEMENT_3D('',#1464,#1465,#1466);
#1464=CARTESIAN_POINT('',(1.168,-0.373,0.0));
#1465=DIRECTION('',(-1.0,0.0,0.0));
#1466=DIRECTION('',(0.,0.,1.));
#1467=FACE_OUTER_BOUND('',#1468,.T.);
#1468=EDGE_LOOP('',(#1469,#1479,#1489,#1499));
#1470=EDGE_CURVE('',#1326,#1422,#1475,.T.);
#1475=LINE('',#1327,#1477);
#1477=VECTOR('',#1478,0.254);
#1478=DIRECTION('',(0.0,1.0,0.0));
#1469=ORIENTED_EDGE('',*,*,#1470,.F.);
#1479=ORIENTED_EDGE('',*,*,#1353,.T.);
#1490=EDGE_CURVE('',#1432,#1344,#1495,.T.);
#1495=LINE('',#1433,#1497);
#1497=VECTOR('',#1498,0.254);
#1498=DIRECTION('',(0.0,-1.0,0.0));
#1489=ORIENTED_EDGE('',*,*,#1490,.F.);
#1499=ORIENTED_EDGE('',*,*,#1431,.T.);
#1509=STYLED_ITEM('',(#34),#1510);
#1510=ADVANCED_FACE('',(#1516),#1511,.T.);
#1511=PLANE('',#1512);
#1512=AXIS2_PLACEMENT_3D('',#1513,#1514,#1515);
#1513=CARTESIAN_POINT('',(1.168,-0.373,0.0));
#1514=DIRECTION('',(0.0,0.0,-1.0));
#1515=DIRECTION('',(0.,1.,0.));
#1516=FACE_OUTER_BOUND('',#1517,.T.);
#1517=EDGE_LOOP('',(#1518,#1528,#1538,#1548));
#1518=ORIENTED_EDGE('',*,*,#1421,.T.);
#1528=ORIENTED_EDGE('',*,*,#1372,.T.);
#1538=ORIENTED_EDGE('',*,*,#1323,.T.);
#1548=ORIENTED_EDGE('',*,*,#1470,.T.);
#1558=STYLED_ITEM('',(#34),#1559);
#1559=ADVANCED_FACE('',(#1565),#1560,.T.);
#1560=PLANE('',#1561);
#1561=AXIS2_PLACEMENT_3D('',#1562,#1563,#1564);
#1562=CARTESIAN_POINT('',(1.168,-0.627,0.051));
#1563=DIRECTION('',(0.0,0.0,1.0));
#1564=DIRECTION('',(0.,1.,0.));
#1565=FACE_OUTER_BOUND('',#1566,.T.);
#1566=EDGE_LOOP('',(#1567,#1577,#1587,#1597));
#1567=ORIENTED_EDGE('',*,*,#1343,.T.);
#1577=ORIENTED_EDGE('',*,*,#1392,.T.);
#1587=ORIENTED_EDGE('',*,*,#1441,.T.);
#1597=ORIENTED_EDGE('',*,*,#1490,.T.);
#1607=MANIFOLD_SOLID_BREP($,#1608);
#1608=CLOSED_SHELL('',(#1610,#1659,#1708,#1757,#1806,#1855));
#1609=STYLED_ITEM('',(#34),#1610);
#1610=ADVANCED_FACE('',(#1616),#1611,.T.);
#1611=PLANE('',#1612);
#1612=AXIS2_PLACEMENT_3D('',#1613,#1614,#1615);
#1613=CARTESIAN_POINT('',(1.168,-1.127,0.0));
#1614=DIRECTION('',(0.0,-1.0,0.0));
#1615=DIRECTION('',(0.,0.,1.));
#1616=FACE_OUTER_BOUND('',#1617,.T.);
#1617=EDGE_LOOP('',(#1618,#1628,#1638,#1648));
#1621=CARTESIAN_POINT('',(1.524,-1.127,0.0));
#1620=VERTEX_POINT('',#1621);
#1623=CARTESIAN_POINT('',(1.168,-1.127,0.0));
#1622=VERTEX_POINT('',#1623);
#1619=EDGE_CURVE('',#1620,#1622,#1624,.T.);
#1624=LINE('',#1621,#1626);
#1626=VECTOR('',#1627,0.3556);
#1627=DIRECTION('',(-1.0,0.0,0.0));
#1618=ORIENTED_EDGE('',*,*,#1619,.F.);
#1631=CARTESIAN_POINT('',(1.524,-1.127,0.051));
#1630=VERTEX_POINT('',#1631);
#1629=EDGE_CURVE('',#1630,#1620,#1634,.T.);
#1634=LINE('',#1631,#1636);
#1636=VECTOR('',#1637,0.0508);
#1637=DIRECTION('',(0.0,0.0,-1.0));
#1628=ORIENTED_EDGE('',*,*,#1629,.F.);
#1641=CARTESIAN_POINT('',(1.168,-1.127,0.051));
#1640=VERTEX_POINT('',#1641);
#1639=EDGE_CURVE('',#1640,#1630,#1644,.T.);
#1644=LINE('',#1641,#1646);
#1646=VECTOR('',#1647,0.3556);
#1647=DIRECTION('',(1.0,0.0,0.0));
#1638=ORIENTED_EDGE('',*,*,#1639,.F.);
#1649=EDGE_CURVE('',#1622,#1640,#1654,.T.);
#1654=LINE('',#1623,#1656);
#1656=VECTOR('',#1657,0.0508);
#1657=DIRECTION('',(0.0,0.0,1.0));
#1648=ORIENTED_EDGE('',*,*,#1649,.F.);
#1658=STYLED_ITEM('',(#34),#1659);
#1659=ADVANCED_FACE('',(#1665),#1660,.T.);
#1660=PLANE('',#1661);
#1661=AXIS2_PLACEMENT_3D('',#1662,#1663,#1664);
#1662=CARTESIAN_POINT('',(1.524,-1.127,0.0));
#1663=DIRECTION('',(1.0,0.0,0.0));
#1664=DIRECTION('',(0.,0.,1.));
#1665=FACE_OUTER_BOUND('',#1666,.T.);
#1666=EDGE_LOOP('',(#1667,#1677,#1687,#1697));
#1670=CARTESIAN_POINT('',(1.524,-0.873,0.0));
#1669=VERTEX_POINT('',#1670);
#1668=EDGE_CURVE('',#1669,#1620,#1673,.T.);
#1673=LINE('',#1670,#1675);
#1675=VECTOR('',#1676,0.254);
#1676=DIRECTION('',(0.0,-1.0,0.0));
#1667=ORIENTED_EDGE('',*,*,#1668,.F.);
#1680=CARTESIAN_POINT('',(1.524,-0.873,0.051));
#1679=VERTEX_POINT('',#1680);
#1678=EDGE_CURVE('',#1679,#1669,#1683,.T.);
#1683=LINE('',#1680,#1685);
#1685=VECTOR('',#1686,0.0508);
#1686=DIRECTION('',(0.0,0.0,-1.0));
#1677=ORIENTED_EDGE('',*,*,#1678,.F.);
#1688=EDGE_CURVE('',#1630,#1679,#1693,.T.);
#1693=LINE('',#1631,#1695);
#1695=VECTOR('',#1696,0.254);
#1696=DIRECTION('',(0.0,1.0,0.0));
#1687=ORIENTED_EDGE('',*,*,#1688,.F.);
#1697=ORIENTED_EDGE('',*,*,#1629,.T.);
#1707=STYLED_ITEM('',(#34),#1708);
#1708=ADVANCED_FACE('',(#1714),#1709,.T.);
#1709=PLANE('',#1710);
#1710=AXIS2_PLACEMENT_3D('',#1711,#1712,#1713);
#1711=CARTESIAN_POINT('',(1.524,-0.873,0.0));
#1712=DIRECTION('',(0.0,1.0,0.0));
#1713=DIRECTION('',(0.,0.,1.));
#1714=FACE_OUTER_BOUND('',#1715,.T.);
#1715=EDGE_LOOP('',(#1716,#1726,#1736,#1746));
#1719=CARTESIAN_POINT('',(1.168,-0.873,0.0));
#1718=VERTEX_POINT('',#1719);
#1717=EDGE_CURVE('',#1718,#1669,#1722,.T.);
#1722=LINE('',#1719,#1724);
#1724=VECTOR('',#1725,0.3556);
#1725=DIRECTION('',(1.0,0.0,0.0));
#1716=ORIENTED_EDGE('',*,*,#1717,.F.);
#1729=CARTESIAN_POINT('',(1.168,-0.873,0.051));
#1728=VERTEX_POINT('',#1729);
#1727=EDGE_CURVE('',#1728,#1718,#1732,.T.);
#1732=LINE('',#1729,#1734);
#1734=VECTOR('',#1735,0.0508);
#1735=DIRECTION('',(0.0,0.0,-1.0));
#1726=ORIENTED_EDGE('',*,*,#1727,.F.);
#1737=EDGE_CURVE('',#1679,#1728,#1742,.T.);
#1742=LINE('',#1680,#1744);
#1744=VECTOR('',#1745,0.3556);
#1745=DIRECTION('',(-1.0,0.0,0.0));
#1736=ORIENTED_EDGE('',*,*,#1737,.F.);
#1746=ORIENTED_EDGE('',*,*,#1678,.T.);
#1756=STYLED_ITEM('',(#34),#1757);
#1757=ADVANCED_FACE('',(#1763),#1758,.T.);
#1758=PLANE('',#1759);
#1759=AXIS2_PLACEMENT_3D('',#1760,#1761,#1762);
#1760=CARTESIAN_POINT('',(1.168,-0.873,0.0));
#1761=DIRECTION('',(-1.0,0.0,0.0));
#1762=DIRECTION('',(0.,0.,1.));
#1763=FACE_OUTER_BOUND('',#1764,.T.);
#1764=EDGE_LOOP('',(#1765,#1775,#1785,#1795));
#1766=EDGE_CURVE('',#1622,#1718,#1771,.T.);
#1771=LINE('',#1623,#1773);
#1773=VECTOR('',#1774,0.254);
#1774=DIRECTION('',(0.0,1.0,0.0));
#1765=ORIENTED_EDGE('',*,*,#1766,.F.);
#1775=ORIENTED_EDGE('',*,*,#1649,.T.);
#1786=EDGE_CURVE('',#1728,#1640,#1791,.T.);
#1791=LINE('',#1729,#1793);
#1793=VECTOR('',#1794,0.254);
#1794=DIRECTION('',(0.0,-1.0,0.0));
#1785=ORIENTED_EDGE('',*,*,#1786,.F.);
#1795=ORIENTED_EDGE('',*,*,#1727,.T.);
#1805=STYLED_ITEM('',(#34),#1806);
#1806=ADVANCED_FACE('',(#1812),#1807,.T.);
#1807=PLANE('',#1808);
#1808=AXIS2_PLACEMENT_3D('',#1809,#1810,#1811);
#1809=CARTESIAN_POINT('',(1.168,-0.873,0.0));
#1810=DIRECTION('',(0.0,0.0,-1.0));
#1811=DIRECTION('',(0.,1.,0.));
#1812=FACE_OUTER_BOUND('',#1813,.T.);
#1813=EDGE_LOOP('',(#1814,#1824,#1834,#1844));
#1814=ORIENTED_EDGE('',*,*,#1717,.T.);
#1824=ORIENTED_EDGE('',*,*,#1668,.T.);
#1834=ORIENTED_EDGE('',*,*,#1619,.T.);
#1844=ORIENTED_EDGE('',*,*,#1766,.T.);
#1854=STYLED_ITEM('',(#34),#1855);
#1855=ADVANCED_FACE('',(#1861),#1856,.T.);
#1856=PLANE('',#1857);
#1857=AXIS2_PLACEMENT_3D('',#1858,#1859,#1860);
#1858=CARTESIAN_POINT('',(1.168,-1.127,0.051));
#1859=DIRECTION('',(0.0,0.0,1.0));
#1860=DIRECTION('',(0.,1.,0.));
#1861=FACE_OUTER_BOUND('',#1862,.T.);
#1862=EDGE_LOOP('',(#1863,#1873,#1883,#1893));
#1863=ORIENTED_EDGE('',*,*,#1639,.T.);
#1873=ORIENTED_EDGE('',*,*,#1688,.T.);
#1883=ORIENTED_EDGE('',*,*,#1737,.T.);
#1893=ORIENTED_EDGE('',*,*,#1786,.T.);
#1903=MANIFOLD_SOLID_BREP($,#1904);
#1904=CLOSED_SHELL('',(#1906,#1955,#2004,#2053,#2102,#2151));
#1905=STYLED_ITEM('',(#34),#1906);
#1906=ADVANCED_FACE('',(#1912),#1907,.T.);
#1907=PLANE('',#1908);
#1908=AXIS2_PLACEMENT_3D('',#1909,#1910,#1911);
#1909=CARTESIAN_POINT('',(-1.524,-1.127,0.0));
#1910=DIRECTION('',(0.0,-1.0,0.0));
#1911=DIRECTION('',(0.,0.,1.));
#1912=FACE_OUTER_BOUND('',#1913,.T.);
#1913=EDGE_LOOP('',(#1914,#1924,#1934,#1944));
#1917=CARTESIAN_POINT('',(-1.168,-1.127,0.0));
#1916=VERTEX_POINT('',#1917);
#1919=CARTESIAN_POINT('',(-1.524,-1.127,0.0));
#1918=VERTEX_POINT('',#1919);
#1915=EDGE_CURVE('',#1916,#1918,#1920,.T.);
#1920=LINE('',#1917,#1922);
#1922=VECTOR('',#1923,0.3556);
#1923=DIRECTION('',(-1.0,0.0,0.0));
#1914=ORIENTED_EDGE('',*,*,#1915,.F.);
#1927=CARTESIAN_POINT('',(-1.168,-1.127,0.051));
#1926=VERTEX_POINT('',#1927);
#1925=EDGE_CURVE('',#1926,#1916,#1930,.T.);
#1930=LINE('',#1927,#1932);
#1932=VECTOR('',#1933,0.0508);
#1933=DIRECTION('',(0.0,0.0,-1.0));
#1924=ORIENTED_EDGE('',*,*,#1925,.F.);
#1937=CARTESIAN_POINT('',(-1.524,-1.127,0.051));
#1936=VERTEX_POINT('',#1937);
#1935=EDGE_CURVE('',#1936,#1926,#1940,.T.);
#1940=LINE('',#1937,#1942);
#1942=VECTOR('',#1943,0.3556);
#1943=DIRECTION('',(1.0,0.0,0.0));
#1934=ORIENTED_EDGE('',*,*,#1935,.F.);
#1945=EDGE_CURVE('',#1918,#1936,#1950,.T.);
#1950=LINE('',#1919,#1952);
#1952=VECTOR('',#1953,0.0508);
#1953=DIRECTION('',(0.0,0.0,1.0));
#1944=ORIENTED_EDGE('',*,*,#1945,.F.);
#1954=STYLED_ITEM('',(#34),#1955);
#1955=ADVANCED_FACE('',(#1961),#1956,.T.);
#1956=PLANE('',#1957);
#1957=AXIS2_PLACEMENT_3D('',#1958,#1959,#1960);
#1958=CARTESIAN_POINT('',(-1.168,-1.127,0.0));
#1959=DIRECTION('',(1.0,0.0,0.0));
#1960=DIRECTION('',(0.,0.,1.));
#1961=FACE_OUTER_BOUND('',#1962,.T.);
#1962=EDGE_LOOP('',(#1963,#1973,#1983,#1993));
#1966=CARTESIAN_POINT('',(-1.168,-0.873,0.0));
#1965=VERTEX_POINT('',#1966);
#1964=EDGE_CURVE('',#1965,#1916,#1969,.T.);
#1969=LINE('',#1966,#1971);
#1971=VECTOR('',#1972,0.254);
#1972=DIRECTION('',(0.0,-1.0,0.0));
#1963=ORIENTED_EDGE('',*,*,#1964,.F.);
#1976=CARTESIAN_POINT('',(-1.168,-0.873,0.051));
#1975=VERTEX_POINT('',#1976);
#1974=EDGE_CURVE('',#1975,#1965,#1979,.T.);
#1979=LINE('',#1976,#1981);
#1981=VECTOR('',#1982,0.0508);
#1982=DIRECTION('',(0.0,0.0,-1.0));
#1973=ORIENTED_EDGE('',*,*,#1974,.F.);
#1984=EDGE_CURVE('',#1926,#1975,#1989,.T.);
#1989=LINE('',#1927,#1991);
#1991=VECTOR('',#1992,0.254);
#1992=DIRECTION('',(0.0,1.0,0.0));
#1983=ORIENTED_EDGE('',*,*,#1984,.F.);
#1993=ORIENTED_EDGE('',*,*,#1925,.T.);
#2003=STYLED_ITEM('',(#34),#2004);
#2004=ADVANCED_FACE('',(#2010),#2005,.T.);
#2005=PLANE('',#2006);
#2006=AXIS2_PLACEMENT_3D('',#2007,#2008,#2009);
#2007=CARTESIAN_POINT('',(-1.168,-0.873,0.0));
#2008=DIRECTION('',(0.0,1.0,0.0));
#2009=DIRECTION('',(0.,0.,1.));
#2010=FACE_OUTER_BOUND('',#2011,.T.);
#2011=EDGE_LOOP('',(#2012,#2022,#2032,#2042));
#2015=CARTESIAN_POINT('',(-1.524,-0.873,0.0));
#2014=VERTEX_POINT('',#2015);
#2013=EDGE_CURVE('',#2014,#1965,#2018,.T.);
#2018=LINE('',#2015,#2020);
#2020=VECTOR('',#2021,0.3556);
#2021=DIRECTION('',(1.0,0.0,0.0));
#2012=ORIENTED_EDGE('',*,*,#2013,.F.);
#2025=CARTESIAN_POINT('',(-1.524,-0.873,0.051));
#2024=VERTEX_POINT('',#2025);
#2023=EDGE_CURVE('',#2024,#2014,#2028,.T.);
#2028=LINE('',#2025,#2030);
#2030=VECTOR('',#2031,0.0508);
#2031=DIRECTION('',(0.0,0.0,-1.0));
#2022=ORIENTED_EDGE('',*,*,#2023,.F.);
#2033=EDGE_CURVE('',#1975,#2024,#2038,.T.);
#2038=LINE('',#1976,#2040);
#2040=VECTOR('',#2041,0.3556);
#2041=DIRECTION('',(-1.0,0.0,0.0));
#2032=ORIENTED_EDGE('',*,*,#2033,.F.);
#2042=ORIENTED_EDGE('',*,*,#1974,.T.);
#2052=STYLED_ITEM('',(#34),#2053);
#2053=ADVANCED_FACE('',(#2059),#2054,.T.);
#2054=PLANE('',#2055);
#2055=AXIS2_PLACEMENT_3D('',#2056,#2057,#2058);
#2056=CARTESIAN_POINT('',(-1.524,-0.873,0.0));
#2057=DIRECTION('',(-1.0,0.0,0.0));
#2058=DIRECTION('',(0.,0.,1.));
#2059=FACE_OUTER_BOUND('',#2060,.T.);
#2060=EDGE_LOOP('',(#2061,#2071,#2081,#2091));
#2062=EDGE_CURVE('',#1918,#2014,#2067,.T.);
#2067=LINE('',#1919,#2069);
#2069=VECTOR('',#2070,0.254);
#2070=DIRECTION('',(0.0,1.0,0.0));
#2061=ORIENTED_EDGE('',*,*,#2062,.F.);
#2071=ORIENTED_EDGE('',*,*,#1945,.T.);
#2082=EDGE_CURVE('',#2024,#1936,#2087,.T.);
#2087=LINE('',#2025,#2089);
#2089=VECTOR('',#2090,0.254);
#2090=DIRECTION('',(0.0,-1.0,0.0));
#2081=ORIENTED_EDGE('',*,*,#2082,.F.);
#2091=ORIENTED_EDGE('',*,*,#2023,.T.);
#2101=STYLED_ITEM('',(#34),#2102);
#2102=ADVANCED_FACE('',(#2108),#2103,.T.);
#2103=PLANE('',#2104);
#2104=AXIS2_PLACEMENT_3D('',#2105,#2106,#2107);
#2105=CARTESIAN_POINT('',(-1.524,-0.873,0.0));
#2106=DIRECTION('',(0.0,0.0,-1.0));
#2107=DIRECTION('',(0.,1.,0.));
#2108=FACE_OUTER_BOUND('',#2109,.T.);
#2109=EDGE_LOOP('',(#2110,#2120,#2130,#2140));
#2110=ORIENTED_EDGE('',*,*,#2013,.T.);
#2120=ORIENTED_EDGE('',*,*,#1964,.T.);
#2130=ORIENTED_EDGE('',*,*,#1915,.T.);
#2140=ORIENTED_EDGE('',*,*,#2062,.T.);
#2150=STYLED_ITEM('',(#34),#2151);
#2151=ADVANCED_FACE('',(#2157),#2152,.T.);
#2152=PLANE('',#2153);
#2153=AXIS2_PLACEMENT_3D('',#2154,#2155,#2156);
#2154=CARTESIAN_POINT('',(-1.524,-1.127,0.051));
#2155=DIRECTION('',(0.0,0.0,1.0));
#2156=DIRECTION('',(0.,1.,0.));
#2157=FACE_OUTER_BOUND('',#2158,.T.);
#2158=EDGE_LOOP('',(#2159,#2169,#2179,#2189));
#2159=ORIENTED_EDGE('',*,*,#1935,.T.);
#2169=ORIENTED_EDGE('',*,*,#1984,.T.);
#2179=ORIENTED_EDGE('',*,*,#2033,.T.);
#2189=ORIENTED_EDGE('',*,*,#2082,.T.);
#2199=MANIFOLD_SOLID_BREP($,#2200);
#2200=CLOSED_SHELL('',(#2202,#2251,#2300,#2349,#2398,#2447));
#2201=STYLED_ITEM('',(#34),#2202);
#2202=ADVANCED_FACE('',(#2208),#2203,.T.);
#2203=PLANE('',#2204);
#2204=AXIS2_PLACEMENT_3D('',#2205,#2206,#2207);
#2205=CARTESIAN_POINT('',(-1.524,-0.627,0.0));
#2206=DIRECTION('',(0.0,-1.0,0.0));
#2207=DIRECTION('',(0.,0.,1.));
#2208=FACE_OUTER_BOUND('',#2209,.T.);
#2209=EDGE_LOOP('',(#2210,#2220,#2230,#2240));
#2213=CARTESIAN_POINT('',(-1.168,-0.627,0.0));
#2212=VERTEX_POINT('',#2213);
#2215=CARTESIAN_POINT('',(-1.524,-0.627,0.0));
#2214=VERTEX_POINT('',#2215);
#2211=EDGE_CURVE('',#2212,#2214,#2216,.T.);
#2216=LINE('',#2213,#2218);
#2218=VECTOR('',#2219,0.3556);
#2219=DIRECTION('',(-1.0,0.0,0.0));
#2210=ORIENTED_EDGE('',*,*,#2211,.F.);
#2223=CARTESIAN_POINT('',(-1.168,-0.627,0.051));
#2222=VERTEX_POINT('',#2223);
#2221=EDGE_CURVE('',#2222,#2212,#2226,.T.);
#2226=LINE('',#2223,#2228);
#2228=VECTOR('',#2229,0.0508);
#2229=DIRECTION('',(0.0,0.0,-1.0));
#2220=ORIENTED_EDGE('',*,*,#2221,.F.);
#2233=CARTESIAN_POINT('',(-1.524,-0.627,0.051));
#2232=VERTEX_POINT('',#2233);
#2231=EDGE_CURVE('',#2232,#2222,#2236,.T.);
#2236=LINE('',#2233,#2238);
#2238=VECTOR('',#2239,0.3556);
#2239=DIRECTION('',(1.0,0.0,0.0));
#2230=ORIENTED_EDGE('',*,*,#2231,.F.);
#2241=EDGE_CURVE('',#2214,#2232,#2246,.T.);
#2246=LINE('',#2215,#2248);
#2248=VECTOR('',#2249,0.0508);
#2249=DIRECTION('',(0.0,0.0,1.0));
#2240=ORIENTED_EDGE('',*,*,#2241,.F.);
#2250=STYLED_ITEM('',(#34),#2251);
#2251=ADVANCED_FACE('',(#2257),#2252,.T.);
#2252=PLANE('',#2253);
#2253=AXIS2_PLACEMENT_3D('',#2254,#2255,#2256);
#2254=CARTESIAN_POINT('',(-1.168,-0.627,0.0));
#2255=DIRECTION('',(1.0,0.0,0.0));
#2256=DIRECTION('',(0.,0.,1.));
#2257=FACE_OUTER_BOUND('',#2258,.T.);
#2258=EDGE_LOOP('',(#2259,#2269,#2279,#2289));
#2262=CARTESIAN_POINT('',(-1.168,-0.373,0.0));
#2261=VERTEX_POINT('',#2262);
#2260=EDGE_CURVE('',#2261,#2212,#2265,.T.);
#2265=LINE('',#2262,#2267);
#2267=VECTOR('',#2268,0.254);
#2268=DIRECTION('',(0.0,-1.0,0.0));
#2259=ORIENTED_EDGE('',*,*,#2260,.F.);
#2272=CARTESIAN_POINT('',(-1.168,-0.373,0.051));
#2271=VERTEX_POINT('',#2272);
#2270=EDGE_CURVE('',#2271,#2261,#2275,.T.);
#2275=LINE('',#2272,#2277);
#2277=VECTOR('',#2278,0.0508);
#2278=DIRECTION('',(0.0,0.0,-1.0));
#2269=ORIENTED_EDGE('',*,*,#2270,.F.);
#2280=EDGE_CURVE('',#2222,#2271,#2285,.T.);
#2285=LINE('',#2223,#2287);
#2287=VECTOR('',#2288,0.254);
#2288=DIRECTION('',(0.0,1.0,0.0));
#2279=ORIENTED_EDGE('',*,*,#2280,.F.);
#2289=ORIENTED_EDGE('',*,*,#2221,.T.);
#2299=STYLED_ITEM('',(#34),#2300);
#2300=ADVANCED_FACE('',(#2306),#2301,.T.);
#2301=PLANE('',#2302);
#2302=AXIS2_PLACEMENT_3D('',#2303,#2304,#2305);
#2303=CARTESIAN_POINT('',(-1.168,-0.373,0.0));
#2304=DIRECTION('',(0.0,1.0,0.0));
#2305=DIRECTION('',(0.,0.,1.));
#2306=FACE_OUTER_BOUND('',#2307,.T.);
#2307=EDGE_LOOP('',(#2308,#2318,#2328,#2338));
#2311=CARTESIAN_POINT('',(-1.524,-0.373,0.0));
#2310=VERTEX_POINT('',#2311);
#2309=EDGE_CURVE('',#2310,#2261,#2314,.T.);
#2314=LINE('',#2311,#2316);
#2316=VECTOR('',#2317,0.3556);
#2317=DIRECTION('',(1.0,0.0,0.0));
#2308=ORIENTED_EDGE('',*,*,#2309,.F.);
#2321=CARTESIAN_POINT('',(-1.524,-0.373,0.051));
#2320=VERTEX_POINT('',#2321);
#2319=EDGE_CURVE('',#2320,#2310,#2324,.T.);
#2324=LINE('',#2321,#2326);
#2326=VECTOR('',#2327,0.0508);
#2327=DIRECTION('',(0.0,0.0,-1.0));
#2318=ORIENTED_EDGE('',*,*,#2319,.F.);
#2329=EDGE_CURVE('',#2271,#2320,#2334,.T.);
#2334=LINE('',#2272,#2336);
#2336=VECTOR('',#2337,0.3556);
#2337=DIRECTION('',(-1.0,0.0,0.0));
#2328=ORIENTED_EDGE('',*,*,#2329,.F.);
#2338=ORIENTED_EDGE('',*,*,#2270,.T.);
#2348=STYLED_ITEM('',(#34),#2349);
#2349=ADVANCED_FACE('',(#2355),#2350,.T.);
#2350=PLANE('',#2351);
#2351=AXIS2_PLACEMENT_3D('',#2352,#2353,#2354);
#2352=CARTESIAN_POINT('',(-1.524,-0.373,0.0));
#2353=DIRECTION('',(-1.0,0.0,0.0));
#2354=DIRECTION('',(0.,0.,1.));
#2355=FACE_OUTER_BOUND('',#2356,.T.);
#2356=EDGE_LOOP('',(#2357,#2367,#2377,#2387));
#2358=EDGE_CURVE('',#2214,#2310,#2363,.T.);
#2363=LINE('',#2215,#2365);
#2365=VECTOR('',#2366,0.254);
#2366=DIRECTION('',(0.0,1.0,0.0));
#2357=ORIENTED_EDGE('',*,*,#2358,.F.);
#2367=ORIENTED_EDGE('',*,*,#2241,.T.);
#2378=EDGE_CURVE('',#2320,#2232,#2383,.T.);
#2383=LINE('',#2321,#2385);
#2385=VECTOR('',#2386,0.254);
#2386=DIRECTION('',(0.0,-1.0,0.0));
#2377=ORIENTED_EDGE('',*,*,#2378,.F.);
#2387=ORIENTED_EDGE('',*,*,#2319,.T.);
#2397=STYLED_ITEM('',(#34),#2398);
#2398=ADVANCED_FACE('',(#2404),#2399,.T.);
#2399=PLANE('',#2400);
#2400=AXIS2_PLACEMENT_3D('',#2401,#2402,#2403);
#2401=CARTESIAN_POINT('',(-1.524,-0.373,0.0));
#2402=DIRECTION('',(0.0,0.0,-1.0));
#2403=DIRECTION('',(0.,1.,0.));
#2404=FACE_OUTER_BOUND('',#2405,.T.);
#2405=EDGE_LOOP('',(#2406,#2416,#2426,#2436));
#2406=ORIENTED_EDGE('',*,*,#2309,.T.);
#2416=ORIENTED_EDGE('',*,*,#2260,.T.);
#2426=ORIENTED_EDGE('',*,*,#2211,.T.);
#2436=ORIENTED_EDGE('',*,*,#2358,.T.);
#2446=STYLED_ITEM('',(#34),#2447);
#2447=ADVANCED_FACE('',(#2453),#2448,.T.);
#2448=PLANE('',#2449);
#2449=AXIS2_PLACEMENT_3D('',#2450,#2451,#2452);
#2450=CARTESIAN_POINT('',(-1.524,-0.627,0.051));
#2451=DIRECTION('',(0.0,0.0,1.0));
#2452=DIRECTION('',(0.,1.,0.));
#2453=FACE_OUTER_BOUND('',#2454,.T.);
#2454=EDGE_LOOP('',(#2455,#2465,#2475,#2485));
#2455=ORIENTED_EDGE('',*,*,#2231,.T.);
#2465=ORIENTED_EDGE('',*,*,#2280,.T.);
#2475=ORIENTED_EDGE('',*,*,#2329,.T.);
#2485=ORIENTED_EDGE('',*,*,#2378,.T.);
#2495=MANIFOLD_SOLID_BREP($,#2496);
#2496=CLOSED_SHELL('',(#2498,#2547,#2596,#2645,#2694,#2743));
#2497=STYLED_ITEM('',(#34),#2498);
#2498=ADVANCED_FACE('',(#2504),#2499,.T.);
#2499=PLANE('',#2500);
#2500=AXIS2_PLACEMENT_3D('',#2501,#2502,#2503);
#2501=CARTESIAN_POINT('',(-1.524,-0.127,0.0));
#2502=DIRECTION('',(0.0,-1.0,0.0));
#2503=DIRECTION('',(0.,0.,1.));
#2504=FACE_OUTER_BOUND('',#2505,.T.);
#2505=EDGE_LOOP('',(#2506,#2516,#2526,#2536));
#2509=CARTESIAN_POINT('',(-1.168,-0.127,0.0));
#2508=VERTEX_POINT('',#2509);
#2511=CARTESIAN_POINT('',(-1.524,-0.127,0.0));
#2510=VERTEX_POINT('',#2511);
#2507=EDGE_CURVE('',#2508,#2510,#2512,.T.);
#2512=LINE('',#2509,#2514);
#2514=VECTOR('',#2515,0.3556);
#2515=DIRECTION('',(-1.0,0.0,0.0));
#2506=ORIENTED_EDGE('',*,*,#2507,.F.);
#2519=CARTESIAN_POINT('',(-1.168,-0.127,0.051));
#2518=VERTEX_POINT('',#2519);
#2517=EDGE_CURVE('',#2518,#2508,#2522,.T.);
#2522=LINE('',#2519,#2524);
#2524=VECTOR('',#2525,0.0508);
#2525=DIRECTION('',(0.0,0.0,-1.0));
#2516=ORIENTED_EDGE('',*,*,#2517,.F.);
#2529=CARTESIAN_POINT('',(-1.524,-0.127,0.051));
#2528=VERTEX_POINT('',#2529);
#2527=EDGE_CURVE('',#2528,#2518,#2532,.T.);
#2532=LINE('',#2529,#2534);
#2534=VECTOR('',#2535,0.3556);
#2535=DIRECTION('',(1.0,0.0,0.0));
#2526=ORIENTED_EDGE('',*,*,#2527,.F.);
#2537=EDGE_CURVE('',#2510,#2528,#2542,.T.);
#2542=LINE('',#2511,#2544);
#2544=VECTOR('',#2545,0.0508);
#2545=DIRECTION('',(0.0,0.0,1.0));
#2536=ORIENTED_EDGE('',*,*,#2537,.F.);
#2546=STYLED_ITEM('',(#34),#2547);
#2547=ADVANCED_FACE('',(#2553),#2548,.T.);
#2548=PLANE('',#2549);
#2549=AXIS2_PLACEMENT_3D('',#2550,#2551,#2552);
#2550=CARTESIAN_POINT('',(-1.168,-0.127,0.0));
#2551=DIRECTION('',(1.0,0.0,0.0));
#2552=DIRECTION('',(0.,0.,1.));
#2553=FACE_OUTER_BOUND('',#2554,.T.);
#2554=EDGE_LOOP('',(#2555,#2565,#2575,#2585));
#2558=CARTESIAN_POINT('',(-1.168,0.127,0.0));
#2557=VERTEX_POINT('',#2558);
#2556=EDGE_CURVE('',#2557,#2508,#2561,.T.);
#2561=LINE('',#2558,#2563);
#2563=VECTOR('',#2564,0.254);
#2564=DIRECTION('',(0.0,-1.0,0.0));
#2555=ORIENTED_EDGE('',*,*,#2556,.F.);
#2568=CARTESIAN_POINT('',(-1.168,0.127,0.051));
#2567=VERTEX_POINT('',#2568);
#2566=EDGE_CURVE('',#2567,#2557,#2571,.T.);
#2571=LINE('',#2568,#2573);
#2573=VECTOR('',#2574,0.0508);
#2574=DIRECTION('',(0.0,0.0,-1.0));
#2565=ORIENTED_EDGE('',*,*,#2566,.F.);
#2576=EDGE_CURVE('',#2518,#2567,#2581,.T.);
#2581=LINE('',#2519,#2583);
#2583=VECTOR('',#2584,0.254);
#2584=DIRECTION('',(0.0,1.0,0.0));
#2575=ORIENTED_EDGE('',*,*,#2576,.F.);
#2585=ORIENTED_EDGE('',*,*,#2517,.T.);
#2595=STYLED_ITEM('',(#34),#2596);
#2596=ADVANCED_FACE('',(#2602),#2597,.T.);
#2597=PLANE('',#2598);
#2598=AXIS2_PLACEMENT_3D('',#2599,#2600,#2601);
#2599=CARTESIAN_POINT('',(-1.168,0.127,0.0));
#2600=DIRECTION('',(0.0,1.0,0.0));
#2601=DIRECTION('',(0.,0.,1.));
#2602=FACE_OUTER_BOUND('',#2603,.T.);
#2603=EDGE_LOOP('',(#2604,#2614,#2624,#2634));
#2607=CARTESIAN_POINT('',(-1.524,0.127,0.0));
#2606=VERTEX_POINT('',#2607);
#2605=EDGE_CURVE('',#2606,#2557,#2610,.T.);
#2610=LINE('',#2607,#2612);
#2612=VECTOR('',#2613,0.3556);
#2613=DIRECTION('',(1.0,0.0,0.0));
#2604=ORIENTED_EDGE('',*,*,#2605,.F.);
#2617=CARTESIAN_POINT('',(-1.524,0.127,0.051));
#2616=VERTEX_POINT('',#2617);
#2615=EDGE_CURVE('',#2616,#2606,#2620,.T.);
#2620=LINE('',#2617,#2622);
#2622=VECTOR('',#2623,0.0508);
#2623=DIRECTION('',(0.0,0.0,-1.0));
#2614=ORIENTED_EDGE('',*,*,#2615,.F.);
#2625=EDGE_CURVE('',#2567,#2616,#2630,.T.);
#2630=LINE('',#2568,#2632);
#2632=VECTOR('',#2633,0.3556);
#2633=DIRECTION('',(-1.0,0.0,0.0));
#2624=ORIENTED_EDGE('',*,*,#2625,.F.);
#2634=ORIENTED_EDGE('',*,*,#2566,.T.);
#2644=STYLED_ITEM('',(#34),#2645);
#2645=ADVANCED_FACE('',(#2651),#2646,.T.);
#2646=PLANE('',#2647);
#2647=AXIS2_PLACEMENT_3D('',#2648,#2649,#2650);
#2648=CARTESIAN_POINT('',(-1.524,0.127,0.0));
#2649=DIRECTION('',(-1.0,0.0,0.0));
#2650=DIRECTION('',(0.,0.,1.));
#2651=FACE_OUTER_BOUND('',#2652,.T.);
#2652=EDGE_LOOP('',(#2653,#2663,#2673,#2683));
#2654=EDGE_CURVE('',#2510,#2606,#2659,.T.);
#2659=LINE('',#2511,#2661);
#2661=VECTOR('',#2662,0.254);
#2662=DIRECTION('',(0.0,1.0,0.0));
#2653=ORIENTED_EDGE('',*,*,#2654,.F.);
#2663=ORIENTED_EDGE('',*,*,#2537,.T.);
#2674=EDGE_CURVE('',#2616,#2528,#2679,.T.);
#2679=LINE('',#2617,#2681);
#2681=VECTOR('',#2682,0.254);
#2682=DIRECTION('',(0.0,-1.0,0.0));
#2673=ORIENTED_EDGE('',*,*,#2674,.F.);
#2683=ORIENTED_EDGE('',*,*,#2615,.T.);
#2693=STYLED_ITEM('',(#34),#2694);
#2694=ADVANCED_FACE('',(#2700),#2695,.T.);
#2695=PLANE('',#2696);
#2696=AXIS2_PLACEMENT_3D('',#2697,#2698,#2699);
#2697=CARTESIAN_POINT('',(-1.524,0.127,0.0));
#2698=DIRECTION('',(0.0,0.0,-1.0));
#2699=DIRECTION('',(0.,1.,0.));
#2700=FACE_OUTER_BOUND('',#2701,.T.);
#2701=EDGE_LOOP('',(#2702,#2712,#2722,#2732));
#2702=ORIENTED_EDGE('',*,*,#2605,.T.);
#2712=ORIENTED_EDGE('',*,*,#2556,.T.);
#2722=ORIENTED_EDGE('',*,*,#2507,.T.);
#2732=ORIENTED_EDGE('',*,*,#2654,.T.);
#2742=STYLED_ITEM('',(#34),#2743);
#2743=ADVANCED_FACE('',(#2749),#2744,.T.);
#2744=PLANE('',#2745);
#2745=AXIS2_PLACEMENT_3D('',#2746,#2747,#2748);
#2746=CARTESIAN_POINT('',(-1.524,-0.127,0.051));
#2747=DIRECTION('',(0.0,0.0,1.0));
#2748=DIRECTION('',(0.,1.,0.));
#2749=FACE_OUTER_BOUND('',#2750,.T.);
#2750=EDGE_LOOP('',(#2751,#2761,#2771,#2781));
#2751=ORIENTED_EDGE('',*,*,#2527,.T.);
#2761=ORIENTED_EDGE('',*,*,#2576,.T.);
#2771=ORIENTED_EDGE('',*,*,#2625,.T.);
#2781=ORIENTED_EDGE('',*,*,#2674,.T.);
#2791=MANIFOLD_SOLID_BREP($,#2792);
#2792=CLOSED_SHELL('',(#2794,#2843,#2892,#2941,#2990,#3039));
#2793=STYLED_ITEM('',(#34),#2794);
#2794=ADVANCED_FACE('',(#2800),#2795,.T.);
#2795=PLANE('',#2796);
#2796=AXIS2_PLACEMENT_3D('',#2797,#2798,#2799);
#2797=CARTESIAN_POINT('',(-1.524,0.373,0.0));
#2798=DIRECTION('',(0.0,-1.0,0.0));
#2799=DIRECTION('',(0.,0.,1.));
#2800=FACE_OUTER_BOUND('',#2801,.T.);
#2801=EDGE_LOOP('',(#2802,#2812,#2822,#2832));
#2805=CARTESIAN_POINT('',(-1.168,0.373,0.0));
#2804=VERTEX_POINT('',#2805);
#2807=CARTESIAN_POINT('',(-1.524,0.373,0.0));
#2806=VERTEX_POINT('',#2807);
#2803=EDGE_CURVE('',#2804,#2806,#2808,.T.);
#2808=LINE('',#2805,#2810);
#2810=VECTOR('',#2811,0.3556);
#2811=DIRECTION('',(-1.0,0.0,0.0));
#2802=ORIENTED_EDGE('',*,*,#2803,.F.);
#2815=CARTESIAN_POINT('',(-1.168,0.373,0.051));
#2814=VERTEX_POINT('',#2815);
#2813=EDGE_CURVE('',#2814,#2804,#2818,.T.);
#2818=LINE('',#2815,#2820);
#2820=VECTOR('',#2821,0.0508);
#2821=DIRECTION('',(0.0,0.0,-1.0));
#2812=ORIENTED_EDGE('',*,*,#2813,.F.);
#2825=CARTESIAN_POINT('',(-1.524,0.373,0.051));
#2824=VERTEX_POINT('',#2825);
#2823=EDGE_CURVE('',#2824,#2814,#2828,.T.);
#2828=LINE('',#2825,#2830);
#2830=VECTOR('',#2831,0.3556);
#2831=DIRECTION('',(1.0,0.0,0.0));
#2822=ORIENTED_EDGE('',*,*,#2823,.F.);
#2833=EDGE_CURVE('',#2806,#2824,#2838,.T.);
#2838=LINE('',#2807,#2840);
#2840=VECTOR('',#2841,0.0508);
#2841=DIRECTION('',(0.0,0.0,1.0));
#2832=ORIENTED_EDGE('',*,*,#2833,.F.);
#2842=STYLED_ITEM('',(#34),#2843);
#2843=ADVANCED_FACE('',(#2849),#2844,.T.);
#2844=PLANE('',#2845);
#2845=AXIS2_PLACEMENT_3D('',#2846,#2847,#2848);
#2846=CARTESIAN_POINT('',(-1.168,0.373,0.0));
#2847=DIRECTION('',(1.0,0.0,0.0));
#2848=DIRECTION('',(0.,0.,1.));
#2849=FACE_OUTER_BOUND('',#2850,.T.);
#2850=EDGE_LOOP('',(#2851,#2861,#2871,#2881));
#2854=CARTESIAN_POINT('',(-1.168,0.627,0.0));
#2853=VERTEX_POINT('',#2854);
#2852=EDGE_CURVE('',#2853,#2804,#2857,.T.);
#2857=LINE('',#2854,#2859);
#2859=VECTOR('',#2860,0.254);
#2860=DIRECTION('',(0.0,-1.0,0.0));
#2851=ORIENTED_EDGE('',*,*,#2852,.F.);
#2864=CARTESIAN_POINT('',(-1.168,0.627,0.051));
#2863=VERTEX_POINT('',#2864);
#2862=EDGE_CURVE('',#2863,#2853,#2867,.T.);
#2867=LINE('',#2864,#2869);
#2869=VECTOR('',#2870,0.0508);
#2870=DIRECTION('',(0.0,0.0,-1.0));
#2861=ORIENTED_EDGE('',*,*,#2862,.F.);
#2872=EDGE_CURVE('',#2814,#2863,#2877,.T.);
#2877=LINE('',#2815,#2879);
#2879=VECTOR('',#2880,0.254);
#2880=DIRECTION('',(0.0,1.0,0.0));
#2871=ORIENTED_EDGE('',*,*,#2872,.F.);
#2881=ORIENTED_EDGE('',*,*,#2813,.T.);
#2891=STYLED_ITEM('',(#34),#2892);
#2892=ADVANCED_FACE('',(#2898),#2893,.T.);
#2893=PLANE('',#2894);
#2894=AXIS2_PLACEMENT_3D('',#2895,#2896,#2897);
#2895=CARTESIAN_POINT('',(-1.168,0.627,0.0));
#2896=DIRECTION('',(0.0,1.0,0.0));
#2897=DIRECTION('',(0.,0.,1.));
#2898=FACE_OUTER_BOUND('',#2899,.T.);
#2899=EDGE_LOOP('',(#2900,#2910,#2920,#2930));
#2903=CARTESIAN_POINT('',(-1.524,0.627,0.0));
#2902=VERTEX_POINT('',#2903);
#2901=EDGE_CURVE('',#2902,#2853,#2906,.T.);
#2906=LINE('',#2903,#2908);
#2908=VECTOR('',#2909,0.3556);
#2909=DIRECTION('',(1.0,0.0,0.0));
#2900=ORIENTED_EDGE('',*,*,#2901,.F.);
#2913=CARTESIAN_POINT('',(-1.524,0.627,0.051));
#2912=VERTEX_POINT('',#2913);
#2911=EDGE_CURVE('',#2912,#2902,#2916,.T.);
#2916=LINE('',#2913,#2918);
#2918=VECTOR('',#2919,0.0508);
#2919=DIRECTION('',(0.0,0.0,-1.0));
#2910=ORIENTED_EDGE('',*,*,#2911,.F.);
#2921=EDGE_CURVE('',#2863,#2912,#2926,.T.);
#2926=LINE('',#2864,#2928);
#2928=VECTOR('',#2929,0.3556);
#2929=DIRECTION('',(-1.0,0.0,0.0));
#2920=ORIENTED_EDGE('',*,*,#2921,.F.);
#2930=ORIENTED_EDGE('',*,*,#2862,.T.);
#2940=STYLED_ITEM('',(#34),#2941);
#2941=ADVANCED_FACE('',(#2947),#2942,.T.);
#2942=PLANE('',#2943);
#2943=AXIS2_PLACEMENT_3D('',#2944,#2945,#2946);
#2944=CARTESIAN_POINT('',(-1.524,0.627,0.0));
#2945=DIRECTION('',(-1.0,0.0,0.0));
#2946=DIRECTION('',(0.,0.,1.));
#2947=FACE_OUTER_BOUND('',#2948,.T.);
#2948=EDGE_LOOP('',(#2949,#2959,#2969,#2979));
#2950=EDGE_CURVE('',#2806,#2902,#2955,.T.);
#2955=LINE('',#2807,#2957);
#2957=VECTOR('',#2958,0.254);
#2958=DIRECTION('',(0.0,1.0,0.0));
#2949=ORIENTED_EDGE('',*,*,#2950,.F.);
#2959=ORIENTED_EDGE('',*,*,#2833,.T.);
#2970=EDGE_CURVE('',#2912,#2824,#2975,.T.);
#2975=LINE('',#2913,#2977);
#2977=VECTOR('',#2978,0.254);
#2978=DIRECTION('',(0.0,-1.0,0.0));
#2969=ORIENTED_EDGE('',*,*,#2970,.F.);
#2979=ORIENTED_EDGE('',*,*,#2911,.T.);
#2989=STYLED_ITEM('',(#34),#2990);
#2990=ADVANCED_FACE('',(#2996),#2991,.T.);
#2991=PLANE('',#2992);
#2992=AXIS2_PLACEMENT_3D('',#2993,#2994,#2995);
#2993=CARTESIAN_POINT('',(-1.524,0.627,0.0));
#2994=DIRECTION('',(0.0,0.0,-1.0));
#2995=DIRECTION('',(0.,1.,0.));
#2996=FACE_OUTER_BOUND('',#2997,.T.);
#2997=EDGE_LOOP('',(#2998,#3008,#3018,#3028));
#2998=ORIENTED_EDGE('',*,*,#2901,.T.);
#3008=ORIENTED_EDGE('',*,*,#2852,.T.);
#3018=ORIENTED_EDGE('',*,*,#2803,.T.);
#3028=ORIENTED_EDGE('',*,*,#2950,.T.);
#3038=STYLED_ITEM('',(#34),#3039);
#3039=ADVANCED_FACE('',(#3045),#3040,.T.);
#3040=PLANE('',#3041);
#3041=AXIS2_PLACEMENT_3D('',#3042,#3043,#3044);
#3042=CARTESIAN_POINT('',(-1.524,0.373,0.051));
#3043=DIRECTION('',(0.0,0.0,1.0));
#3044=DIRECTION('',(0.,1.,0.));
#3045=FACE_OUTER_BOUND('',#3046,.T.);
#3046=EDGE_LOOP('',(#3047,#3057,#3067,#3077));
#3047=ORIENTED_EDGE('',*,*,#2823,.T.);
#3057=ORIENTED_EDGE('',*,*,#2872,.T.);
#3067=ORIENTED_EDGE('',*,*,#2921,.T.);
#3077=ORIENTED_EDGE('',*,*,#2970,.T.);
#3087=MANIFOLD_SOLID_BREP($,#3088);
#3088=CLOSED_SHELL('',(#3090,#3139,#3188,#3237,#3286,#3335));
#3089=STYLED_ITEM('',(#34),#3090);
#3090=ADVANCED_FACE('',(#3096),#3091,.T.);
#3091=PLANE('',#3092);
#3092=AXIS2_PLACEMENT_3D('',#3093,#3094,#3095);
#3093=CARTESIAN_POINT('',(-1.524,0.873,0.0));
#3094=DIRECTION('',(0.0,-1.0,0.0));
#3095=DIRECTION('',(0.,0.,1.));
#3096=FACE_OUTER_BOUND('',#3097,.T.);
#3097=EDGE_LOOP('',(#3098,#3108,#3118,#3128));
#3101=CARTESIAN_POINT('',(-1.168,0.873,0.0));
#3100=VERTEX_POINT('',#3101);
#3103=CARTESIAN_POINT('',(-1.524,0.873,0.0));
#3102=VERTEX_POINT('',#3103);
#3099=EDGE_CURVE('',#3100,#3102,#3104,.T.);
#3104=LINE('',#3101,#3106);
#3106=VECTOR('',#3107,0.3556);
#3107=DIRECTION('',(-1.0,0.0,0.0));
#3098=ORIENTED_EDGE('',*,*,#3099,.F.);
#3111=CARTESIAN_POINT('',(-1.168,0.873,0.051));
#3110=VERTEX_POINT('',#3111);
#3109=EDGE_CURVE('',#3110,#3100,#3114,.T.);
#3114=LINE('',#3111,#3116);
#3116=VECTOR('',#3117,0.0508);
#3117=DIRECTION('',(0.0,0.0,-1.0));
#3108=ORIENTED_EDGE('',*,*,#3109,.F.);
#3121=CARTESIAN_POINT('',(-1.524,0.873,0.051));
#3120=VERTEX_POINT('',#3121);
#3119=EDGE_CURVE('',#3120,#3110,#3124,.T.);
#3124=LINE('',#3121,#3126);
#3126=VECTOR('',#3127,0.3556);
#3127=DIRECTION('',(1.0,0.0,0.0));
#3118=ORIENTED_EDGE('',*,*,#3119,.F.);
#3129=EDGE_CURVE('',#3102,#3120,#3134,.T.);
#3134=LINE('',#3103,#3136);
#3136=VECTOR('',#3137,0.0508);
#3137=DIRECTION('',(0.0,0.0,1.0));
#3128=ORIENTED_EDGE('',*,*,#3129,.F.);
#3138=STYLED_ITEM('',(#34),#3139);
#3139=ADVANCED_FACE('',(#3145),#3140,.T.);
#3140=PLANE('',#3141);
#3141=AXIS2_PLACEMENT_3D('',#3142,#3143,#3144);
#3142=CARTESIAN_POINT('',(-1.168,0.873,0.0));
#3143=DIRECTION('',(1.0,0.0,0.0));
#3144=DIRECTION('',(0.,0.,1.));
#3145=FACE_OUTER_BOUND('',#3146,.T.);
#3146=EDGE_LOOP('',(#3147,#3157,#3167,#3177));
#3150=CARTESIAN_POINT('',(-1.168,1.127,0.0));
#3149=VERTEX_POINT('',#3150);
#3148=EDGE_CURVE('',#3149,#3100,#3153,.T.);
#3153=LINE('',#3150,#3155);
#3155=VECTOR('',#3156,0.254);
#3156=DIRECTION('',(0.0,-1.0,0.0));
#3147=ORIENTED_EDGE('',*,*,#3148,.F.);
#3160=CARTESIAN_POINT('',(-1.168,1.127,0.051));
#3159=VERTEX_POINT('',#3160);
#3158=EDGE_CURVE('',#3159,#3149,#3163,.T.);
#3163=LINE('',#3160,#3165);
#3165=VECTOR('',#3166,0.0508);
#3166=DIRECTION('',(0.0,0.0,-1.0));
#3157=ORIENTED_EDGE('',*,*,#3158,.F.);
#3168=EDGE_CURVE('',#3110,#3159,#3173,.T.);
#3173=LINE('',#3111,#3175);
#3175=VECTOR('',#3176,0.254);
#3176=DIRECTION('',(0.0,1.0,0.0));
#3167=ORIENTED_EDGE('',*,*,#3168,.F.);
#3177=ORIENTED_EDGE('',*,*,#3109,.T.);
#3187=STYLED_ITEM('',(#34),#3188);
#3188=ADVANCED_FACE('',(#3194),#3189,.T.);
#3189=PLANE('',#3190);
#3190=AXIS2_PLACEMENT_3D('',#3191,#3192,#3193);
#3191=CARTESIAN_POINT('',(-1.168,1.127,0.0));
#3192=DIRECTION('',(0.0,1.0,0.0));
#3193=DIRECTION('',(0.,0.,1.));
#3194=FACE_OUTER_BOUND('',#3195,.T.);
#3195=EDGE_LOOP('',(#3196,#3206,#3216,#3226));
#3199=CARTESIAN_POINT('',(-1.524,1.127,0.0));
#3198=VERTEX_POINT('',#3199);
#3197=EDGE_CURVE('',#3198,#3149,#3202,.T.);
#3202=LINE('',#3199,#3204);
#3204=VECTOR('',#3205,0.3556);
#3205=DIRECTION('',(1.0,0.0,0.0));
#3196=ORIENTED_EDGE('',*,*,#3197,.F.);
#3209=CARTESIAN_POINT('',(-1.524,1.127,0.051));
#3208=VERTEX_POINT('',#3209);
#3207=EDGE_CURVE('',#3208,#3198,#3212,.T.);
#3212=LINE('',#3209,#3214);
#3214=VECTOR('',#3215,0.0508);
#3215=DIRECTION('',(0.0,0.0,-1.0));
#3206=ORIENTED_EDGE('',*,*,#3207,.F.);
#3217=EDGE_CURVE('',#3159,#3208,#3222,.T.);
#3222=LINE('',#3160,#3224);
#3224=VECTOR('',#3225,0.3556);
#3225=DIRECTION('',(-1.0,0.0,0.0));
#3216=ORIENTED_EDGE('',*,*,#3217,.F.);
#3226=ORIENTED_EDGE('',*,*,#3158,.T.);
#3236=STYLED_ITEM('',(#34),#3237);
#3237=ADVANCED_FACE('',(#3243),#3238,.T.);
#3238=PLANE('',#3239);
#3239=AXIS2_PLACEMENT_3D('',#3240,#3241,#3242);
#3240=CARTESIAN_POINT('',(-1.524,1.127,0.0));
#3241=DIRECTION('',(-1.0,0.0,0.0));
#3242=DIRECTION('',(0.,0.,1.));
#3243=FACE_OUTER_BOUND('',#3244,.T.);
#3244=EDGE_LOOP('',(#3245,#3255,#3265,#3275));
#3246=EDGE_CURVE('',#3102,#3198,#3251,.T.);
#3251=LINE('',#3103,#3253);
#3253=VECTOR('',#3254,0.254);
#3254=DIRECTION('',(0.0,1.0,0.0));
#3245=ORIENTED_EDGE('',*,*,#3246,.F.);
#3255=ORIENTED_EDGE('',*,*,#3129,.T.);
#3266=EDGE_CURVE('',#3208,#3120,#3271,.T.);
#3271=LINE('',#3209,#3273);
#3273=VECTOR('',#3274,0.254);
#3274=DIRECTION('',(0.0,-1.0,0.0));
#3265=ORIENTED_EDGE('',*,*,#3266,.F.);
#3275=ORIENTED_EDGE('',*,*,#3207,.T.);
#3285=STYLED_ITEM('',(#34),#3286);
#3286=ADVANCED_FACE('',(#3292),#3287,.T.);
#3287=PLANE('',#3288);
#3288=AXIS2_PLACEMENT_3D('',#3289,#3290,#3291);
#3289=CARTESIAN_POINT('',(-1.524,1.127,0.0));
#3290=DIRECTION('',(0.0,0.0,-1.0));
#3291=DIRECTION('',(0.,1.,0.));
#3292=FACE_OUTER_BOUND('',#3293,.T.);
#3293=EDGE_LOOP('',(#3294,#3304,#3314,#3324));
#3294=ORIENTED_EDGE('',*,*,#3197,.T.);
#3304=ORIENTED_EDGE('',*,*,#3148,.T.);
#3314=ORIENTED_EDGE('',*,*,#3099,.T.);
#3324=ORIENTED_EDGE('',*,*,#3246,.T.);
#3334=STYLED_ITEM('',(#34),#3335);
#3335=ADVANCED_FACE('',(#3341),#3336,.T.);
#3336=PLANE('',#3337);
#3337=AXIS2_PLACEMENT_3D('',#3338,#3339,#3340);
#3338=CARTESIAN_POINT('',(-1.524,0.873,0.051));
#3339=DIRECTION('',(0.0,0.0,1.0));
#3340=DIRECTION('',(0.,1.,0.));
#3341=FACE_OUTER_BOUND('',#3342,.T.);
#3342=EDGE_LOOP('',(#3343,#3353,#3363,#3373));
#3343=ORIENTED_EDGE('',*,*,#3119,.T.);
#3353=ORIENTED_EDGE('',*,*,#3168,.T.);
#3363=ORIENTED_EDGE('',*,*,#3217,.T.);
#3373=ORIENTED_EDGE('',*,*,#3266,.T.);
#3383=MANIFOLD_SOLID_BREP($,#3384);
#3384=CLOSED_SHELL('',(#3386,#3435,#3484,#3533,#3582,#3631));
#3385=STYLED_ITEM('',(#34),#3386);
#3386=ADVANCED_FACE('',(#3392),#3387,.T.);
#3387=PLANE('',#3388);
#3388=AXIS2_PLACEMENT_3D('',#3389,#3390,#3391);
#3389=CARTESIAN_POINT('',(0.373,-1.524,0.0));
#3390=DIRECTION('',(0.0,-1.0,0.0));
#3391=DIRECTION('',(0.,0.,1.));
#3392=FACE_OUTER_BOUND('',#3393,.T.);
#3393=EDGE_LOOP('',(#3394,#3404,#3414,#3424));
#3397=CARTESIAN_POINT('',(0.627,-1.524,0.0));
#3396=VERTEX_POINT('',#3397);
#3399=CARTESIAN_POINT('',(0.373,-1.524,0.0));
#3398=VERTEX_POINT('',#3399);
#3395=EDGE_CURVE('',#3396,#3398,#3400,.T.);
#3400=LINE('',#3397,#3402);
#3402=VECTOR('',#3403,0.254);
#3403=DIRECTION('',(-1.0,0.0,0.0));
#3394=ORIENTED_EDGE('',*,*,#3395,.F.);
#3407=CARTESIAN_POINT('',(0.627,-1.524,0.051));
#3406=VERTEX_POINT('',#3407);
#3405=EDGE_CURVE('',#3406,#3396,#3410,.T.);
#3410=LINE('',#3407,#3412);
#3412=VECTOR('',#3413,0.0508);
#3413=DIRECTION('',(0.0,0.0,-1.0));
#3404=ORIENTED_EDGE('',*,*,#3405,.F.);
#3417=CARTESIAN_POINT('',(0.373,-1.524,0.051));
#3416=VERTEX_POINT('',#3417);
#3415=EDGE_CURVE('',#3416,#3406,#3420,.T.);
#3420=LINE('',#3417,#3422);
#3422=VECTOR('',#3423,0.254);
#3423=DIRECTION('',(1.0,0.0,0.0));
#3414=ORIENTED_EDGE('',*,*,#3415,.F.);
#3425=EDGE_CURVE('',#3398,#3416,#3430,.T.);
#3430=LINE('',#3399,#3432);
#3432=VECTOR('',#3433,0.0508);
#3433=DIRECTION('',(0.0,0.0,1.0));
#3424=ORIENTED_EDGE('',*,*,#3425,.F.);
#3434=STYLED_ITEM('',(#34),#3435);
#3435=ADVANCED_FACE('',(#3441),#3436,.T.);
#3436=PLANE('',#3437);
#3437=AXIS2_PLACEMENT_3D('',#3438,#3439,#3440);
#3438=CARTESIAN_POINT('',(0.627,-1.524,0.0));
#3439=DIRECTION('',(1.0,0.0,0.0));
#3440=DIRECTION('',(0.,0.,1.));
#3441=FACE_OUTER_BOUND('',#3442,.T.);
#3442=EDGE_LOOP('',(#3443,#3453,#3463,#3473));
#3446=CARTESIAN_POINT('',(0.627,-1.168,0.0));
#3445=VERTEX_POINT('',#3446);
#3444=EDGE_CURVE('',#3445,#3396,#3449,.T.);
#3449=LINE('',#3446,#3451);
#3451=VECTOR('',#3452,0.3556);
#3452=DIRECTION('',(0.0,-1.0,0.0));
#3443=ORIENTED_EDGE('',*,*,#3444,.F.);
#3456=CARTESIAN_POINT('',(0.627,-1.168,0.051));
#3455=VERTEX_POINT('',#3456);
#3454=EDGE_CURVE('',#3455,#3445,#3459,.T.);
#3459=LINE('',#3456,#3461);
#3461=VECTOR('',#3462,0.0508);
#3462=DIRECTION('',(0.0,0.0,-1.0));
#3453=ORIENTED_EDGE('',*,*,#3454,.F.);
#3464=EDGE_CURVE('',#3406,#3455,#3469,.T.);
#3469=LINE('',#3407,#3471);
#3471=VECTOR('',#3472,0.3556);
#3472=DIRECTION('',(0.0,1.0,0.0));
#3463=ORIENTED_EDGE('',*,*,#3464,.F.);
#3473=ORIENTED_EDGE('',*,*,#3405,.T.);
#3483=STYLED_ITEM('',(#34),#3484);
#3484=ADVANCED_FACE('',(#3490),#3485,.T.);
#3485=PLANE('',#3486);
#3486=AXIS2_PLACEMENT_3D('',#3487,#3488,#3489);
#3487=CARTESIAN_POINT('',(0.627,-1.168,0.0));
#3488=DIRECTION('',(0.0,1.0,0.0));
#3489=DIRECTION('',(0.,0.,1.));
#3490=FACE_OUTER_BOUND('',#3491,.T.);
#3491=EDGE_LOOP('',(#3492,#3502,#3512,#3522));
#3495=CARTESIAN_POINT('',(0.373,-1.168,0.0));
#3494=VERTEX_POINT('',#3495);
#3493=EDGE_CURVE('',#3494,#3445,#3498,.T.);
#3498=LINE('',#3495,#3500);
#3500=VECTOR('',#3501,0.254);
#3501=DIRECTION('',(1.0,0.0,0.0));
#3492=ORIENTED_EDGE('',*,*,#3493,.F.);
#3505=CARTESIAN_POINT('',(0.373,-1.168,0.051));
#3504=VERTEX_POINT('',#3505);
#3503=EDGE_CURVE('',#3504,#3494,#3508,.T.);
#3508=LINE('',#3505,#3510);
#3510=VECTOR('',#3511,0.0508);
#3511=DIRECTION('',(0.0,0.0,-1.0));
#3502=ORIENTED_EDGE('',*,*,#3503,.F.);
#3513=EDGE_CURVE('',#3455,#3504,#3518,.T.);
#3518=LINE('',#3456,#3520);
#3520=VECTOR('',#3521,0.254);
#3521=DIRECTION('',(-1.0,0.0,0.0));
#3512=ORIENTED_EDGE('',*,*,#3513,.F.);
#3522=ORIENTED_EDGE('',*,*,#3454,.T.);
#3532=STYLED_ITEM('',(#34),#3533);
#3533=ADVANCED_FACE('',(#3539),#3534,.T.);
#3534=PLANE('',#3535);
#3535=AXIS2_PLACEMENT_3D('',#3536,#3537,#3538);
#3536=CARTESIAN_POINT('',(0.373,-1.168,0.0));
#3537=DIRECTION('',(-1.0,0.0,0.0));
#3538=DIRECTION('',(0.,0.,1.));
#3539=FACE_OUTER_BOUND('',#3540,.T.);
#3540=EDGE_LOOP('',(#3541,#3551,#3561,#3571));
#3542=EDGE_CURVE('',#3398,#3494,#3547,.T.);
#3547=LINE('',#3399,#3549);
#3549=VECTOR('',#3550,0.3556);
#3550=DIRECTION('',(0.0,1.0,0.0));
#3541=ORIENTED_EDGE('',*,*,#3542,.F.);
#3551=ORIENTED_EDGE('',*,*,#3425,.T.);
#3562=EDGE_CURVE('',#3504,#3416,#3567,.T.);
#3567=LINE('',#3505,#3569);
#3569=VECTOR('',#3570,0.3556);
#3570=DIRECTION('',(0.0,-1.0,0.0));
#3561=ORIENTED_EDGE('',*,*,#3562,.F.);
#3571=ORIENTED_EDGE('',*,*,#3503,.T.);
#3581=STYLED_ITEM('',(#34),#3582);
#3582=ADVANCED_FACE('',(#3588),#3583,.T.);
#3583=PLANE('',#3584);
#3584=AXIS2_PLACEMENT_3D('',#3585,#3586,#3587);
#3585=CARTESIAN_POINT('',(0.373,-1.168,0.0));
#3586=DIRECTION('',(0.0,0.0,-1.0));
#3587=DIRECTION('',(0.,1.,0.));
#3588=FACE_OUTER_BOUND('',#3589,.T.);
#3589=EDGE_LOOP('',(#3590,#3600,#3610,#3620));
#3590=ORIENTED_EDGE('',*,*,#3493,.T.);
#3600=ORIENTED_EDGE('',*,*,#3444,.T.);
#3610=ORIENTED_EDGE('',*,*,#3395,.T.);
#3620=ORIENTED_EDGE('',*,*,#3542,.T.);
#3630=STYLED_ITEM('',(#34),#3631);
#3631=ADVANCED_FACE('',(#3637),#3632,.T.);
#3632=PLANE('',#3633);
#3633=AXIS2_PLACEMENT_3D('',#3634,#3635,#3636);
#3634=CARTESIAN_POINT('',(0.373,-1.524,0.051));
#3635=DIRECTION('',(0.0,0.0,1.0));
#3636=DIRECTION('',(0.,1.,0.));
#3637=FACE_OUTER_BOUND('',#3638,.T.);
#3638=EDGE_LOOP('',(#3639,#3649,#3659,#3669));
#3639=ORIENTED_EDGE('',*,*,#3415,.T.);
#3649=ORIENTED_EDGE('',*,*,#3464,.T.);
#3659=ORIENTED_EDGE('',*,*,#3513,.T.);
#3669=ORIENTED_EDGE('',*,*,#3562,.T.);
#3679=MANIFOLD_SOLID_BREP($,#3680);
#3680=CLOSED_SHELL('',(#3682,#3731,#3780,#3829,#3878,#3927));
#3681=STYLED_ITEM('',(#34),#3682);
#3682=ADVANCED_FACE('',(#3688),#3683,.T.);
#3683=PLANE('',#3684);
#3684=AXIS2_PLACEMENT_3D('',#3685,#3686,#3687);
#3685=CARTESIAN_POINT('',(-0.127,-1.524,0.0));
#3686=DIRECTION('',(0.0,-1.0,0.0));
#3687=DIRECTION('',(0.,0.,1.));
#3688=FACE_OUTER_BOUND('',#3689,.T.);
#3689=EDGE_LOOP('',(#3690,#3700,#3710,#3720));
#3693=CARTESIAN_POINT('',(0.127,-1.524,0.0));
#3692=VERTEX_POINT('',#3693);
#3695=CARTESIAN_POINT('',(-0.127,-1.524,0.0));
#3694=VERTEX_POINT('',#3695);
#3691=EDGE_CURVE('',#3692,#3694,#3696,.T.);
#3696=LINE('',#3693,#3698);
#3698=VECTOR('',#3699,0.254);
#3699=DIRECTION('',(-1.0,0.0,0.0));
#3690=ORIENTED_EDGE('',*,*,#3691,.F.);
#3703=CARTESIAN_POINT('',(0.127,-1.524,0.051));
#3702=VERTEX_POINT('',#3703);
#3701=EDGE_CURVE('',#3702,#3692,#3706,.T.);
#3706=LINE('',#3703,#3708);
#3708=VECTOR('',#3709,0.0508);
#3709=DIRECTION('',(0.0,0.0,-1.0));
#3700=ORIENTED_EDGE('',*,*,#3701,.F.);
#3713=CARTESIAN_POINT('',(-0.127,-1.524,0.051));
#3712=VERTEX_POINT('',#3713);
#3711=EDGE_CURVE('',#3712,#3702,#3716,.T.);
#3716=LINE('',#3713,#3718);
#3718=VECTOR('',#3719,0.254);
#3719=DIRECTION('',(1.0,0.0,0.0));
#3710=ORIENTED_EDGE('',*,*,#3711,.F.);
#3721=EDGE_CURVE('',#3694,#3712,#3726,.T.);
#3726=LINE('',#3695,#3728);
#3728=VECTOR('',#3729,0.0508);
#3729=DIRECTION('',(0.0,0.0,1.0));
#3720=ORIENTED_EDGE('',*,*,#3721,.F.);
#3730=STYLED_ITEM('',(#34),#3731);
#3731=ADVANCED_FACE('',(#3737),#3732,.T.);
#3732=PLANE('',#3733);
#3733=AXIS2_PLACEMENT_3D('',#3734,#3735,#3736);
#3734=CARTESIAN_POINT('',(0.127,-1.524,0.0));
#3735=DIRECTION('',(1.0,0.0,0.0));
#3736=DIRECTION('',(0.,0.,1.));
#3737=FACE_OUTER_BOUND('',#3738,.T.);
#3738=EDGE_LOOP('',(#3739,#3749,#3759,#3769));
#3742=CARTESIAN_POINT('',(0.127,-1.168,0.0));
#3741=VERTEX_POINT('',#3742);
#3740=EDGE_CURVE('',#3741,#3692,#3745,.T.);
#3745=LINE('',#3742,#3747);
#3747=VECTOR('',#3748,0.3556);
#3748=DIRECTION('',(0.0,-1.0,0.0));
#3739=ORIENTED_EDGE('',*,*,#3740,.F.);
#3752=CARTESIAN_POINT('',(0.127,-1.168,0.051));
#3751=VERTEX_POINT('',#3752);
#3750=EDGE_CURVE('',#3751,#3741,#3755,.T.);
#3755=LINE('',#3752,#3757);
#3757=VECTOR('',#3758,0.0508);
#3758=DIRECTION('',(0.0,0.0,-1.0));
#3749=ORIENTED_EDGE('',*,*,#3750,.F.);
#3760=EDGE_CURVE('',#3702,#3751,#3765,.T.);
#3765=LINE('',#3703,#3767);
#3767=VECTOR('',#3768,0.3556);
#3768=DIRECTION('',(0.0,1.0,0.0));
#3759=ORIENTED_EDGE('',*,*,#3760,.F.);
#3769=ORIENTED_EDGE('',*,*,#3701,.T.);
#3779=STYLED_ITEM('',(#34),#3780);
#3780=ADVANCED_FACE('',(#3786),#3781,.T.);
#3781=PLANE('',#3782);
#3782=AXIS2_PLACEMENT_3D('',#3783,#3784,#3785);
#3783=CARTESIAN_POINT('',(0.127,-1.168,0.0));
#3784=DIRECTION('',(0.0,1.0,0.0));
#3785=DIRECTION('',(0.,0.,1.));
#3786=FACE_OUTER_BOUND('',#3787,.T.);
#3787=EDGE_LOOP('',(#3788,#3798,#3808,#3818));
#3791=CARTESIAN_POINT('',(-0.127,-1.168,0.0));
#3790=VERTEX_POINT('',#3791);
#3789=EDGE_CURVE('',#3790,#3741,#3794,.T.);
#3794=LINE('',#3791,#3796);
#3796=VECTOR('',#3797,0.254);
#3797=DIRECTION('',(1.0,0.0,0.0));
#3788=ORIENTED_EDGE('',*,*,#3789,.F.);
#3801=CARTESIAN_POINT('',(-0.127,-1.168,0.051));
#3800=VERTEX_POINT('',#3801);
#3799=EDGE_CURVE('',#3800,#3790,#3804,.T.);
#3804=LINE('',#3801,#3806);
#3806=VECTOR('',#3807,0.0508);
#3807=DIRECTION('',(0.0,0.0,-1.0));
#3798=ORIENTED_EDGE('',*,*,#3799,.F.);
#3809=EDGE_CURVE('',#3751,#3800,#3814,.T.);
#3814=LINE('',#3752,#3816);
#3816=VECTOR('',#3817,0.254);
#3817=DIRECTION('',(-1.0,0.0,0.0));
#3808=ORIENTED_EDGE('',*,*,#3809,.F.);
#3818=ORIENTED_EDGE('',*,*,#3750,.T.);
#3828=STYLED_ITEM('',(#34),#3829);
#3829=ADVANCED_FACE('',(#3835),#3830,.T.);
#3830=PLANE('',#3831);
#3831=AXIS2_PLACEMENT_3D('',#3832,#3833,#3834);
#3832=CARTESIAN_POINT('',(-0.127,-1.168,0.0));
#3833=DIRECTION('',(-1.0,0.0,0.0));
#3834=DIRECTION('',(0.,0.,1.));
#3835=FACE_OUTER_BOUND('',#3836,.T.);
#3836=EDGE_LOOP('',(#3837,#3847,#3857,#3867));
#3838=EDGE_CURVE('',#3694,#3790,#3843,.T.);
#3843=LINE('',#3695,#3845);
#3845=VECTOR('',#3846,0.3556);
#3846=DIRECTION('',(0.0,1.0,0.0));
#3837=ORIENTED_EDGE('',*,*,#3838,.F.);
#3847=ORIENTED_EDGE('',*,*,#3721,.T.);
#3858=EDGE_CURVE('',#3800,#3712,#3863,.T.);
#3863=LINE('',#3801,#3865);
#3865=VECTOR('',#3866,0.3556);
#3866=DIRECTION('',(0.0,-1.0,0.0));
#3857=ORIENTED_EDGE('',*,*,#3858,.F.);
#3867=ORIENTED_EDGE('',*,*,#3799,.T.);
#3877=STYLED_ITEM('',(#34),#3878);
#3878=ADVANCED_FACE('',(#3884),#3879,.T.);
#3879=PLANE('',#3880);
#3880=AXIS2_PLACEMENT_3D('',#3881,#3882,#3883);
#3881=CARTESIAN_POINT('',(-0.127,-1.168,0.0));
#3882=DIRECTION('',(0.0,0.0,-1.0));
#3883=DIRECTION('',(0.,1.,0.));
#3884=FACE_OUTER_BOUND('',#3885,.T.);
#3885=EDGE_LOOP('',(#3886,#3896,#3906,#3916));
#3886=ORIENTED_EDGE('',*,*,#3789,.T.);
#3896=ORIENTED_EDGE('',*,*,#3740,.T.);
#3906=ORIENTED_EDGE('',*,*,#3691,.T.);
#3916=ORIENTED_EDGE('',*,*,#3838,.T.);
#3926=STYLED_ITEM('',(#34),#3927);
#3927=ADVANCED_FACE('',(#3933),#3928,.T.);
#3928=PLANE('',#3929);
#3929=AXIS2_PLACEMENT_3D('',#3930,#3931,#3932);
#3930=CARTESIAN_POINT('',(-0.127,-1.524,0.051));
#3931=DIRECTION('',(0.0,0.0,1.0));
#3932=DIRECTION('',(0.,1.,0.));
#3933=FACE_OUTER_BOUND('',#3934,.T.);
#3934=EDGE_LOOP('',(#3935,#3945,#3955,#3965));
#3935=ORIENTED_EDGE('',*,*,#3711,.T.);
#3945=ORIENTED_EDGE('',*,*,#3760,.T.);
#3955=ORIENTED_EDGE('',*,*,#3809,.T.);
#3965=ORIENTED_EDGE('',*,*,#3858,.T.);
#3975=MANIFOLD_SOLID_BREP($,#3976);
#3976=CLOSED_SHELL('',(#3978,#4027,#4076,#4125,#4174,#4223));
#3977=STYLED_ITEM('',(#34),#3978);
#3978=ADVANCED_FACE('',(#3984),#3979,.T.);
#3979=PLANE('',#3980);
#3980=AXIS2_PLACEMENT_3D('',#3981,#3982,#3983);
#3981=CARTESIAN_POINT('',(-0.627,-1.524,0.0));
#3982=DIRECTION('',(0.0,-1.0,0.0));
#3983=DIRECTION('',(0.,0.,1.));
#3984=FACE_OUTER_BOUND('',#3985,.T.);
#3985=EDGE_LOOP('',(#3986,#3996,#4006,#4016));
#3989=CARTESIAN_POINT('',(-0.373,-1.524,0.0));
#3988=VERTEX_POINT('',#3989);
#3991=CARTESIAN_POINT('',(-0.627,-1.524,0.0));
#3990=VERTEX_POINT('',#3991);
#3987=EDGE_CURVE('',#3988,#3990,#3992,.T.);
#3992=LINE('',#3989,#3994);
#3994=VECTOR('',#3995,0.254);
#3995=DIRECTION('',(-1.0,0.0,0.0));
#3986=ORIENTED_EDGE('',*,*,#3987,.F.);
#3999=CARTESIAN_POINT('',(-0.373,-1.524,0.051));
#3998=VERTEX_POINT('',#3999);
#3997=EDGE_CURVE('',#3998,#3988,#4002,.T.);
#4002=LINE('',#3999,#4004);
#4004=VECTOR('',#4005,0.0508);
#4005=DIRECTION('',(0.0,0.0,-1.0));
#3996=ORIENTED_EDGE('',*,*,#3997,.F.);
#4009=CARTESIAN_POINT('',(-0.627,-1.524,0.051));
#4008=VERTEX_POINT('',#4009);
#4007=EDGE_CURVE('',#4008,#3998,#4012,.T.);
#4012=LINE('',#4009,#4014);
#4014=VECTOR('',#4015,0.254);
#4015=DIRECTION('',(1.0,0.0,0.0));
#4006=ORIENTED_EDGE('',*,*,#4007,.F.);
#4017=EDGE_CURVE('',#3990,#4008,#4022,.T.);
#4022=LINE('',#3991,#4024);
#4024=VECTOR('',#4025,0.0508);
#4025=DIRECTION('',(0.0,0.0,1.0));
#4016=ORIENTED_EDGE('',*,*,#4017,.F.);
#4026=STYLED_ITEM('',(#34),#4027);
#4027=ADVANCED_FACE('',(#4033),#4028,.T.);
#4028=PLANE('',#4029);
#4029=AXIS2_PLACEMENT_3D('',#4030,#4031,#4032);
#4030=CARTESIAN_POINT('',(-0.373,-1.524,0.0));
#4031=DIRECTION('',(1.0,0.0,0.0));
#4032=DIRECTION('',(0.,0.,1.));
#4033=FACE_OUTER_BOUND('',#4034,.T.);
#4034=EDGE_LOOP('',(#4035,#4045,#4055,#4065));
#4038=CARTESIAN_POINT('',(-0.373,-1.168,0.0));
#4037=VERTEX_POINT('',#4038);
#4036=EDGE_CURVE('',#4037,#3988,#4041,.T.);
#4041=LINE('',#4038,#4043);
#4043=VECTOR('',#4044,0.3556);
#4044=DIRECTION('',(0.0,-1.0,0.0));
#4035=ORIENTED_EDGE('',*,*,#4036,.F.);
#4048=CARTESIAN_POINT('',(-0.373,-1.168,0.051));
#4047=VERTEX_POINT('',#4048);
#4046=EDGE_CURVE('',#4047,#4037,#4051,.T.);
#4051=LINE('',#4048,#4053);
#4053=VECTOR('',#4054,0.0508);
#4054=DIRECTION('',(0.0,0.0,-1.0));
#4045=ORIENTED_EDGE('',*,*,#4046,.F.);
#4056=EDGE_CURVE('',#3998,#4047,#4061,.T.);
#4061=LINE('',#3999,#4063);
#4063=VECTOR('',#4064,0.3556);
#4064=DIRECTION('',(0.0,1.0,0.0));
#4055=ORIENTED_EDGE('',*,*,#4056,.F.);
#4065=ORIENTED_EDGE('',*,*,#3997,.T.);
#4075=STYLED_ITEM('',(#34),#4076);
#4076=ADVANCED_FACE('',(#4082),#4077,.T.);
#4077=PLANE('',#4078);
#4078=AXIS2_PLACEMENT_3D('',#4079,#4080,#4081);
#4079=CARTESIAN_POINT('',(-0.373,-1.168,0.0));
#4080=DIRECTION('',(0.0,1.0,0.0));
#4081=DIRECTION('',(0.,0.,1.));
#4082=FACE_OUTER_BOUND('',#4083,.T.);
#4083=EDGE_LOOP('',(#4084,#4094,#4104,#4114));
#4087=CARTESIAN_POINT('',(-0.627,-1.168,0.0));
#4086=VERTEX_POINT('',#4087);
#4085=EDGE_CURVE('',#4086,#4037,#4090,.T.);
#4090=LINE('',#4087,#4092);
#4092=VECTOR('',#4093,0.254);
#4093=DIRECTION('',(1.0,0.0,0.0));
#4084=ORIENTED_EDGE('',*,*,#4085,.F.);
#4097=CARTESIAN_POINT('',(-0.627,-1.168,0.051));
#4096=VERTEX_POINT('',#4097);
#4095=EDGE_CURVE('',#4096,#4086,#4100,.T.);
#4100=LINE('',#4097,#4102);
#4102=VECTOR('',#4103,0.0508);
#4103=DIRECTION('',(0.0,0.0,-1.0));
#4094=ORIENTED_EDGE('',*,*,#4095,.F.);
#4105=EDGE_CURVE('',#4047,#4096,#4110,.T.);
#4110=LINE('',#4048,#4112);
#4112=VECTOR('',#4113,0.254);
#4113=DIRECTION('',(-1.0,0.0,0.0));
#4104=ORIENTED_EDGE('',*,*,#4105,.F.);
#4114=ORIENTED_EDGE('',*,*,#4046,.T.);
#4124=STYLED_ITEM('',(#34),#4125);
#4125=ADVANCED_FACE('',(#4131),#4126,.T.);
#4126=PLANE('',#4127);
#4127=AXIS2_PLACEMENT_3D('',#4128,#4129,#4130);
#4128=CARTESIAN_POINT('',(-0.627,-1.168,0.0));
#4129=DIRECTION('',(-1.0,0.0,0.0));
#4130=DIRECTION('',(0.,0.,1.));
#4131=FACE_OUTER_BOUND('',#4132,.T.);
#4132=EDGE_LOOP('',(#4133,#4143,#4153,#4163));
#4134=EDGE_CURVE('',#3990,#4086,#4139,.T.);
#4139=LINE('',#3991,#4141);
#4141=VECTOR('',#4142,0.3556);
#4142=DIRECTION('',(0.0,1.0,0.0));
#4133=ORIENTED_EDGE('',*,*,#4134,.F.);
#4143=ORIENTED_EDGE('',*,*,#4017,.T.);
#4154=EDGE_CURVE('',#4096,#4008,#4159,.T.);
#4159=LINE('',#4097,#4161);
#4161=VECTOR('',#4162,0.3556);
#4162=DIRECTION('',(0.0,-1.0,0.0));
#4153=ORIENTED_EDGE('',*,*,#4154,.F.);
#4163=ORIENTED_EDGE('',*,*,#4095,.T.);
#4173=STYLED_ITEM('',(#34),#4174);
#4174=ADVANCED_FACE('',(#4180),#4175,.T.);
#4175=PLANE('',#4176);
#4176=AXIS2_PLACEMENT_3D('',#4177,#4178,#4179);
#4177=CARTESIAN_POINT('',(-0.627,-1.168,0.0));
#4178=DIRECTION('',(0.0,0.0,-1.0));
#4179=DIRECTION('',(0.,1.,0.));
#4180=FACE_OUTER_BOUND('',#4181,.T.);
#4181=EDGE_LOOP('',(#4182,#4192,#4202,#4212));
#4182=ORIENTED_EDGE('',*,*,#4085,.T.);
#4192=ORIENTED_EDGE('',*,*,#4036,.T.);
#4202=ORIENTED_EDGE('',*,*,#3987,.T.);
#4212=ORIENTED_EDGE('',*,*,#4134,.T.);
#4222=STYLED_ITEM('',(#34),#4223);
#4223=ADVANCED_FACE('',(#4229),#4224,.T.);
#4224=PLANE('',#4225);
#4225=AXIS2_PLACEMENT_3D('',#4226,#4227,#4228);
#4226=CARTESIAN_POINT('',(-0.627,-1.524,0.051));
#4227=DIRECTION('',(0.0,0.0,1.0));
#4228=DIRECTION('',(0.,1.,0.));
#4229=FACE_OUTER_BOUND('',#4230,.T.);
#4230=EDGE_LOOP('',(#4231,#4241,#4251,#4261));
#4231=ORIENTED_EDGE('',*,*,#4007,.T.);
#4241=ORIENTED_EDGE('',*,*,#4056,.T.);
#4251=ORIENTED_EDGE('',*,*,#4105,.T.);
#4261=ORIENTED_EDGE('',*,*,#4154,.T.);
#4271=MANIFOLD_SOLID_BREP($,#4272);
#4272=CLOSED_SHELL('',(#4274,#4323,#4372,#4421,#4470,#4519));
#4273=STYLED_ITEM('',(#34),#4274);
#4274=ADVANCED_FACE('',(#4280),#4275,.T.);
#4275=PLANE('',#4276);
#4276=AXIS2_PLACEMENT_3D('',#4277,#4278,#4279);
#4277=CARTESIAN_POINT('',(-0.627,1.168,0.0));
#4278=DIRECTION('',(0.0,-1.0,0.0));
#4279=DIRECTION('',(0.,0.,1.));
#4280=FACE_OUTER_BOUND('',#4281,.T.);
#4281=EDGE_LOOP('',(#4282,#4292,#4302,#4312));
#4285=CARTESIAN_POINT('',(-0.373,1.168,0.0));
#4284=VERTEX_POINT('',#4285);
#4287=CARTESIAN_POINT('',(-0.627,1.168,0.0));
#4286=VERTEX_POINT('',#4287);
#4283=EDGE_CURVE('',#4284,#4286,#4288,.T.);
#4288=LINE('',#4285,#4290);
#4290=VECTOR('',#4291,0.254);
#4291=DIRECTION('',(-1.0,0.0,0.0));
#4282=ORIENTED_EDGE('',*,*,#4283,.F.);
#4295=CARTESIAN_POINT('',(-0.373,1.168,0.051));
#4294=VERTEX_POINT('',#4295);
#4293=EDGE_CURVE('',#4294,#4284,#4298,.T.);
#4298=LINE('',#4295,#4300);
#4300=VECTOR('',#4301,0.0508);
#4301=DIRECTION('',(0.0,0.0,-1.0));
#4292=ORIENTED_EDGE('',*,*,#4293,.F.);
#4305=CARTESIAN_POINT('',(-0.627,1.168,0.051));
#4304=VERTEX_POINT('',#4305);
#4303=EDGE_CURVE('',#4304,#4294,#4308,.T.);
#4308=LINE('',#4305,#4310);
#4310=VECTOR('',#4311,0.254);
#4311=DIRECTION('',(1.0,0.0,0.0));
#4302=ORIENTED_EDGE('',*,*,#4303,.F.);
#4313=EDGE_CURVE('',#4286,#4304,#4318,.T.);
#4318=LINE('',#4287,#4320);
#4320=VECTOR('',#4321,0.0508);
#4321=DIRECTION('',(0.0,0.0,1.0));
#4312=ORIENTED_EDGE('',*,*,#4313,.F.);
#4322=STYLED_ITEM('',(#34),#4323);
#4323=ADVANCED_FACE('',(#4329),#4324,.T.);
#4324=PLANE('',#4325);
#4325=AXIS2_PLACEMENT_3D('',#4326,#4327,#4328);
#4326=CARTESIAN_POINT('',(-0.373,1.168,0.0));
#4327=DIRECTION('',(1.0,0.0,0.0));
#4328=DIRECTION('',(0.,0.,1.));
#4329=FACE_OUTER_BOUND('',#4330,.T.);
#4330=EDGE_LOOP('',(#4331,#4341,#4351,#4361));
#4334=CARTESIAN_POINT('',(-0.373,1.524,0.0));
#4333=VERTEX_POINT('',#4334);
#4332=EDGE_CURVE('',#4333,#4284,#4337,.T.);
#4337=LINE('',#4334,#4339);
#4339=VECTOR('',#4340,0.3556);
#4340=DIRECTION('',(0.0,-1.0,0.0));
#4331=ORIENTED_EDGE('',*,*,#4332,.F.);
#4344=CARTESIAN_POINT('',(-0.373,1.524,0.051));
#4343=VERTEX_POINT('',#4344);
#4342=EDGE_CURVE('',#4343,#4333,#4347,.T.);
#4347=LINE('',#4344,#4349);
#4349=VECTOR('',#4350,0.0508);
#4350=DIRECTION('',(0.0,0.0,-1.0));
#4341=ORIENTED_EDGE('',*,*,#4342,.F.);
#4352=EDGE_CURVE('',#4294,#4343,#4357,.T.);
#4357=LINE('',#4295,#4359);
#4359=VECTOR('',#4360,0.3556);
#4360=DIRECTION('',(0.0,1.0,0.0));
#4351=ORIENTED_EDGE('',*,*,#4352,.F.);
#4361=ORIENTED_EDGE('',*,*,#4293,.T.);
#4371=STYLED_ITEM('',(#34),#4372);
#4372=ADVANCED_FACE('',(#4378),#4373,.T.);
#4373=PLANE('',#4374);
#4374=AXIS2_PLACEMENT_3D('',#4375,#4376,#4377);
#4375=CARTESIAN_POINT('',(-0.373,1.524,0.0));
#4376=DIRECTION('',(0.0,1.0,0.0));
#4377=DIRECTION('',(0.,0.,1.));
#4378=FACE_OUTER_BOUND('',#4379,.T.);
#4379=EDGE_LOOP('',(#4380,#4390,#4400,#4410));
#4383=CARTESIAN_POINT('',(-0.627,1.524,0.0));
#4382=VERTEX_POINT('',#4383);
#4381=EDGE_CURVE('',#4382,#4333,#4386,.T.);
#4386=LINE('',#4383,#4388);
#4388=VECTOR('',#4389,0.254);
#4389=DIRECTION('',(1.0,0.0,0.0));
#4380=ORIENTED_EDGE('',*,*,#4381,.F.);
#4393=CARTESIAN_POINT('',(-0.627,1.524,0.051));
#4392=VERTEX_POINT('',#4393);
#4391=EDGE_CURVE('',#4392,#4382,#4396,.T.);
#4396=LINE('',#4393,#4398);
#4398=VECTOR('',#4399,0.0508);
#4399=DIRECTION('',(0.0,0.0,-1.0));
#4390=ORIENTED_EDGE('',*,*,#4391,.F.);
#4401=EDGE_CURVE('',#4343,#4392,#4406,.T.);
#4406=LINE('',#4344,#4408);
#4408=VECTOR('',#4409,0.254);
#4409=DIRECTION('',(-1.0,0.0,0.0));
#4400=ORIENTED_EDGE('',*,*,#4401,.F.);
#4410=ORIENTED_EDGE('',*,*,#4342,.T.);
#4420=STYLED_ITEM('',(#34),#4421);
#4421=ADVANCED_FACE('',(#4427),#4422,.T.);
#4422=PLANE('',#4423);
#4423=AXIS2_PLACEMENT_3D('',#4424,#4425,#4426);
#4424=CARTESIAN_POINT('',(-0.627,1.524,0.0));
#4425=DIRECTION('',(-1.0,0.0,0.0));
#4426=DIRECTION('',(0.,0.,1.));
#4427=FACE_OUTER_BOUND('',#4428,.T.);
#4428=EDGE_LOOP('',(#4429,#4439,#4449,#4459));
#4430=EDGE_CURVE('',#4286,#4382,#4435,.T.);
#4435=LINE('',#4287,#4437);
#4437=VECTOR('',#4438,0.3556);
#4438=DIRECTION('',(0.0,1.0,0.0));
#4429=ORIENTED_EDGE('',*,*,#4430,.F.);
#4439=ORIENTED_EDGE('',*,*,#4313,.T.);
#4450=EDGE_CURVE('',#4392,#4304,#4455,.T.);
#4455=LINE('',#4393,#4457);
#4457=VECTOR('',#4458,0.3556);
#4458=DIRECTION('',(0.0,-1.0,0.0));
#4449=ORIENTED_EDGE('',*,*,#4450,.F.);
#4459=ORIENTED_EDGE('',*,*,#4391,.T.);
#4469=STYLED_ITEM('',(#34),#4470);
#4470=ADVANCED_FACE('',(#4476),#4471,.T.);
#4471=PLANE('',#4472);
#4472=AXIS2_PLACEMENT_3D('',#4473,#4474,#4475);
#4473=CARTESIAN_POINT('',(-0.627,1.524,0.0));
#4474=DIRECTION('',(0.0,0.0,-1.0));
#4475=DIRECTION('',(0.,1.,0.));
#4476=FACE_OUTER_BOUND('',#4477,.T.);
#4477=EDGE_LOOP('',(#4478,#4488,#4498,#4508));
#4478=ORIENTED_EDGE('',*,*,#4381,.T.);
#4488=ORIENTED_EDGE('',*,*,#4332,.T.);
#4498=ORIENTED_EDGE('',*,*,#4283,.T.);
#4508=ORIENTED_EDGE('',*,*,#4430,.T.);
#4518=STYLED_ITEM('',(#34),#4519);
#4519=ADVANCED_FACE('',(#4525),#4520,.T.);
#4520=PLANE('',#4521);
#4521=AXIS2_PLACEMENT_3D('',#4522,#4523,#4524);
#4522=CARTESIAN_POINT('',(-0.627,1.168,0.051));
#4523=DIRECTION('',(0.0,0.0,1.0));
#4524=DIRECTION('',(0.,1.,0.));
#4525=FACE_OUTER_BOUND('',#4526,.T.);
#4526=EDGE_LOOP('',(#4527,#4537,#4547,#4557));
#4527=ORIENTED_EDGE('',*,*,#4303,.T.);
#4537=ORIENTED_EDGE('',*,*,#4352,.T.);
#4547=ORIENTED_EDGE('',*,*,#4401,.T.);
#4557=ORIENTED_EDGE('',*,*,#4450,.T.);
#4567=MANIFOLD_SOLID_BREP($,#4568);
#4568=CLOSED_SHELL('',(#4570,#4619,#4668,#4717,#4766,#4815));
#4569=STYLED_ITEM('',(#34),#4570);
#4570=ADVANCED_FACE('',(#4576),#4571,.T.);
#4571=PLANE('',#4572);
#4572=AXIS2_PLACEMENT_3D('',#4573,#4574,#4575);
#4573=CARTESIAN_POINT('',(-0.127,1.168,0.0));
#4574=DIRECTION('',(0.0,-1.0,0.0));
#4575=DIRECTION('',(0.,0.,1.));
#4576=FACE_OUTER_BOUND('',#4577,.T.);
#4577=EDGE_LOOP('',(#4578,#4588,#4598,#4608));
#4581=CARTESIAN_POINT('',(0.127,1.168,0.0));
#4580=VERTEX_POINT('',#4581);
#4583=CARTESIAN_POINT('',(-0.127,1.168,0.0));
#4582=VERTEX_POINT('',#4583);
#4579=EDGE_CURVE('',#4580,#4582,#4584,.T.);
#4584=LINE('',#4581,#4586);
#4586=VECTOR('',#4587,0.254);
#4587=DIRECTION('',(-1.0,0.0,0.0));
#4578=ORIENTED_EDGE('',*,*,#4579,.F.);
#4591=CARTESIAN_POINT('',(0.127,1.168,0.051));
#4590=VERTEX_POINT('',#4591);
#4589=EDGE_CURVE('',#4590,#4580,#4594,.T.);
#4594=LINE('',#4591,#4596);
#4596=VECTOR('',#4597,0.0508);
#4597=DIRECTION('',(0.0,0.0,-1.0));
#4588=ORIENTED_EDGE('',*,*,#4589,.F.);
#4601=CARTESIAN_POINT('',(-0.127,1.168,0.051));
#4600=VERTEX_POINT('',#4601);
#4599=EDGE_CURVE('',#4600,#4590,#4604,.T.);
#4604=LINE('',#4601,#4606);
#4606=VECTOR('',#4607,0.254);
#4607=DIRECTION('',(1.0,0.0,0.0));
#4598=ORIENTED_EDGE('',*,*,#4599,.F.);
#4609=EDGE_CURVE('',#4582,#4600,#4614,.T.);
#4614=LINE('',#4583,#4616);
#4616=VECTOR('',#4617,0.0508);
#4617=DIRECTION('',(0.0,0.0,1.0));
#4608=ORIENTED_EDGE('',*,*,#4609,.F.);
#4618=STYLED_ITEM('',(#34),#4619);
#4619=ADVANCED_FACE('',(#4625),#4620,.T.);
#4620=PLANE('',#4621);
#4621=AXIS2_PLACEMENT_3D('',#4622,#4623,#4624);
#4622=CARTESIAN_POINT('',(0.127,1.168,0.0));
#4623=DIRECTION('',(1.0,0.0,0.0));
#4624=DIRECTION('',(0.,0.,1.));
#4625=FACE_OUTER_BOUND('',#4626,.T.);
#4626=EDGE_LOOP('',(#4627,#4637,#4647,#4657));
#4630=CARTESIAN_POINT('',(0.127,1.524,0.0));
#4629=VERTEX_POINT('',#4630);
#4628=EDGE_CURVE('',#4629,#4580,#4633,.T.);
#4633=LINE('',#4630,#4635);
#4635=VECTOR('',#4636,0.3556);
#4636=DIRECTION('',(0.0,-1.0,0.0));
#4627=ORIENTED_EDGE('',*,*,#4628,.F.);
#4640=CARTESIAN_POINT('',(0.127,1.524,0.051));
#4639=VERTEX_POINT('',#4640);
#4638=EDGE_CURVE('',#4639,#4629,#4643,.T.);
#4643=LINE('',#4640,#4645);
#4645=VECTOR('',#4646,0.0508);
#4646=DIRECTION('',(0.0,0.0,-1.0));
#4637=ORIENTED_EDGE('',*,*,#4638,.F.);
#4648=EDGE_CURVE('',#4590,#4639,#4653,.T.);
#4653=LINE('',#4591,#4655);
#4655=VECTOR('',#4656,0.3556);
#4656=DIRECTION('',(0.0,1.0,0.0));
#4647=ORIENTED_EDGE('',*,*,#4648,.F.);
#4657=ORIENTED_EDGE('',*,*,#4589,.T.);
#4667=STYLED_ITEM('',(#34),#4668);
#4668=ADVANCED_FACE('',(#4674),#4669,.T.);
#4669=PLANE('',#4670);
#4670=AXIS2_PLACEMENT_3D('',#4671,#4672,#4673);
#4671=CARTESIAN_POINT('',(0.127,1.524,0.0));
#4672=DIRECTION('',(0.0,1.0,0.0));
#4673=DIRECTION('',(0.,0.,1.));
#4674=FACE_OUTER_BOUND('',#4675,.T.);
#4675=EDGE_LOOP('',(#4676,#4686,#4696,#4706));
#4679=CARTESIAN_POINT('',(-0.127,1.524,0.0));
#4678=VERTEX_POINT('',#4679);
#4677=EDGE_CURVE('',#4678,#4629,#4682,.T.);
#4682=LINE('',#4679,#4684);
#4684=VECTOR('',#4685,0.254);
#4685=DIRECTION('',(1.0,0.0,0.0));
#4676=ORIENTED_EDGE('',*,*,#4677,.F.);
#4689=CARTESIAN_POINT('',(-0.127,1.524,0.051));
#4688=VERTEX_POINT('',#4689);
#4687=EDGE_CURVE('',#4688,#4678,#4692,.T.);
#4692=LINE('',#4689,#4694);
#4694=VECTOR('',#4695,0.0508);
#4695=DIRECTION('',(0.0,0.0,-1.0));
#4686=ORIENTED_EDGE('',*,*,#4687,.F.);
#4697=EDGE_CURVE('',#4639,#4688,#4702,.T.);
#4702=LINE('',#4640,#4704);
#4704=VECTOR('',#4705,0.254);
#4705=DIRECTION('',(-1.0,0.0,0.0));
#4696=ORIENTED_EDGE('',*,*,#4697,.F.);
#4706=ORIENTED_EDGE('',*,*,#4638,.T.);
#4716=STYLED_ITEM('',(#34),#4717);
#4717=ADVANCED_FACE('',(#4723),#4718,.T.);
#4718=PLANE('',#4719);
#4719=AXIS2_PLACEMENT_3D('',#4720,#4721,#4722);
#4720=CARTESIAN_POINT('',(-0.127,1.524,0.0));
#4721=DIRECTION('',(-1.0,0.0,0.0));
#4722=DIRECTION('',(0.,0.,1.));
#4723=FACE_OUTER_BOUND('',#4724,.T.);
#4724=EDGE_LOOP('',(#4725,#4735,#4745,#4755));
#4726=EDGE_CURVE('',#4582,#4678,#4731,.T.);
#4731=LINE('',#4583,#4733);
#4733=VECTOR('',#4734,0.3556);
#4734=DIRECTION('',(0.0,1.0,0.0));
#4725=ORIENTED_EDGE('',*,*,#4726,.F.);
#4735=ORIENTED_EDGE('',*,*,#4609,.T.);
#4746=EDGE_CURVE('',#4688,#4600,#4751,.T.);
#4751=LINE('',#4689,#4753);
#4753=VECTOR('',#4754,0.3556);
#4754=DIRECTION('',(0.0,-1.0,0.0));
#4745=ORIENTED_EDGE('',*,*,#4746,.F.);
#4755=ORIENTED_EDGE('',*,*,#4687,.T.);
#4765=STYLED_ITEM('',(#34),#4766);
#4766=ADVANCED_FACE('',(#4772),#4767,.T.);
#4767=PLANE('',#4768);
#4768=AXIS2_PLACEMENT_3D('',#4769,#4770,#4771);
#4769=CARTESIAN_POINT('',(-0.127,1.524,0.0));
#4770=DIRECTION('',(0.0,0.0,-1.0));
#4771=DIRECTION('',(0.,1.,0.));
#4772=FACE_OUTER_BOUND('',#4773,.T.);
#4773=EDGE_LOOP('',(#4774,#4784,#4794,#4804));
#4774=ORIENTED_EDGE('',*,*,#4677,.T.);
#4784=ORIENTED_EDGE('',*,*,#4628,.T.);
#4794=ORIENTED_EDGE('',*,*,#4579,.T.);
#4804=ORIENTED_EDGE('',*,*,#4726,.T.);
#4814=STYLED_ITEM('',(#34),#4815);
#4815=ADVANCED_FACE('',(#4821),#4816,.T.);
#4816=PLANE('',#4817);
#4817=AXIS2_PLACEMENT_3D('',#4818,#4819,#4820);
#4818=CARTESIAN_POINT('',(-0.127,1.168,0.051));
#4819=DIRECTION('',(0.0,0.0,1.0));
#4820=DIRECTION('',(0.,1.,0.));
#4821=FACE_OUTER_BOUND('',#4822,.T.);
#4822=EDGE_LOOP('',(#4823,#4833,#4843,#4853));
#4823=ORIENTED_EDGE('',*,*,#4599,.T.);
#4833=ORIENTED_EDGE('',*,*,#4648,.T.);
#4843=ORIENTED_EDGE('',*,*,#4697,.T.);
#4853=ORIENTED_EDGE('',*,*,#4746,.T.);
#4863=MANIFOLD_SOLID_BREP($,#4864);
#4864=CLOSED_SHELL('',(#4866,#4915,#4964,#5013,#5062,#5111));
#4865=STYLED_ITEM('',(#34),#4866);
#4866=ADVANCED_FACE('',(#4872),#4867,.T.);
#4867=PLANE('',#4868);
#4868=AXIS2_PLACEMENT_3D('',#4869,#4870,#4871);
#4869=CARTESIAN_POINT('',(0.373,1.168,0.0));
#4870=DIRECTION('',(0.0,-1.0,0.0));
#4871=DIRECTION('',(0.,0.,1.));
#4872=FACE_OUTER_BOUND('',#4873,.T.);
#4873=EDGE_LOOP('',(#4874,#4884,#4894,#4904));
#4877=CARTESIAN_POINT('',(0.627,1.168,0.0));
#4876=VERTEX_POINT('',#4877);
#4879=CARTESIAN_POINT('',(0.373,1.168,0.0));
#4878=VERTEX_POINT('',#4879);
#4875=EDGE_CURVE('',#4876,#4878,#4880,.T.);
#4880=LINE('',#4877,#4882);
#4882=VECTOR('',#4883,0.254);
#4883=DIRECTION('',(-1.0,0.0,0.0));
#4874=ORIENTED_EDGE('',*,*,#4875,.F.);
#4887=CARTESIAN_POINT('',(0.627,1.168,0.051));
#4886=VERTEX_POINT('',#4887);
#4885=EDGE_CURVE('',#4886,#4876,#4890,.T.);
#4890=LINE('',#4887,#4892);
#4892=VECTOR('',#4893,0.0508);
#4893=DIRECTION('',(0.0,0.0,-1.0));
#4884=ORIENTED_EDGE('',*,*,#4885,.F.);
#4897=CARTESIAN_POINT('',(0.373,1.168,0.051));
#4896=VERTEX_POINT('',#4897);
#4895=EDGE_CURVE('',#4896,#4886,#4900,.T.);
#4900=LINE('',#4897,#4902);
#4902=VECTOR('',#4903,0.254);
#4903=DIRECTION('',(1.0,0.0,0.0));
#4894=ORIENTED_EDGE('',*,*,#4895,.F.);
#4905=EDGE_CURVE('',#4878,#4896,#4910,.T.);
#4910=LINE('',#4879,#4912);
#4912=VECTOR('',#4913,0.0508);
#4913=DIRECTION('',(0.0,0.0,1.0));
#4904=ORIENTED_EDGE('',*,*,#4905,.F.);
#4914=STYLED_ITEM('',(#34),#4915);
#4915=ADVANCED_FACE('',(#4921),#4916,.T.);
#4916=PLANE('',#4917);
#4917=AXIS2_PLACEMENT_3D('',#4918,#4919,#4920);
#4918=CARTESIAN_POINT('',(0.627,1.168,0.0));
#4919=DIRECTION('',(1.0,0.0,0.0));
#4920=DIRECTION('',(0.,0.,1.));
#4921=FACE_OUTER_BOUND('',#4922,.T.);
#4922=EDGE_LOOP('',(#4923,#4933,#4943,#4953));
#4926=CARTESIAN_POINT('',(0.627,1.524,0.0));
#4925=VERTEX_POINT('',#4926);
#4924=EDGE_CURVE('',#4925,#4876,#4929,.T.);
#4929=LINE('',#4926,#4931);
#4931=VECTOR('',#4932,0.3556);
#4932=DIRECTION('',(0.0,-1.0,0.0));
#4923=ORIENTED_EDGE('',*,*,#4924,.F.);
#4936=CARTESIAN_POINT('',(0.627,1.524,0.051));
#4935=VERTEX_POINT('',#4936);
#4934=EDGE_CURVE('',#4935,#4925,#4939,.T.);
#4939=LINE('',#4936,#4941);
#4941=VECTOR('',#4942,0.0508);
#4942=DIRECTION('',(0.0,0.0,-1.0));
#4933=ORIENTED_EDGE('',*,*,#4934,.F.);
#4944=EDGE_CURVE('',#4886,#4935,#4949,.T.);
#4949=LINE('',#4887,#4951);
#4951=VECTOR('',#4952,0.3556);
#4952=DIRECTION('',(0.0,1.0,0.0));
#4943=ORIENTED_EDGE('',*,*,#4944,.F.);
#4953=ORIENTED_EDGE('',*,*,#4885,.T.);
#4963=STYLED_ITEM('',(#34),#4964);
#4964=ADVANCED_FACE('',(#4970),#4965,.T.);
#4965=PLANE('',#4966);
#4966=AXIS2_PLACEMENT_3D('',#4967,#4968,#4969);
#4967=CARTESIAN_POINT('',(0.627,1.524,0.0));
#4968=DIRECTION('',(0.0,1.0,0.0));
#4969=DIRECTION('',(0.,0.,1.));
#4970=FACE_OUTER_BOUND('',#4971,.T.);
#4971=EDGE_LOOP('',(#4972,#4982,#4992,#5002));
#4975=CARTESIAN_POINT('',(0.373,1.524,0.0));
#4974=VERTEX_POINT('',#4975);
#4973=EDGE_CURVE('',#4974,#4925,#4978,.T.);
#4978=LINE('',#4975,#4980);
#4980=VECTOR('',#4981,0.254);
#4981=DIRECTION('',(1.0,0.0,0.0));
#4972=ORIENTED_EDGE('',*,*,#4973,.F.);
#4985=CARTESIAN_POINT('',(0.373,1.524,0.051));
#4984=VERTEX_POINT('',#4985);
#4983=EDGE_CURVE('',#4984,#4974,#4988,.T.);
#4988=LINE('',#4985,#4990);
#4990=VECTOR('',#4991,0.0508);
#4991=DIRECTION('',(0.0,0.0,-1.0));
#4982=ORIENTED_EDGE('',*,*,#4983,.F.);
#4993=EDGE_CURVE('',#4935,#4984,#4998,.T.);
#4998=LINE('',#4936,#5000);
#5000=VECTOR('',#5001,0.254);
#5001=DIRECTION('',(-1.0,0.0,0.0));
#4992=ORIENTED_EDGE('',*,*,#4993,.F.);
#5002=ORIENTED_EDGE('',*,*,#4934,.T.);
#5012=STYLED_ITEM('',(#34),#5013);
#5013=ADVANCED_FACE('',(#5019),#5014,.T.);
#5014=PLANE('',#5015);
#5015=AXIS2_PLACEMENT_3D('',#5016,#5017,#5018);
#5016=CARTESIAN_POINT('',(0.373,1.524,0.0));
#5017=DIRECTION('',(-1.0,0.0,0.0));
#5018=DIRECTION('',(0.,0.,1.));
#5019=FACE_OUTER_BOUND('',#5020,.T.);
#5020=EDGE_LOOP('',(#5021,#5031,#5041,#5051));
#5022=EDGE_CURVE('',#4878,#4974,#5027,.T.);
#5027=LINE('',#4879,#5029);
#5029=VECTOR('',#5030,0.3556);
#5030=DIRECTION('',(0.0,1.0,0.0));
#5021=ORIENTED_EDGE('',*,*,#5022,.F.);
#5031=ORIENTED_EDGE('',*,*,#4905,.T.);
#5042=EDGE_CURVE('',#4984,#4896,#5047,.T.);
#5047=LINE('',#4985,#5049);
#5049=VECTOR('',#5050,0.3556);
#5050=DIRECTION('',(0.0,-1.0,0.0));
#5041=ORIENTED_EDGE('',*,*,#5042,.F.);
#5051=ORIENTED_EDGE('',*,*,#4983,.T.);
#5061=STYLED_ITEM('',(#34),#5062);
#5062=ADVANCED_FACE('',(#5068),#5063,.T.);
#5063=PLANE('',#5064);
#5064=AXIS2_PLACEMENT_3D('',#5065,#5066,#5067);
#5065=CARTESIAN_POINT('',(0.373,1.524,0.0));
#5066=DIRECTION('',(0.0,0.0,-1.0));
#5067=DIRECTION('',(0.,1.,0.));
#5068=FACE_OUTER_BOUND('',#5069,.T.);
#5069=EDGE_LOOP('',(#5070,#5080,#5090,#5100));
#5070=ORIENTED_EDGE('',*,*,#4973,.T.);
#5080=ORIENTED_EDGE('',*,*,#4924,.T.);
#5090=ORIENTED_EDGE('',*,*,#4875,.T.);
#5100=ORIENTED_EDGE('',*,*,#5022,.T.);
#5110=STYLED_ITEM('',(#34),#5111);
#5111=ADVANCED_FACE('',(#5117),#5112,.T.);
#5112=PLANE('',#5113);
#5113=AXIS2_PLACEMENT_3D('',#5114,#5115,#5116);
#5114=CARTESIAN_POINT('',(0.373,1.168,0.051));
#5115=DIRECTION('',(0.0,0.0,1.0));
#5116=DIRECTION('',(0.,1.,0.));
#5117=FACE_OUTER_BOUND('',#5118,.T.);
#5118=EDGE_LOOP('',(#5119,#5129,#5139,#5149));
#5119=ORIENTED_EDGE('',*,*,#4895,.T.);
#5129=ORIENTED_EDGE('',*,*,#4944,.T.);
#5139=ORIENTED_EDGE('',*,*,#4993,.T.);
#5149=ORIENTED_EDGE('',*,*,#5042,.T.);
ENDSEC;
END-ISO-10303-21;
