ISO-10303-21;
HEADER;
FILE_DESCRIPTION (( 'STEP AP214' ),
    '1' );
FILE_NAME ('575-4.STEP',
    '2007-12-10T17:14:54',
    ( 'Richard Maletta' ),
    ( '' ),
    'SwSTEP 2.0',
    'SolidWorks 2007',
    '' );
FILE_SCHEMA (( 'AUTOMOTIVE_DESIGN' ));
ENDSEC;

DATA;
#1 = EDGE_CURVE ( 'NONE', #238, #48, #120, .T. ) ;
#2 = ORIENTED_EDGE ( 'NONE', *, *, #8, .T. ) ;
#3 = EDGE_LOOP ( 'NONE', ( #30, #31 ) ) ;
#4 = ORIENTED_EDGE ( 'NONE', *, *, #1, .F. ) ;
#5 = ORIENTED_EDGE ( 'NONE', *, *, #24, .T. ) ;
#6 = ORIENTED_EDGE ( 'NONE', *, *, #51, .T. ) ;
#7 = ADVANCED_FACE ( 'NONE', ( #121, #204 ), #170, .T. ) ;
#8 = EDGE_CURVE ( 'NONE', #49, #52, #245, .T. ) ;
#9 = EDGE_CURVE ( 'NONE', #95, #83, #241, .T. ) ;
#10 = ORIENTED_EDGE ( 'NONE', *, *, #85, .F. ) ;
#11 = ADVANCED_FACE ( 'NONE', ( #237 ), #216, .F. ) ;
#12 = EDGE_LOOP ( 'NONE', ( #26, #27, #33, #34 ) ) ;
#13 = ORIENTED_EDGE ( 'NONE', *, *, #25, .T. ) ;
#14 = ORIENTED_EDGE ( 'NONE', *, *, #1, .T. ) ;
#15 = EDGE_LOOP ( 'NONE', ( #16, #10 ) ) ;
#16 = ORIENTED_EDGE ( 'NONE', *, *, #9, .F. ) ;
#17 = ORIENTED_EDGE ( 'NONE', *, *, #74, .T. ) ;
#18 = ORIENTED_EDGE ( 'NONE', *, *, #44, .T. ) ;
#19 = EDGE_LOOP ( 'NONE', ( #164, #165 ) ) ;
#20 = ADVANCED_FACE ( 'NONE', ( #212, #211 ), #232, .T. ) ;
#21 = EDGE_LOOP ( 'NONE', ( #22, #14 ) ) ;
#22 = ORIENTED_EDGE ( 'NONE', *, *, #29, .T. ) ;
#23 = ORIENTED_EDGE ( 'NONE', *, *, #24, .F. ) ;
#24 = EDGE_CURVE ( 'NONE', #87, #48, #162, .T. ) ;
#25 = EDGE_CURVE ( 'NONE', #89, #238, #158, .T. ) ;
#26 = ORIENTED_EDGE ( 'NONE', *, *, #82, .F. ) ;
#27 = ORIENTED_EDGE ( 'NONE', *, *, #28, .F. ) ;
#28 = EDGE_CURVE ( 'NONE', #60, #59, #202, .T. ) ;
#29 = EDGE_CURVE ( 'NONE', #48, #238, #197, .T. ) ;
#30 = ORIENTED_EDGE ( 'NONE', *, *, #86, .F. ) ;
#31 = ORIENTED_EDGE ( 'NONE', *, *, #231, .F. ) ;
#32 = CLOSED_SHELL ( 'NONE', ( #71, #55, #78, #93, #38, #20, #11, #35, #45, #118, #7 ) ) ;
#33 = ORIENTED_EDGE ( 'NONE', *, *, #92, .T. ) ;
#34 = ORIENTED_EDGE ( 'NONE', *, *, #9, .T. ) ;
#35 = ADVANCED_FACE ( 'NONE', ( #192 ), #191, .F. ) ;
#36 = EDGE_LOOP ( 'NONE', ( #37, #41, #42, #43 ) ) ;
#37 = ORIENTED_EDGE ( 'NONE', *, *, #62, .F. ) ;
#38 = ADVANCED_FACE ( 'NONE', ( #190 ), #189, .T. ) ;
#39 = EDGE_LOOP ( 'NONE', ( #40, #240, #5, #4 ) ) ;
#40 = ORIENTED_EDGE ( 'NONE', *, *, #25, .F. ) ;
#41 = ORIENTED_EDGE ( 'NONE', *, *, #28, .T. ) ;
#42 = ORIENTED_EDGE ( 'NONE', *, *, #77, .T. ) ;
#43 = ORIENTED_EDGE ( 'NONE', *, *, #44, .F. ) ;
#44 = EDGE_CURVE ( 'NONE', #63, #75, #151, .T. ) ;
#45 = ADVANCED_FACE ( 'NONE', ( #147, #146 ), #145, .T. ) ;
#46 = EDGE_LOOP ( 'NONE', ( #17, #18 ) ) ;
#47 = ORIENTED_EDGE ( 'NONE', *, *, #29, .F. ) ;
#48 = VERTEX_POINT ( 'NONE', #140 ) ;
#49 = VERTEX_POINT ( 'NONE', #139 ) ;
#50 = ORIENTED_EDGE ( 'NONE', *, *, #51, .F. ) ;
#51 = EDGE_CURVE ( 'NONE', #52, #49, #138, .T. ) ;
#52 = VERTEX_POINT ( 'NONE', #133 ) ;
#53 = ORIENTED_EDGE ( 'NONE', *, *, #54, .F. ) ;
#54 = EDGE_CURVE ( 'NONE', #65, #52, #132, .T. ) ;
#55 = ADVANCED_FACE ( 'NONE', ( #128 ), #126, .F. ) ;
#56 = EDGE_LOOP ( 'NONE', ( #57, #61, #73, #76 ) ) ;
#57 = ORIENTED_EDGE ( 'NONE', *, *, #58, .T. ) ;
#58 = EDGE_CURVE ( 'NONE', #59, #60, #127, .T. ) ;
#59 = VERTEX_POINT ( 'NONE', #313 ) ;
#60 = VERTEX_POINT ( 'NONE', #312 ) ;
#61 = ORIENTED_EDGE ( 'NONE', *, *, #62, .T. ) ;
#62 = EDGE_CURVE ( 'NONE', #60, #63, #311, .T. ) ;
#63 = VERTEX_POINT ( 'NONE', #271 ) ;
#64 = EDGE_CURVE ( 'NONE', #65, #66, #270, .T. ) ;
#65 = VERTEX_POINT ( 'NONE', #265 ) ;
#66 = VERTEX_POINT ( 'NONE', #264 ) ;
#67 = ORIENTED_EDGE ( 'NONE', *, *, #68, .T. ) ;
#68 = EDGE_CURVE ( 'NONE', #66, #49, #262, .T. ) ;
#69 = EDGE_LOOP ( 'NONE', ( #72, #67, #50, #53 ) ) ;
#70 = MANIFOLD_SOLID_BREP ( 'NONE', #32 ) ;
#71 = ADVANCED_FACE ( 'NONE', ( #302 ), #299, .T. ) ;
#72 = ORIENTED_EDGE ( 'NONE', *, *, #64, .T. ) ;
#73 = ORIENTED_EDGE ( 'NONE', *, *, #74, .F. ) ;
#74 = EDGE_CURVE ( 'NONE', #75, #63, #295, .T. ) ;
#75 = VERTEX_POINT ( 'NONE', #291 ) ;
#76 = ORIENTED_EDGE ( 'NONE', *, *, #77, .F. ) ;
#77 = EDGE_CURVE ( 'NONE', #59, #75, #289, .T. ) ;
#78 = ADVANCED_FACE ( 'NONE', ( #290 ), #284, .F. ) ;
#79 = EDGE_LOOP ( 'NONE', ( #80, #81, #84, #91 ) ) ;
#80 = ORIENTED_EDGE ( 'NONE', *, *, #58, .F. ) ;
#81 = ORIENTED_EDGE ( 'NONE', *, *, #82, .T. ) ;
#82 = EDGE_CURVE ( 'NONE', #59, #83, #280, .T. ) ;
#83 = VERTEX_POINT ( 'NONE', #276 ) ;
#84 = ORIENTED_EDGE ( 'NONE', *, *, #85, .T. ) ;
#85 = EDGE_CURVE ( 'NONE', #83, #95, #227, .T. ) ;
#86 = EDGE_CURVE ( 'NONE', #87, #89, #222, .T. ) ;
#87 = VERTEX_POINT ( 'NONE', #218 ) ;
#88 = ORIENTED_EDGE ( 'NONE', *, *, #86, .T. ) ;
#89 = VERTEX_POINT ( 'NONE', #217 ) ;
#90 = EDGE_LOOP ( 'NONE', ( #88, #13, #47, #23 ) ) ;
#91 = ORIENTED_EDGE ( 'NONE', *, *, #92, .F. ) ;
#92 = EDGE_CURVE ( 'NONE', #60, #95, #183, .T. ) ;
#93 = ADVANCED_FACE ( 'NONE', ( #179 ), #178, .T. ) ;
#94 = UNCERTAINTY_MEASURE_WITH_UNIT (LENGTH_MEASURE( 1.000000000000000100E-005 ), #98, 'distance_accuracy_value', 'NONE');
#95 = VERTEX_POINT ( 'NONE', #173 ) ;
#96 =( NAMED_UNIT ( * ) SI_UNIT ( $, .STERADIAN. ) SOLID_ANGLE_UNIT ( ) );
#97 =( NAMED_UNIT ( * ) PLANE_ANGLE_UNIT ( ) SI_UNIT ( $, .RADIAN. ) );
#98 =( CONVERSION_BASED_UNIT ( 'INCH', #99 ) LENGTH_UNIT ( ) NAMED_UNIT ( #100 ) );
#99 = LENGTH_MEASURE_WITH_UNIT ( LENGTH_MEASURE( 0.02539999999999999900 ), #272 );
#100 = DIMENSIONAL_EXPONENTS ( 1.000000000000000000, 0.0000000000000000000, 0.0000000000000000000, 0.0000000000000000000, 0.0000000000000000000, 0.0000000000000000000, 0.0000000000000000000 ) ;
#101 = CARTESIAN_POINT ( 'NONE',  ( 1.242975449129713200E-017, 0.0000000000000000000, 0.1015000000000000100 ) ) ;
#102 = DIRECTION ( 'NONE',  ( 0.0000000000000000000, 0.0000000000000000000, -1.000000000000000000 ) ) ;
#103 = DIRECTION ( 'NONE',  ( 0.0000000000000000000, -1.000000000000000000, 0.0000000000000000000 ) ) ;
#104 = CARTESIAN_POINT ( 'NONE',  ( 0.0000000000000000000, 0.2180000000000000000, 0.0000000000000000000 ) ) ;
#105 = AXIS2_PLACEMENT_3D ( 'NONE', #104, #103, #102 ) ;
#106 = CIRCLE ( 'NONE', #105, 0.1015000000000000100 ) ;
#107 = DIRECTION ( 'NONE',  ( 0.0000000000000000000, 0.0000000000000000000, -1.000000000000000000 ) ) ;
#108 = DIRECTION ( 'NONE',  ( 0.0000000000000000000, -1.000000000000000000, 0.0000000000000000000 ) ) ;
#109 = AXIS2_PLACEMENT_3D ( 'NONE', #172, #108, #107 ) ;
#110 = CYLINDRICAL_SURFACE ( 'NONE', #109, 0.1560000000000000000 ) ;
#111 = FACE_OUTER_BOUND ( 'NONE', #273, .T. ) ;
#112 = DIRECTION ( 'NONE',  ( 0.0000000000000000000, 0.0000000000000000000, -1.000000000000000000 ) ) ;
#113 = DIRECTION ( 'NONE',  ( 0.0000000000000000000, -1.000000000000000000, 0.0000000000000000000 ) ) ;
#114 = CARTESIAN_POINT ( 'NONE',  ( 0.0000000000000000000, 0.3110000000000000000, 0.0000000000000000000 ) ) ;
#115 = AXIS2_PLACEMENT_3D ( 'NONE', #114, #113, #112 ) ;
#116 = CIRCLE ( 'NONE', #115, 0.1560000000000000300 ) ;
#117 = EDGE_CURVE ( 'NONE', #66, #65, #116, .T. ) ;
#118 = ADVANCED_FACE ( 'NONE', ( #111 ), #110, .T. ) ;
#119 = CARTESIAN_POINT ( 'NONE',  ( 0.0000000000000000000, 0.0000000000000000000, 0.0000000000000000000 ) ) ;
#120 = CIRCLE ( 'NONE', #207, 0.1015000000000000100 ) ;
#121 = FACE_OUTER_BOUND ( 'NONE', #239, .T. ) ;
#122 = DIRECTION ( 'NONE',  ( 0.0000000000000000000, 0.0000000000000000000, 1.000000000000000000 ) ) ;
#123 = DIRECTION ( 'NONE',  ( 0.0000000000000000000, 1.000000000000000000, 0.0000000000000000000 ) ) ;
#124 = CARTESIAN_POINT ( 'NONE',  ( 0.0000000000000000000, 0.3110000000000000000, 0.0000000000000000000 ) ) ;
#125 = AXIS2_PLACEMENT_3D ( 'NONE', #124, #123, #122 ) ;
#126 = CONICAL_SURFACE ( 'NONE', #125, 0.1182957166897568200, 0.5235987755982995900 ) ;
#127 = CIRCLE ( 'NONE', #317, 0.08249999999999997600 ) ;
#128 = FACE_OUTER_BOUND ( 'NONE', #56, .T. ) ;
#129 = DIRECTION ( 'NONE',  ( 0.0000000000000000000, -1.000000000000000000, 0.0000000000000000000 ) ) ;
#130 = VECTOR ( 'NONE', #129, 39.37007874015748100 ) ;
#131 = CARTESIAN_POINT ( 'NONE',  ( 0.0000000000000000000, 0.0000000000000000000, -0.1560000000000000000 ) ) ;
#132 = LINE ( 'NONE', #131, #130 ) ;
#133 = CARTESIAN_POINT ( 'NONE',  ( 0.0000000000000000000, 0.2180000000000000000, -0.1560000000000000000 ) ) ;
#134 = DIRECTION ( 'NONE',  ( 0.0000000000000000000, 0.0000000000000000000, -1.000000000000000000 ) ) ;
#135 = DIRECTION ( 'NONE',  ( 0.0000000000000000000, -1.000000000000000000, 0.0000000000000000000 ) ) ;
#136 = CARTESIAN_POINT ( 'NONE',  ( 0.0000000000000000000, 0.2180000000000000000, 0.0000000000000000000 ) ) ;
#137 = AXIS2_PLACEMENT_3D ( 'NONE', #136, #135, #134 ) ;
#138 = CIRCLE ( 'NONE', #137, 0.1560000000000000000 ) ;
#139 = CARTESIAN_POINT ( 'NONE',  ( 1.910385911962908500E-017, 0.2180000000000000000, 0.1560000000000000000 ) ) ;
#140 = CARTESIAN_POINT ( 'NONE',  ( 0.0000000000000000000, 0.0000000000000000000, -0.1015000000000000100 ) ) ;
#141 = DIRECTION ( 'NONE',  ( 0.0000000000000000000, 0.0000000000000000000, 1.000000000000000000 ) ) ;
#142 = DIRECTION ( 'NONE',  ( 0.0000000000000000000, 1.000000000000000000, 0.0000000000000000000 ) ) ;
#143 = CARTESIAN_POINT ( 'NONE',  ( 0.1560000000000000300, 0.3110000000000000000, 0.0000000000000000000 ) ) ;
#144 = AXIS2_PLACEMENT_3D ( 'NONE', #143, #142, #141 ) ;
#145 = PLANE ( 'NONE',  #144 ) ;
#146 = FACE_OUTER_BOUND ( 'NONE', #19, .T. ) ;
#147 = FACE_BOUND ( 'NONE', #46, .T. ) ;
#148 = DIRECTION ( 'NONE',  ( 0.0000000000000000000, 0.0000000000000000000, -1.000000000000000000 ) ) ;
#149 = DIRECTION ( 'NONE',  ( 0.0000000000000000000, -1.000000000000000000, 0.0000000000000000000 ) ) ;
#150 = AXIS2_PLACEMENT_3D ( 'NONE', #155, #149, #148 ) ;
#151 = CIRCLE ( 'NONE', #150, 0.1182957166897568200 ) ;
#152 = DIRECTION ( 'NONE',  ( 0.0000000000000000000, 0.0000000000000000000, -1.000000000000000000 ) ) ;
#153 = DIRECTION ( 'NONE',  ( 0.0000000000000000000, -1.000000000000000000, 0.0000000000000000000 ) ) ;
#154 = CARTESIAN_POINT ( 'NONE',  ( 0.0000000000000000000, 0.0000000000000000000, 0.0000000000000000000 ) ) ;
#155 = CARTESIAN_POINT ( 'NONE',  ( 0.0000000000000000000, 0.3110000000000000000, 0.0000000000000000000 ) ) ;
#156 = VECTOR ( 'NONE', #203, 39.37007874015748100 ) ;
#157 = CARTESIAN_POINT ( 'NONE',  ( 1.242975449129713200E-017, 0.0000000000000000000, 0.1015000000000000100 ) ) ;
#158 = LINE ( 'NONE', #157, #156 ) ;
#159 = DIRECTION ( 'NONE',  ( 0.0000000000000000000, -1.000000000000000000, 0.0000000000000000000 ) ) ;
#160 = VECTOR ( 'NONE', #159, 39.37007874015748100 ) ;
#161 = CARTESIAN_POINT ( 'NONE',  ( 0.0000000000000000000, 0.0000000000000000000, -0.1015000000000000100 ) ) ;
#162 = LINE ( 'NONE', #161, #160 ) ;
#163 = DIRECTION ( 'NONE',  ( 0.0000000000000000000, 0.0000000000000000000, -1.000000000000000000 ) ) ;
#164 = ORIENTED_EDGE ( 'NONE', *, *, #64, .F. ) ;
#165 = ORIENTED_EDGE ( 'NONE', *, *, #117, .F. ) ;
#166 = DIRECTION ( 'NONE',  ( 0.0000000000000000000, 0.0000000000000000000, -1.000000000000000000 ) ) ;
#167 = DIRECTION ( 'NONE',  ( 0.0000000000000000000, -1.000000000000000000, 0.0000000000000000000 ) ) ;
#168 = CARTESIAN_POINT ( 'NONE',  ( 0.1015000000000000100, 0.2180000000000000000, 0.0000000000000000000 ) ) ;
#169 = AXIS2_PLACEMENT_3D ( 'NONE', #168, #167, #166 ) ;
#170 = PLANE ( 'NONE',  #169 ) ;
#171 = CARTESIAN_POINT ( 'NONE',  ( 0.0000000000000000000, 0.2180000000000000000, 0.0000000000000000000 ) ) ;
#172 = CARTESIAN_POINT ( 'NONE',  ( 0.0000000000000000000, 0.0000000000000000000, 0.0000000000000000000 ) ) ;
#173 = CARTESIAN_POINT ( 'NONE',  ( 0.0000000000000000000, 0.0000000000000000000, -0.08250000000000000400 ) ) ;
#174 = DIRECTION ( 'NONE',  ( 0.0000000000000000000, 0.0000000000000000000, -1.000000000000000000 ) ) ;
#175 = DIRECTION ( 'NONE',  ( 0.0000000000000000000, -1.000000000000000000, 0.0000000000000000000 ) ) ;
#176 = CARTESIAN_POINT ( 'NONE',  ( 0.0000000000000000000, 0.0000000000000000000, 0.0000000000000000000 ) ) ;
#177 = AXIS2_PLACEMENT_3D ( 'NONE', #176, #175, #174 ) ;
#178 = CYLINDRICAL_SURFACE ( 'NONE', #177, 0.1015000000000000100 ) ;
#179 = FACE_OUTER_BOUND ( 'NONE', #90, .T. ) ;
#180 = DIRECTION ( 'NONE',  ( 0.0000000000000000000, -1.000000000000000000, 0.0000000000000000000 ) ) ;
#181 = VECTOR ( 'NONE', #180, 39.37007874015748100 ) ;
#182 = CARTESIAN_POINT ( 'NONE',  ( 0.0000000000000000000, 0.0000000000000000000, -0.08249999999999999000 ) ) ;
#183 = LINE ( 'NONE', #182, #181 ) ;
#184 = AXIS2_PLACEMENT_3D ( 'NONE', #154, #153, #152 ) ;
#185 = DIRECTION ( 'NONE',  ( 0.0000000000000000000, 0.0000000000000000000, 1.000000000000000000 ) ) ;
#186 = DIRECTION ( 'NONE',  ( 0.0000000000000000000, 1.000000000000000000, 0.0000000000000000000 ) ) ;
#187 = CARTESIAN_POINT ( 'NONE',  ( 0.0000000000000000000, 0.3110000000000000000, 0.0000000000000000000 ) ) ;
#188 = AXIS2_PLACEMENT_3D ( 'NONE', #187, #186, #185 ) ;
#189 = CYLINDRICAL_SURFACE ( 'NONE', #184, 0.1015000000000000100 ) ;
#190 = FACE_OUTER_BOUND ( 'NONE', #39, .T. ) ;
#191 = CONICAL_SURFACE ( 'NONE', #188, 0.1182957166897568200, 0.5235987755982995900 ) ;
#192 = FACE_OUTER_BOUND ( 'NONE', #36, .T. ) ;
#193 = DIRECTION ( 'NONE',  ( 0.0000000000000000000, 0.0000000000000000000, -1.000000000000000000 ) ) ;
#194 = DIRECTION ( 'NONE',  ( 0.0000000000000000000, -1.000000000000000000, 0.0000000000000000000 ) ) ;
#195 = CARTESIAN_POINT ( 'NONE',  ( 0.0000000000000000000, 0.0000000000000000000, 0.0000000000000000000 ) ) ;
#196 = AXIS2_PLACEMENT_3D ( 'NONE', #195, #194, #193 ) ;
#197 = CIRCLE ( 'NONE', #196, 0.1015000000000000100 ) ;
#198 = DIRECTION ( 'NONE',  ( 0.0000000000000000000, 0.0000000000000000000, -1.000000000000000000 ) ) ;
#199 = DIRECTION ( 'NONE',  ( 0.0000000000000000000, -1.000000000000000000, 0.0000000000000000000 ) ) ;
#200 = CARTESIAN_POINT ( 'NONE',  ( 0.0000000000000000000, 0.2490000000000000000, 0.0000000000000000000 ) ) ;
#201 = AXIS2_PLACEMENT_3D ( 'NONE', #200, #199, #198 ) ;
#202 = CIRCLE ( 'NONE', #201, 0.08249999999999997600 ) ;
#203 = DIRECTION ( 'NONE',  ( 0.0000000000000000000, -1.000000000000000000, 0.0000000000000000000 ) ) ;
#204 = FACE_BOUND ( 'NONE', #3, .T. ) ;
#205 = DIRECTION ( 'NONE',  ( 0.0000000000000000000, 0.0000000000000000000, -1.000000000000000000 ) ) ;
#206 = DIRECTION ( 'NONE',  ( 0.0000000000000000000, -1.000000000000000000, 0.0000000000000000000 ) ) ;
#207 = AXIS2_PLACEMENT_3D ( 'NONE', #119, #206, #205 ) ;
#208 = DIRECTION ( 'NONE',  ( 0.0000000000000000000, -1.000000000000000000, 0.0000000000000000000 ) ) ;
#209 = CARTESIAN_POINT ( 'NONE',  ( 0.08250000000000000400, 0.0000000000000000000, 0.0000000000000000000 ) ) ;
#210 = AXIS2_PLACEMENT_3D ( 'NONE', #209, #208, #163 ) ;
#211 = FACE_BOUND ( 'NONE', #15, .T. ) ;
#212 = FACE_OUTER_BOUND ( 'NONE', #21, .T. ) ;
#213 = DIRECTION ( 'NONE',  ( 0.0000000000000000000, 0.0000000000000000000, -1.000000000000000000 ) ) ;
#214 = DIRECTION ( 'NONE',  ( 0.0000000000000000000, -1.000000000000000000, 0.0000000000000000000 ) ) ;
#215 = AXIS2_PLACEMENT_3D ( 'NONE', #233, #214, #213 ) ;
#216 = CYLINDRICAL_SURFACE ( 'NONE', #215, 0.08249999999999999000 ) ;
#217 = CARTESIAN_POINT ( 'NONE',  ( 1.242975449129713200E-017, 0.2180000000000000000, 0.1015000000000000100 ) ) ;
#218 = CARTESIAN_POINT ( 'NONE',  ( 0.0000000000000000000, 0.2180000000000000000, -0.1015000000000000100 ) ) ;
#219 = DIRECTION ( 'NONE',  ( 0.0000000000000000000, 0.0000000000000000000, -1.000000000000000000 ) ) ;
#220 = DIRECTION ( 'NONE',  ( 0.0000000000000000000, -1.000000000000000000, 0.0000000000000000000 ) ) ;
#221 = AXIS2_PLACEMENT_3D ( 'NONE', #228, #220, #219 ) ;
#222 = CIRCLE ( 'NONE', #221, 0.1015000000000000100 ) ;
#223 = DIRECTION ( 'NONE',  ( 0.0000000000000000000, 0.0000000000000000000, -1.000000000000000000 ) ) ;
#224 = DIRECTION ( 'NONE',  ( 0.0000000000000000000, -1.000000000000000000, 0.0000000000000000000 ) ) ;
#225 = CARTESIAN_POINT ( 'NONE',  ( 0.0000000000000000000, 0.0000000000000000000, 0.0000000000000000000 ) ) ;
#226 = AXIS2_PLACEMENT_3D ( 'NONE', #225, #224, #223 ) ;
#227 = CIRCLE ( 'NONE', #226, 0.08250000000000000400 ) ;
#228 = CARTESIAN_POINT ( 'NONE',  ( 0.0000000000000000000, 0.2180000000000000000, 0.0000000000000000000 ) ) ;
#229 = ORIENTED_EDGE ( 'NONE', *, *, #54, .T. ) ;
#230 = ORIENTED_EDGE ( 'NONE', *, *, #8, .F. ) ;
#231 = EDGE_CURVE ( 'NONE', #89, #87, #106, .T. ) ;
#232 = PLANE ( 'NONE',  #210 ) ;
#233 = CARTESIAN_POINT ( 'NONE',  ( 0.0000000000000000000, 0.0000000000000000000, 0.0000000000000000000 ) ) ;
#234 = DIRECTION ( 'NONE',  ( 0.0000000000000000000, 0.0000000000000000000, -1.000000000000000000 ) ) ;
#235 = DIRECTION ( 'NONE',  ( 0.0000000000000000000, -1.000000000000000000, 0.0000000000000000000 ) ) ;
#236 = AXIS2_PLACEMENT_3D ( 'NONE', #246, #235, #234 ) ;
#237 = FACE_OUTER_BOUND ( 'NONE', #12, .T. ) ;
#238 = VERTEX_POINT ( 'NONE', #101 ) ;
#239 = EDGE_LOOP ( 'NONE', ( #6, #2 ) ) ;
#240 = ORIENTED_EDGE ( 'NONE', *, *, #231, .T. ) ;
#241 = CIRCLE ( 'NONE', #236, 0.08250000000000000400 ) ;
#242 = DIRECTION ( 'NONE',  ( 0.0000000000000000000, 0.0000000000000000000, -1.000000000000000000 ) ) ;
#243 = DIRECTION ( 'NONE',  ( 0.0000000000000000000, -1.000000000000000000, 0.0000000000000000000 ) ) ;
#244 = AXIS2_PLACEMENT_3D ( 'NONE', #171, #243, #242 ) ;
#245 = CIRCLE ( 'NONE', #244, 0.1560000000000000000 ) ;
#246 = CARTESIAN_POINT ( 'NONE',  ( 0.0000000000000000000, 0.0000000000000000000, 0.0000000000000000000 ) ) ;
#247 = LENGTH_MEASURE_WITH_UNIT ( LENGTH_MEASURE( 0.02539999999999999900 ), #249 );
#248 = DIMENSIONAL_EXPONENTS ( 1.000000000000000000, 0.0000000000000000000, 0.0000000000000000000, 0.0000000000000000000, 0.0000000000000000000, 0.0000000000000000000, 0.0000000000000000000 ) ;
#249 =( LENGTH_UNIT ( ) NAMED_UNIT ( * ) SI_UNIT ( $, .METRE. ) );
#250 = MECHANICAL_DESIGN_GEOMETRIC_PRESENTATION_REPRESENTATION (  '', ( #252 ), #303 ) ;
#251 = PRESENTATION_LAYER_ASSIGNMENT (  '', '', ( #252 ) ) ;
#252 = STYLED_ITEM ( 'NONE', ( #253 ), #70 ) ;
#253 = PRESENTATION_STYLE_ASSIGNMENT (( #254 ) ) ;
#254 = SURFACE_STYLE_USAGE ( .BOTH. , #255 ) ;
#255 = SURFACE_SIDE_STYLE ('',( #256 ) ) ;
#256 = SURFACE_STYLE_FILL_AREA ( #257 ) ;
#257 = FILL_AREA_STYLE ('',( #263 ) ) ;
#258 = COLOUR_RGB ( '',0.7960784313725489700, 0.8235294117647058400, 0.9372549019607843100 ) ;
#259 = DIRECTION ( 'NONE',  ( 0.0000000000000000000, -1.000000000000000000, 0.0000000000000000000 ) ) ;
#260 = VECTOR ( 'NONE', #259, 39.37007874015748100 ) ;
#261 = CARTESIAN_POINT ( 'NONE',  ( 1.910385911962908500E-017, 0.0000000000000000000, 0.1560000000000000000 ) ) ;
#262 = LINE ( 'NONE', #261, #260 ) ;
#263 = FILL_AREA_STYLE_COLOUR ( '', #258 ) ;
#264 = CARTESIAN_POINT ( 'NONE',  ( 1.910385911962908800E-017, 0.3110000000000000000, 0.1560000000000000300 ) ) ;
#265 = CARTESIAN_POINT ( 'NONE',  ( 0.0000000000000000000, 0.3110000000000000000, -0.1560000000000000300 ) ) ;
#266 = DIRECTION ( 'NONE',  ( 0.0000000000000000000, 0.0000000000000000000, -1.000000000000000000 ) ) ;
#267 = DIRECTION ( 'NONE',  ( 0.0000000000000000000, -1.000000000000000000, 0.0000000000000000000 ) ) ;
#268 = CARTESIAN_POINT ( 'NONE',  ( 0.0000000000000000000, 0.3110000000000000000, 0.0000000000000000000 ) ) ;
#269 = AXIS2_PLACEMENT_3D ( 'NONE', #268, #267, #266 ) ;
#270 = CIRCLE ( 'NONE', #269, 0.1560000000000000300 ) ;
#271 = CARTESIAN_POINT ( 'NONE',  ( 1.448656862882480300E-017, 0.3110000000000000000, -0.1182957166897568200 ) ) ;
#272 =( LENGTH_UNIT ( ) NAMED_UNIT ( * ) SI_UNIT ( $, .METRE. ) );
#273 = EDGE_LOOP ( 'NONE', ( #274, #275, #229, #230 ) ) ;
#274 = ORIENTED_EDGE ( 'NONE', *, *, #68, .F. ) ;
#275 = ORIENTED_EDGE ( 'NONE', *, *, #117, .T. ) ;
#276 = CARTESIAN_POINT ( 'NONE',  ( 1.010300241903461400E-017, 0.0000000000000000000, 0.08250000000000000400 ) ) ;
#277 = DIRECTION ( 'NONE',  ( 0.0000000000000000000, -1.000000000000000000, 0.0000000000000000000 ) ) ;
#278 = VECTOR ( 'NONE', #277, 39.37007874015748100 ) ;
#279 = CARTESIAN_POINT ( 'NONE',  ( 1.010300241903461300E-017, 0.0000000000000000000, 0.08249999999999999000 ) ) ;
#280 = LINE ( 'NONE', #279, #278 ) ;
#281 = DIRECTION ( 'NONE',  ( 0.0000000000000000000, 0.0000000000000000000, -1.000000000000000000 ) ) ;
#282 = DIRECTION ( 'NONE',  ( 0.0000000000000000000, -1.000000000000000000, 0.0000000000000000000 ) ) ;
#283 = AXIS2_PLACEMENT_3D ( 'NONE', #285, #282, #281 ) ;
#284 = CYLINDRICAL_SURFACE ( 'NONE', #283, 0.08249999999999999000 ) ;
#285 = CARTESIAN_POINT ( 'NONE',  ( 0.0000000000000000000, 0.0000000000000000000, 0.0000000000000000000 ) ) ;
#286 = DIRECTION ( 'NONE',  ( 0.0000000000000000000, 0.8660254037844382600, 0.5000000000000006700 ) ) ;
#287 = VECTOR ( 'NONE', #286, 39.37007874015748100 ) ;
#288 = CARTESIAN_POINT ( 'NONE',  ( 0.0000000000000000000, 0.3110000000000000000, 0.1182957166897568200 ) ) ;
#289 = LINE ( 'NONE', #288, #287 ) ;
#290 = FACE_OUTER_BOUND ( 'NONE', #79, .T. ) ;
#291 = CARTESIAN_POINT ( 'NONE',  ( 0.0000000000000000000, 0.3110000000000000000, 0.1182957166897568200 ) ) ;
#292 = DIRECTION ( 'NONE',  ( 0.0000000000000000000, 0.0000000000000000000, -1.000000000000000000 ) ) ;
#293 = DIRECTION ( 'NONE',  ( 0.0000000000000000000, -1.000000000000000000, 0.0000000000000000000 ) ) ;
#294 = AXIS2_PLACEMENT_3D ( 'NONE', #300, #293, #292 ) ;
#295 = CIRCLE ( 'NONE', #294, 0.1182957166897568200 ) ;
#296 = DIRECTION ( 'NONE',  ( 0.0000000000000000000, 0.0000000000000000000, -1.000000000000000000 ) ) ;
#297 = DIRECTION ( 'NONE',  ( 0.0000000000000000000, -1.000000000000000000, 0.0000000000000000000 ) ) ;
#298 = AXIS2_PLACEMENT_3D ( 'NONE', #301, #297, #296 ) ;
#299 = CYLINDRICAL_SURFACE ( 'NONE', #298, 0.1560000000000000000 ) ;
#300 = CARTESIAN_POINT ( 'NONE',  ( 0.0000000000000000000, 0.3110000000000000000, 0.0000000000000000000 ) ) ;
#301 = CARTESIAN_POINT ( 'NONE',  ( 0.0000000000000000000, 0.0000000000000000000, 0.0000000000000000000 ) ) ;
#302 = FACE_OUTER_BOUND ( 'NONE', #69, .T. ) ;
#303 =( GEOMETRIC_REPRESENTATION_CONTEXT ( 3 ) GLOBAL_UNCERTAINTY_ASSIGNED_CONTEXT ( ( #304 ) ) GLOBAL_UNIT_ASSIGNED_CONTEXT ( ( #307, #306, #305 ) ) REPRESENTATION_CONTEXT ( 'NONE', 'WORKASPACE' ) );
#304 = UNCERTAINTY_MEASURE_WITH_UNIT (LENGTH_MEASURE( 1.000000000000000100E-005 ), #307, 'distance_accuracy_value', 'NONE');
#305 =( NAMED_UNIT ( * ) SI_UNIT ( $, .STERADIAN. ) SOLID_ANGLE_UNIT ( ) );
#306 =( NAMED_UNIT ( * ) PLANE_ANGLE_UNIT ( ) SI_UNIT ( $, .RADIAN. ) );
#307 =( CONVERSION_BASED_UNIT ( 'INCH', #247 ) LENGTH_UNIT ( ) NAMED_UNIT ( #248 ) );
#308 = DIRECTION ( 'NONE',  ( 6.123031769111894900E-017, 0.8660254037844382600, -0.5000000000000006700 ) ) ;
#309 = VECTOR ( 'NONE', #308, 39.37007874015748100 ) ;
#310 = CARTESIAN_POINT ( 'NONE',  ( 1.448656862882480300E-017, 0.3110000000000000000, -0.1182957166897568200 ) ) ;
#311 = LINE ( 'NONE', #310, #309 ) ;
#312 = CARTESIAN_POINT ( 'NONE',  ( 0.0000000000000000000, 0.2490000000000000000, -0.08249999999999997600 ) ) ;
#313 = CARTESIAN_POINT ( 'NONE',  ( 1.010300241903461300E-017, 0.2490000000000000000, 0.08249999999999997600 ) ) ;
#314 = DIRECTION ( 'NONE',  ( 0.0000000000000000000, 0.0000000000000000000, -1.000000000000000000 ) ) ;
#315 = DIRECTION ( 'NONE',  ( 0.0000000000000000000, -1.000000000000000000, 0.0000000000000000000 ) ) ;
#316 = CARTESIAN_POINT ( 'NONE',  ( 0.0000000000000000000, 0.2490000000000000000, 0.0000000000000000000 ) ) ;
#317 = AXIS2_PLACEMENT_3D ( 'NONE', #316, #315, #314 ) ;
#318 = PRODUCT_RELATED_PRODUCT_CATEGORY ( 'part', '', ( #328 ) ) ;
#319 = PRODUCT_DEFINITION_FORMATION_WITH_SPECIFIED_SOURCE ( 'ANY', '', #328, .NOT_KNOWN. ) ;
#320 =( GEOMETRIC_REPRESENTATION_CONTEXT ( 3 ) GLOBAL_UNCERTAINTY_ASSIGNED_CONTEXT ( ( #94 ) ) GLOBAL_UNIT_ASSIGNED_CONTEXT ( ( #98, #97, #96 ) ) REPRESENTATION_CONTEXT ( 'NONE', 'WORKASPACE' ) );
#321 = PRODUCT_DEFINITION_SHAPE ( 'NONE', 'NONE',  #322 ) ;
#322 = PRODUCT_DEFINITION ( 'UNKNOWN', '', #319, #323 ) ;
#323 = PRODUCT_DEFINITION_CONTEXT ( 'detailed design', #325, 'design' ) ;
#324 = APPLICATION_PROTOCOL_DEFINITION ( 'draft international standard', 'automotive_design', 1998, #325 ) ;
#325 = APPLICATION_CONTEXT ( 'automotive_design' ) ;
#326 = DIRECTION ( 'NONE',  ( 1.000000000000000000, 0.0000000000000000000, 0.0000000000000000000 ) ) ;
#327 = DIRECTION ( 'NONE',  ( 0.0000000000000000000, 0.0000000000000000000, 1.000000000000000000 ) ) ;
#328 = PRODUCT ( '575-4', '575-4', '', ( #329 ) ) ;
#329 = PRODUCT_CONTEXT ( 'NONE', #331, 'mechanical' ) ;
#330 = APPLICATION_PROTOCOL_DEFINITION ( 'draft international standard', 'automotive_design', 1998, #331 ) ;
#331 = APPLICATION_CONTEXT ( 'automotive_design' ) ;
#332 = SHAPE_DEFINITION_REPRESENTATION ( #321, #335 ) ;
#333 = CARTESIAN_POINT ( 'NONE',  ( 0.0000000000000000000, 0.0000000000000000000, 0.0000000000000000000 ) ) ;
#334 = AXIS2_PLACEMENT_3D ( 'NONE', #333, #327, #326 ) ;
#335 = ADVANCED_BREP_SHAPE_REPRESENTATION ( '575-4', ( #70, #334 ), #320 ) ;
ENDSEC;
END-ISO-10303-21;
