ISO-10303-21;
HEADER;
FILE_DESCRIPTION( ( 'Unknown' ), '1' );
FILE_NAME( 'I:/User_Groups_Only/17_EMC_Product_&_Development/Article_Master/eiCan/Assembly/As_SBRIE/Master_Data/01_CAD_drawing/1_Drawing/971xxxxx4/971xxx354/971050354/Released_Data/971050354.stp', 'Unknown', ( 'Unknown' ), ( 'Unknown' ), 'PSStep 19.0.9', 'Unknown', '  ' );
FILE_SCHEMA( ( 'AUTOMOTIVE_DESIGN { 1 0 10303 214 1 1 1 1 }' ) );
ENDSEC;
DATA;
#1 = MECHANICAL_DESIGN_GEOMETRIC_PRESENTATION_REPRESENTATION( ' ', ( #10, #11, #12, #13, #14, #15, #16, #17, #18, #19, #20, #21, #22, #23, #24, #25, #26, #27, #28, #29, #30, #31, #32, #33, #34, #35, #36, #37, #38, #39, #40 ), #6 );
#2 = PRODUCT_DEFINITION_CONTEXT( '', #41, 'design' );
#3 = APPLICATION_PROTOCOL_DEFINITION( 'international standard', 'automotive_design', 2001, #41 );
#4 = PRODUCT_CATEGORY_RELATIONSHIP( 'NONE', 'NONE', #42, #43 );
#5 = SHAPE_DEFINITION_REPRESENTATION( #44, #45 );
#6 =  ( GEOMETRIC_REPRESENTATION_CONTEXT( 3 )GLOBAL_UNCERTAINTY_ASSIGNED_CONTEXT( ( #48 ) )GLOBAL_UNIT_ASSIGNED_CONTEXT( ( #50, #51, #52 ) )REPRESENTATION_CONTEXT( 'NONE', 'WORKSPACE' ) );
#10 = STYLED_ITEM( '', ( #54 ), #55 );
#11 = STYLED_ITEM( '', ( #56 ), #57 );
#12 = STYLED_ITEM( '', ( #58 ), #59 );
#13 = STYLED_ITEM( '', ( #60 ), #61 );
#14 = STYLED_ITEM( '', ( #62 ), #63 );
#15 = STYLED_ITEM( '', ( #64 ), #65 );
#16 = STYLED_ITEM( '', ( #66 ), #67 );
#17 = STYLED_ITEM( '', ( #68 ), #69 );
#18 = STYLED_ITEM( '', ( #70 ), #71 );
#19 = STYLED_ITEM( '', ( #72 ), #73 );
#20 = STYLED_ITEM( '', ( #74 ), #75 );
#21 = STYLED_ITEM( '', ( #76 ), #77 );
#22 = STYLED_ITEM( '', ( #78 ), #79 );
#23 = STYLED_ITEM( '', ( #80 ), #81 );
#24 = STYLED_ITEM( '', ( #82 ), #83 );
#25 = STYLED_ITEM( '', ( #84 ), #85 );
#26 = STYLED_ITEM( '', ( #86 ), #87 );
#27 = STYLED_ITEM( '', ( #88 ), #89 );
#28 = STYLED_ITEM( '', ( #90 ), #91 );
#29 = STYLED_ITEM( '', ( #92 ), #93 );
#30 = STYLED_ITEM( '', ( #94 ), #95 );
#31 = STYLED_ITEM( '', ( #96 ), #97 );
#32 = STYLED_ITEM( '', ( #98 ), #99 );
#33 = STYLED_ITEM( '', ( #100 ), #101 );
#34 = STYLED_ITEM( '', ( #102 ), #103 );
#35 = STYLED_ITEM( '', ( #104 ), #105 );
#36 = STYLED_ITEM( '', ( #106 ), #107 );
#37 = STYLED_ITEM( '', ( #108 ), #109 );
#38 = STYLED_ITEM( '', ( #110 ), #111 );
#39 = STYLED_ITEM( '', ( #112 ), #113 );
#40 = STYLED_ITEM( '', ( #114 ), #115 );
#41 = APPLICATION_CONTEXT( 'core data for automotive mechanical design processes' );
#42 = PRODUCT_CATEGORY( 'part', 'NONE' );
#43 = PRODUCT_RELATED_PRODUCT_CATEGORY( 'detail', ' ', ( #116 ) );
#44 = PRODUCT_DEFINITION_SHAPE( 'NONE', 'NONE', #117 );
#45 = ADVANCED_BREP_SHAPE_REPRESENTATION( '1', ( #118, #119 ), #6 );
#48 = UNCERTAINTY_MEASURE_WITH_UNIT( LENGTH_MEASURE( 0.00100000000000000 ), #50, '', '' );
#50 =  ( CONVERSION_BASED_UNIT( 'MILLIMETRE', #122 )LENGTH_UNIT(  )NAMED_UNIT( #125 ) );
#51 =  ( NAMED_UNIT( #127 )PLANE_ANGLE_UNIT(  )SI_UNIT( $, .RADIAN. ) );
#52 =  ( NAMED_UNIT( #127 )SI_UNIT( $, .STERADIAN. )SOLID_ANGLE_UNIT(  ) );
#54 = PRESENTATION_STYLE_ASSIGNMENT( ( #133 ) );
#55 = ADVANCED_FACE( '', ( #134 ), #135, .F. );
#56 = PRESENTATION_STYLE_ASSIGNMENT( ( #136 ) );
#57 = ADVANCED_FACE( '', ( #137, #138 ), #139, .T. );
#58 = PRESENTATION_STYLE_ASSIGNMENT( ( #140 ) );
#59 = ADVANCED_FACE( '', ( #141 ), #142, .T. );
#60 = PRESENTATION_STYLE_ASSIGNMENT( ( #143 ) );
#61 = ADVANCED_FACE( '', ( #144 ), #145, .T. );
#62 = PRESENTATION_STYLE_ASSIGNMENT( ( #146 ) );
#63 = ADVANCED_FACE( '', ( #147 ), #148, .T. );
#64 = PRESENTATION_STYLE_ASSIGNMENT( ( #149 ) );
#65 = ADVANCED_FACE( '', ( #150 ), #151, .T. );
#66 = PRESENTATION_STYLE_ASSIGNMENT( ( #152 ) );
#67 = ADVANCED_FACE( '', ( #153, #154 ), #155, .F. );
#68 = PRESENTATION_STYLE_ASSIGNMENT( ( #156 ) );
#69 = ADVANCED_FACE( '', ( #157, #158 ), #159, .F. );
#70 = PRESENTATION_STYLE_ASSIGNMENT( ( #160 ) );
#71 = ADVANCED_FACE( '', ( #161, #162 ), #163, .T. );
#72 = PRESENTATION_STYLE_ASSIGNMENT( ( #164 ) );
#73 = ADVANCED_FACE( '', ( #165 ), #166, .T. );
#74 = PRESENTATION_STYLE_ASSIGNMENT( ( #167 ) );
#75 = ADVANCED_FACE( '', ( #168 ), #169, .T. );
#76 = PRESENTATION_STYLE_ASSIGNMENT( ( #170 ) );
#77 = ADVANCED_FACE( '', ( #171, #172 ), #173, .T. );
#78 = PRESENTATION_STYLE_ASSIGNMENT( ( #174 ) );
#79 = ADVANCED_FACE( '', ( #175 ), #176, .T. );
#80 = PRESENTATION_STYLE_ASSIGNMENT( ( #177 ) );
#81 = ADVANCED_FACE( '', ( #178 ), #179, .T. );
#82 = PRESENTATION_STYLE_ASSIGNMENT( ( #180 ) );
#83 = ADVANCED_FACE( '', ( #181, #182 ), #183, .F. );
#84 = PRESENTATION_STYLE_ASSIGNMENT( ( #184 ) );
#85 = ADVANCED_FACE( '', ( #185, #186 ), #187, .F. );
#86 = PRESENTATION_STYLE_ASSIGNMENT( ( #188 ) );
#87 = ADVANCED_FACE( '', ( #189, #190 ), #191, .T. );
#88 = PRESENTATION_STYLE_ASSIGNMENT( ( #192 ) );
#89 = ADVANCED_FACE( '', ( #193 ), #194, .T. );
#90 = PRESENTATION_STYLE_ASSIGNMENT( ( #195 ) );
#91 = ADVANCED_FACE( '', ( #196 ), #197, .T. );
#92 = PRESENTATION_STYLE_ASSIGNMENT( ( #198 ) );
#93 = ADVANCED_FACE( '', ( #199 ), #200, .T. );
#94 = PRESENTATION_STYLE_ASSIGNMENT( ( #201 ) );
#95 = ADVANCED_FACE( '', ( #202 ), #203, .T. );
#96 = PRESENTATION_STYLE_ASSIGNMENT( ( #204 ) );
#97 = ADVANCED_FACE( '', ( #205 ), #206, .T. );
#98 = PRESENTATION_STYLE_ASSIGNMENT( ( #207 ) );
#99 = ADVANCED_FACE( '', ( #208 ), #209, .T. );
#100 = PRESENTATION_STYLE_ASSIGNMENT( ( #210 ) );
#101 = ADVANCED_FACE( '', ( #211, #212 ), #213, .F. );
#102 = PRESENTATION_STYLE_ASSIGNMENT( ( #214 ) );
#103 = ADVANCED_FACE( '', ( #215, #216 ), #217, .F. );
#104 = PRESENTATION_STYLE_ASSIGNMENT( ( #218 ) );
#105 = ADVANCED_FACE( '', ( #219 ), #220, .T. );
#106 = PRESENTATION_STYLE_ASSIGNMENT( ( #221 ) );
#107 = ADVANCED_FACE( '', ( #222 ), #223, .T. );
#108 = PRESENTATION_STYLE_ASSIGNMENT( ( #224 ) );
#109 = ADVANCED_FACE( '', ( #225, #226 ), #227, .F. );
#110 = PRESENTATION_STYLE_ASSIGNMENT( ( #228 ) );
#111 = ADVANCED_FACE( '', ( #229, #230 ), #231, .T. );
#112 = PRESENTATION_STYLE_ASSIGNMENT( ( #232 ) );
#113 = ADVANCED_FACE( '', ( #233 ), #234, .T. );
#114 = PRESENTATION_STYLE_ASSIGNMENT( ( #235 ) );
#115 = ADVANCED_FACE( '', ( #236 ), #237, .T. );
#116 = PRODUCT( '1', '1', 'PART-1-DESC', ( #238 ) );
#117 = PRODUCT_DEFINITION( 'NONE', 'NONE', #239, #2 );
#118 = MANIFOLD_SOLID_BREP( '1', #240 );
#119 = AXIS2_PLACEMENT_3D( '', #241, #242, #243 );
#122 = LENGTH_MEASURE_WITH_UNIT( LENGTH_MEASURE( 1.00000000000000 ), #244 );
#125 = DIMENSIONAL_EXPONENTS( 1.00000000000000, 0.000000000000000, 0.000000000000000, 0.000000000000000, 0.000000000000000, 0.000000000000000, 0.000000000000000 );
#127 = DIMENSIONAL_EXPONENTS( 0.000000000000000, 0.000000000000000, 0.000000000000000, 0.000000000000000, 0.000000000000000, 0.000000000000000, 0.000000000000000 );
#133 = SURFACE_STYLE_USAGE( .BOTH., #245 );
#134 = FACE_OUTER_BOUND( '', #246, .T. );
#135 = PLANE( '', #247 );
#136 = SURFACE_STYLE_USAGE( .BOTH., #248 );
#137 = FACE_OUTER_BOUND( '', #249, .T. );
#138 = FACE_OUTER_BOUND( '', #250, .T. );
#139 = CYLINDRICAL_SURFACE( '', #251, 1.10000000000000 );
#140 = SURFACE_STYLE_USAGE( .BOTH., #252 );
#141 = FACE_OUTER_BOUND( '', #253, .T. );
#142 = CONICAL_SURFACE( '', #254, 3.50000000000000, 0.785398163400000 );
#143 = SURFACE_STYLE_USAGE( .BOTH., #255 );
#144 = FACE_OUTER_BOUND( '', #256, .T. );
#145 = PLANE( '', #257 );
#146 = SURFACE_STYLE_USAGE( .BOTH., #258 );
#147 = FACE_OUTER_BOUND( '', #259, .T. );
#148 = PLANE( '', #260 );
#149 = SURFACE_STYLE_USAGE( .BOTH., #261 );
#150 = FACE_OUTER_BOUND( '', #262, .T. );
#151 = CONICAL_SURFACE( '', #263, 3.50000000000000, 0.785398163400000 );
#152 = SURFACE_STYLE_USAGE( .BOTH., #264 );
#153 = FACE_BOUND( '', #265, .T. );
#154 = FACE_OUTER_BOUND( '', #266, .T. );
#155 = PLANE( '', #267 );
#156 = SURFACE_STYLE_USAGE( .BOTH., #268 );
#157 = FACE_OUTER_BOUND( '', #269, .T. );
#158 = FACE_OUTER_BOUND( '', #270, .T. );
#159 = CYLINDRICAL_SURFACE( '', #271, 1.22950000000000 );
#160 = SURFACE_STYLE_USAGE( .BOTH., #272 );
#161 = FACE_BOUND( '', #273, .T. );
#162 = FACE_OUTER_BOUND( '', #274, .T. );
#163 = PLANE( '', #275 );
#164 = SURFACE_STYLE_USAGE( .BOTH., #276 );
#165 = FACE_OUTER_BOUND( '', #277, .T. );
#166 = CONICAL_SURFACE( '', #278, 3.50000000000000, 0.785398163400000 );
#167 = SURFACE_STYLE_USAGE( .BOTH., #279 );
#168 = FACE_OUTER_BOUND( '', #280, .T. );
#169 = CONICAL_SURFACE( '', #281, 3.50000000000000, 0.785398163400000 );
#170 = SURFACE_STYLE_USAGE( .BOTH., #282 );
#171 = FACE_BOUND( '', #283, .T. );
#172 = FACE_OUTER_BOUND( '', #284, .T. );
#173 = CONICAL_SURFACE( '', #285, 1.50000000000000, 0.523598775600000 );
#174 = SURFACE_STYLE_USAGE( .BOTH., #286 );
#175 = FACE_OUTER_BOUND( '', #287, .T. );
#176 = CONICAL_SURFACE( '', #288, 3.50000000000000, 0.785398163400000 );
#177 = SURFACE_STYLE_USAGE( .BOTH., #289 );
#178 = FACE_OUTER_BOUND( '', #290, .T. );
#179 = CONICAL_SURFACE( '', #291, 3.50000000000000, 0.785398163400000 );
#180 = SURFACE_STYLE_USAGE( .BOTH., #292 );
#181 = FACE_BOUND( '', #293, .T. );
#182 = FACE_OUTER_BOUND( '', #294, .T. );
#183 = CONICAL_SURFACE( '', #295, 1.52950000000000, 0.785398163400000 );
#184 = SURFACE_STYLE_USAGE( .BOTH., #296 );
#185 = FACE_OUTER_BOUND( '', #297, .T. );
#186 = FACE_BOUND( '', #298, .T. );
#187 = CONICAL_SURFACE( '', #299, 1.22950000000000, 1.02974425870000 );
#188 = SURFACE_STYLE_USAGE( .BOTH., #300 );
#189 = FACE_OUTER_BOUND( '', #301, .T. );
#190 = FACE_OUTER_BOUND( '', #302, .T. );
#191 = CYLINDRICAL_SURFACE( '', #303, 1.50000000000000 );
#192 = SURFACE_STYLE_USAGE( .BOTH., #304 );
#193 = FACE_OUTER_BOUND( '', #305, .T. );
#194 = CONICAL_SURFACE( '', #306, 3.50000000000000, 0.785398163400000 );
#195 = SURFACE_STYLE_USAGE( .BOTH., #307 );
#196 = FACE_OUTER_BOUND( '', #308, .T. );
#197 = CONICAL_SURFACE( '', #309, 3.50000000000000, 0.785398163400000 );
#198 = SURFACE_STYLE_USAGE( .BOTH., #310 );
#199 = FACE_OUTER_BOUND( '', #311, .T. );
#200 = PLANE( '', #312 );
#201 = SURFACE_STYLE_USAGE( .BOTH., #313 );
#202 = FACE_OUTER_BOUND( '', #314, .T. );
#203 = CONICAL_SURFACE( '', #315, 3.50000000000000, 0.785398163400000 );
#204 = SURFACE_STYLE_USAGE( .BOTH., #316 );
#205 = FACE_OUTER_BOUND( '', #317, .T. );
#206 = PLANE( '', #318 );
#207 = SURFACE_STYLE_USAGE( .BOTH., #319 );
#208 = FACE_OUTER_BOUND( '', #320, .T. );
#209 = PLANE( '', #321 );
#210 = SURFACE_STYLE_USAGE( .BOTH., #322 );
#211 = FACE_OUTER_BOUND( '', #323, .T. );
#212 = FACE_OUTER_BOUND( '', #324, .T. );
#213 = TOROIDAL_SURFACE( '', #325, 1.30000000000000, 0.200000000000000 );
#214 = SURFACE_STYLE_USAGE( .BOTH., #326 );
#215 = FACE_OUTER_BOUND( '', #327, .T. );
#216 = FACE_OUTER_BOUND( '', #328, .T. );
#217 = CYLINDRICAL_SURFACE( '', #329, 1.22950000000000 );
#218 = SURFACE_STYLE_USAGE( .BOTH., #330 );
#219 = FACE_OUTER_BOUND( '', #331, .T. );
#220 = CONICAL_SURFACE( '', #332, 3.50000000000000, 0.785398163400000 );
#221 = SURFACE_STYLE_USAGE( .BOTH., #333 );
#222 = FACE_OUTER_BOUND( '', #334, .T. );
#223 = CONICAL_SURFACE( '', #335, 3.50000000000000, 0.785398163400000 );
#224 = SURFACE_STYLE_USAGE( .BOTH., #336 );
#225 = FACE_OUTER_BOUND( '', #337, .T. );
#226 = FACE_OUTER_BOUND( '', #338, .T. );
#227 = TOROIDAL_SURFACE( '', #339, 1.30000000000000, 0.200000000000000 );
#228 = SURFACE_STYLE_USAGE( .BOTH., #340 );
#229 = FACE_BOUND( '', #341, .T. );
#230 = FACE_OUTER_BOUND( '', #342, .T. );
#231 = CONICAL_SURFACE( '', #343, 1.50000000000000, 0.785398163400000 );
#232 = SURFACE_STYLE_USAGE( .BOTH., #344 );
#233 = FACE_OUTER_BOUND( '', #345, .T. );
#234 = PLANE( '', #346 );
#235 = SURFACE_STYLE_USAGE( .BOTH., #347 );
#236 = FACE_OUTER_BOUND( '', #348, .T. );
#237 = CONICAL_SURFACE( '', #349, 3.50000000000000, 0.785398163400000 );
#238 = PRODUCT_CONTEXT( '', #41, 'mechanical' );
#239 = PRODUCT_DEFINITION_FORMATION_WITH_SPECIFIED_SOURCE( ' ', 'NONE', #116, .NOT_KNOWN. );
#240 = CLOSED_SHELL( '', ( #91, #97, #99, #63, #61, #113, #93, #101, #109, #111, #57, #71, #55, #67, #87, #77, #69, #83, #85, #103, #105, #59, #89, #79, #95, #73, #75, #107, #81, #65, #115 ) );
#241 = CARTESIAN_POINT( '', ( 0.000000000000000, 0.000000000000000, 0.000000000000000 ) );
#242 = DIRECTION( '', ( 0.000000000000000, 0.000000000000000, 1.00000000000000 ) );
#243 = DIRECTION( '', ( 1.00000000000000, 0.000000000000000, 0.000000000000000 ) );
#244 =  ( LENGTH_UNIT(  )NAMED_UNIT( #125 )SI_UNIT( .MILLI., .METRE. ) );
#245 = SURFACE_SIDE_STYLE( '', ( #351 ) );
#246 = EDGE_LOOP( '', ( #352 ) );
#247 = AXIS2_PLACEMENT_3D( '', #353, #354, #355 );
#248 = SURFACE_SIDE_STYLE( '', ( #356 ) );
#249 = EDGE_LOOP( '', ( #357 ) );
#250 = EDGE_LOOP( '', ( #358 ) );
#251 = AXIS2_PLACEMENT_3D( '', #359, #360, #361 );
#252 = SURFACE_SIDE_STYLE( '', ( #362 ) );
#253 = EDGE_LOOP( '', ( #363, #364, #365 ) );
#254 = AXIS2_PLACEMENT_3D( '', #366, #367, #368 );
#255 = SURFACE_SIDE_STYLE( '', ( #369 ) );
#256 = EDGE_LOOP( '', ( #370, #371, #372, #373, #374, #375 ) );
#257 = AXIS2_PLACEMENT_3D( '', #376, #377, #378 );
#258 = SURFACE_SIDE_STYLE( '', ( #379 ) );
#259 = EDGE_LOOP( '', ( #380, #381, #382, #383, #384, #385 ) );
#260 = AXIS2_PLACEMENT_3D( '', #386, #387, #388 );
#261 = SURFACE_SIDE_STYLE( '', ( #389 ) );
#262 = EDGE_LOOP( '', ( #390, #391, #392 ) );
#263 = AXIS2_PLACEMENT_3D( '', #393, #394, #395 );
#264 = SURFACE_SIDE_STYLE( '', ( #396 ) );
#265 = EDGE_LOOP( '', ( #397 ) );
#266 = EDGE_LOOP( '', ( #398, #399, #400, #401, #402, #403 ) );
#267 = AXIS2_PLACEMENT_3D( '', #404, #405, #406 );
#268 = SURFACE_SIDE_STYLE( '', ( #407 ) );
#269 = EDGE_LOOP( '', ( #408 ) );
#270 = EDGE_LOOP( '', ( #409 ) );
#271 = AXIS2_PLACEMENT_3D( '', #410, #411, #412 );
#272 = SURFACE_SIDE_STYLE( '', ( #413 ) );
#273 = EDGE_LOOP( '', ( #414 ) );
#274 = EDGE_LOOP( '', ( #415, #416, #417, #418, #419, #420 ) );
#275 = AXIS2_PLACEMENT_3D( '', #421, #422, #423 );
#276 = SURFACE_SIDE_STYLE( '', ( #424 ) );
#277 = EDGE_LOOP( '', ( #425, #426, #427 ) );
#278 = AXIS2_PLACEMENT_3D( '', #428, #429, #430 );
#279 = SURFACE_SIDE_STYLE( '', ( #431 ) );
#280 = EDGE_LOOP( '', ( #432, #433, #434 ) );
#281 = AXIS2_PLACEMENT_3D( '', #435, #436, #437 );
#282 = SURFACE_SIDE_STYLE( '', ( #438 ) );
#283 = EDGE_LOOP( '', ( #439 ) );
#284 = EDGE_LOOP( '', ( #440 ) );
#285 = AXIS2_PLACEMENT_3D( '', #441, #442, #443 );
#286 = SURFACE_SIDE_STYLE( '', ( #444 ) );
#287 = EDGE_LOOP( '', ( #445, #446, #447 ) );
#288 = AXIS2_PLACEMENT_3D( '', #448, #449, #450 );
#289 = SURFACE_SIDE_STYLE( '', ( #451 ) );
#290 = EDGE_LOOP( '', ( #452, #453, #454 ) );
#291 = AXIS2_PLACEMENT_3D( '', #455, #456, #457 );
#292 = SURFACE_SIDE_STYLE( '', ( #458 ) );
#293 = EDGE_LOOP( '', ( #459 ) );
#294 = EDGE_LOOP( '', ( #460 ) );
#295 = AXIS2_PLACEMENT_3D( '', #461, #462, #463 );
#296 = SURFACE_SIDE_STYLE( '', ( #464 ) );
#297 = EDGE_LOOP( '', ( #465 ) );
#298 = VERTEX_LOOP( '', #466 );
#299 = AXIS2_PLACEMENT_3D( '', #467, #468, #469 );
#300 = SURFACE_SIDE_STYLE( '', ( #470 ) );
#301 = EDGE_LOOP( '', ( #471 ) );
#302 = EDGE_LOOP( '', ( #472 ) );
#303 = AXIS2_PLACEMENT_3D( '', #473, #474, #475 );
#304 = SURFACE_SIDE_STYLE( '', ( #476 ) );
#305 = EDGE_LOOP( '', ( #477, #478, #479 ) );
#306 = AXIS2_PLACEMENT_3D( '', #480, #481, #482 );
#307 = SURFACE_SIDE_STYLE( '', ( #483 ) );
#308 = EDGE_LOOP( '', ( #484, #485, #486 ) );
#309 = AXIS2_PLACEMENT_3D( '', #487, #488, #489 );
#310 = SURFACE_SIDE_STYLE( '', ( #490 ) );
#311 = EDGE_LOOP( '', ( #491, #492, #493, #494, #495, #496 ) );
#312 = AXIS2_PLACEMENT_3D( '', #497, #498, #499 );
#313 = SURFACE_SIDE_STYLE( '', ( #500 ) );
#314 = EDGE_LOOP( '', ( #501, #502, #503 ) );
#315 = AXIS2_PLACEMENT_3D( '', #504, #505, #506 );
#316 = SURFACE_SIDE_STYLE( '', ( #507 ) );
#317 = EDGE_LOOP( '', ( #508, #509, #510, #511, #512, #513 ) );
#318 = AXIS2_PLACEMENT_3D( '', #514, #515, #516 );
#319 = SURFACE_SIDE_STYLE( '', ( #517 ) );
#320 = EDGE_LOOP( '', ( #518, #519, #520, #521, #522, #523 ) );
#321 = AXIS2_PLACEMENT_3D( '', #524, #525, #526 );
#322 = SURFACE_SIDE_STYLE( '', ( #527 ) );
#323 = EDGE_LOOP( '', ( #528 ) );
#324 = EDGE_LOOP( '', ( #529 ) );
#325 = AXIS2_PLACEMENT_3D( '', #530, #531, #532 );
#326 = SURFACE_SIDE_STYLE( '', ( #533 ) );
#327 = EDGE_LOOP( '', ( #534 ) );
#328 = EDGE_LOOP( '', ( #535 ) );
#329 = AXIS2_PLACEMENT_3D( '', #536, #537, #538 );
#330 = SURFACE_SIDE_STYLE( '', ( #539 ) );
#331 = EDGE_LOOP( '', ( #540, #541, #542 ) );
#332 = AXIS2_PLACEMENT_3D( '', #543, #544, #545 );
#333 = SURFACE_SIDE_STYLE( '', ( #546 ) );
#334 = EDGE_LOOP( '', ( #547, #548, #549 ) );
#335 = AXIS2_PLACEMENT_3D( '', #550, #551, #552 );
#336 = SURFACE_SIDE_STYLE( '', ( #553 ) );
#337 = EDGE_LOOP( '', ( #554 ) );
#338 = EDGE_LOOP( '', ( #555 ) );
#339 = AXIS2_PLACEMENT_3D( '', #556, #557, #558 );
#340 = SURFACE_SIDE_STYLE( '', ( #559 ) );
#341 = EDGE_LOOP( '', ( #560 ) );
#342 = EDGE_LOOP( '', ( #561 ) );
#343 = AXIS2_PLACEMENT_3D( '', #562, #563, #564 );
#344 = SURFACE_SIDE_STYLE( '', ( #565 ) );
#345 = EDGE_LOOP( '', ( #566, #567, #568, #569, #570, #571 ) );
#346 = AXIS2_PLACEMENT_3D( '', #572, #573, #574 );
#347 = SURFACE_SIDE_STYLE( '', ( #575 ) );
#348 = EDGE_LOOP( '', ( #576, #577, #578 ) );
#349 = AXIS2_PLACEMENT_3D( '', #579, #580, #581 );
#351 = SURFACE_STYLE_FILL_AREA( #582 );
#352 = ORIENTED_EDGE( '', *, *, #583, .T. );
#353 = CARTESIAN_POINT( '', ( -6.66725702107016E-032, 0.000000000000000, 8.00000000000000 ) );
#354 = DIRECTION( '', ( -2.98155597433513E-016, 0.000000000000000, -1.00000000000000 ) );
#355 = DIRECTION( '', ( -1.00000000000000, 0.000000000000000, 2.98155597433513E-016 ) );
#356 = SURFACE_STYLE_FILL_AREA( #584 );
#357 = ORIENTED_EDGE( '', *, *, #585, .T. );
#358 = ORIENTED_EDGE( '', *, *, #586, .T. );
#359 = CARTESIAN_POINT( '', ( -2.38524477946811E-015, 0.000000000000000, 0.000000000000000 ) );
#360 = DIRECTION( '', ( 2.98155597433513E-016, -0.000000000000000, 1.00000000000000 ) );
#361 = DIRECTION( '', ( -1.00000000000000, 0.000000000000000, 2.98155597433513E-016 ) );
#362 = SURFACE_STYLE_FILL_AREA( #587 );
#363 = ORIENTED_EDGE( '', *, *, #588, .T. );
#364 = ORIENTED_EDGE( '', *, *, #589, .F. );
#365 = ORIENTED_EDGE( '', *, *, #590, .F. );
#366 = CARTESIAN_POINT( '', ( 0.000000000000000, 0.000000000000000, -4.00000000000000 ) );
#367 = DIRECTION( '', ( -0.000000000000000, -0.000000000000000, 1.00000000000000 ) );
#368 = DIRECTION( '', ( 1.00000000000000, 0.000000000000000, 0.000000000000000 ) );
#369 = SURFACE_STYLE_FILL_AREA( #591 );
#370 = ORIENTED_EDGE( '', *, *, #592, .F. );
#371 = ORIENTED_EDGE( '', *, *, #593, .T. );
#372 = ORIENTED_EDGE( '', *, *, #590, .T. );
#373 = ORIENTED_EDGE( '', *, *, #594, .T. );
#374 = ORIENTED_EDGE( '', *, *, #595, .F. );
#375 = ORIENTED_EDGE( '', *, *, #596, .F. );
#376 = CARTESIAN_POINT( '', ( -1.44337567297407, -2.50000000000000, -5.00000000000000 ) );
#377 = DIRECTION( '', ( -7.51157299368580E-016, -1.00000000000000, 0.000000000000000 ) );
#378 = DIRECTION( '', ( 1.00000000000000, -7.51157299368580E-016, 0.000000000000000 ) );
#379 = SURFACE_STYLE_FILL_AREA( #597 );
#380 = ORIENTED_EDGE( '', *, *, #598, .F. );
#381 = ORIENTED_EDGE( '', *, *, #599, .T. );
#382 = ORIENTED_EDGE( '', *, *, #600, .T. );
#383 = ORIENTED_EDGE( '', *, *, #601, .T. );
#384 = ORIENTED_EDGE( '', *, *, #602, .F. );
#385 = ORIENTED_EDGE( '', *, *, #603, .F. );
#386 = CARTESIAN_POINT( '', ( -1.44337567297406, 2.50000000000000, -5.00000000000000 ) );
#387 = DIRECTION( '', ( -0.866025403784438, 0.500000000000000, 0.000000000000000 ) );
#388 = DIRECTION( '', ( -0.500000000000000, -0.866025403784438, 0.000000000000000 ) );
#389 = SURFACE_STYLE_FILL_AREA( #604 );
#390 = ORIENTED_EDGE( '', *, *, #605, .T. );
#391 = ORIENTED_EDGE( '', *, *, #606, .T. );
#392 = ORIENTED_EDGE( '', *, *, #607, .T. );
#393 = CARTESIAN_POINT( '', ( 0.000000000000000, 0.000000000000000, -1.00000000000000 ) );
#394 = DIRECTION( '', ( -0.000000000000000, 0.000000000000000, -1.00000000000000 ) );
#395 = DIRECTION( '', ( -1.00000000000000, 0.000000000000000, 0.000000000000000 ) );
#396 = SURFACE_STYLE_FILL_AREA( #608 );
#397 = ORIENTED_EDGE( '', *, *, #609, .T. );
#398 = ORIENTED_EDGE( '', *, *, #610, .F. );
#399 = ORIENTED_EDGE( '', *, *, #611, .F. );
#400 = ORIENTED_EDGE( '', *, *, #588, .F. );
#401 = ORIENTED_EDGE( '', *, *, #612, .F. );
#402 = ORIENTED_EDGE( '', *, *, #613, .F. );
#403 = ORIENTED_EDGE( '', *, *, #614, .F. );
#404 = CARTESIAN_POINT( '', ( 0.000000000000000, 0.000000000000000, -5.00000000000000 ) );
#405 = DIRECTION( '', ( 0.000000000000000, 0.000000000000000, 1.00000000000000 ) );
#406 = DIRECTION( '', ( 1.00000000000000, 0.000000000000000, 0.000000000000000 ) );
#407 = SURFACE_STYLE_FILL_AREA( #615 );
#408 = ORIENTED_EDGE( '', *, *, #616, .F. );
#409 = ORIENTED_EDGE( '', *, *, #617, .T. );
#410 = CARTESIAN_POINT( '', ( 0.000000000000000, 0.000000000000000, -5.00000000000000 ) );
#411 = DIRECTION( '', ( -0.000000000000000, 0.000000000000000, -1.00000000000000 ) );
#412 = DIRECTION( '', ( 0.000000000000000, 1.00000000000000, 0.000000000000000 ) );
#413 = SURFACE_STYLE_FILL_AREA( #618 );
#414 = ORIENTED_EDGE( '', *, *, #619, .T. );
#415 = ORIENTED_EDGE( '', *, *, #620, .F. );
#416 = ORIENTED_EDGE( '', *, *, #621, .F. );
#417 = ORIENTED_EDGE( '', *, *, #606, .F. );
#418 = ORIENTED_EDGE( '', *, *, #622, .T. );
#419 = ORIENTED_EDGE( '', *, *, #623, .F. );
#420 = ORIENTED_EDGE( '', *, *, #624, .F. );
#421 = CARTESIAN_POINT( '', ( 0.000000000000000, 0.000000000000000, 0.000000000000000 ) );
#422 = DIRECTION( '', ( 0.000000000000000, 0.000000000000000, 1.00000000000000 ) );
#423 = DIRECTION( '', ( 1.00000000000000, 0.000000000000000, 0.000000000000000 ) );
#424 = SURFACE_STYLE_FILL_AREA( #625 );
#425 = ORIENTED_EDGE( '', *, *, #626, .T. );
#426 = ORIENTED_EDGE( '', *, *, #596, .T. );
#427 = ORIENTED_EDGE( '', *, *, #624, .T. );
#428 = CARTESIAN_POINT( '', ( 0.000000000000000, 0.000000000000000, -1.00000000000000 ) );
#429 = DIRECTION( '', ( -0.000000000000000, 0.000000000000000, -1.00000000000000 ) );
#430 = DIRECTION( '', ( -1.00000000000000, 0.000000000000000, 0.000000000000000 ) );
#431 = SURFACE_STYLE_FILL_AREA( #627 );
#432 = ORIENTED_EDGE( '', *, *, #595, .T. );
#433 = ORIENTED_EDGE( '', *, *, #628, .T. );
#434 = ORIENTED_EDGE( '', *, *, #620, .T. );
#435 = CARTESIAN_POINT( '', ( 0.000000000000000, 0.000000000000000, -1.00000000000000 ) );
#436 = DIRECTION( '', ( -0.000000000000000, 0.000000000000000, -1.00000000000000 ) );
#437 = DIRECTION( '', ( -1.00000000000000, 0.000000000000000, 0.000000000000000 ) );
#438 = SURFACE_STYLE_FILL_AREA( #629 );
#439 = ORIENTED_EDGE( '', *, *, #630, .T. );
#440 = ORIENTED_EDGE( '', *, *, #631, .T. );
#441 = CARTESIAN_POINT( '', ( -2.02959872342499E-015, 0.000000000000000, 1.19282032302755 ) );
#442 = DIRECTION( '', ( 2.98155597433513E-016, -0.000000000000000, 1.00000000000000 ) );
#443 = DIRECTION( '', ( 1.00000000000000, 0.000000000000000, -2.98155597433513E-016 ) );
#444 = SURFACE_STYLE_FILL_AREA( #632 );
#445 = ORIENTED_EDGE( '', *, *, #633, .F. );
#446 = ORIENTED_EDGE( '', *, *, #612, .T. );
#447 = ORIENTED_EDGE( '', *, *, #593, .F. );
#448 = CARTESIAN_POINT( '', ( 0.000000000000000, 0.000000000000000, -4.00000000000000 ) );
#449 = DIRECTION( '', ( -0.000000000000000, -0.000000000000000, 1.00000000000000 ) );
#450 = DIRECTION( '', ( 1.00000000000000, 0.000000000000000, 0.000000000000000 ) );
#451 = SURFACE_STYLE_FILL_AREA( #634 );
#452 = ORIENTED_EDGE( '', *, *, #635, .T. );
#453 = ORIENTED_EDGE( '', *, *, #603, .T. );
#454 = ORIENTED_EDGE( '', *, *, #622, .F. );
#455 = CARTESIAN_POINT( '', ( 0.000000000000000, 0.000000000000000, -1.00000000000000 ) );
#456 = DIRECTION( '', ( -0.000000000000000, 0.000000000000000, -1.00000000000000 ) );
#457 = DIRECTION( '', ( -1.00000000000000, 0.000000000000000, 0.000000000000000 ) );
#458 = SURFACE_STYLE_FILL_AREA( #636 );
#459 = ORIENTED_EDGE( '', *, *, #617, .F. );
#460 = ORIENTED_EDGE( '', *, *, #609, .F. );
#461 = CARTESIAN_POINT( '', ( 0.000000000000000, 0.000000000000000, -5.00000000000000 ) );
#462 = DIRECTION( '', ( 0.000000000000000, -0.000000000000000, -1.00000000000000 ) );
#463 = DIRECTION( '', ( 1.00000000000000, 0.000000000000000, 0.000000000000000 ) );
#464 = SURFACE_STYLE_FILL_AREA( #637 );
#465 = ORIENTED_EDGE( '', *, *, #638, .F. );
#466 = VERTEX_POINT( '', #639 );
#467 = CARTESIAN_POINT( '', ( 0.000000000000000, 0.000000000000000, 0.000000000000000 ) );
#468 = DIRECTION( '', ( 0.000000000000000, -0.000000000000000, -1.00000000000000 ) );
#469 = DIRECTION( '', ( 0.000000000000000, -1.00000000000000, 0.000000000000000 ) );
#470 = SURFACE_STYLE_FILL_AREA( #640 );
#471 = ORIENTED_EDGE( '', *, *, #641, .T. );
#472 = ORIENTED_EDGE( '', *, *, #631, .F. );
#473 = CARTESIAN_POINT( '', ( -2.38524477946811E-015, 0.000000000000000, 0.000000000000000 ) );
#474 = DIRECTION( '', ( 2.98155597433513E-016, -0.000000000000000, 1.00000000000000 ) );
#475 = DIRECTION( '', ( -1.00000000000000, 0.000000000000000, 2.98155597433513E-016 ) );
#476 = SURFACE_STYLE_FILL_AREA( #642 );
#477 = ORIENTED_EDGE( '', *, *, #600, .F. );
#478 = ORIENTED_EDGE( '', *, *, #613, .T. );
#479 = ORIENTED_EDGE( '', *, *, #643, .F. );
#480 = CARTESIAN_POINT( '', ( 0.000000000000000, 0.000000000000000, -4.00000000000000 ) );
#481 = DIRECTION( '', ( -0.000000000000000, -0.000000000000000, 1.00000000000000 ) );
#482 = DIRECTION( '', ( 1.00000000000000, 0.000000000000000, 0.000000000000000 ) );
#483 = SURFACE_STYLE_FILL_AREA( #644 );
#484 = ORIENTED_EDGE( '', *, *, #645, .F. );
#485 = ORIENTED_EDGE( '', *, *, #614, .T. );
#486 = ORIENTED_EDGE( '', *, *, #599, .F. );
#487 = CARTESIAN_POINT( '', ( 0.000000000000000, 0.000000000000000, -4.00000000000000 ) );
#488 = DIRECTION( '', ( -0.000000000000000, -0.000000000000000, 1.00000000000000 ) );
#489 = DIRECTION( '', ( 1.00000000000000, 0.000000000000000, 0.000000000000000 ) );
#490 = SURFACE_STYLE_FILL_AREA( #646 );
#491 = ORIENTED_EDGE( '', *, *, #647, .F. );
#492 = ORIENTED_EDGE( '', *, *, #648, .T. );
#493 = ORIENTED_EDGE( '', *, *, #645, .T. );
#494 = ORIENTED_EDGE( '', *, *, #598, .T. );
#495 = ORIENTED_EDGE( '', *, *, #635, .F. );
#496 = ORIENTED_EDGE( '', *, *, #605, .F. );
#497 = CARTESIAN_POINT( '', ( 1.44337567297406, 2.50000000000000, -5.00000000000000 ) );
#498 = DIRECTION( '', ( 7.51157299368583E-016, 1.00000000000000, 0.000000000000000 ) );
#499 = DIRECTION( '', ( -1.00000000000000, 7.51157299368583E-016, 0.000000000000000 ) );
#500 = SURFACE_STYLE_FILL_AREA( #649 );
#501 = ORIENTED_EDGE( '', *, *, #610, .T. );
#502 = ORIENTED_EDGE( '', *, *, #648, .F. );
#503 = ORIENTED_EDGE( '', *, *, #650, .F. );
#504 = CARTESIAN_POINT( '', ( 0.000000000000000, 0.000000000000000, -4.00000000000000 ) );
#505 = DIRECTION( '', ( -0.000000000000000, -0.000000000000000, 1.00000000000000 ) );
#506 = DIRECTION( '', ( 1.00000000000000, 0.000000000000000, 0.000000000000000 ) );
#507 = SURFACE_STYLE_FILL_AREA( #651 );
#508 = ORIENTED_EDGE( '', *, *, #594, .F. );
#509 = ORIENTED_EDGE( '', *, *, #589, .T. );
#510 = ORIENTED_EDGE( '', *, *, #652, .T. );
#511 = ORIENTED_EDGE( '', *, *, #653, .T. );
#512 = ORIENTED_EDGE( '', *, *, #654, .F. );
#513 = ORIENTED_EDGE( '', *, *, #628, .F. );
#514 = CARTESIAN_POINT( '', ( 1.44337567297406, -2.50000000000000, -5.00000000000000 ) );
#515 = DIRECTION( '', ( 0.866025403784439, -0.500000000000000, 0.000000000000000 ) );
#516 = DIRECTION( '', ( 0.500000000000000, 0.866025403784439, 0.000000000000000 ) );
#517 = SURFACE_STYLE_FILL_AREA( #655 );
#518 = ORIENTED_EDGE( '', *, *, #601, .F. );
#519 = ORIENTED_EDGE( '', *, *, #643, .T. );
#520 = ORIENTED_EDGE( '', *, *, #633, .T. );
#521 = ORIENTED_EDGE( '', *, *, #592, .T. );
#522 = ORIENTED_EDGE( '', *, *, #626, .F. );
#523 = ORIENTED_EDGE( '', *, *, #656, .F. );
#524 = CARTESIAN_POINT( '', ( -2.88675134594812, 9.99499788717343E-015, -5.00000000000000 ) );
#525 = DIRECTION( '', ( -0.866025403784439, -0.500000000000000, 0.000000000000000 ) );
#526 = DIRECTION( '', ( 0.499999999999999, -0.866025403784439, 0.000000000000000 ) );
#527 = SURFACE_STYLE_FILL_AREA( #657 );
#528 = ORIENTED_EDGE( '', *, *, #586, .F. );
#529 = ORIENTED_EDGE( '', *, *, #619, .F. );
#530 = CARTESIAN_POINT( '', ( -2.32561365998141E-015, 0.000000000000000, 0.200000000000000 ) );
#531 = DIRECTION( '', ( 0.000000000000000, 0.000000000000000, 1.00000000000000 ) );
#532 = DIRECTION( '', ( 1.00000000000000, 0.000000000000000, 0.000000000000000 ) );
#533 = SURFACE_STYLE_FILL_AREA( #658 );
#534 = ORIENTED_EDGE( '', *, *, #638, .T. );
#535 = ORIENTED_EDGE( '', *, *, #616, .T. );
#536 = CARTESIAN_POINT( '', ( 0.000000000000000, 0.000000000000000, -5.00000000000000 ) );
#537 = DIRECTION( '', ( -0.000000000000000, 0.000000000000000, -1.00000000000000 ) );
#538 = DIRECTION( '', ( 0.000000000000000, 1.00000000000000, 0.000000000000000 ) );
#539 = SURFACE_STYLE_FILL_AREA( #659 );
#540 = ORIENTED_EDGE( '', *, *, #611, .T. );
#541 = ORIENTED_EDGE( '', *, *, #660, .F. );
#542 = ORIENTED_EDGE( '', *, *, #652, .F. );
#543 = CARTESIAN_POINT( '', ( 0.000000000000000, 0.000000000000000, -4.00000000000000 ) );
#544 = DIRECTION( '', ( -0.000000000000000, -0.000000000000000, 1.00000000000000 ) );
#545 = DIRECTION( '', ( 1.00000000000000, 0.000000000000000, 0.000000000000000 ) );
#546 = SURFACE_STYLE_FILL_AREA( #661 );
#547 = ORIENTED_EDGE( '', *, *, #602, .T. );
#548 = ORIENTED_EDGE( '', *, *, #656, .T. );
#549 = ORIENTED_EDGE( '', *, *, #623, .T. );
#550 = CARTESIAN_POINT( '', ( 0.000000000000000, 0.000000000000000, -1.00000000000000 ) );
#551 = DIRECTION( '', ( -0.000000000000000, 0.000000000000000, -1.00000000000000 ) );
#552 = DIRECTION( '', ( -1.00000000000000, 0.000000000000000, 0.000000000000000 ) );
#553 = SURFACE_STYLE_FILL_AREA( #662 );
#554 = ORIENTED_EDGE( '', *, *, #630, .F. );
#555 = ORIENTED_EDGE( '', *, *, #585, .F. );
#556 = CARTESIAN_POINT( '', ( -2.25214509106158E-015, 0.000000000000000, 0.446410161513775 ) );
#557 = DIRECTION( '', ( -2.98155597433513E-016, 0.000000000000000, -1.00000000000000 ) );
#558 = DIRECTION( '', ( -1.00000000000000, 0.000000000000000, 2.98155597433513E-016 ) );
#559 = SURFACE_STYLE_FILL_AREA( #663 );
#560 = ORIENTED_EDGE( '', *, *, #583, .F. );
#561 = ORIENTED_EDGE( '', *, *, #641, .F. );
#562 = CARTESIAN_POINT( '', ( -8.94466792300540E-017, 0.000000000000000, 7.70000000000000 ) );
#563 = DIRECTION( '', ( -2.98155597433513E-016, 0.000000000000000, -1.00000000000000 ) );
#564 = DIRECTION( '', ( -1.00000000000000, 0.000000000000000, 2.98155597433513E-016 ) );
#565 = SURFACE_STYLE_FILL_AREA( #664 );
#566 = ORIENTED_EDGE( '', *, *, #653, .F. );
#567 = ORIENTED_EDGE( '', *, *, #660, .T. );
#568 = ORIENTED_EDGE( '', *, *, #650, .T. );
#569 = ORIENTED_EDGE( '', *, *, #647, .T. );
#570 = ORIENTED_EDGE( '', *, *, #607, .F. );
#571 = ORIENTED_EDGE( '', *, *, #665, .F. );
#572 = CARTESIAN_POINT( '', ( 2.88675134594812, 4.92691419841691E-015, -5.00000000000000 ) );
#573 = DIRECTION( '', ( 0.866025403784439, 0.500000000000000, 0.000000000000000 ) );
#574 = DIRECTION( '', ( -0.500000000000000, 0.866025403784439, 0.000000000000000 ) );
#575 = SURFACE_STYLE_FILL_AREA( #666 );
#576 = ORIENTED_EDGE( '', *, *, #654, .T. );
#577 = ORIENTED_EDGE( '', *, *, #665, .T. );
#578 = ORIENTED_EDGE( '', *, *, #621, .T. );
#579 = CARTESIAN_POINT( '', ( 0.000000000000000, 0.000000000000000, -1.00000000000000 ) );
#580 = DIRECTION( '', ( -0.000000000000000, 0.000000000000000, -1.00000000000000 ) );
#581 = DIRECTION( '', ( -1.00000000000000, 0.000000000000000, 0.000000000000000 ) );
#582 = FILL_AREA_STYLE( '', ( #667 ) );
#583 = EDGE_CURVE( '', #668, #668, #669, .F. );
#584 = FILL_AREA_STYLE( '', ( #670 ) );
#585 = EDGE_CURVE( '', #671, #671, #672, .T. );
#586 = EDGE_CURVE( '', #673, #673, #674, .T. );
#587 = FILL_AREA_STYLE( '', ( #675 ) );
#588 = EDGE_CURVE( '', #676, #677, #678, .T. );
#589 = EDGE_CURVE( '', #679, #677, #680, .T. );
#590 = EDGE_CURVE( '', #676, #679, #681, .T. );
#591 = FILL_AREA_STYLE( '', ( #682 ) );
#592 = EDGE_CURVE( '', #683, #684, #685, .T. );
#593 = EDGE_CURVE( '', #683, #676, #686, .T. );
#594 = EDGE_CURVE( '', #679, #687, #688, .T. );
#595 = EDGE_CURVE( '', #689, #687, #690, .T. );
#596 = EDGE_CURVE( '', #684, #689, #691, .T. );
#597 = FILL_AREA_STYLE( '', ( #692 ) );
#598 = EDGE_CURVE( '', #693, #694, #695, .T. );
#599 = EDGE_CURVE( '', #693, #696, #697, .T. );
#600 = EDGE_CURVE( '', #696, #698, #699, .T. );
#601 = EDGE_CURVE( '', #698, #700, #701, .T. );
#602 = EDGE_CURVE( '', #702, #700, #703, .T. );
#603 = EDGE_CURVE( '', #694, #702, #704, .T. );
#604 = FILL_AREA_STYLE( '', ( #705 ) );
#605 = EDGE_CURVE( '', #706, #707, #708, .F. );
#606 = EDGE_CURVE( '', #707, #709, #710, .F. );
#607 = EDGE_CURVE( '', #709, #706, #711, .T. );
#608 = FILL_AREA_STYLE( '', ( #712 ) );
#609 = EDGE_CURVE( '', #713, #713, #714, .T. );
#610 = EDGE_CURVE( '', #715, #716, #717, .T. );
#611 = EDGE_CURVE( '', #677, #715, #718, .T. );
#612 = EDGE_CURVE( '', #719, #676, #720, .T. );
#613 = EDGE_CURVE( '', #696, #719, #721, .T. );
#614 = EDGE_CURVE( '', #716, #696, #722, .T. );
#615 = FILL_AREA_STYLE( '', ( #723 ) );
#616 = EDGE_CURVE( '', #724, #724, #725, .T. );
#617 = EDGE_CURVE( '', #726, #726, #727, .T. );
#618 = FILL_AREA_STYLE( '', ( #728 ) );
#619 = EDGE_CURVE( '', #729, #729, #730, .F. );
#620 = EDGE_CURVE( '', #731, #689, #732, .F. );
#621 = EDGE_CURVE( '', #709, #731, #733, .F. );
#622 = EDGE_CURVE( '', #707, #702, #734, .T. );
#623 = EDGE_CURVE( '', #735, #702, #736, .F. );
#624 = EDGE_CURVE( '', #689, #735, #737, .F. );
#625 = FILL_AREA_STYLE( '', ( #738 ) );
#626 = EDGE_CURVE( '', #735, #684, #739, .T. );
#627 = FILL_AREA_STYLE( '', ( #740 ) );
#628 = EDGE_CURVE( '', #687, #731, #741, .T. );
#629 = FILL_AREA_STYLE( '', ( #742 ) );
#630 = EDGE_CURVE( '', #743, #743, #744, .T. );
#631 = EDGE_CURVE( '', #745, #745, #746, .T. );
#632 = FILL_AREA_STYLE( '', ( #747 ) );
#633 = EDGE_CURVE( '', #719, #683, #748, .T. );
#634 = FILL_AREA_STYLE( '', ( #749 ) );
#635 = EDGE_CURVE( '', #707, #694, #750, .F. );
#636 = FILL_AREA_STYLE( '', ( #751 ) );
#637 = FILL_AREA_STYLE( '', ( #752 ) );
#638 = EDGE_CURVE( '', #753, #753, #754, .T. );
#639 = CARTESIAN_POINT( '', ( 0.000000000000000, 0.000000000000000, 0.738758131094386 ) );
#640 = FILL_AREA_STYLE( '', ( #755 ) );
#641 = EDGE_CURVE( '', #756, #756, #757, .T. );
#642 = FILL_AREA_STYLE( '', ( #758 ) );
#643 = EDGE_CURVE( '', #698, #719, #759, .T. );
#644 = FILL_AREA_STYLE( '', ( #760 ) );
#645 = EDGE_CURVE( '', #716, #693, #761, .F. );
#646 = FILL_AREA_STYLE( '', ( #762 ) );
#647 = EDGE_CURVE( '', #763, #706, #764, .T. );
#648 = EDGE_CURVE( '', #763, #716, #765, .F. );
#649 = FILL_AREA_STYLE( '', ( #766 ) );
#650 = EDGE_CURVE( '', #715, #763, #767, .T. );
#651 = FILL_AREA_STYLE( '', ( #768 ) );
#652 = EDGE_CURVE( '', #677, #769, #770, .T. );
#653 = EDGE_CURVE( '', #769, #771, #772, .T. );
#654 = EDGE_CURVE( '', #731, #771, #773, .T. );
#655 = FILL_AREA_STYLE( '', ( #774 ) );
#656 = EDGE_CURVE( '', #700, #735, #775, .T. );
#657 = FILL_AREA_STYLE( '', ( #776 ) );
#658 = FILL_AREA_STYLE( '', ( #777 ) );
#659 = FILL_AREA_STYLE( '', ( #778 ) );
#660 = EDGE_CURVE( '', #769, #715, #779, .T. );
#661 = FILL_AREA_STYLE( '', ( #780 ) );
#662 = FILL_AREA_STYLE( '', ( #781 ) );
#663 = FILL_AREA_STYLE( '', ( #782 ) );
#664 = FILL_AREA_STYLE( '', ( #783 ) );
#665 = EDGE_CURVE( '', #771, #709, #784, .T. );
#666 = FILL_AREA_STYLE( '', ( #785 ) );
#667 = FILL_AREA_STYLE_COLOUR( '', #786 );
#668 = VERTEX_POINT( '', #787 );
#669 = CIRCLE( '', #788, 1.20000000000000 );
#670 = FILL_AREA_STYLE_COLOUR( '', #789 );
#671 = VERTEX_POINT( '', #790 );
#672 = CIRCLE( '', #791, 1.10000000000000 );
#673 = VERTEX_POINT( '', #792 );
#674 = CIRCLE( '', #793, 1.10000000000000 );
#675 = FILL_AREA_STYLE_COLOUR( '', #794 );
#676 = VERTEX_POINT( '', #795 );
#677 = VERTEX_POINT( '', #796 );
#678 = CIRCLE( '', #797, 2.50000000000000 );
#679 = VERTEX_POINT( '', #798 );
#680 = B_SPLINE_CURVE_WITH_KNOTS( '', 3, ( #799, #800, #801, #802, #803, #804, #805, #806 ), .UNSPECIFIED., .F., .F., ( 4, 2, 2, 4 ), ( 0.000000000000000, 0.000748349068371359, 0.00112239638553523, 0.00149644370269909 ), .UNSPECIFIED. );
#681 = B_SPLINE_CURVE_WITH_KNOTS( '', 3, ( #807, #808, #809, #810, #811, #812 ), .UNSPECIFIED., .F., .F., ( 4, 2, 4 ), ( 0.00369212338756634, 0.00444153877190694, 0.00519095415624754 ), .UNSPECIFIED. );
#682 = FILL_AREA_STYLE_COLOUR( '', #813 );
#683 = VERTEX_POINT( '', #814 );
#684 = VERTEX_POINT( '', #815 );
#685 = LINE( '', #816, #817 );
#686 = B_SPLINE_CURVE_WITH_KNOTS( '', 3, ( #818, #819, #820, #821, #822, #823, #824, #825 ), .UNSPECIFIED., .F., .F., ( 4, 2, 2, 4 ), ( 0.00219594592926562, 0.00294403465841598, 0.00331807902299116, 0.00369212338756634 ), .UNSPECIFIED. );
#687 = VERTEX_POINT( '', #826 );
#688 = LINE( '', #827, #828 );
#689 = VERTEX_POINT( '', #829 );
#690 = B_SPLINE_CURVE_WITH_KNOTS( '', 3, ( #830, #831, #832, #833, #834, #835 ), .UNSPECIFIED., .F., .F., ( 4, 2, 4 ), ( 0.00369212338756634, 0.00444153877190694, 0.00519095415624755 ), .UNSPECIFIED. );
#691 = B_SPLINE_CURVE_WITH_KNOTS( '', 3, ( #836, #837, #838, #839, #840, #841, #842, #843 ), .UNSPECIFIED., .F., .F., ( 4, 2, 2, 4 ), ( 0.00219594592926563, 0.00294403465841598, 0.00331807902299116, 0.00369212338756634 ), .UNSPECIFIED. );
#692 = FILL_AREA_STYLE_COLOUR( '', #844 );
#693 = VERTEX_POINT( '', #845 );
#694 = VERTEX_POINT( '', #846 );
#695 = LINE( '', #847, #848 );
#696 = VERTEX_POINT( '', #849 );
#697 = B_SPLINE_CURVE_WITH_KNOTS( '', 3, ( #850, #851, #852, #853, #854, #855, #856, #857 ), .UNSPECIFIED., .F., .F., ( 4, 2, 2, 4 ), ( 0.000000000000000, 0.000748349068371361, 0.00112239638553523, 0.00149644370269910 ), .UNSPECIFIED. );
#698 = VERTEX_POINT( '', #858 );
#699 = B_SPLINE_CURVE_WITH_KNOTS( '', 3, ( #859, #860, #861, #862, #863, #864 ), .UNSPECIFIED., .F., .F., ( 4, 2, 4 ), ( 0.00149644370269910, 0.00223929648777399, 0.00298214927284887 ), .UNSPECIFIED. );
#700 = VERTEX_POINT( '', #865 );
#701 = LINE( '', #866, #867 );
#702 = VERTEX_POINT( '', #868 );
#703 = B_SPLINE_CURVE_WITH_KNOTS( '', 3, ( #869, #870, #871, #872, #873, #874 ), .UNSPECIFIED., .F., .F., ( 4, 2, 4 ), ( 0.00149644370269910, 0.00223929648777399, 0.00298214927284887 ), .UNSPECIFIED. );
#704 = B_SPLINE_CURVE_WITH_KNOTS( '', 3, ( #875, #876, #877, #878, #879, #880, #881, #882 ), .UNSPECIFIED., .F., .F., ( 4, 2, 2, 4 ), ( 0.000000000000000, 0.000748349068371362, 0.00112239638553523, 0.00149644370269910 ), .UNSPECIFIED. );
#705 = FILL_AREA_STYLE_COLOUR( '', #883 );
#706 = VERTEX_POINT( '', #884 );
#707 = VERTEX_POINT( '', #885 );
#708 = B_SPLINE_CURVE_WITH_KNOTS( '', 3, ( #886, #887, #888, #889, #890, #891 ), .UNSPECIFIED., .F., .F., ( 4, 2, 4 ), ( 0.00369212339065708, 0.00444153877500312, 0.00519095415934916 ), .UNSPECIFIED. );
#709 = VERTEX_POINT( '', #892 );
#710 = CIRCLE( '', #893, 2.50000000000000 );
#711 = B_SPLINE_CURVE_WITH_KNOTS( '', 3, ( #894, #895, #896, #897, #898, #899 ), .UNSPECIFIED., .F., .F., ( 4, 2, 4 ), ( 0.00149644370269909, 0.00223929648777398, 0.00298214927284888 ), .UNSPECIFIED. );
#712 = FILL_AREA_STYLE_COLOUR( '', #900 );
#713 = VERTEX_POINT( '', #901 );
#714 = CIRCLE( '', #902, 1.52950000000000 );
#715 = VERTEX_POINT( '', #903 );
#716 = VERTEX_POINT( '', #904 );
#717 = CIRCLE( '', #905, 2.50000000000000 );
#718 = CIRCLE( '', #906, 2.50000000000000 );
#719 = VERTEX_POINT( '', #907 );
#720 = CIRCLE( '', #908, 2.50000000000000 );
#721 = CIRCLE( '', #909, 2.50000000000000 );
#722 = CIRCLE( '', #910, 2.50000000000000 );
#723 = FILL_AREA_STYLE_COLOUR( '', #911 );
#724 = VERTEX_POINT( '', #912 );
#725 = CIRCLE( '', #913, 1.22950000000000 );
#726 = VERTEX_POINT( '', #914 );
#727 = CIRCLE( '', #915, 1.22950000000000 );
#728 = FILL_AREA_STYLE_COLOUR( '', #916 );
#729 = VERTEX_POINT( '', #917 );
#730 = CIRCLE( '', #918, 1.30000000000000 );
#731 = VERTEX_POINT( '', #919 );
#732 = CIRCLE( '', #920, 2.50000000000000 );
#733 = CIRCLE( '', #921, 2.50000000000000 );
#734 = CIRCLE( '', #922, 2.50000000000000 );
#735 = VERTEX_POINT( '', #923 );
#736 = CIRCLE( '', #924, 2.50000000000000 );
#737 = CIRCLE( '', #925, 2.50000000000000 );
#738 = FILL_AREA_STYLE_COLOUR( '', #926 );
#739 = B_SPLINE_CURVE_WITH_KNOTS( '', 3, ( #927, #928, #929, #930, #931, #932 ), .UNSPECIFIED., .F., .F., ( 4, 2, 4 ), ( 0.00149644370269910, 0.00223929648777399, 0.00298214927284889 ), .UNSPECIFIED. );
#740 = FILL_AREA_STYLE_COLOUR( '', #933 );
#741 = B_SPLINE_CURVE_WITH_KNOTS( '', 3, ( #934, #935, #936, #937, #938, #939, #940, #941 ), .UNSPECIFIED., .F., .F., ( 4, 2, 2, 4 ), ( 0.000000000000000, 0.000748349068371361, 0.00112239638553523, 0.00149644370269910 ), .UNSPECIFIED. );
#742 = FILL_AREA_STYLE_COLOUR( '', #942 );
#743 = VERTEX_POINT( '', #943 );
#744 = CIRCLE( '', #944, 1.12679491920000 );
#745 = VERTEX_POINT( '', #945 );
#746 = CIRCLE( '', #946, 1.50000000000000 );
#747 = FILL_AREA_STYLE_COLOUR( '', #947 );
#748 = B_SPLINE_CURVE_WITH_KNOTS( '', 3, ( #948, #949, #950, #951, #952, #953 ), .UNSPECIFIED., .F., .F., ( 4, 2, 4 ), ( 0.00149644370269910, 0.00223929648777400, 0.00298214927284889 ), .UNSPECIFIED. );
#749 = FILL_AREA_STYLE_COLOUR( '', #954 );
#750 = B_SPLINE_CURVE_WITH_KNOTS( '', 3, ( #955, #956, #957, #958, #959, #960, #961, #962 ), .UNSPECIFIED., .F., .F., ( 4, 2, 2, 4 ), ( 0.00219594593239751, 0.00294403466152730, 0.00331807902609219, 0.00369212339065708 ), .UNSPECIFIED. );
#751 = FILL_AREA_STYLE_COLOUR( '', #963 );
#752 = FILL_AREA_STYLE_COLOUR( '', #964 );
#753 = VERTEX_POINT( '', #965 );
#754 = CIRCLE( '', #966, 1.22950000000000 );
#755 = FILL_AREA_STYLE_COLOUR( '', #967 );
#756 = VERTEX_POINT( '', #968 );
#757 = CIRCLE( '', #969, 1.50000000000000 );
#758 = FILL_AREA_STYLE_COLOUR( '', #970 );
#759 = B_SPLINE_CURVE_WITH_KNOTS( '', 3, ( #971, #972, #973, #974, #975, #976, #977, #978 ), .UNSPECIFIED., .F., .F., ( 4, 2, 2, 4 ), ( 0.000000000000000, 0.000748349068371364, 0.00112239638553523, 0.00149644370269910 ), .UNSPECIFIED. );
#760 = FILL_AREA_STYLE_COLOUR( '', #979 );
#761 = B_SPLINE_CURVE_WITH_KNOTS( '', 3, ( #980, #981, #982, #983, #984, #985, #986, #987 ), .UNSPECIFIED., .F., .F., ( 4, 2, 2, 4 ), ( 0.00219594593239750, 0.00294403466152729, 0.00331807902609219, 0.00369212339065708 ), .UNSPECIFIED. );
#762 = FILL_AREA_STYLE_COLOUR( '', #988 );
#763 = VERTEX_POINT( '', #989 );
#764 = LINE( '', #990, #991 );
#765 = B_SPLINE_CURVE_WITH_KNOTS( '', 3, ( #992, #993, #994, #995, #996, #997 ), .UNSPECIFIED., .F., .F., ( 4, 2, 4 ), ( 0.00369212339065708, 0.00444153877500312, 0.00519095415934916 ), .UNSPECIFIED. );
#766 = FILL_AREA_STYLE_COLOUR( '', #998 );
#767 = B_SPLINE_CURVE_WITH_KNOTS( '', 3, ( #999, #1000, #1001, #1002, #1003, #1004 ), .UNSPECIFIED., .F., .F., ( 4, 2, 4 ), ( 0.00149644370269909, 0.00223929648777398, 0.00298214927284887 ), .UNSPECIFIED. );
#768 = FILL_AREA_STYLE_COLOUR( '', #1005 );
#769 = VERTEX_POINT( '', #1006 );
#770 = B_SPLINE_CURVE_WITH_KNOTS( '', 3, ( #1007, #1008, #1009, #1010, #1011, #1012 ), .UNSPECIFIED., .F., .F., ( 4, 2, 4 ), ( 0.00149644370269909, 0.00223929648777399, 0.00298214927284888 ), .UNSPECIFIED. );
#771 = VERTEX_POINT( '', #1013 );
#772 = LINE( '', #1014, #1015 );
#773 = B_SPLINE_CURVE_WITH_KNOTS( '', 3, ( #1016, #1017, #1018, #1019, #1020, #1021 ), .UNSPECIFIED., .F., .F., ( 4, 2, 4 ), ( 0.00149644370269910, 0.00223929648777399, 0.00298214927284888 ), .UNSPECIFIED. );
#774 = FILL_AREA_STYLE_COLOUR( '', #1022 );
#775 = B_SPLINE_CURVE_WITH_KNOTS( '', 3, ( #1023, #1024, #1025, #1026, #1027, #1028, #1029, #1030 ), .UNSPECIFIED., .F., .F., ( 4, 2, 2, 4 ), ( 0.000000000000000, 0.000748349068371364, 0.00112239638553523, 0.00149644370269910 ), .UNSPECIFIED. );
#776 = FILL_AREA_STYLE_COLOUR( '', #1031 );
#777 = FILL_AREA_STYLE_COLOUR( '', #1032 );
#778 = FILL_AREA_STYLE_COLOUR( '', #1033 );
#779 = B_SPLINE_CURVE_WITH_KNOTS( '', 3, ( #1034, #1035, #1036, #1037, #1038, #1039, #1040, #1041 ), .UNSPECIFIED., .F., .F., ( 4, 2, 2, 4 ), ( 0.000000000000000, 0.000748349068371359, 0.00112239638553522, 0.00149644370269909 ), .UNSPECIFIED. );
#780 = FILL_AREA_STYLE_COLOUR( '', #1042 );
#781 = FILL_AREA_STYLE_COLOUR( '', #1043 );
#782 = FILL_AREA_STYLE_COLOUR( '', #1044 );
#783 = FILL_AREA_STYLE_COLOUR( '', #1045 );
#784 = B_SPLINE_CURVE_WITH_KNOTS( '', 3, ( #1046, #1047, #1048, #1049, #1050, #1051, #1052, #1053 ), .UNSPECIFIED., .F., .F., ( 4, 2, 2, 4 ), ( 0.000000000000000, 0.000748349068371358, 0.00112239638553522, 0.00149644370269909 ), .UNSPECIFIED. );
#785 = FILL_AREA_STYLE_COLOUR( '', #1054 );
#786 = COLOUR_RGB( '', 0.505882382400000, 0.529411792800000, 0.549019634700000 );
#787 = CARTESIAN_POINT( '', ( -1.20000000000000, 0.000000000000000, 8.00000000000000 ) );
#788 = AXIS2_PLACEMENT_3D( '', #1055, #1056, #1057 );
#789 = COLOUR_RGB( '', 0.505882382400000, 0.529411792800000, 0.549019634700000 );
#790 = CARTESIAN_POINT( '', ( -1.10000000000000, 0.000000000000000, 0.446410161513775 ) );
#791 = AXIS2_PLACEMENT_3D( '', #1058, #1059, #1060 );
#792 = CARTESIAN_POINT( '', ( 1.10000000000000, 0.000000000000000, 0.200000000000000 ) );
#793 = AXIS2_PLACEMENT_3D( '', #1061, #1062, #1063 );
#794 = COLOUR_RGB( '', 0.505882382400000, 0.529411792800000, 0.549019634700000 );
#795 = CARTESIAN_POINT( '', ( -1.87789324842145E-015, -2.50000000000000, -5.00000000000000 ) );
#796 = CARTESIAN_POINT( '', ( 2.16506350946109, -1.25000000000000, -5.00000000000000 ) );
#797 = AXIS2_PLACEMENT_3D( '', #1064, #1065, #1066 );
#798 = CARTESIAN_POINT( '', ( 1.44337567297406, -2.50000000000000, -4.61324865405188 ) );
#799 = CARTESIAN_POINT( '', ( 1.44337567297406, -2.50000000000000, -4.61324865405187 ) );
#800 = CARTESIAN_POINT( '', ( 1.55654607131316, -2.30398312016387, -4.72641905239097 ) );
#801 = CARTESIAN_POINT( '', ( 1.67227798695456, -2.10352956221570, -4.82258480794738 ) );
#802 = CARTESIAN_POINT( '', ( 1.85211660925412, -1.79203993122967, -4.92540420534346 ) );
#803 = CARTESIAN_POINT( '', ( 1.91311398200213, -1.68638938250190, -4.95269917269237 ) );
#804 = CARTESIAN_POINT( '', ( 2.03770144149891, -1.47059757266754, -4.99007736520080 ) );
#805 = CARTESIAN_POINT( '', ( 2.10185541161879, -1.35947963691266, -5.00000000000000 ) );
#806 = CARTESIAN_POINT( '', ( 2.16506350946109, -1.25000000000000, -5.00000000000000 ) );
#807 = CARTESIAN_POINT( '', ( 2.78166219584256E-015, -2.50000000000000, -5.00000000000003 ) );
#808 = CARTESIAN_POINT( '', ( 0.253234879748819, -2.50000000000000, -5.00000000000003 ) );
#809 = CARTESIAN_POINT( '', ( 0.500224935022546, -2.50000000000000, -4.96103859280575 ) );
#810 = CARTESIAN_POINT( '', ( 0.984593629761784, -2.50000000000000, -4.82315023630930 ) );
#811 = CARTESIAN_POINT( '', ( 1.21977456855226, -2.50000000000000, -4.72504920626277 ) );
#812 = CARTESIAN_POINT( '', ( 1.44337567297406, -2.50000000000000, -4.61324865405187 ) );
#813 = COLOUR_RGB( '', 0.505882382400000, 0.529411792800000, 0.549019634700000 );
#814 = CARTESIAN_POINT( '', ( -1.44337567297407, -2.50000000000000, -4.61324865405188 ) );
#815 = CARTESIAN_POINT( '', ( -1.44337567297407, -2.50000000000000, -0.386751345948119 ) );
#816 = CARTESIAN_POINT( '', ( -1.44337567297407, -2.50000000000000, -5.00000000000000 ) );
#817 = VECTOR( '', #1067, 1000.00000000000 );
#818 = CARTESIAN_POINT( '', ( -1.44337567297407, -2.50000000000000, -4.61324865405190 ) );
#819 = CARTESIAN_POINT( '', ( -1.21898320801721, -2.50000000000000, -4.72544488653033 ) );
#820 = CARTESIAN_POINT( '', ( -0.983776352875465, -2.50000000000000, -4.82328828985950 ) );
#821 = CARTESIAN_POINT( '', ( -0.623398419205448, -2.50000000000000, -4.92602097798964 ) );
#822 = CARTESIAN_POINT( '', ( -0.501544167946531, -2.50000000000000, -4.95313363225331 ) );
#823 = CARTESIAN_POINT( '', ( -0.253666138893215, -2.50000000000000, -4.99015373921449 ) );
#824 = CARTESIAN_POINT( '', ( -0.126393294911151, -2.50000000000000, -5.00000000000003 ) );
#825 = CARTESIAN_POINT( '', ( 2.78166219584256E-015, -2.50000000000000, -5.00000000000003 ) );
#826 = CARTESIAN_POINT( '', ( 1.44337567297406, -2.50000000000000, -0.386751345948119 ) );
#827 = CARTESIAN_POINT( '', ( 1.44337567297406, -2.50000000000000, -5.00000000000000 ) );
#828 = VECTOR( '', #1068, 1000.00000000000 );
#829 = CARTESIAN_POINT( '', ( -1.87789324842146E-015, -2.50000000000000, 0.000000000000000 ) );
#830 = CARTESIAN_POINT( '', ( 3.34106231703079E-015, -2.50000000000000, 3.16986082836875E-014 ) );
#831 = CARTESIAN_POINT( '', ( 0.253234879748819, -2.50000000000000, 3.11716594919055E-014 ) );
#832 = CARTESIAN_POINT( '', ( 0.500224935022546, -2.50000000000000, -0.0389614071942474 ) );
#833 = CARTESIAN_POINT( '', ( 0.984593629761783, -2.50000000000000, -0.176849763690702 ) );
#834 = CARTESIAN_POINT( '', ( 1.21977456855226, -2.50000000000000, -0.274950793737228 ) );
#835 = CARTESIAN_POINT( '', ( 1.44337567297406, -2.50000000000000, -0.386751345948126 ) );
#836 = CARTESIAN_POINT( '', ( -1.44337567297408, -2.50000000000000, -0.386751345948104 ) );
#837 = CARTESIAN_POINT( '', ( -1.21898320801722, -2.50000000000000, -0.274555113469674 ) );
#838 = CARTESIAN_POINT( '', ( -0.983776352875465, -2.50000000000000, -0.176711710140495 ) );
#839 = CARTESIAN_POINT( '', ( -0.623398419205448, -2.50000000000000, -0.0739790220103638 ) );
#840 = CARTESIAN_POINT( '', ( -0.501544167946532, -2.50000000000000, -0.0468663677466861 ) );
#841 = CARTESIAN_POINT( '', ( -0.253666138893216, -2.50000000000000, -0.00984626078551121 ) );
#842 = CARTESIAN_POINT( '', ( -0.126393294911150, -2.50000000000000, 3.19619412316938E-014 ) );
#843 = CARTESIAN_POINT( '', ( 3.34106231703079E-015, -2.50000000000000, 3.16986082836875E-014 ) );
#844 = COLOUR_RGB( '', 0.505882382400000, 0.529411792800000, 0.549019634700000 );
#845 = CARTESIAN_POINT( '', ( -1.44337567297406, 2.50000000000000, -4.61324865405187 ) );
#846 = CARTESIAN_POINT( '', ( -1.44337567297406, 2.50000000000000, -0.386751345948126 ) );
#847 = CARTESIAN_POINT( '', ( -1.44337567297406, 2.50000000000000, -5.00000000000000 ) );
#848 = VECTOR( '', #1069, 1000.00000000000 );
#849 = CARTESIAN_POINT( '', ( -2.16506350946110, 1.25000000000000, -5.00000000000000 ) );
#850 = CARTESIAN_POINT( '', ( -1.44337567297406, 2.50000000000000, -4.61324865405187 ) );
#851 = CARTESIAN_POINT( '', ( -1.55654607131315, 2.30398312016387, -4.72641905239097 ) );
#852 = CARTESIAN_POINT( '', ( -1.67227798695455, 2.10352956221570, -4.82258480794738 ) );
#853 = CARTESIAN_POINT( '', ( -1.85211660925411, 1.79203993122967, -4.92540420534347 ) );
#854 = CARTESIAN_POINT( '', ( -1.91311398200212, 1.68638938250191, -4.95269917269238 ) );
#855 = CARTESIAN_POINT( '', ( -2.03770144149891, 1.47059757266754, -4.99007736520081 ) );
#856 = CARTESIAN_POINT( '', ( -2.10185541161878, 1.35947963691266, -5.00000000000001 ) );
#857 = CARTESIAN_POINT( '', ( -2.16506350946109, 1.25000000000000, -5.00000000000001 ) );
#858 = CARTESIAN_POINT( '', ( -2.88675134594812, 9.88242448807309E-015, -4.61324865405188 ) );
#859 = CARTESIAN_POINT( '', ( -2.16506350946109, 1.25000000000000, -5.00000000000001 ) );
#860 = CARTESIAN_POINT( '', ( -2.29059391528639, 1.03257495921585, -5.00000000000001 ) );
#861 = CARTESIAN_POINT( '', ( -2.41399003288465, 0.818846614078906, -4.96161168292551 ) );
#862 = CARTESIAN_POINT( '', ( -2.65735846609846, 0.397320122794161, -4.82325292765124 ) );
#863 = CARTESIAN_POINT( '', ( -2.77371166169352, 0.195790476400520, -4.72628833830683 ) );
#864 = CARTESIAN_POINT( '', ( -2.88675134594817, -9.31381119424944E-014, -4.61324865405217 ) );
#865 = CARTESIAN_POINT( '', ( -2.88675134594812, 1.00347730009371E-014, -0.386751345948122 ) );
#866 = CARTESIAN_POINT( '', ( -2.88675134594812, 9.97465998686664E-015, -5.00000000000000 ) );
#867 = VECTOR( '', #1070, 1000.00000000000 );
#868 = CARTESIAN_POINT( '', ( -2.16506350946110, 1.25000000000000, 0.000000000000000 ) );
#869 = CARTESIAN_POINT( '', ( -2.16506350946109, 1.25000000000000, 7.04231131302498E-015 ) );
#870 = CARTESIAN_POINT( '', ( -2.29059391528639, 1.03257495921585, 6.97531632063916E-015 ) );
#871 = CARTESIAN_POINT( '', ( -2.41399003288465, 0.818846614078906, -0.0383883170744867 ) );
#872 = CARTESIAN_POINT( '', ( -2.65735846609846, 0.397320122794160, -0.176747072348755 ) );
#873 = CARTESIAN_POINT( '', ( -2.77371166169352, 0.195790476400519, -0.273711661693167 ) );
#874 = CARTESIAN_POINT( '', ( -2.88675134594818, -9.41875104907068E-014, -0.386751345947832 ) );
#875 = CARTESIAN_POINT( '', ( -1.44337567297406, 2.50000000000000, -0.386751345948125 ) );
#876 = CARTESIAN_POINT( '', ( -1.55654607131315, 2.30398312016387, -0.273580947609026 ) );
#877 = CARTESIAN_POINT( '', ( -1.67227798695455, 2.10352956221570, -0.177415192052613 ) );
#878 = CARTESIAN_POINT( '', ( -1.85211660925411, 1.79203993122967, -0.0745957946565302 ) );
#879 = CARTESIAN_POINT( '', ( -1.91311398200212, 1.68638938250191, -0.0473008273076220 ) );
#880 = CARTESIAN_POINT( '', ( -2.03770144149891, 1.47059757266754, -0.00992263479919111 ) );
#881 = CARTESIAN_POINT( '', ( -2.10185541161878, 1.35947963691266, 7.07173690446828E-015 ) );
#882 = CARTESIAN_POINT( '', ( -2.16506350946109, 1.25000000000000, 7.04231131302498E-015 ) );
#883 = COLOUR_RGB( '', 0.505882382400000, 0.529411792800000, 0.549019634700000 );
#884 = CARTESIAN_POINT( '', ( 1.44337567297406, 2.50000000000000, -0.386751345948126 ) );
#885 = CARTESIAN_POINT( '', ( 0.000000000000000, 2.50000000000000, 0.000000000000000 ) );
#886 = CARTESIAN_POINT( '', ( 5.30521627831927E-015, 2.50000000000000, 3.19191338078135E-014 ) );
#887 = CARTESIAN_POINT( '', ( 0.253234879731344, 2.50000000000000, 3.15593182374322E-014 ) );
#888 = CARTESIAN_POINT( '', ( 0.500224935008256, 2.50000000000000, -0.0389614071899432 ) );
#889 = CARTESIAN_POINT( '', ( 0.984593629781595, 2.50000000000000, -0.176849763696577 ) );
#890 = CARTESIAN_POINT( '', ( 1.21977456855404, 2.50000000000000, -0.274950793738117 ) );
#891 = CARTESIAN_POINT( '', ( 1.44337567297406, 2.50000000000000, -0.386751345948126 ) );
#892 = CARTESIAN_POINT( '', ( 2.16506350946110, 1.25000000000000, 0.000000000000000 ) );
#893 = AXIS2_PLACEMENT_3D( '', #1071, #1072, #1073 );
#894 = CARTESIAN_POINT( '', ( 2.16506350946110, 1.25000000000000, 8.98766457338530E-016 ) );
#895 = CARTESIAN_POINT( '', ( 2.03953310363580, 1.46742504078415, 7.81387893842092E-016 ) );
#896 = CARTESIAN_POINT( '', ( 1.91613698603753, 1.68115338592110, -0.0383883170744938 ) );
#897 = CARTESIAN_POINT( '', ( 1.67276855282372, 2.10267987720584, -0.176747072348764 ) );
#898 = CARTESIAN_POINT( '', ( 1.55641535722867, 2.30420952359949, -0.273711661693175 ) );
#899 = CARTESIAN_POINT( '', ( 1.44337567297401, 2.50000000000010, -0.386751345947842 ) );
#900 = COLOUR_RGB( '', 0.505882382400000, 0.529411792800000, 0.549019634700000 );
#901 = CARTESIAN_POINT( '', ( 1.52950000000000, 0.000000000000000, -5.00000000000000 ) );
#902 = AXIS2_PLACEMENT_3D( '', #1074, #1075, #1076 );
#903 = CARTESIAN_POINT( '', ( 2.16506350946110, 1.25000000000000, -5.00000000000000 ) );
#904 = CARTESIAN_POINT( '', ( 0.000000000000000, 2.50000000000000, -5.00000000000000 ) );
#905 = AXIS2_PLACEMENT_3D( '', #1077, #1078, #1079 );
#906 = AXIS2_PLACEMENT_3D( '', #1080, #1081, #1082 );
#907 = CARTESIAN_POINT( '', ( -2.16506350946110, -1.25000000000000, -5.00000000000000 ) );
#908 = AXIS2_PLACEMENT_3D( '', #1083, #1084, #1085 );
#909 = AXIS2_PLACEMENT_3D( '', #1086, #1087, #1088 );
#910 = AXIS2_PLACEMENT_3D( '', #1089, #1090, #1091 );
#911 = COLOUR_RGB( '', 0.184313729400000, 0.749019622800000, 0.580392181900000 );
#912 = CARTESIAN_POINT( '', ( 0.000000000000000, 1.22950000000000, -2.00000000000000 ) );
#913 = AXIS2_PLACEMENT_3D( '', #1092, #1093, #1094 );
#914 = CARTESIAN_POINT( '', ( -1.22950000000000, 0.000000000000000, -4.70000000000000 ) );
#915 = AXIS2_PLACEMENT_3D( '', #1095, #1096, #1097 );
#916 = COLOUR_RGB( '', 0.505882382400000, 0.529411792800000, 0.549019634700000 );
#917 = CARTESIAN_POINT( '', ( 1.30000000000000, 0.000000000000000, 0.000000000000000 ) );
#918 = AXIS2_PLACEMENT_3D( '', #1098, #1099, #1100 );
#919 = CARTESIAN_POINT( '', ( 2.16506350946110, -1.25000000000000, 0.000000000000000 ) );
#920 = AXIS2_PLACEMENT_3D( '', #1101, #1102, #1103 );
#921 = AXIS2_PLACEMENT_3D( '', #1104, #1105, #1106 );
#922 = AXIS2_PLACEMENT_3D( '', #1107, #1108, #1109 );
#923 = CARTESIAN_POINT( '', ( -2.16506350946110, -1.25000000000000, 0.000000000000000 ) );
#924 = AXIS2_PLACEMENT_3D( '', #1110, #1111, #1112 );
#925 = AXIS2_PLACEMENT_3D( '', #1113, #1114, #1115 );
#926 = COLOUR_RGB( '', 0.505882382400000, 0.529411792800000, 0.549019634700000 );
#927 = CARTESIAN_POINT( '', ( -2.16506350946109, -1.25000000000000, 7.58268524614873E-015 ) );
#928 = CARTESIAN_POINT( '', ( -2.03953310363580, -1.46742504078415, 7.49906502635807E-015 ) );
#929 = CARTESIAN_POINT( '', ( -1.91613698603753, -1.68115338592109, -0.0383883170744868 ) );
#930 = CARTESIAN_POINT( '', ( -1.67276855282372, -2.10267987720584, -0.176747072348757 ) );
#931 = CARTESIAN_POINT( '', ( -1.55641535722866, -2.30420952359948, -0.273711661693168 ) );
#932 = CARTESIAN_POINT( '', ( -1.44337567297400, -2.50000000000009, -0.386751345947835 ) );
#933 = COLOUR_RGB( '', 0.505882382400000, 0.529411792800000, 0.549019634700000 );
#934 = CARTESIAN_POINT( '', ( 1.44337567297406, -2.50000000000000, -0.386751345948126 ) );
#935 = CARTESIAN_POINT( '', ( 1.55654607131316, -2.30398312016387, -0.273580947609028 ) );
#936 = CARTESIAN_POINT( '', ( 1.67227798695456, -2.10352956221570, -0.177415192052615 ) );
#937 = CARTESIAN_POINT( '', ( 1.85211660925412, -1.79203993122967, -0.0745957946565337 ) );
#938 = CARTESIAN_POINT( '', ( 1.91311398200213, -1.68638938250190, -0.0473008273076256 ) );
#939 = CARTESIAN_POINT( '', ( 2.03770144149892, -1.47059757266753, -0.00992263479919522 ) );
#940 = CARTESIAN_POINT( '', ( 2.10185541161879, -1.35947963691266, 2.49832367792656E-015 ) );
#941 = CARTESIAN_POINT( '', ( 2.16506350946110, -1.25000000000000, 2.43189526468820E-015 ) );
#942 = COLOUR_RGB( '', 0.505882382400000, 0.529411792800000, 0.549019634700000 );
#943 = CARTESIAN_POINT( '', ( 1.12679491924311, 0.000000000000000, 0.546410161513775 ) );
#944 = AXIS2_PLACEMENT_3D( '', #1116, #1117, #1118 );
#945 = CARTESIAN_POINT( '', ( -1.50000000000000, 0.000000000000000, 1.19282032302755 ) );
#946 = AXIS2_PLACEMENT_3D( '', #1119, #1120, #1121 );
#947 = COLOUR_RGB( '', 0.505882382400000, 0.529411792800000, 0.549019634700000 );
#948 = CARTESIAN_POINT( '', ( -2.16506350946109, -1.25000000000000, -5.00000000000001 ) );
#949 = CARTESIAN_POINT( '', ( -2.03953310363579, -1.46742504078415, -5.00000000000001 ) );
#950 = CARTESIAN_POINT( '', ( -1.91613698603753, -1.68115338592109, -4.96161168292551 ) );
#951 = CARTESIAN_POINT( '', ( -1.67276855282372, -2.10267987720584, -4.82325292765124 ) );
#952 = CARTESIAN_POINT( '', ( -1.55641535722866, -2.30420952359948, -4.72628833830683 ) );
#953 = CARTESIAN_POINT( '', ( -1.44337567297400, -2.50000000000009, -4.61324865405216 ) );
#954 = COLOUR_RGB( '', 0.505882382400000, 0.529411792800000, 0.549019634700000 );
#955 = CARTESIAN_POINT( '', ( -1.44337567297407, 2.50000000000000, -0.386751345948103 ) );
#956 = CARTESIAN_POINT( '', ( -1.21898320801964, 2.50000000000000, -0.274555113470886 ) );
#957 = CARTESIAN_POINT( '', ( -0.983776352884800, 2.50000000000000, -0.176711710143946 ) );
#958 = CARTESIAN_POINT( '', ( -0.623398419214764, 2.50000000000000, -0.0739790220126257 ) );
#959 = CARTESIAN_POINT( '', ( -0.501544167953933, 2.50000000000000, -0.0468663677479338 ) );
#960 = CARTESIAN_POINT( '', ( -0.253666138891726, 2.50000000000000, -0.00984626078514743 ) );
#961 = CARTESIAN_POINT( '', ( -0.126393294898033, 2.50000000000000, 3.20953489208863E-014 ) );
#962 = CARTESIAN_POINT( '', ( 5.47360597370412E-015, 2.50000000000000, 3.19191338078135E-014 ) );
#963 = COLOUR_RGB( '', 0.505882382400000, 0.529411792800000, 0.549019634700000 );
#964 = COLOUR_RGB( '', 0.505882382400000, 0.529411792800000, 0.549019634700000 );
#965 = CARTESIAN_POINT( '', ( 0.000000000000000, -1.22950000000000, 0.000000000000000 ) );
#966 = AXIS2_PLACEMENT_3D( '', #1122, #1123, #1124 );
#967 = COLOUR_RGB( '', 0.184313729400000, 0.749019622800000, 0.580392181900000 );
#968 = CARTESIAN_POINT( '', ( -1.50000000000000, 0.000000000000000, 7.70000000000000 ) );
#969 = AXIS2_PLACEMENT_3D( '', #1125, #1126, #1127 );
#970 = COLOUR_RGB( '', 0.505882382400000, 0.529411792800000, 0.549019634700000 );
#971 = CARTESIAN_POINT( '', ( -2.88675134594812, 8.54962054192178E-015, -4.61324865405188 ) );
#972 = CARTESIAN_POINT( '', ( -2.77358094760903, -0.196016879836119, -4.72641905239097 ) );
#973 = CARTESIAN_POINT( '', ( -2.65784903196763, -0.396470437784293, -4.82258480794739 ) );
#974 = CARTESIAN_POINT( '', ( -2.47801040966807, -0.707960068770322, -4.92540420534347 ) );
#975 = CARTESIAN_POINT( '', ( -2.41701303692006, -0.813610617498090, -4.95269917269238 ) );
#976 = CARTESIAN_POINT( '', ( -2.29242557742327, -1.02940242733246, -4.99007736520081 ) );
#977 = CARTESIAN_POINT( '', ( -2.22827160730340, -1.14052036308734, -5.00000000000001 ) );
#978 = CARTESIAN_POINT( '', ( -2.16506350946109, -1.25000000000000, -5.00000000000001 ) );
#979 = COLOUR_RGB( '', 0.505882382400000, 0.529411792800000, 0.549019634700000 );
#980 = CARTESIAN_POINT( '', ( -1.44337567297407, 2.50000000000000, -4.61324865405189 ) );
#981 = CARTESIAN_POINT( '', ( -1.21898320801964, 2.50000000000000, -4.72544488652911 ) );
#982 = CARTESIAN_POINT( '', ( -0.983776352884802, 2.50000000000000, -4.82328828985605 ) );
#983 = CARTESIAN_POINT( '', ( -0.623398419214765, 2.50000000000000, -4.92602097798737 ) );
#984 = CARTESIAN_POINT( '', ( -0.501544167953934, 2.50000000000000, -4.95313363225206 ) );
#985 = CARTESIAN_POINT( '', ( -0.253666138891727, 2.50000000000000, -4.99015373921485 ) );
#986 = CARTESIAN_POINT( '', ( -0.126393294898034, 2.50000000000000, -5.00000000000003 ) );
#987 = CARTESIAN_POINT( '', ( 5.01115322976470E-015, 2.50000000000000, -5.00000000000003 ) );
#988 = COLOUR_RGB( '', 0.505882382400000, 0.529411792800000, 0.549019634700000 );
#989 = CARTESIAN_POINT( '', ( 1.44337567297406, 2.50000000000000, -4.61324865405188 ) );
#990 = CARTESIAN_POINT( '', ( 1.44337567297406, 2.50000000000000, -5.00000000000000 ) );
#991 = VECTOR( '', #1128, 1000.00000000000 );
#992 = CARTESIAN_POINT( '', ( 4.84276353437985E-015, 2.50000000000000, -5.00000000000003 ) );
#993 = CARTESIAN_POINT( '', ( 0.253234879731343, 2.50000000000000, -5.00000000000003 ) );
#994 = CARTESIAN_POINT( '', ( 0.500224935008255, 2.50000000000000, -4.96103859281006 ) );
#995 = CARTESIAN_POINT( '', ( 0.984593629781595, 2.50000000000000, -4.82315023630342 ) );
#996 = CARTESIAN_POINT( '', ( 1.21977456855404, 2.50000000000000, -4.72504920626188 ) );
#997 = CARTESIAN_POINT( '', ( 1.44337567297406, 2.50000000000000, -4.61324865405187 ) );
#998 = COLOUR_RGB( '', 0.505882382400000, 0.529411792800000, 0.549019634700000 );
#999 = CARTESIAN_POINT( '', ( 2.16506350946110, 1.25000000000000, -5.00000000000000 ) );
#1000 = CARTESIAN_POINT( '', ( 2.03953310363580, 1.46742504078415, -5.00000000000000 ) );
#1001 = CARTESIAN_POINT( '', ( 1.91613698603753, 1.68115338592109, -4.96161168292551 ) );
#1002 = CARTESIAN_POINT( '', ( 1.67276855282373, 2.10267987720584, -4.82325292765123 ) );
#1003 = CARTESIAN_POINT( '', ( 1.55641535722867, 2.30420952359948, -4.72628833830682 ) );
#1004 = CARTESIAN_POINT( '', ( 1.44337567297401, 2.50000000000010, -4.61324865405216 ) );
#1005 = COLOUR_RGB( '', 0.505882382400000, 0.529411792800000, 0.549019634700000 );
#1006 = CARTESIAN_POINT( '', ( 2.88675134594812, 4.94553542394039E-015, -4.61324865405188 ) );
#1007 = CARTESIAN_POINT( '', ( 2.16506350946109, -1.25000000000000, -5.00000000000000 ) );
#1008 = CARTESIAN_POINT( '', ( 2.29059391528639, -1.03257495921585, -5.00000000000000 ) );
#1009 = CARTESIAN_POINT( '', ( 2.41399003288466, -0.818846614078906, -4.96161168292551 ) );
#1010 = CARTESIAN_POINT( '', ( 2.65735846609846, -0.397320122794155, -4.82325292765124 ) );
#1011 = CARTESIAN_POINT( '', ( 2.77371166169352, -0.195790476400516, -4.72628833830683 ) );
#1012 = CARTESIAN_POINT( '', ( 2.88675134594818, 9.95044938785287E-014, -4.61324865405216 ) );
#1013 = CARTESIAN_POINT( '', ( 2.88675134594812, 4.82697071778165E-015, -0.386751345948122 ) );
#1014 = CARTESIAN_POINT( '', ( 2.88675134594812, 4.77048955893622E-015, -5.00000000000000 ) );
#1015 = VECTOR( '', #1129, 1000.00000000000 );
#1016 = CARTESIAN_POINT( '', ( 2.16506350946110, -1.25000000000000, 2.43189526468820E-015 ) );
#1017 = CARTESIAN_POINT( '', ( 2.29059391528639, -1.03257495921585, 2.27936566106132E-015 ) );
#1018 = CARTESIAN_POINT( '', ( 2.41399003288466, -0.818846614078903, -0.0383883170744920 ) );
#1019 = CARTESIAN_POINT( '', ( 2.65735846609847, -0.397320122794154, -0.176747072348762 ) );
#1020 = CARTESIAN_POINT( '', ( 2.77371166169352, -0.195790476400514, -0.273711661693174 ) );
#1021 = CARTESIAN_POINT( '', ( 2.88675134594818, 1.00828551131694E-013, -0.386751345947840 ) );
#1022 = COLOUR_RGB( '', 0.505882382400000, 0.529411792800000, 0.549019634700000 );
#1023 = CARTESIAN_POINT( '', ( -2.88675134594812, 9.46063994856335E-015, -0.386751345948124 ) );
#1024 = CARTESIAN_POINT( '', ( -2.77358094760903, -0.196016879836117, -0.273580947609026 ) );
#1025 = CARTESIAN_POINT( '', ( -2.65784903196763, -0.396470437784291, -0.177415192052612 ) );
#1026 = CARTESIAN_POINT( '', ( -2.47801040966807, -0.707960068770319, -0.0745957946565296 ) );
#1027 = CARTESIAN_POINT( '', ( -2.41701303692006, -0.813610617498087, -0.0473008273076210 ) );
#1028 = CARTESIAN_POINT( '', ( -2.29242557742327, -1.02940242733246, -0.00992263479919015 ) );
#1029 = CARTESIAN_POINT( '', ( -2.22827160730340, -1.14052036308734, 7.61863784407880E-015 ) );
#1030 = CARTESIAN_POINT( '', ( -2.16506350946109, -1.25000000000000, 7.58268524614873E-015 ) );
#1031 = COLOUR_RGB( '', 0.505882382400000, 0.529411792800000, 0.549019634700000 );
#1032 = COLOUR_RGB( '', 0.505882382400000, 0.529411792800000, 0.549019634700000 );
#1033 = COLOUR_RGB( '', 0.505882382400000, 0.529411792800000, 0.549019634700000 );
#1034 = CARTESIAN_POINT( '', ( 2.88675134594812, 6.30539632777867E-015, -4.61324865405188 ) );
#1035 = CARTESIAN_POINT( '', ( 2.77358094760903, 0.196016879836131, -4.72641905239098 ) );
#1036 = CARTESIAN_POINT( '', ( 2.65784903196763, 0.396470437784304, -4.82258480794738 ) );
#1037 = CARTESIAN_POINT( '', ( 2.47801040966807, 0.707960068770329, -4.92540420534347 ) );
#1038 = CARTESIAN_POINT( '', ( 2.41701303692006, 0.813610617498096, -4.95269917269237 ) );
#1039 = CARTESIAN_POINT( '', ( 2.29242557742328, 1.02940242733246, -4.99007736520080 ) );
#1040 = CARTESIAN_POINT( '', ( 2.22827160730340, 1.14052036308734, -5.00000000000000 ) );
#1041 = CARTESIAN_POINT( '', ( 2.16506350946110, 1.25000000000000, -5.00000000000000 ) );
#1042 = COLOUR_RGB( '', 0.505882382400000, 0.529411792800000, 0.549019634700000 );
#1043 = COLOUR_RGB( '', 0.505882382400000, 0.529411792800000, 0.549019634700000 );
#1044 = COLOUR_RGB( '', 0.505882382400000, 0.529411792800000, 0.549019634700000 );
#1045 = COLOUR_RGB( '', 0.505882382400000, 0.529411792800000, 0.549019634700000 );
#1046 = CARTESIAN_POINT( '', ( 2.88675134594812, 5.27694183920703E-015, -0.386751345948124 ) );
#1047 = CARTESIAN_POINT( '', ( 2.77358094760903, 0.196016879836130, -0.273580947609027 ) );
#1048 = CARTESIAN_POINT( '', ( 2.65784903196763, 0.396470437784303, -0.177415192052615 ) );
#1049 = CARTESIAN_POINT( '', ( 2.47801040966807, 0.707960068770329, -0.0745957946565345 ) );
#1050 = CARTESIAN_POINT( '', ( 2.41701303692006, 0.813610617498096, -0.0473008273076269 ) );
#1051 = CARTESIAN_POINT( '', ( 2.29242557742328, 1.02940242733246, -0.00992263479919676 ) );
#1052 = CARTESIAN_POINT( '', ( 2.22827160730340, 1.14052036308734, 9.58041320730572E-016 ) );
#1053 = CARTESIAN_POINT( '', ( 2.16506350946110, 1.25000000000000, 8.98766457338530E-016 ) );
#1054 = COLOUR_RGB( '', 0.505882382400000, 0.529411792800000, 0.549019634700000 );
#1055 = CARTESIAN_POINT( '', ( -2.26670575669061E-031, 0.000000000000000, 8.00000000000000 ) );
#1056 = DIRECTION( '', ( -2.98155597433513E-016, 0.000000000000000, -1.00000000000000 ) );
#1057 = DIRECTION( '', ( -1.00000000000000, 0.000000000000000, 2.98155597433513E-016 ) );
#1058 = CARTESIAN_POINT( '', ( -2.25214509106158E-015, 0.000000000000000, 0.446410161513775 ) );
#1059 = DIRECTION( '', ( -2.98155597433513E-016, 0.000000000000000, -1.00000000000000 ) );
#1060 = DIRECTION( '', ( -1.00000000000000, 0.000000000000000, 2.98155597433513E-016 ) );
#1061 = CARTESIAN_POINT( '', ( -2.32561365998141E-015, 0.000000000000000, 0.200000000000000 ) );
#1062 = DIRECTION( '', ( 0.000000000000000, 0.000000000000000, 1.00000000000000 ) );
#1063 = DIRECTION( '', ( 1.00000000000000, 0.000000000000000, 0.000000000000000 ) );
#1064 = CARTESIAN_POINT( '', ( 0.000000000000000, 0.000000000000000, -5.00000000000000 ) );
#1065 = DIRECTION( '', ( 0.000000000000000, 0.000000000000000, 1.00000000000000 ) );
#1066 = DIRECTION( '', ( 1.00000000000000, 0.000000000000000, 0.000000000000000 ) );
#1067 = DIRECTION( '', ( 0.000000000000000, 0.000000000000000, 1.00000000000000 ) );
#1068 = DIRECTION( '', ( 0.000000000000000, 0.000000000000000, 1.00000000000000 ) );
#1069 = DIRECTION( '', ( 0.000000000000000, 0.000000000000000, 1.00000000000000 ) );
#1070 = DIRECTION( '', ( 0.000000000000000, 0.000000000000000, 1.00000000000000 ) );
#1071 = CARTESIAN_POINT( '', ( 0.000000000000000, 0.000000000000000, 0.000000000000000 ) );
#1072 = DIRECTION( '', ( 0.000000000000000, 0.000000000000000, 1.00000000000000 ) );
#1073 = DIRECTION( '', ( 1.00000000000000, 0.000000000000000, 0.000000000000000 ) );
#1074 = CARTESIAN_POINT( '', ( 0.000000000000000, 0.000000000000000, -5.00000000000000 ) );
#1075 = DIRECTION( '', ( 0.000000000000000, 0.000000000000000, 1.00000000000000 ) );
#1076 = DIRECTION( '', ( 1.00000000000000, 0.000000000000000, 0.000000000000000 ) );
#1077 = CARTESIAN_POINT( '', ( 0.000000000000000, 0.000000000000000, -5.00000000000000 ) );
#1078 = DIRECTION( '', ( 0.000000000000000, 0.000000000000000, 1.00000000000000 ) );
#1079 = DIRECTION( '', ( 1.00000000000000, 0.000000000000000, 0.000000000000000 ) );
#1080 = CARTESIAN_POINT( '', ( 0.000000000000000, 0.000000000000000, -5.00000000000000 ) );
#1081 = DIRECTION( '', ( 0.000000000000000, 0.000000000000000, 1.00000000000000 ) );
#1082 = DIRECTION( '', ( 1.00000000000000, 0.000000000000000, 0.000000000000000 ) );
#1083 = CARTESIAN_POINT( '', ( 0.000000000000000, 0.000000000000000, -5.00000000000000 ) );
#1084 = DIRECTION( '', ( 0.000000000000000, 0.000000000000000, 1.00000000000000 ) );
#1085 = DIRECTION( '', ( 1.00000000000000, 0.000000000000000, 0.000000000000000 ) );
#1086 = CARTESIAN_POINT( '', ( 0.000000000000000, 0.000000000000000, -5.00000000000000 ) );
#1087 = DIRECTION( '', ( 0.000000000000000, 0.000000000000000, 1.00000000000000 ) );
#1088 = DIRECTION( '', ( 1.00000000000000, 0.000000000000000, 0.000000000000000 ) );
#1089 = CARTESIAN_POINT( '', ( 0.000000000000000, 0.000000000000000, -5.00000000000000 ) );
#1090 = DIRECTION( '', ( 0.000000000000000, 0.000000000000000, 1.00000000000000 ) );
#1091 = DIRECTION( '', ( 1.00000000000000, 0.000000000000000, 0.000000000000000 ) );
#1092 = CARTESIAN_POINT( '', ( 0.000000000000000, 0.000000000000000, -2.00000000000000 ) );
#1093 = DIRECTION( '', ( 0.000000000000000, 0.000000000000000, -1.00000000000000 ) );
#1094 = DIRECTION( '', ( 0.000000000000000, 1.00000000000000, 0.000000000000000 ) );
#1095 = CARTESIAN_POINT( '', ( 0.000000000000000, 0.000000000000000, -4.70000000000000 ) );
#1096 = DIRECTION( '', ( 0.000000000000000, 0.000000000000000, -1.00000000000000 ) );
#1097 = DIRECTION( '', ( -1.00000000000000, 0.000000000000000, 0.000000000000000 ) );
#1098 = CARTESIAN_POINT( '', ( -2.32561365998141E-015, 0.000000000000000, 0.000000000000000 ) );
#1099 = DIRECTION( '', ( 0.000000000000000, 0.000000000000000, 1.00000000000000 ) );
#1100 = DIRECTION( '', ( 1.00000000000000, 0.000000000000000, 0.000000000000000 ) );
#1101 = CARTESIAN_POINT( '', ( 0.000000000000000, 0.000000000000000, 0.000000000000000 ) );
#1102 = DIRECTION( '', ( 0.000000000000000, 0.000000000000000, 1.00000000000000 ) );
#1103 = DIRECTION( '', ( 1.00000000000000, 0.000000000000000, 0.000000000000000 ) );
#1104 = CARTESIAN_POINT( '', ( 0.000000000000000, 0.000000000000000, 0.000000000000000 ) );
#1105 = DIRECTION( '', ( 0.000000000000000, 0.000000000000000, 1.00000000000000 ) );
#1106 = DIRECTION( '', ( 1.00000000000000, 0.000000000000000, 0.000000000000000 ) );
#1107 = CARTESIAN_POINT( '', ( 0.000000000000000, 0.000000000000000, 0.000000000000000 ) );
#1108 = DIRECTION( '', ( 0.000000000000000, 0.000000000000000, 1.00000000000000 ) );
#1109 = DIRECTION( '', ( 1.00000000000000, 0.000000000000000, 0.000000000000000 ) );
#1110 = CARTESIAN_POINT( '', ( 0.000000000000000, 0.000000000000000, 0.000000000000000 ) );
#1111 = DIRECTION( '', ( 0.000000000000000, 0.000000000000000, 1.00000000000000 ) );
#1112 = DIRECTION( '', ( 1.00000000000000, 0.000000000000000, 0.000000000000000 ) );
#1113 = CARTESIAN_POINT( '', ( 0.000000000000000, 0.000000000000000, 0.000000000000000 ) );
#1114 = DIRECTION( '', ( 0.000000000000000, 0.000000000000000, 1.00000000000000 ) );
#1115 = DIRECTION( '', ( 1.00000000000000, 0.000000000000000, 0.000000000000000 ) );
#1116 = CARTESIAN_POINT( '', ( -2.22232953131823E-015, 0.000000000000000, 0.546410161513775 ) );
#1117 = DIRECTION( '', ( 2.98155597433513E-016, 0.000000000000000, 1.00000000000000 ) );
#1118 = DIRECTION( '', ( 1.00000000000000, 0.000000000000000, -2.98155597433513E-016 ) );
#1119 = CARTESIAN_POINT( '', ( -2.02959872342499E-015, 0.000000000000000, 1.19282032302755 ) );
#1120 = DIRECTION( '', ( -2.98155597433513E-016, 0.000000000000000, -1.00000000000000 ) );
#1121 = DIRECTION( '', ( -1.00000000000000, 0.000000000000000, 2.98155597433513E-016 ) );
#1122 = CARTESIAN_POINT( '', ( 0.000000000000000, 0.000000000000000, 0.000000000000000 ) );
#1123 = DIRECTION( '', ( 0.000000000000000, 0.000000000000000, 1.00000000000000 ) );
#1124 = DIRECTION( '', ( 0.000000000000000, -1.00000000000000, 0.000000000000000 ) );
#1125 = CARTESIAN_POINT( '', ( -8.94466792300540E-017, 0.000000000000000, 7.70000000000000 ) );
#1126 = DIRECTION( '', ( -2.98155597433513E-016, 0.000000000000000, -1.00000000000000 ) );
#1127 = DIRECTION( '', ( -1.00000000000000, 0.000000000000000, 2.98155597433513E-016 ) );
#1128 = DIRECTION( '', ( 0.000000000000000, 0.000000000000000, 1.00000000000000 ) );
#1129 = DIRECTION( '', ( 0.000000000000000, 0.000000000000000, 1.00000000000000 ) );
ENDSEC;
END-ISO-10303-21;
