(module "Samtec_FTR-110-51-L-D-06" (layer F.Cu) (tedit 5EBB057A)
  (attr smd)
  (fp_text reference "REF**" (at -7.112 0 90 unlocked) (layer F.SilkS)
    (effects (font (size 1 1) (thickness 0.15)))
  )
  (fp_text value "Samtec_FTR-110-51-L-D-06" (at 0 1.524 unlocked) (layer F.Fab) hide
    (effects (font (size 1 1) (thickness 0.15)))
  )
  (fp_line (start -6.35 -2.54) (end -6.35 2.54) (layer F.SilkS) (width 0.1))
  (fp_line (start -6.35 -2.54) (end -6.096 -2.54) (layer F.SilkS) (width 0.1))
  (fp_line (start -6.35 2.54) (end -6.096 2.54) (layer F.SilkS) (width 0.1))
  (fp_line (start 6.35 2.54) (end 6.096 2.54) (layer F.SilkS) (width 0.1))
  (fp_line (start 6.35 -2.54) (end 6.096 -2.54) (layer F.SilkS) (width 0.1))
  (fp_line (start 6.35 2.54) (end 6.35 -2.54) (layer F.SilkS) (width 0.1))
  (fp_text user "^" (at -6.731 3.429 270 unlocked) (layer F.SilkS)
    (effects (font (size 1 1) (thickness 0.15)))
  )
  (fp_line (start -6.477 -4.191) (end -6.477 4.191) (layer F.CrtYd) (width 0.05))
  (fp_line (start -6.477 -4.191) (end 6.477 -4.191) (layer F.CrtYd) (width 0.05))
  (fp_line (start -6.477 4.191) (end 6.477 4.191) (layer F.CrtYd) (width 0.05))
  (fp_line (start 6.477 4.191) (end 6.477 -4.191) (layer F.CrtYd) (width 0.05))
  (fp_text user "${REFERENCE}" (at 0 0 unlocked) (layer F.Fab)
    (effects (font (size 1 1) (thickness 0.15)))
  )
  (fp_line (start 6.35 -2.55) (end 6.35 2.55) (layer F.Fab) (width 0.1))
  (fp_line (start 6.35 2.55) (end -5.95 2.55) (layer F.Fab) (width 0.1))
  (fp_line (start -5.95 2.55) (end -6.35 2.15) (layer F.Fab) (width 0.1))
  (fp_line (start -6.35 2.15) (end -6.35 -2.55) (layer F.Fab) (width 0.1))
  (fp_line (start -6.35 -2.55) (end 6.35 -2.55) (layer F.Fab) (width 0.1))
  (pad "1" smd rect (at -5.715 2.54) (size 0.6 3) (layers "F.Cu" "F.Paste" "F.Mask") (tstamp 3e9190ce-f85d-41f2-a9a4-0fc682f31290))
  (pad "2" smd rect (at -5.715 -2.54) (size 0.6 3) (layers "F.Cu" "F.Paste" "F.Mask") (tstamp 04ba058b-e3e8-48db-8b81-54065cff72de))
  (pad "3" smd rect (at -4.445 2.54) (size 0.6 3) (layers "F.Cu" "F.Paste" "F.Mask") (tstamp 227d0909-f8b0-41e1-a8bd-49e3d0f2663c))
  (pad "4" smd rect (at -4.445 -2.54) (size 0.6 3) (layers "F.Cu" "F.Paste" "F.Mask") (tstamp 20f80d02-507a-4317-9040-4b1f7e0435e6))
  (pad "5" smd rect (at -3.175 2.54) (size 0.6 3) (layers "F.Cu" "F.Paste" "F.Mask") (tstamp 236625b8-993c-469e-9e5d-6ea51c38724f))
  (pad "7" smd rect (at -1.905 2.54) (size 0.6 3) (layers "F.Cu" "F.Paste" "F.Mask") (tstamp 5ad1b32e-92cf-49f2-aa96-9bad8c4ee2ec))
  (pad "8" smd rect (at -1.905 -2.54) (size 0.6 3) (layers "F.Cu" "F.Paste" "F.Mask") (tstamp c4d0b31b-a176-4dd4-8e3c-c6394be55f30))
  (pad "9" smd rect (at -0.635 2.54) (size 0.6 3) (layers "F.Cu" "F.Paste" "F.Mask") (tstamp e4147987-cb80-4d61-ab0e-848f3364bd4e))
  (pad "10" smd rect (at -0.635 -2.54) (size 0.6 3) (layers "F.Cu" "F.Paste" "F.Mask") (tstamp 68961c76-2bfe-49e9-8b4e-b896adcc646a))
  (pad "11" smd rect (at 0.635 2.54) (size 0.6 3) (layers "F.Cu" "F.Paste" "F.Mask") (tstamp db93fc9e-a36e-4a17-af04-6308b21eefd1))
  (pad "12" smd rect (at 0.635 -2.54) (size 0.6 3) (layers "F.Cu" "F.Paste" "F.Mask") (tstamp e4ad23ae-cfa0-4144-9b62-13c2e05f1abd))
  (pad "13" smd rect (at 1.905 2.54) (size 0.6 3) (layers "F.Cu" "F.Paste" "F.Mask") (tstamp 0fa27978-ee39-4131-b54c-07c320a2dae3))
  (pad "14" smd rect (at 1.905 -2.54) (size 0.6 3) (layers "F.Cu" "F.Paste" "F.Mask") (tstamp 47b50568-4df5-4fef-8492-28020378391b))
  (pad "15" smd rect (at 3.175 2.54) (size 0.6 3) (layers "F.Cu" "F.Paste" "F.Mask") (tstamp 6c28f2c7-b67e-4ea9-b2d3-3bee32d707ea))
  (pad "16" smd rect (at 3.175 -2.54) (size 0.6 3) (layers "F.Cu" "F.Paste" "F.Mask") (tstamp 9849e7cc-b9ef-4377-bec7-5d8f420123e7))
  (pad "17" smd rect (at 4.445 2.54) (size 0.6 3) (layers "F.Cu" "F.Paste" "F.Mask") (tstamp 06f98f38-3d8c-42d7-8bd2-a9d6f48a0e9c))
  (pad "18" smd rect (at 4.445 -2.54) (size 0.6 3) (layers "F.Cu" "F.Paste" "F.Mask") (tstamp 20ded1e2-0192-4e6b-b8da-796b606a686c))
  (pad "19" smd rect (at 5.715 2.54) (size 0.6 3) (layers "F.Cu" "F.Paste" "F.Mask") (tstamp 3812d969-3f38-4a10-b78f-16b05b2c8f49))
  (pad "20" smd rect (at 5.715 -2.54) (size 0.6 3) (layers "F.Cu" "F.Paste" "F.Mask") (tstamp c5e6f9d2-642d-40b3-bb89-e95836611f47))
  (model "${KICADLIB}/model/connector/Samtec_FTR-110-51-L-D-06.stp"
    (offset (xyz 0 0 2.54))
    (scale (xyz 1 1 1))
    (rotate (xyz -90 0 0))
  )
)
