(footprint "Keystone_575" (version 20211014) (generator pcbnew)
  (layer "F.Cu")
  (tedit 0)
  (attr smd)
  (fp_text reference "REF**" (at 0 -5 unlocked) (layer "F.SilkS")
    (effects (font (size 1 1) (thickness 0.15)))
    (tstamp 9cc38e11-80bf-4bb7-96d1-6de790fadf9d)
  )
  (fp_text value "Keystone_575" (at 0 1 unlocked) (layer "F.Fab") hide
    (effects (font (size 1 1) (thickness 0.15)))
    (tstamp 8f851cb5-ab46-4fab-bfae-1fc2a316fbcb)
  )
  (fp_text user "${REFERENCE}" (at 0 0 unlocked) (layer "F.Fab")
    (effects (font (size 1 1) (thickness 0.15)))
    (tstamp a761032c-018e-4400-bce2-02413a320c0a)
  )
  (fp_circle (center 0 0) (end 0 -8) (layer "Eco1.User") (width 0.1) (fill none) (tstamp db084293-2e30-45fd-9587-6a293c46a225))
  (fp_circle (center 0 0) (end 0 -4.25) (layer "F.CrtYd") (width 0.05) (fill none) (tstamp 6ea09e61-477e-408d-b107-60d1ea041e36))
  (pad "1" thru_hole circle (at 0 0) (size 8.5 8.5) (drill 5.3) (layers *.Cu *.Mask)
    (solder_mask_margin -0.05) (tstamp d44cb29a-be1a-40fe-81fd-db63100c222e))
  (model "${KICADLIB}/model/connector/keystone_575-4.step" hide
    (offset (xyz 0 0 -5.5))
    (scale (xyz 1 1 1))
    (rotate (xyz -90 0 0))
  )
  (model "${KICADLIB}/model/connector/keystone_575-8.step"
    (offset (xyz 0 0 -8.85))
    (scale (xyz 1 1 1))
    (rotate (xyz -90 0 0))
  )
  (model "${KICADLIB}/model/mechanical/CONN_bananaMale_red.step"
    (offset (xyz 1.2 -0.9 5.5))
    (scale (xyz 1 1 1))
    (rotate (xyz 0 0 0))
  )
)
