(module "AMASS_XT60-F_Vertical" (layer "F.Cu") (tedit 5F734802)
  (descr "AMASS female XT60, through hole, vertical, https://www.tme.eu/Document/2d152ced3b7a446066e6c419d84bb460/XT60%20SPEC.pdf")
  (tags "XT60 female vertical")
  (attr through_hole)
  (fp_text reference "REF**" (at 3.6 -5.3 180) (layer "F.SilkS")
    (effects (font (size 1 1) (thickness 0.15)))
    (tstamp 452bcd12-f0f9-4856-b18d-7e5c234248c2)
  )
  (fp_text value "AMASS_XT60-F_Vertical" (at 3.6 5.4) (layer "F.Fab")
    (effects (font (size 1 1) (thickness 0.15)))
    (tstamp 95d80b6b-5ea5-4991-81bc-64b2c6cda733)
  )
  (fp_text user "${REFERENCE}" (at 3.6 0.05) (layer "F.Fab")
    (effects (font (size 1 1) (thickness 0.15)))
    (tstamp 712c589f-412d-46f0-99cd-dc2f39a0a136)
  )
  (fp_line (start 11.45 -4.15) (end -1.4 -4.15) (layer "F.SilkS") (width 0.12) (tstamp 0c754a20-8eff-4279-bd25-d6209e46a1c3))
  (fp_line (start -4.25 1.55) (end -1.4 4.15) (layer "F.SilkS") (width 0.12) (tstamp 0d8fe8a1-33d6-4ae9-a386-68458e345b21))
  (fp_line (start -4.25 -1.6) (end -4.25 1.55) (layer "F.SilkS") (width 0.12) (tstamp 2bf19069-2177-4408-961a-3fa8cb01ece4))
  (fp_line (start -1.4 4.15) (end 11.45 4.15) (layer "F.SilkS") (width 0.12) (tstamp 965ec24f-5fd3-4d56-ac96-3fb6de775746))
  (fp_line (start 11.45 4.15) (end 11.45 -4.15) (layer "F.SilkS") (width 0.12) (tstamp ab9e0605-7d39-4fca-ac54-acd9061a3420))
  (fp_line (start -1.4 -4.15) (end -4.25 -1.6) (layer "F.SilkS") (width 0.12) (tstamp c218e39f-cbbe-4ddf-94f2-1db27a7ca66d))
  (fp_line (start -1.6 4.6) (end -4.65 1.85) (layer "F.CrtYd") (width 0.05) (tstamp 139ef778-c7cc-45ab-a42c-a8703e6679ab))
  (fp_line (start -4.65 1.85) (end -4.65 -1.85) (layer "F.CrtYd") (width 0.05) (tstamp 52825902-b15e-4f3a-b3e9-882ae29dcd97))
  (fp_line (start -4.65 -1.85) (end -1.6 -4.6) (layer "F.CrtYd") (width 0.05) (tstamp 6348ff69-485c-49ea-9e6a-8f3b5101868d))
  (fp_line (start 11.85 4.6) (end -1.6 4.6) (layer "F.CrtYd") (width 0.05) (tstamp cdfd0692-91d9-4e02-8a4c-1192638f3d1c))
  (fp_line (start 11.85 -4.6) (end 11.85 4.6) (layer "F.CrtYd") (width 0.05) (tstamp ead9a9e4-b31b-48f2-9b48-1b83ffb97825))
  (fp_line (start -1.6 -4.6) (end 11.85 -4.6) (layer "F.CrtYd") (width 0.05) (tstamp f1b77f6f-59a6-4a8f-ba73-d2f0b17f116d))
  (fp_line (start 11.35 4.05) (end 11.35 -4.05) (layer "F.Fab") (width 0.12) (tstamp 481b78a6-cfad-4539-bc57-7bc2b4c21ce5))
  (fp_line (start -1.4 4.05) (end 11.35 4.05) (layer "F.Fab") (width 0.12) (tstamp 98acc775-cd2f-4af7-b801-99d88271856b))
  (fp_line (start -4.15 1.55) (end -1.4 4.05) (layer "F.Fab") (width 0.12) (tstamp 9dd1e441-e7a1-44b8-a86e-b4e29fb6e354))
  (fp_line (start -1.4 -4.05) (end -4.15 -1.55) (layer "F.Fab") (width 0.12) (tstamp c4bb2329-4934-4733-8b87-6427ed8895bb))
  (fp_line (start 11.35 -4.05) (end -1.4 -4.05) (layer "F.Fab") (width 0.12) (tstamp d1788046-72d4-452a-b66e-574ce2b6b259))
  (fp_line (start -4.15 -1.55) (end -4.15 1.55) (layer "F.Fab") (width 0.12) (tstamp ff014c77-0fa3-4157-a4b4-406a63eaf245))
  (pad "1" thru_hole roundrect (at 0 0) (size 6 6) (drill 4.5) (layers *.Cu *.Mask) (roundrect_rratio 0.25) (tstamp 0c35da61-e4c4-48f1-9096-1c9cee98406d))
  (pad "2" thru_hole circle (at 7.2 0) (size 6 6) (drill 4.5) (layers *.Cu *.Mask) (tstamp fe8bf415-cf98-4d73-9c56-79a515fc50f2))
  (model "${KICADLIB}/model/connector/AMASS_XT60-F.step"
    (offset (xyz 0 0 0))
    (scale (xyz 1 1 1))
    (rotate (xyz 0 0 0))
  )
)
