(footprint "TE_IMxxJR" (version 20221018) (generator pcbnew)
  (layer "F.Cu")
  (fp_text reference "REF**" (at 0 -4.1 unlocked) (layer "F.SilkS")
      (effects (font (size 1 1) (thickness 0.15)))
    (tstamp 19a6aa2f-da9e-4ba5-a037-ef253c9a53fd)
  )
  (fp_text value "TE_IMxxJR" (at 0 1 unlocked) (layer "F.Fab") hide
      (effects (font (size 1 1) (thickness 0.15)))
    (tstamp 68cfd460-74c1-4d6a-9852-20abea89aff6)
  )
  (fp_text user "^" (at -3.8 4 unlocked) (layer "F.SilkS")
      (effects (font (size 1 1) (thickness 0.15)))
    (tstamp 55d78677-d0a8-41e8-a31a-c9bf92415282)
  )
  (fp_text user "${REFERENCE}" (at 0 0 unlocked) (layer "F.Fab")
      (effects (font (size 1 1) (thickness 0.15)))
    (tstamp 9a6c9111-285d-44bd-87b1-eb66923b1fe0)
  )
  (fp_line (start -5 -3) (end -4.325 -3)
    (stroke (width 0.1) (type solid)) (layer "F.SilkS") (tstamp 1a0ce774-275a-4588-8044-7de78d2bd6c1))
  (fp_line (start -5 3) (end -5 -3)
    (stroke (width 0.1) (type solid)) (layer "F.SilkS") (tstamp 7d5322fe-0f5c-4f1f-8330-149a7473c845))
  (fp_line (start -4.325 3) (end -5 3)
    (stroke (width 0.1) (type solid)) (layer "F.SilkS") (tstamp 84b32324-0e2d-4b15-83ec-d8287fb431c5))
  (fp_line (start -3.275 -3) (end -1.125 -3)
    (stroke (width 0.1) (type solid)) (layer "F.SilkS") (tstamp eee8990a-8a8a-4ecb-8cf3-1f60225b8a33))
  (fp_line (start -1.125 3) (end -3.275 3)
    (stroke (width 0.1) (type solid)) (layer "F.SilkS") (tstamp 43374969-b3c9-4ef7-b863-00d02cfe2015))
  (fp_line (start -0.075 -3) (end 1.075 -3)
    (stroke (width 0.1) (type solid)) (layer "F.SilkS") (tstamp 0329f549-673e-4e46-ae8d-5617653603d8))
  (fp_line (start 1.075 3) (end -0.075 3)
    (stroke (width 0.1) (type solid)) (layer "F.SilkS") (tstamp 6113d190-8e77-49dd-be34-4850e76eaab2))
  (fp_line (start 2.125 -3) (end 3.275 -3)
    (stroke (width 0.1) (type solid)) (layer "F.SilkS") (tstamp ea690fcd-183c-4dd4-aa59-20b69628dcdc))
  (fp_line (start 3.275 3) (end 2.125 3)
    (stroke (width 0.1) (type solid)) (layer "F.SilkS") (tstamp 8733df15-5982-4515-bf17-883cfed722db))
  (fp_line (start 5 -3) (end 4.325 -3)
    (stroke (width 0.1) (type solid)) (layer "F.SilkS") (tstamp f4e826c9-abaa-497e-9190-09eeaa6e0043))
  (fp_line (start 5 -3) (end 5 3)
    (stroke (width 0.1) (type solid)) (layer "F.SilkS") (tstamp f05f72d3-3972-4ac9-a26d-2b3013d570d3))
  (fp_line (start 5 3) (end 4.325 3)
    (stroke (width 0.1) (type solid)) (layer "F.SilkS") (tstamp dc882e69-98cf-4eb3-aa63-7c4be1af01cf))
  (fp_rect (start -5.3 -3.4) (end 5.4 3.4)
    (stroke (width 0.05) (type solid)) (fill none) (layer "F.CrtYd") (tstamp ddcff13c-1db3-425e-8aa6-596f39fb2c76))
  (fp_line (start -5 -3) (end -5 2.3)
    (stroke (width 0.1) (type solid)) (layer "F.Fab") (tstamp f14d507e-473d-4744-b9eb-64153e53c368))
  (fp_line (start -5 2.3) (end -4.3 3)
    (stroke (width 0.1) (type solid)) (layer "F.Fab") (tstamp 91cb99c3-8428-4c88-8f9a-547a7b9970c6))
  (fp_line (start -4.3 3) (end 5 3)
    (stroke (width 0.1) (type solid)) (layer "F.Fab") (tstamp d9360dec-9daf-42ff-806d-1474520adf96))
  (fp_line (start 5 -3) (end -5 -3)
    (stroke (width 0.1) (type solid)) (layer "F.Fab") (tstamp ca799c8b-9ed3-4163-b644-8d6e70c5d575))
  (fp_line (start 5 3) (end 5 -3)
    (stroke (width 0.1) (type solid)) (layer "F.Fab") (tstamp 533a5ac8-344a-4b4e-b1cc-86bbb36e33fc))
  (pad "1" smd roundrect (at -3.8 2.2) (size 0.9 2.2) (layers "F.Cu" "F.Paste" "F.Mask") (roundrect_rratio 0.05555555556)
    (solder_mask_margin -0.1) (solder_paste_margin -0.1) (tstamp 5a01041b-d0e9-4912-8a2d-27af93824e9a))
  (pad "2" smd roundrect (at -0.6 2.2) (size 0.9 2.2) (layers "F.Cu" "F.Paste" "F.Mask") (roundrect_rratio 0.05555555556)
    (solder_mask_margin -0.1) (solder_paste_margin -0.1) (tstamp 182f99fb-8de9-4ed7-b723-a0147e42fba9))
  (pad "3" smd roundrect (at 1.6 2.2) (size 0.9 2.2) (layers "F.Cu" "F.Paste" "F.Mask") (roundrect_rratio 0.05555555556)
    (solder_mask_margin -0.1) (solder_paste_margin -0.1) (tstamp b943df14-8dfd-40ac-8e10-3705facc707c))
  (pad "4" smd roundrect (at 3.8 2.2) (size 0.9 2.2) (layers "F.Cu" "F.Paste" "F.Mask") (roundrect_rratio 0.05555555556)
    (solder_mask_margin -0.1) (solder_paste_margin -0.1) (tstamp 94ecd48f-3f20-489a-9e91-b100a37edb17))
  (pad "5" smd roundrect (at 3.8 -2.2) (size 0.9 2.2) (layers "F.Cu" "F.Paste" "F.Mask") (roundrect_rratio 0.05555555556)
    (solder_mask_margin -0.1) (solder_paste_margin -0.1) (tstamp 414dad99-f5c0-4ed8-9cba-04b0e13a025d))
  (pad "6" smd roundrect (at 1.6 -2.2) (size 0.9 2.2) (layers "F.Cu" "F.Paste" "F.Mask") (roundrect_rratio 0.05555555556)
    (solder_mask_margin -0.1) (solder_paste_margin -0.1) (tstamp 93dc62f5-e0a2-42d3-bd44-01dfbdff6fa5))
  (pad "7" smd roundrect (at -0.6 -2.2) (size 0.9 2.2) (layers "F.Cu" "F.Paste" "F.Mask") (roundrect_rratio 0.05555555556)
    (solder_mask_margin -0.1) (solder_paste_margin -0.1) (tstamp b03f236a-40eb-46d4-9387-1dffc4edecf4))
  (pad "8" smd roundrect (at -3.8 -2.2) (size 0.9 2.2) (layers "F.Cu" "F.Paste" "F.Mask") (roundrect_rratio 0.05555555556)
    (solder_mask_margin -0.1) (solder_paste_margin -0.1) (tstamp 11e07481-a60d-4119-b030-53521d912844))
  (model "${KICADLIB}/model/mechanical/TE_IMxxJR.stp"
    (offset (xyz 0 0 0))
    (scale (xyz 1 1 1))
    (rotate (xyz 180 0 0))
  )
)
