(footprint "ublox_TOBY" (version 20221018) (generator pcbnew)
  (layer "F.Cu")
  (attr smd)
  (fp_text reference "REF**" (at 0 13.28 unlocked) (layer "F.SilkS")
      (effects (font (size 1 1) (thickness 0.15)))
    (tstamp b0dc7958-0037-479a-9497-1332102b963a)
  )
  (fp_text value "ublox_TOBY" (at 0 11.6 unlocked) (layer "F.Fab") hide
      (effects (font (size 1 1) (thickness 0.15)))
    (tstamp 51411bfb-e646-49cb-b5b0-621116866abe)
  )
  (fp_text user "^" (at -15.4 13.26 unlocked) (layer "F.SilkS")
      (effects (font (size 1 1) (thickness 0.15)))
    (tstamp 6ae84934-10a1-484b-8322-6c923219c4e2)
  )
  (fp_text user "${REFERENCE}" (at 0.1 0 unlocked) (layer "F.Fab")
      (effects (font (size 1 1) (thickness 0.15)))
    (tstamp b1372ba3-c873-481d-a9e0-cff63075388d)
  )
  (fp_line (start -17.8 -12.4) (end -17.8 12.4)
    (stroke (width 0.12) (type solid)) (layer "F.SilkS") (tstamp 607ee26e-217e-4306-9823-101b183e0b84))
  (fp_line (start -17.8 12.4) (end 17.8 12.4)
    (stroke (width 0.12) (type solid)) (layer "F.SilkS") (tstamp d348225f-4e71-4362-b8da-e2dc6df3db8b))
  (fp_line (start 17.8 -12.4) (end -17.8 -12.4)
    (stroke (width 0.12) (type solid)) (layer "F.SilkS") (tstamp 7ce7ccda-1b7a-45af-891f-8b32a1bb0496))
  (fp_line (start 17.8 12.4) (end 17.8 -12.4)
    (stroke (width 0.12) (type solid)) (layer "F.SilkS") (tstamp 9e9c4946-389f-4903-884c-faa686dcf58a))
  (fp_line (start -18 -12.6) (end -18 12.6)
    (stroke (width 0.05) (type solid)) (layer "F.CrtYd") (tstamp ee52c74f-5f75-4f42-b66f-b7ed5d3367ce))
  (fp_line (start -18 12.6) (end 18 12.6)
    (stroke (width 0.05) (type solid)) (layer "F.CrtYd") (tstamp ebab33c9-46fe-489c-8732-b7c0d9c20496))
  (fp_line (start 18 -12.6) (end -18 -12.6)
    (stroke (width 0.05) (type solid)) (layer "F.CrtYd") (tstamp e9a2fc68-0618-4555-a7ae-1794a9edd10d))
  (fp_line (start 18 12.6) (end 18 -12.6)
    (stroke (width 0.05) (type solid)) (layer "F.CrtYd") (tstamp a6e1513c-febb-4def-966e-ba2f737fd7d1))
  (fp_line (start -17.8 -12.4) (end -17.8 11.6)
    (stroke (width 0.1) (type solid)) (layer "F.Fab") (tstamp e10902e8-3afb-499a-ac4e-1655e9f062b5))
  (fp_line (start -17.8 11.6) (end -17 12.4)
    (stroke (width 0.1) (type solid)) (layer "F.Fab") (tstamp 7d60f4c5-6f1d-457e-b7c8-9f2b95d1a62a))
  (fp_line (start -17 12.4) (end 17.8 12.4)
    (stroke (width 0.1) (type solid)) (layer "F.Fab") (tstamp ec42b4c5-b650-4780-a1f7-b26299713044))
  (fp_line (start 17.8 -12.4) (end -17.8 -12.4)
    (stroke (width 0.1) (type solid)) (layer "F.Fab") (tstamp 1222232e-afbb-47ce-844f-61f016f61eb2))
  (fp_line (start 17.8 12.4) (end 17.8 -12.4)
    (stroke (width 0.1) (type solid)) (layer "F.Fab") (tstamp d5ce7ef3-8bc7-424c-9858-b1ecd3d0da25))
  (pad "1" smd roundrect (at -15.4 11) (size 0.8 1.5) (layers "F.Cu" "F.Paste" "F.Mask") (roundrect_rratio 0.0625) (tstamp 5d3f138e-838a-48c3-b631-78ead4a94a70))
  (pad "2" smd roundrect (at -14.3 11) (size 0.8 1.5) (layers "F.Cu" "F.Paste" "F.Mask") (roundrect_rratio 0.0625) (tstamp 4331b5f8-712d-4075-9b26-a6fdd270e599))
  (pad "3" smd roundrect (at -13.2 11) (size 0.8 1.5) (layers "F.Cu" "F.Paste" "F.Mask") (roundrect_rratio 0.0625) (tstamp 7b784483-4f63-42f3-9bde-7b92a5dd3dc7))
  (pad "4" smd roundrect (at -12.1 11) (size 0.8 1.5) (layers "F.Cu" "F.Paste" "F.Mask") (roundrect_rratio 0.0625) (tstamp 0a362e4f-c40a-4f10-a1ee-fdd2cc195b48))
  (pad "5" smd roundrect (at -11 11) (size 0.8 1.5) (layers "F.Cu" "F.Paste" "F.Mask") (roundrect_rratio 0.0625) (tstamp 78d3afee-1d45-40ae-b628-97d80d8c4bc9))
  (pad "6" smd roundrect (at -9.9 11) (size 0.8 1.5) (layers "F.Cu" "F.Paste" "F.Mask") (roundrect_rratio 0.0625) (tstamp 86d60c78-c5c4-4af6-a9da-5366e57009a5))
  (pad "7" smd roundrect (at -8.8 11) (size 0.8 1.5) (layers "F.Cu" "F.Paste" "F.Mask") (roundrect_rratio 0.0625) (tstamp f09a6a72-e06a-499d-80b0-f75f6f8e51cb))
  (pad "8" smd roundrect (at -7.7 11) (size 0.8 1.5) (layers "F.Cu" "F.Paste" "F.Mask") (roundrect_rratio 0.0625) (tstamp 0c3a7c92-7048-4fc5-a44b-280b4b8de2f6))
  (pad "9" smd roundrect (at -6.6 11) (size 0.8 1.5) (layers "F.Cu" "F.Paste" "F.Mask") (roundrect_rratio 0.0625) (tstamp 59e73712-1b46-457e-9a9d-a91df9f96bed))
  (pad "10" smd roundrect (at -5.5 11) (size 0.8 1.5) (layers "F.Cu" "F.Paste" "F.Mask") (roundrect_rratio 0.0625) (tstamp c7af39d4-9253-4b3d-888b-068f779266df))
  (pad "11" smd roundrect (at -4.4 11) (size 0.8 1.5) (layers "F.Cu" "F.Paste" "F.Mask") (roundrect_rratio 0.0625) (tstamp 6dcd7ef5-1d5a-4294-8548-7fad8238480e))
  (pad "12" smd roundrect (at -3.3 11) (size 0.8 1.5) (layers "F.Cu" "F.Paste" "F.Mask") (roundrect_rratio 0.0625) (tstamp bb86a0bc-5bce-4476-8113-e9c87cdd4a11))
  (pad "13" smd roundrect (at -2.2 11) (size 0.8 1.5) (layers "F.Cu" "F.Paste" "F.Mask") (roundrect_rratio 0.0625) (tstamp 29287095-6d41-48bc-8825-3db861741cb2))
  (pad "14" smd roundrect (at -1.1 11) (size 0.8 1.5) (layers "F.Cu" "F.Paste" "F.Mask") (roundrect_rratio 0.0625) (tstamp ec407331-c6d0-4faa-9cc4-071909481a02))
  (pad "15" smd roundrect (at 0 11) (size 0.8 1.5) (layers "F.Cu" "F.Paste" "F.Mask") (roundrect_rratio 0.0625) (tstamp 8bbabec3-ddd4-4a06-8f82-e2041714c66f))
  (pad "16" smd roundrect (at 1.1 11) (size 0.8 1.5) (layers "F.Cu" "F.Paste" "F.Mask") (roundrect_rratio 0.0625) (tstamp aea93848-c9e0-4822-81c9-cd6e422ac24b))
  (pad "17" smd roundrect (at 2.2 11) (size 0.8 1.5) (layers "F.Cu" "F.Paste" "F.Mask") (roundrect_rratio 0.0625) (tstamp 39d0169f-1422-4ace-a3c0-83d21b141b52))
  (pad "18" smd roundrect (at 3.3 11) (size 0.8 1.5) (layers "F.Cu" "F.Paste" "F.Mask") (roundrect_rratio 0.0625) (tstamp 3bd665cf-f1a1-4736-a2c8-ac62fb7b4970))
  (pad "19" smd roundrect (at 4.4 11) (size 0.8 1.5) (layers "F.Cu" "F.Paste" "F.Mask") (roundrect_rratio 0.0625) (tstamp 45d43441-5d34-4ee1-99f3-512cba7e6a12))
  (pad "20" smd roundrect (at 5.5 11) (size 0.8 1.5) (layers "F.Cu" "F.Paste" "F.Mask") (roundrect_rratio 0.0625) (tstamp 4ddb9d29-88a4-4531-a23d-cdf85d8adf3e))
  (pad "21" smd roundrect (at 6.6 11) (size 0.8 1.5) (layers "F.Cu" "F.Paste" "F.Mask") (roundrect_rratio 0.0625) (tstamp 1350e49e-5fe1-42f2-b233-dec6e8c38d01))
  (pad "22" smd roundrect (at 7.7 11) (size 0.8 1.5) (layers "F.Cu" "F.Paste" "F.Mask") (roundrect_rratio 0.0625) (tstamp ce0526e7-181e-4177-aa83-d4e88fc5c52e))
  (pad "23" smd roundrect (at 8.8 11) (size 0.8 1.5) (layers "F.Cu" "F.Paste" "F.Mask") (roundrect_rratio 0.0625) (tstamp 27eab1db-d456-4f2e-9da9-157bf889f811))
  (pad "24" smd roundrect (at 9.9 11) (size 0.8 1.5) (layers "F.Cu" "F.Paste" "F.Mask") (roundrect_rratio 0.0625) (tstamp 50248333-14a1-439d-91da-63d8516744f6))
  (pad "25" smd roundrect (at 11 11) (size 0.8 1.5) (layers "F.Cu" "F.Paste" "F.Mask") (roundrect_rratio 0.0625) (tstamp b63076e2-c0fe-4b99-92e0-50448fa1b991))
  (pad "26" smd roundrect (at 12.1 11) (size 0.8 1.5) (layers "F.Cu" "F.Paste" "F.Mask") (roundrect_rratio 0.0625) (tstamp c3264feb-3e5d-4a70-a88e-449dd943474f))
  (pad "27" smd roundrect (at 13.2 11) (size 0.8 1.5) (layers "F.Cu" "F.Paste" "F.Mask") (roundrect_rratio 0.0625) (tstamp 927d12e9-86a3-4b4c-a367-a74963724d26))
  (pad "28" smd roundrect (at 14.3 11) (size 0.8 1.5) (layers "F.Cu" "F.Paste" "F.Mask") (roundrect_rratio 0.0625) (tstamp a938f9fe-a5d5-46a7-b418-209146e7d767))
  (pad "29" smd roundrect (at 15.4 11) (size 0.8 1.5) (layers "F.Cu" "F.Paste" "F.Mask") (roundrect_rratio 0.0625) (tstamp df63c483-3c31-4ee8-95cd-d8f1f599064d))
  (pad "30" smd roundrect (at 16.7 10.15) (size 0.8 1.5) (layers "F.Cu" "F.Paste" "F.Mask") (roundrect_rratio 0.0625) (tstamp ebd7d6e1-1d3d-4fb9-b756-9a940eab5740))
  (pad "31" smd roundrect (at 16.55 8.55) (size 1.1 1.1) (layers "F.Cu" "F.Paste" "F.Mask") (roundrect_rratio 0.04545454545) (tstamp 1e002ffc-65e0-49c7-b35c-8c995d27813f))
  (pad "32" smd roundrect (at 16.7 6.95) (size 0.8 1.5) (layers "F.Cu" "F.Paste" "F.Mask") (roundrect_rratio 0.0625) (tstamp eb9a5040-9678-43e7-af87-df528b2deca5))
  (pad "33" smd roundrect (at 16.35 5.5 270) (size 0.8 1.5) (layers "F.Cu" "F.Paste" "F.Mask") (roundrect_rratio 0.0625) (tstamp 932abe3f-e9e7-4ec9-bafa-6ef08f36aa89))
  (pad "34" smd roundrect (at 16.35 4.4 270) (size 0.8 1.5) (layers "F.Cu" "F.Paste" "F.Mask") (roundrect_rratio 0.0625) (tstamp 8bacf252-6b29-4c6d-84a4-26406ee4d753))
  (pad "35" smd roundrect (at 16.35 3.3 270) (size 0.8 1.5) (layers "F.Cu" "F.Paste" "F.Mask") (roundrect_rratio 0.0625) (tstamp 9bfc9b3a-5ed6-42a3-a670-e97bae27aa79))
  (pad "36" smd roundrect (at 16.35 2.2 270) (size 0.8 1.5) (layers "F.Cu" "F.Paste" "F.Mask") (roundrect_rratio 0.0625) (tstamp f17f0800-17f2-4de7-b0eb-2534a6eb2de2))
  (pad "37" smd roundrect (at 16.35 1.1 270) (size 0.8 1.5) (layers "F.Cu" "F.Paste" "F.Mask") (roundrect_rratio 0.0625) (tstamp 6a791812-c2bf-495b-a4fc-53b023d97e73))
  (pad "38" smd roundrect (at 16.35 0 270) (size 0.8 1.5) (layers "F.Cu" "F.Paste" "F.Mask") (roundrect_rratio 0.0625) (tstamp 4af76142-c9c7-4e90-bc7f-bc490e9cb491))
  (pad "39" smd roundrect (at 16.35 -1.1 270) (size 0.8 1.5) (layers "F.Cu" "F.Paste" "F.Mask") (roundrect_rratio 0.0625) (tstamp 6363cace-83b8-4400-bb65-a67725216330))
  (pad "40" smd roundrect (at 16.35 -2.2 270) (size 0.8 1.5) (layers "F.Cu" "F.Paste" "F.Mask") (roundrect_rratio 0.0625) (tstamp 9bd068e7-b729-4145-a131-22801780bda8))
  (pad "41" smd roundrect (at 16.35 -3.3 270) (size 0.8 1.5) (layers "F.Cu" "F.Paste" "F.Mask") (roundrect_rratio 0.0625) (tstamp 152602be-a784-4b5e-a358-4e54cab2efbc))
  (pad "42" smd roundrect (at 16.35 -4.4 270) (size 0.8 1.5) (layers "F.Cu" "F.Paste" "F.Mask") (roundrect_rratio 0.0625) (tstamp ab62443a-def5-4ef8-8414-bf8e5855ed55))
  (pad "43" smd roundrect (at 16.35 -5.5 270) (size 0.8 1.5) (layers "F.Cu" "F.Paste" "F.Mask") (roundrect_rratio 0.0625) (tstamp 04e1811b-40bf-4ef0-aa0d-1d63084ec5b5))
  (pad "44" smd roundrect (at 16.7 -6.95) (size 0.8 1.5) (layers "F.Cu" "F.Paste" "F.Mask") (roundrect_rratio 0.0625) (tstamp ab247f80-14b8-481d-b57f-bfa8db6b4502))
  (pad "45" smd roundrect (at 16.55 -8.55) (size 1.1 1.1) (layers "F.Cu" "F.Paste" "F.Mask") (roundrect_rratio 0.04545454545) (tstamp 245a02eb-829a-4885-85ca-6331b2da3b76))
  (pad "46" smd roundrect (at 16.7 -10.15) (size 0.8 1.5) (layers "F.Cu" "F.Paste" "F.Mask") (roundrect_rratio 0.0625) (tstamp 471d23fd-ae9d-416e-b14b-e0f39f4b6e99))
  (pad "47" smd roundrect (at 15.4 -11) (size 0.8 1.5) (layers "F.Cu" "F.Paste" "F.Mask") (roundrect_rratio 0.0625) (tstamp 1f92b9ff-9577-4130-b688-cdd2c9e9f80d))
  (pad "48" smd roundrect (at 14.3 -11) (size 0.8 1.5) (layers "F.Cu" "F.Paste" "F.Mask") (roundrect_rratio 0.0625) (tstamp b2badcdf-5c77-4f5d-a1c1-f2386e901ba8))
  (pad "49" smd roundrect (at 13.2 -11) (size 0.8 1.5) (layers "F.Cu" "F.Paste" "F.Mask") (roundrect_rratio 0.0625) (tstamp 979b0f01-74dc-42fa-be38-4454de5a1977))
  (pad "50" smd roundrect (at 12.1 -11) (size 0.8 1.5) (layers "F.Cu" "F.Paste" "F.Mask") (roundrect_rratio 0.0625) (tstamp 4bfebb95-25f8-49b6-8a13-3f4cc5907f1c))
  (pad "51" smd roundrect (at 11 -11) (size 0.8 1.5) (layers "F.Cu" "F.Paste" "F.Mask") (roundrect_rratio 0.0625) (tstamp 82e523ca-860f-4027-857b-b8e9cf143cfb))
  (pad "52" smd roundrect (at 9.9 -11) (size 0.8 1.5) (layers "F.Cu" "F.Paste" "F.Mask") (roundrect_rratio 0.0625) (tstamp 67eca81f-65ef-40dd-a38b-258860f34509))
  (pad "53" smd roundrect (at 8.8 -11) (size 0.8 1.5) (layers "F.Cu" "F.Paste" "F.Mask") (roundrect_rratio 0.0625) (tstamp 27416b42-425e-4549-8e1b-819d4f7e12bf))
  (pad "54" smd roundrect (at 7.7 -11) (size 0.8 1.5) (layers "F.Cu" "F.Paste" "F.Mask") (roundrect_rratio 0.0625) (tstamp 3958694d-643b-43d4-a10a-ce0f5c31b629))
  (pad "55" smd roundrect (at 6.6 -11) (size 0.8 1.5) (layers "F.Cu" "F.Paste" "F.Mask") (roundrect_rratio 0.0625) (tstamp d72df49e-728a-439c-9ff0-01ece2dc7c57))
  (pad "56" smd roundrect (at 5.5 -11) (size 0.8 1.5) (layers "F.Cu" "F.Paste" "F.Mask") (roundrect_rratio 0.0625) (tstamp dd708faf-d619-4bec-a8ad-110d6fa8eef2))
  (pad "57" smd roundrect (at 4.4 -11) (size 0.8 1.5) (layers "F.Cu" "F.Paste" "F.Mask") (roundrect_rratio 0.0625) (tstamp db2599bf-cfa5-418f-86f0-e4bb3f11a341))
  (pad "58" smd roundrect (at 3.3 -11) (size 0.8 1.5) (layers "F.Cu" "F.Paste" "F.Mask") (roundrect_rratio 0.0625) (tstamp 82ae6ab3-c57d-4b8e-9d7b-2c628e4d073b))
  (pad "59" smd roundrect (at 2.2 -11) (size 0.8 1.5) (layers "F.Cu" "F.Paste" "F.Mask") (roundrect_rratio 0.0625) (tstamp d1b6e940-014e-4860-92bd-fe78e0a09c86))
  (pad "60" smd roundrect (at 1.1 -11) (size 0.8 1.5) (layers "F.Cu" "F.Paste" "F.Mask") (roundrect_rratio 0.0625) (tstamp 492aa2c4-2273-4aeb-a0af-b868436cd040))
  (pad "61" smd roundrect (at 0 -11) (size 0.8 1.5) (layers "F.Cu" "F.Paste" "F.Mask") (roundrect_rratio 0.0625) (tstamp 6f7b8b28-9238-4cf5-8fc6-a13fd6480c5a))
  (pad "62" smd roundrect (at -1.1 -11) (size 0.8 1.5) (layers "F.Cu" "F.Paste" "F.Mask") (roundrect_rratio 0.0625) (tstamp ba23f71e-d60b-4654-af6a-11ddb6593089))
  (pad "63" smd roundrect (at -2.2 -11) (size 0.8 1.5) (layers "F.Cu" "F.Paste" "F.Mask") (roundrect_rratio 0.0625) (tstamp 90c73b4b-30b0-42dc-bb8a-40b32dd11f22))
  (pad "64" smd roundrect (at -3.3 -11) (size 0.8 1.5) (layers "F.Cu" "F.Paste" "F.Mask") (roundrect_rratio 0.0625) (tstamp ed5d84af-92dd-45d3-99ce-ff4ef6b87c38))
  (pad "65" smd roundrect (at -4.4 -11) (size 0.8 1.5) (layers "F.Cu" "F.Paste" "F.Mask") (roundrect_rratio 0.0625) (tstamp d5a5c590-9b4d-49fb-a8dd-b47f8e0ba235))
  (pad "66" smd roundrect (at -5.5 -11) (size 0.8 1.5) (layers "F.Cu" "F.Paste" "F.Mask") (roundrect_rratio 0.0625) (tstamp 5ed3fa83-70db-433f-b924-7812e7f44623))
  (pad "67" smd roundrect (at -6.6 -11) (size 0.8 1.5) (layers "F.Cu" "F.Paste" "F.Mask") (roundrect_rratio 0.0625) (tstamp 8d39704c-e7ad-497b-bc10-025be62a97d9))
  (pad "68" smd roundrect (at -7.7 -11) (size 0.8 1.5) (layers "F.Cu" "F.Paste" "F.Mask") (roundrect_rratio 0.0625) (tstamp bbd700f2-aa6b-48b5-9ec1-dcf8c810ae4d))
  (pad "69" smd roundrect (at -8.8 -11) (size 0.8 1.5) (layers "F.Cu" "F.Paste" "F.Mask") (roundrect_rratio 0.0625) (tstamp eafac7e6-701e-4e53-ab2e-fdad4847abac))
  (pad "70" smd roundrect (at -9.9 -11) (size 0.8 1.5) (layers "F.Cu" "F.Paste" "F.Mask") (roundrect_rratio 0.0625) (tstamp 9cfb0e5f-32b5-416f-85de-8ecaef455d0a))
  (pad "71" smd roundrect (at -11 -11) (size 0.8 1.5) (layers "F.Cu" "F.Paste" "F.Mask") (roundrect_rratio 0.0625) (tstamp 447b7786-8f84-410e-b8ea-a759a2446f58))
  (pad "72" smd roundrect (at -12.1 -11) (size 0.8 1.5) (layers "F.Cu" "F.Paste" "F.Mask") (roundrect_rratio 0.0625) (tstamp d79251c4-da37-4b39-9c86-cb2565c85a61))
  (pad "73" smd roundrect (at -13.2 -11) (size 0.8 1.5) (layers "F.Cu" "F.Paste" "F.Mask") (roundrect_rratio 0.0625) (tstamp 44c37c00-b534-48c1-ab96-5526b414a8b5))
  (pad "74" smd roundrect (at -14.3 -11) (size 0.8 1.5) (layers "F.Cu" "F.Paste" "F.Mask") (roundrect_rratio 0.0625) (tstamp f7967d89-abe9-4463-a543-ace58e76e1ba))
  (pad "75" smd roundrect (at -15.4 -11) (size 0.8 1.5) (layers "F.Cu" "F.Paste" "F.Mask") (roundrect_rratio 0.0625) (tstamp 2c7a5f4a-3f23-4261-ab1a-772b04eaede9))
  (pad "76" smd roundrect (at -16.7 -10.15) (size 0.8 1.5) (layers "F.Cu" "F.Paste" "F.Mask") (roundrect_rratio 0.0625) (tstamp 537ff8d1-6ff5-4f96-b841-75524c0bb1f0))
  (pad "77" smd roundrect (at -16.55 -8.55) (size 1.1 1.1) (layers "F.Cu" "F.Paste" "F.Mask") (roundrect_rratio 0.04545454545) (tstamp c6e90e38-8413-4a9e-bdc8-5a0deeaa0826))
  (pad "78" smd roundrect (at -16.7 -6.95) (size 0.8 1.5) (layers "F.Cu" "F.Paste" "F.Mask") (roundrect_rratio 0.0625) (tstamp a8226b11-b11d-4a42-86a5-c21b611d6157))
  (pad "79" smd roundrect (at -16.35 -5.5 270) (size 0.8 1.5) (layers "F.Cu" "F.Paste" "F.Mask") (roundrect_rratio 0.0625) (tstamp bcd0f8c0-03da-43e9-837a-110a538af8bf))
  (pad "80" smd roundrect (at -16.35 -4.4 270) (size 0.8 1.5) (layers "F.Cu" "F.Paste" "F.Mask") (roundrect_rratio 0.0625) (tstamp cf3e49ec-b7a9-40b8-b5bc-f032338451b7))
  (pad "81" smd roundrect (at -16.35 -3.3 270) (size 0.8 1.5) (layers "F.Cu" "F.Paste" "F.Mask") (roundrect_rratio 0.0625) (tstamp 8b659d11-0d19-4ebf-b130-3c860f1a28a3))
  (pad "82" smd roundrect (at -16.35 -2.2 270) (size 0.8 1.5) (layers "F.Cu" "F.Paste" "F.Mask") (roundrect_rratio 0.0625) (tstamp 8bbe9a6f-a7f9-45e8-93a4-57a31c6cb067))
  (pad "83" smd roundrect (at -16.35 -1.1 270) (size 0.8 1.5) (layers "F.Cu" "F.Paste" "F.Mask") (roundrect_rratio 0.0625) (tstamp 25b301ca-7fe5-4da8-b332-33d6a78a9770))
  (pad "84" smd roundrect (at -16.35 0 270) (size 0.8 1.5) (layers "F.Cu" "F.Paste" "F.Mask") (roundrect_rratio 0.0625) (tstamp f4a3109d-55e7-4ed2-8d86-9a4c27515939))
  (pad "85" smd roundrect (at -16.35 1.1 270) (size 0.8 1.5) (layers "F.Cu" "F.Paste" "F.Mask") (roundrect_rratio 0.0625) (tstamp 4ff727ed-20fc-477c-badd-890306d4ae6f))
  (pad "86" smd roundrect (at -16.35 2.2 270) (size 0.8 1.5) (layers "F.Cu" "F.Paste" "F.Mask") (roundrect_rratio 0.0625) (tstamp fcbfb982-f80f-404e-aaa2-7515d0c886e4))
  (pad "87" smd roundrect (at -16.35 3.3 270) (size 0.8 1.5) (layers "F.Cu" "F.Paste" "F.Mask") (roundrect_rratio 0.0625) (tstamp 4568c2bb-1bf5-4a68-aa7c-c3f157366ab1))
  (pad "88" smd roundrect (at -16.35 4.4 270) (size 0.8 1.5) (layers "F.Cu" "F.Paste" "F.Mask") (roundrect_rratio 0.0625) (tstamp b1218895-cf1b-4b82-ac53-491132b2d7bf))
  (pad "89" smd roundrect (at -16.35 5.5 270) (size 0.8 1.5) (layers "F.Cu" "F.Paste" "F.Mask") (roundrect_rratio 0.0625) (tstamp f81ec5d4-ea20-4031-a583-c0d8db6336b0))
  (pad "90" smd roundrect (at -16.7 6.95) (size 0.8 1.5) (layers "F.Cu" "F.Paste" "F.Mask") (roundrect_rratio 0.0625) (tstamp a4adb023-a3bb-481a-a7a1-d86bebd705bb))
  (pad "91" smd roundrect (at -16.55 8.55) (size 1.1 1.1) (layers "F.Cu" "F.Paste" "F.Mask") (roundrect_rratio 0.04545454545) (tstamp d00f2a9b-e86d-40ee-b748-c49edb7b21ff))
  (pad "92" smd roundrect (at -16.7 10.15) (size 0.8 1.5) (layers "F.Cu" "F.Paste" "F.Mask") (roundrect_rratio 0.0625) (tstamp 7ea043b1-17d4-4ccd-9860-f08f1cfe4406))
  (pad "93" smd roundrect (at -14.95 8.55 270) (size 0.8 1.5) (layers "F.Cu" "F.Paste" "F.Mask") (roundrect_rratio 0.0625) (tstamp 2f25063a-48f6-4bfb-a25e-e7dceeee4f7e))
  (pad "94" smd roundrect (at -14.65 5.25 270) (size 1.1 1.1) (layers "F.Cu" "F.Paste" "F.Mask") (roundrect_rratio 0.04545454545) (tstamp c4e9b416-9ddf-4413-9a5b-a26865aacb71))
  (pad "95" smd roundrect (at -14.65 3.15 270) (size 1.1 1.1) (layers "F.Cu" "F.Paste" "F.Mask") (roundrect_rratio 0.04545454545) (tstamp b042ac7b-ac51-4460-a927-7e7ebca9355b))
  (pad "96" smd roundrect (at -14.65 1.05 270) (size 1.1 1.1) (layers "F.Cu" "F.Paste" "F.Mask") (roundrect_rratio 0.04545454545) (tstamp a8ac6524-8a93-45b0-9e4f-b44535d5cbeb))
  (pad "97" smd roundrect (at -14.65 -1.05 270) (size 1.1 1.1) (layers "F.Cu" "F.Paste" "F.Mask") (roundrect_rratio 0.04545454545) (tstamp de2da586-0ac3-42dc-a8d4-21f8b4900853))
  (pad "98" smd roundrect (at -14.65 -3.15 270) (size 1.1 1.1) (layers "F.Cu" "F.Paste" "F.Mask") (roundrect_rratio 0.04545454545) (tstamp 7a0a76d1-0f49-41f2-b534-8dc44458985d))
  (pad "99" smd roundrect (at -14.65 -5.25 270) (size 1.1 1.1) (layers "F.Cu" "F.Paste" "F.Mask") (roundrect_rratio 0.04545454545) (tstamp 7b926093-94e1-42fd-b0b1-cc64faa46ac9))
  (pad "100" smd roundrect (at -14.95 -8.55 270) (size 0.8 1.5) (layers "F.Cu" "F.Paste" "F.Mask") (roundrect_rratio 0.0625) (tstamp e7bac9bd-df88-4285-9356-fcf7e1c333e5))
  (pad "101" smd roundrect (at -12.85 5.25 270) (size 1.1 1.1) (layers "F.Cu" "F.Paste" "F.Mask") (roundrect_rratio 0.04545454545) (tstamp a2c539cc-debf-4275-8f01-0769c9a233cb))
  (pad "102" smd roundrect (at -12.85 3.15 270) (size 1.1 1.1) (layers "F.Cu" "F.Paste" "F.Mask") (roundrect_rratio 0.04545454545) (tstamp f42dddae-2f24-427a-8e9c-08aee272af45))
  (pad "103" smd roundrect (at -12.85 1.05 270) (size 1.1 1.1) (layers "F.Cu" "F.Paste" "F.Mask") (roundrect_rratio 0.04545454545) (tstamp 32b7fd93-2cf4-4012-9fce-9e5a7f78409f))
  (pad "104" smd roundrect (at -12.85 -1.05 270) (size 1.1 1.1) (layers "F.Cu" "F.Paste" "F.Mask") (roundrect_rratio 0.04545454545) (tstamp 5d709a04-bfe4-4a6d-8c8c-f2f86561f70f))
  (pad "105" smd roundrect (at -12.85 -3.15 270) (size 1.1 1.1) (layers "F.Cu" "F.Paste" "F.Mask") (roundrect_rratio 0.04545454545) (tstamp 6aad56f2-5223-405e-a637-719e5857b489))
  (pad "106" smd roundrect (at -12.85 -5.25 270) (size 1.1 1.1) (layers "F.Cu" "F.Paste" "F.Mask") (roundrect_rratio 0.04545454545) (tstamp 18f9d095-f2b4-4e96-ba34-aeaecdcef1fa))
  (pad "107" smd roundrect (at -11.05 5.25 270) (size 1.1 1.1) (layers "F.Cu" "F.Paste" "F.Mask") (roundrect_rratio 0.04545454545) (tstamp 4d6f691e-680f-48ff-ad81-51c7fa2fa98a))
  (pad "108" smd roundrect (at -11.05 -5.25 270) (size 1.1 1.1) (layers "F.Cu" "F.Paste" "F.Mask") (roundrect_rratio 0.04545454545) (tstamp b97fc93e-8578-4503-b352-5bfabd97cabf))
  (pad "109" smd roundrect (at -5.85 5.25 270) (size 1.1 1.1) (layers "F.Cu" "F.Paste" "F.Mask") (roundrect_rratio 0.04545454545) (tstamp a97b6356-dea2-428e-9a01-6aa286933bf5))
  (pad "110" smd roundrect (at -5.85 3.15 270) (size 1.1 1.1) (layers "F.Cu" "F.Paste" "F.Mask") (roundrect_rratio 0.04545454545) (tstamp c85f9638-26bd-4bd5-8c7c-2790ef608fa3))
  (pad "111" smd roundrect (at -5.85 1.05 270) (size 1.1 1.1) (layers "F.Cu" "F.Paste" "F.Mask") (roundrect_rratio 0.04545454545) (tstamp 990543d1-5871-401f-b916-7d80eb740ac3))
  (pad "112" smd roundrect (at -5.85 -1.05 270) (size 1.1 1.1) (layers "F.Cu" "F.Paste" "F.Mask") (roundrect_rratio 0.04545454545) (tstamp 374e8245-79f1-4cc9-83ab-ecfbedb09978))
  (pad "113" smd roundrect (at -5.85 -3.15 270) (size 1.1 1.1) (layers "F.Cu" "F.Paste" "F.Mask") (roundrect_rratio 0.04545454545) (tstamp d0ac64a4-ba27-4d3c-a423-9dde8b6be98d))
  (pad "114" smd roundrect (at -5.85 -5.25 270) (size 1.1 1.1) (layers "F.Cu" "F.Paste" "F.Mask") (roundrect_rratio 0.04545454545) (tstamp 9cca09b0-fefc-429c-ac3d-abdfd302835b))
  (pad "115" smd roundrect (at -4.05 5.25 270) (size 1.1 1.1) (layers "F.Cu" "F.Paste" "F.Mask") (roundrect_rratio 0.04545454545) (tstamp 2a8abb6c-018e-423d-af09-f058ed2c8add))
  (pad "116" smd roundrect (at -4.05 3.15 270) (size 1.1 1.1) (layers "F.Cu" "F.Paste" "F.Mask") (roundrect_rratio 0.04545454545) (tstamp a33c9ff1-4e13-4e04-bf12-79520ea6cad0))
  (pad "117" smd roundrect (at -4.05 1.05 270) (size 1.1 1.1) (layers "F.Cu" "F.Paste" "F.Mask") (roundrect_rratio 0.04545454545) (tstamp af6d7601-9692-4c1b-ab20-3622d7830535))
  (pad "118" smd roundrect (at -4.05 -1.05 270) (size 1.1 1.1) (layers "F.Cu" "F.Paste" "F.Mask") (roundrect_rratio 0.04545454545) (tstamp 696459ec-94df-4655-a584-5758ad392364))
  (pad "119" smd roundrect (at -4.05 -3.15 270) (size 1.1 1.1) (layers "F.Cu" "F.Paste" "F.Mask") (roundrect_rratio 0.04545454545) (tstamp 42260a75-b216-40fd-b9a6-67d4d7312658))
  (pad "120" smd roundrect (at -4.05 -5.25 270) (size 1.1 1.1) (layers "F.Cu" "F.Paste" "F.Mask") (roundrect_rratio 0.04545454545) (tstamp 7d3bd0bb-dab5-4462-91ef-f082697dcca7))
  (pad "121" smd roundrect (at -2.25 5.25 270) (size 1.1 1.1) (layers "F.Cu" "F.Paste" "F.Mask") (roundrect_rratio 0.04545454545) (tstamp 9c3e3fe7-70f8-4f4f-897b-929dee1798c0))
  (pad "122" smd roundrect (at -2.25 -5.25 270) (size 1.1 1.1) (layers "F.Cu" "F.Paste" "F.Mask") (roundrect_rratio 0.04545454545) (tstamp 7d2ad6f6-fb3d-40fa-b177-a17066010c48))
  (pad "123" smd roundrect (at 2.25 5.25 270) (size 1.1 1.1) (layers "F.Cu" "F.Paste" "F.Mask") (roundrect_rratio 0.04545454545) (tstamp a7285357-3913-4ddb-a4f5-14da4fe07961))
  (pad "124" smd roundrect (at 2.25 -5.25 270) (size 1.1 1.1) (layers "F.Cu" "F.Paste" "F.Mask") (roundrect_rratio 0.04545454545) (tstamp 78c6f29f-f4b1-484f-ae4c-3762fe3f7b61))
  (pad "125" smd roundrect (at 4.05 5.25 270) (size 1.1 1.1) (layers "F.Cu" "F.Paste" "F.Mask") (roundrect_rratio 0.04545454545) (tstamp 68015f2e-e98a-4cba-85d8-162652f56b64))
  (pad "126" smd roundrect (at 4.05 3.15 270) (size 1.1 1.1) (layers "F.Cu" "F.Paste" "F.Mask") (roundrect_rratio 0.04545454545) (tstamp b168cc26-9488-4d01-a087-97e566c923e9))
  (pad "127" smd roundrect (at 4.05 1.05 270) (size 1.1 1.1) (layers "F.Cu" "F.Paste" "F.Mask") (roundrect_rratio 0.04545454545) (tstamp 32e1cbfb-d13e-4918-a3ae-d664cac72e1e))
  (pad "128" smd roundrect (at 4.05 -1.05 270) (size 1.1 1.1) (layers "F.Cu" "F.Paste" "F.Mask") (roundrect_rratio 0.04545454545) (tstamp 3f737ead-58b3-476e-98b3-94586fcce1ac))
  (pad "129" smd roundrect (at 4.05 -3.15 270) (size 1.1 1.1) (layers "F.Cu" "F.Paste" "F.Mask") (roundrect_rratio 0.04545454545) (tstamp 8a3e7dbd-170e-4558-952a-dfc5827d10dd))
  (pad "130" smd roundrect (at 4.05 -5.25 270) (size 1.1 1.1) (layers "F.Cu" "F.Paste" "F.Mask") (roundrect_rratio 0.04545454545) (tstamp 033b3813-e8f0-41ea-9122-9ee8e62469dc))
  (pad "131" smd roundrect (at 5.85 5.25 270) (size 1.1 1.1) (layers "F.Cu" "F.Paste" "F.Mask") (roundrect_rratio 0.04545454545) (tstamp f32d56c9-99ea-4cf7-a883-789da9ce3588))
  (pad "132" smd roundrect (at 5.85 3.15 270) (size 1.1 1.1) (layers "F.Cu" "F.Paste" "F.Mask") (roundrect_rratio 0.04545454545) (tstamp e1f71eac-d07f-4135-b38e-3e898d3141d8))
  (pad "133" smd roundrect (at 5.85 1.05 270) (size 1.1 1.1) (layers "F.Cu" "F.Paste" "F.Mask") (roundrect_rratio 0.04545454545) (tstamp 2ab3b55f-f637-419e-a550-e764e5005333))
  (pad "134" smd roundrect (at 5.85 -1.05 270) (size 1.1 1.1) (layers "F.Cu" "F.Paste" "F.Mask") (roundrect_rratio 0.04545454545) (tstamp 02121620-0b41-4541-96bf-174ef0e15d96))
  (pad "135" smd roundrect (at 5.85 -3.15 270) (size 1.1 1.1) (layers "F.Cu" "F.Paste" "F.Mask") (roundrect_rratio 0.04545454545) (tstamp f2f32492-c6ec-434d-9b62-b9f5c43a808e))
  (pad "136" smd roundrect (at 5.85 -5.25 270) (size 1.1 1.1) (layers "F.Cu" "F.Paste" "F.Mask") (roundrect_rratio 0.04545454545) (tstamp 80e32418-9d6b-4a6e-bbe2-99560f28d26b))
  (pad "137" smd roundrect (at 11.05 5.25 270) (size 1.1 1.1) (layers "F.Cu" "F.Paste" "F.Mask") (roundrect_rratio 0.04545454545) (tstamp 49a5dfec-b85f-4a24-b6bc-84228313aa2c))
  (pad "138" smd roundrect (at 11.05 -5.25 270) (size 1.1 1.1) (layers "F.Cu" "F.Paste" "F.Mask") (roundrect_rratio 0.04545454545) (tstamp 415fae70-e933-4996-98a2-b89e8c9e9fce))
  (pad "139" smd roundrect (at 12.85 5.25 270) (size 1.1 1.1) (layers "F.Cu" "F.Paste" "F.Mask") (roundrect_rratio 0.04545454545) (tstamp 52bd32ee-ae34-462d-ab18-3753c0f1bc19))
  (pad "140" smd roundrect (at 12.85 3.15 270) (size 1.1 1.1) (layers "F.Cu" "F.Paste" "F.Mask") (roundrect_rratio 0.04545454545) (tstamp 821d033f-d74d-45b6-9417-e83c6269f8c8))
  (pad "141" smd roundrect (at 12.85 1.05 270) (size 1.1 1.1) (layers "F.Cu" "F.Paste" "F.Mask") (roundrect_rratio 0.04545454545) (tstamp de828444-b273-4384-b3bf-a55684735bec))
  (pad "142" smd roundrect (at 12.85 -1.05 270) (size 1.1 1.1) (layers "F.Cu" "F.Paste" "F.Mask") (roundrect_rratio 0.04545454545) (tstamp 890aee5e-2bca-44ce-b814-defb57cb2795))
  (pad "143" smd roundrect (at 12.85 -3.15 270) (size 1.1 1.1) (layers "F.Cu" "F.Paste" "F.Mask") (roundrect_rratio 0.04545454545) (tstamp ac2423fb-7d0d-4f8f-afa5-27f28660c3f0))
  (pad "144" smd roundrect (at 12.85 -5.25 270) (size 1.1 1.1) (layers "F.Cu" "F.Paste" "F.Mask") (roundrect_rratio 0.04545454545) (tstamp 359d3ace-df03-4687-b295-ac06443ec16e))
  (pad "145" smd roundrect (at 14.95 8.55 270) (size 0.8 1.5) (layers "F.Cu" "F.Paste" "F.Mask") (roundrect_rratio 0.0625) (tstamp 40d9f100-80f6-448e-8b05-48c460bae891))
  (pad "146" smd roundrect (at 14.65 5.25 270) (size 1.1 1.1) (layers "F.Cu" "F.Paste" "F.Mask") (roundrect_rratio 0.04545454545) (tstamp 6277d169-e0ef-42cb-b0c0-2221efe99f4c))
  (pad "147" smd roundrect (at 14.65 3.15 270) (size 1.1 1.1) (layers "F.Cu" "F.Paste" "F.Mask") (roundrect_rratio 0.04545454545) (tstamp 24ea3e8a-fa43-4340-8ccd-5bbf2e9e8ef3))
  (pad "148" smd roundrect (at 14.65 1.05 270) (size 1.1 1.1) (layers "F.Cu" "F.Paste" "F.Mask") (roundrect_rratio 0.04545454545) (tstamp 8bc67645-e964-4a82-9a5d-057a398a62bb))
  (pad "149" smd roundrect (at 14.65 -1.05 270) (size 1.1 1.1) (layers "F.Cu" "F.Paste" "F.Mask") (roundrect_rratio 0.04545454545) (tstamp 90154ec8-a190-4059-a9bd-80a060a9062f))
  (pad "150" smd roundrect (at 14.65 -3.15 270) (size 1.1 1.1) (layers "F.Cu" "F.Paste" "F.Mask") (roundrect_rratio 0.04545454545) (tstamp 9d361fd8-7a9c-4ef2-8068-522282d8ccc8))
  (pad "151" smd roundrect (at 14.65 -5.25 270) (size 1.1 1.1) (layers "F.Cu" "F.Paste" "F.Mask") (roundrect_rratio 0.04545454545) (tstamp 5ef3fd54-34fe-4c1d-b6ca-9bedf3fa0ae9))
  (pad "152" smd roundrect (at 14.95 -8.55 270) (size 0.8 1.5) (layers "F.Cu" "F.Paste" "F.Mask") (roundrect_rratio 0.0625) (tstamp 7c2bcb01-9fe5-42db-a7d7-9147cd965b70))
  (model "${KICADLIB}/model/SoM/ublox_TOBY.step"
    (offset (xyz 0 0 0))
    (scale (xyz 1 1 1))
    (rotate (xyz 0 0 -90))
  )
)
