(footprint "Bourns_3266W" (version 20210824) (generator pcbnew) (layer "F.Cu")
  (tedit 613E438F)
  (fp_text reference "REF**" (at 0 -3 unlocked) (layer "F.SilkS")
    (effects (font (size 1 1) (thickness 0.15)))
    (tstamp cc48f26b-af41-4ee4-a146-63c50b9d0913)
  )
  (fp_text value "Bourns_3266W" (at 0 1 unlocked) (layer "F.Fab") hide
    (effects (font (size 1 1) (thickness 0.15)))
    (tstamp 1d863a0c-c341-409d-8059-267f51de8f56)
  )
  (fp_text user "^" (at -2.55 2.725 unlocked) (layer "B.SilkS")
    (effects (font (size 1 1) (thickness 0.15)) (justify mirror))
    (tstamp a73929cd-7c54-4b9b-84b0-0b17db648ca1)
  )
  (fp_text user "^" (at -2.55 3.075 unlocked) (layer "F.SilkS")
    (effects (font (size 1 1) (thickness 0.15)))
    (tstamp 1dfa1f87-ea86-421e-8839-58d912f3047f)
  )
  (fp_text user "CW" (at 0.55 1.6 unlocked) (layer "Dwgs.User")
    (effects (font (size 0.5 0.5) (thickness 0.125)))
    (tstamp edb4307a-c62d-4dac-9ad3-614ef5b8a64a)
  )
  (fp_text user "${REFERENCE}" (at 0 0 unlocked) (layer "F.Fab")
    (effects (font (size 1 1) (thickness 0.15)))
    (tstamp 231c48c2-8709-42ae-957d-bdd73acf8723)
  )
  (fp_rect (start -3.375 -2.25) (end 3.375 2.25) (layer "F.SilkS") (width 0.1) (fill none) (tstamp 449f8c88-99f5-4135-b36c-16b78afd69d9))
  (fp_line (start 0.505592 0.997183) (end 0.6 0.5) (layer "Dwgs.User") (width 0.12) (tstamp 2966592f-122c-43e8-bffb-8bdb45a2d065))
  (fp_line (start 0.505592 0.997183) (end 1 1.1) (layer "Dwgs.User") (width 0.12) (tstamp f57a2135-625c-4f52-958f-aade80a6ff8b))
  (fp_arc (start 0.000005 0.001064) (end -0.5 0.999999) (angle 306.5) (layer "Dwgs.User") (width 0.12) (tstamp 03905e4f-04c3-4c8c-b090-4fb771632e63))
  (fp_rect (start -3.5 -2.4) (end 3.5 2.4) (layer "F.CrtYd") (width 0.05) (fill none) (tstamp a81ba8eb-f475-49b6-b73c-03f5a13deb42))
  (pad "1" thru_hole circle (at -2.55 1.225) (size 1.5 1.5) (drill 0.75) (layers *.Cu *.Mask) (tstamp 6ecab893-21a7-4668-952e-0264d69b4be0))
  (pad "2" thru_hole circle (at 0 -1.325) (size 1.5 1.5) (drill 0.75) (layers *.Cu *.Mask) (tstamp 48e74c52-9543-460c-a604-ded8016fb9e5))
  (pad "3" thru_hole circle (at 2.55 1.225) (size 1.5 1.5) (drill 0.75) (layers *.Cu *.Mask) (tstamp be818dd0-27c9-4d06-b21d-a90495f583f4))
  (model "${KICADLIB}/model/passive/Bourns_3266W.stp"
    (offset (xyz 0 2.25 1.15))
    (scale (xyz 1 1 1))
    (rotate (xyz 90 -90 -180))
  )
)
