(footprint "PinHeader_2x16_P2.54mm_Vertical" (version 20211014) (generator pcbnew)
  (layer "F.Cu")
  (tedit 6116C91B)
  (descr "Through hole straight pin header, 2x16, 2.54mm pitch, double rows")
  (tags "Through hole pin header THT 2x16 2.54mm double row")
  (attr through_hole)
  (fp_text reference "REF**" (at 1.27 -2.33) (layer "F.SilkS")
    (effects (font (size 1 1) (thickness 0.15)))
    (tstamp 8b069c6e-4f4b-478f-af55-2382b9384b9a)
  )
  (fp_text value "PinHeader_2x16_P2.54mm_Vertical" (at 1.27 40.43) (layer "F.Fab") hide
    (effects (font (size 1 1) (thickness 0.15)))
    (tstamp bb95ba94-cf55-4af3-bbdd-0c7b6dd9fadb)
  )
  (fp_text user "^" (at -2.15 0.02 270 unlocked) (layer "F.SilkS")
    (effects (font (size 1 1) (thickness 0.15)))
    (tstamp 5dd9da10-009f-4e27-8f6b-80c63044d286)
  )
  (fp_text user "${REFERENCE}" (at 1.27 19.05 90) (layer "F.Fab")
    (effects (font (size 1 1) (thickness 0.15)))
    (tstamp 46d84d3d-1419-46d9-b17f-e84e02d2f451)
  )
  (fp_line (start -1.33 1.27) (end -1.33 39.43) (layer "F.SilkS") (width 0.12) (tstamp 06af0cbe-68c0-4f18-8c20-6c46572494f6))
  (fp_line (start 1.27 1.27) (end 1.27 -1.33) (layer "F.SilkS") (width 0.12) (tstamp 1a3bbad6-1354-4415-b216-1b4d14f185cb))
  (fp_line (start -1.33 1.27) (end 1.27 1.27) (layer "F.SilkS") (width 0.12) (tstamp 34c5cf29-251f-40f7-af44-5bd186aa8f4b))
  (fp_line (start -1.33 -1.33) (end 0 -1.33) (layer "F.SilkS") (width 0.12) (tstamp 36e7e0a3-3c9c-46a1-bce2-73fa3c594667))
  (fp_line (start 3.87 -1.33) (end 3.87 39.43) (layer "F.SilkS") (width 0.12) (tstamp 98f234cf-21fe-424f-bda1-f1a22a45131e))
  (fp_line (start -1.33 39.43) (end 3.87 39.43) (layer "F.SilkS") (width 0.12) (tstamp ac5d333e-82b2-4cc6-97b3-f84a7065cb79))
  (fp_line (start -1.33 0) (end -1.33 -1.33) (layer "F.SilkS") (width 0.12) (tstamp c0494150-52a7-4648-a599-575a2d84563a))
  (fp_line (start 1.27 -1.33) (end 3.87 -1.33) (layer "F.SilkS") (width 0.12) (tstamp dcb7b71e-09eb-47dd-9de0-6a4aa7ec7f5a))
  (fp_line (start 4.35 39.9) (end 4.35 -1.8) (layer "F.CrtYd") (width 0.05) (tstamp 82a42c97-41ca-4b98-894f-3f8716d71a25))
  (fp_line (start -1.8 39.9) (end 4.35 39.9) (layer "F.CrtYd") (width 0.05) (tstamp 98c8dd55-fe28-4037-995e-da64bf340c39))
  (fp_line (start -1.8 -1.8) (end -1.8 39.9) (layer "F.CrtYd") (width 0.05) (tstamp 9d9e259a-3257-4d27-84bd-0895081db6aa))
  (fp_line (start 4.35 -1.8) (end -1.8 -1.8) (layer "F.CrtYd") (width 0.05) (tstamp 9e24362a-ca5b-46f9-9767-216af98dc977))
  (fp_line (start 3.81 -1.27) (end 3.81 39.37) (layer "F.Fab") (width 0.1) (tstamp 054bca0c-01aa-4b60-80e7-a4a7987da922))
  (fp_line (start 3.81 39.37) (end -1.27 39.37) (layer "F.Fab") (width 0.1) (tstamp 06853ccd-536c-458c-8bde-418b478e664c))
  (fp_line (start 0 -1.27) (end 3.81 -1.27) (layer "F.Fab") (width 0.1) (tstamp b42803b9-d9e8-4de6-908d-e8b776743f55))
  (fp_line (start -1.27 39.37) (end -1.27 0) (layer "F.Fab") (width 0.1) (tstamp b82c6f23-ab91-4f47-8db6-215da273bff8))
  (fp_line (start -1.27 0) (end 0 -1.27) (layer "F.Fab") (width 0.1) (tstamp f3763d09-3199-4d94-a981-c5abebcd218e))
  (pad "1" thru_hole rect (at 0 0) (size 1.7 1.7) (drill 1) (layers *.Cu *.Mask) (tstamp 9af505b4-644a-4397-a74d-2ff34d255515))
  (pad "2" thru_hole oval (at 2.54 0) (size 1.7 1.7) (drill 1) (layers *.Cu *.Mask) (tstamp c0ccb235-506a-4fc1-84ae-ad93627276e0))
  (pad "3" thru_hole oval (at 0 2.54) (size 1.7 1.7) (drill 1) (layers *.Cu *.Mask) (tstamp 54f8f897-1549-41f3-b30f-8c32ae0bbcaa))
  (pad "4" thru_hole oval (at 2.54 2.54) (size 1.7 1.7) (drill 1) (layers *.Cu *.Mask) (tstamp 81011c71-1f99-4ad6-950b-2f74f9b0ec58))
  (pad "5" thru_hole oval (at 0 5.08) (size 1.7 1.7) (drill 1) (layers *.Cu *.Mask) (tstamp 5d16d594-9ad5-4bd1-863a-48586dbdaecd))
  (pad "6" thru_hole oval (at 2.54 5.08) (size 1.7 1.7) (drill 1) (layers *.Cu *.Mask) (tstamp 65a751e6-3e5b-4cb5-b420-9bd866dff11b))
  (pad "7" thru_hole oval (at 0 7.62) (size 1.7 1.7) (drill 1) (layers *.Cu *.Mask) (tstamp 0772866d-2aa5-4c28-a182-745a1af2591e))
  (pad "8" thru_hole oval (at 2.54 7.62) (size 1.7 1.7) (drill 1) (layers *.Cu *.Mask) (tstamp aa784f7e-7234-4ad7-95e1-cb1a37ff9763))
  (pad "9" thru_hole oval (at 0 10.16) (size 1.7 1.7) (drill 1) (layers *.Cu *.Mask) (tstamp af604587-a262-4f73-bc1b-19a897972c50))
  (pad "10" thru_hole oval (at 2.54 10.16) (size 1.7 1.7) (drill 1) (layers *.Cu *.Mask) (tstamp dddd46ca-9c73-42a7-8021-cd0af7273f97))
  (pad "11" thru_hole oval (at 0 12.7) (size 1.7 1.7) (drill 1) (layers *.Cu *.Mask) (tstamp 2a18ca35-1045-4513-894f-84fdfc8444c0))
  (pad "12" thru_hole oval (at 2.54 12.7) (size 1.7 1.7) (drill 1) (layers *.Cu *.Mask) (tstamp 8cf2a9fe-0afa-44f2-a377-048a9a797ff1))
  (pad "13" thru_hole oval (at 0 15.24) (size 1.7 1.7) (drill 1) (layers *.Cu *.Mask) (tstamp de820f06-9927-426d-8774-6131fda03e24))
  (pad "14" thru_hole oval (at 2.54 15.24) (size 1.7 1.7) (drill 1) (layers *.Cu *.Mask) (tstamp dcce1e77-66c5-415f-aa1a-079b008b9da2))
  (pad "15" thru_hole oval (at 0 17.78) (size 1.7 1.7) (drill 1) (layers *.Cu *.Mask) (tstamp 8b664716-6ddf-4fc4-a3d7-58f9b545059a))
  (pad "16" thru_hole oval (at 2.54 17.78) (size 1.7 1.7) (drill 1) (layers *.Cu *.Mask) (tstamp c1342fd5-124a-456d-8795-8eb28fe19c55))
  (pad "17" thru_hole oval (at 0 20.32) (size 1.7 1.7) (drill 1) (layers *.Cu *.Mask) (tstamp a30e1aa8-f58f-47a7-96aa-52377a1fad71))
  (pad "18" thru_hole oval (at 2.54 20.32) (size 1.7 1.7) (drill 1) (layers *.Cu *.Mask) (tstamp 8ae2ce8e-c457-4124-a6a6-c0abbb01d6c0))
  (pad "19" thru_hole oval (at 0 22.86) (size 1.7 1.7) (drill 1) (layers *.Cu *.Mask) (tstamp 66ab6381-223d-4c20-9bd2-3994802eb992))
  (pad "20" thru_hole oval (at 2.54 22.86) (size 1.7 1.7) (drill 1) (layers *.Cu *.Mask) (tstamp 6ed9045c-476f-4017-9f8c-aec1f34a731e))
  (pad "21" thru_hole oval (at 0 25.4) (size 1.7 1.7) (drill 1) (layers *.Cu *.Mask) (tstamp a99bd76d-a365-49d6-ac68-807bc3e1e794))
  (pad "22" thru_hole oval (at 2.54 25.4) (size 1.7 1.7) (drill 1) (layers *.Cu *.Mask) (tstamp 0ea72d01-317f-43ff-acf1-e87fcd95e686))
  (pad "23" thru_hole oval (at 0 27.94) (size 1.7 1.7) (drill 1) (layers *.Cu *.Mask) (tstamp 5571281a-a1b2-4b86-80da-12346bfe1479))
  (pad "24" thru_hole oval (at 2.54 27.94) (size 1.7 1.7) (drill 1) (layers *.Cu *.Mask) (tstamp 58db9ae3-f1b3-4a2e-81c0-e0d3ffb6a0b3))
  (pad "25" thru_hole oval (at 0 30.48) (size 1.7 1.7) (drill 1) (layers *.Cu *.Mask) (tstamp 429e1f65-39e9-4bb2-84fa-ed615ded5260))
  (pad "26" thru_hole oval (at 2.54 30.48) (size 1.7 1.7) (drill 1) (layers *.Cu *.Mask) (tstamp b201c8d5-fc4e-4d90-aea0-4c1fa4163d7c))
  (pad "27" thru_hole oval (at 0 33.02) (size 1.7 1.7) (drill 1) (layers *.Cu *.Mask) (tstamp 30e4527c-2b5c-467d-9919-c52e1e96c898))
  (pad "28" thru_hole oval (at 2.54 33.02) (size 1.7 1.7) (drill 1) (layers *.Cu *.Mask) (tstamp ad738405-6ed1-41af-9334-089310239888))
  (pad "29" thru_hole oval (at 0 35.56) (size 1.7 1.7) (drill 1) (layers *.Cu *.Mask) (tstamp 3a6ab253-360a-4ba2-8c96-4eaf7376055f))
  (pad "30" thru_hole oval (at 2.54 35.56) (size 1.7 1.7) (drill 1) (layers *.Cu *.Mask) (tstamp 067cf0da-7be1-4e91-9ad6-c1425741e42e))
  (pad "31" thru_hole oval (at 0 38.1) (size 1.7 1.7) (drill 1) (layers *.Cu *.Mask) (tstamp cf6e3b54-ae79-402c-8ed1-644e5b40ea78))
  (pad "32" thru_hole oval (at 2.54 38.1) (size 1.7 1.7) (drill 1) (layers *.Cu *.Mask) (tstamp a4097f00-217a-4e50-b0d3-6fa645562e0b))
  (model "${KICADLIB}/model/connector/PinHeader_2x16_P2.54mm_Vertical.step"
    (offset (xyz 0 0 0))
    (scale (xyz 1 1 1))
    (rotate (xyz 0 0 0))
  )
)
