(footprint "TE_1734366-1" (version 20211014) (generator pcbnew)
  (layer "F.Cu")
  (tedit 61A80828)
  (descr "CONN RCPT USB2.0 TYPEA 4POS VERT")
  (tags "USB 2.0 vertical")
  (attr through_hole)
  (fp_text reference "REF**" (at 0 -3.9 unlocked) (layer "F.SilkS")
    (effects (font (size 1 1) (thickness 0.15)))
    (tstamp 86a65945-2d11-418c-a4ed-cbf09f33c221)
  )
  (fp_text value "TE_1734366-1" (at 0 -0.3 unlocked) (layer "F.Fab") hide
    (effects (font (size 1 1) (thickness 0.15)))
    (tstamp 1c6d00a8-ad26-4b63-baea-b4fdcd62186e)
  )
  (fp_text user "^" (at -3.5 -3 180 unlocked) (layer "B.SilkS")
    (effects (font (size 1 1) (thickness 0.15)) (justify mirror))
    (tstamp 6b8398e9-d9fd-4ad2-a73b-b166cba7d812)
  )
  (fp_text user "^" (at -3.49 -4 180 unlocked) (layer "F.SilkS")
    (effects (font (size 1 1) (thickness 0.15)))
    (tstamp 91fb66ac-c352-401a-8602-55ad00b62b02)
  )
  (fp_text user "${REFERENCE}" (at 0 0 unlocked) (layer "F.Fab")
    (effects (font (size 1 1) (thickness 0.15)))
    (tstamp f1af9dcf-8562-4526-b73d-c497d32bafec)
  )
  (fp_line (start 6.6 -2.082) (end 6.6 -0.4) (layer "F.SilkS") (width 0.1) (tstamp 53575297-d674-486f-ba1a-5609a4fc5c8a))
  (fp_line (start -6.6 -2.106) (end -6.6 -0.4) (layer "F.SilkS") (width 0.1) (tstamp 7becda6e-5563-417a-a435-fb7da018a0f0))
  (fp_line (start -5.779999 -2.898198) (end 5.8 -2.9) (layer "F.SilkS") (width 0.1) (tstamp 9821ccdb-0ef1-45ad-8eb7-282ee88314cd))
  (fp_line (start -5.4 2.85) (end 5.4 2.85) (layer "F.SilkS") (width 0.1) (tstamp dfcd3752-8003-4f2b-a839-d573ba245d7e))
  (fp_arc (start 5.8 -2.9) (mid 6.372035 -2.65931) (end 6.599798 -2.082005) (layer "F.SilkS") (width 0.1) (tstamp 0f8c7b77-b829-4ab2-8b44-5846cfbc67f1))
  (fp_arc (start -6.6 -2.106) (mid -6.356408 -2.674821) (end -5.77996 -2.899771) (layer "F.SilkS") (width 0.1) (tstamp 6ef9d449-a6da-471d-b1a8-922313f38fc8))
  (fp_rect (start -8.1 -3.31) (end 8.1 3.11) (layer "F.CrtYd") (width 0.05) (fill none) (tstamp 62c5c92b-a94f-4c73-b01d-95485296bd9d))
  (fp_line (start 5.8 -2.9) (end -3 -2.9) (layer "F.Fab") (width 0.1) (tstamp 173b7637-d019-4636-964d-e41bc73a8934))
  (fp_line (start -5.8 2.85) (end 5.8 2.85) (layer "F.Fab") (width 0.1) (tstamp 3e47fae5-c4eb-4044-90e8-416d521f9f84))
  (fp_line (start -3 -2.9) (end -3.5 -2.4) (layer "F.Fab") (width 0.1) (tstamp 5be17657-834d-4eb3-a5f3-729d421a3745))
  (fp_line (start 6.6 2.05) (end 6.6 -2.1) (layer "F.Fab") (width 0.1) (tstamp a2a4a8ad-1d07-41f7-a480-08bce804bfa5))
  (fp_line (start -5.8 -2.9) (end -4 -2.9) (layer "F.Fab") (width 0.1) (tstamp ada792be-da67-446e-8adc-2985abaff731))
  (fp_line (start -3.5 -2.4) (end -4 -2.9) (layer "F.Fab") (width 0.1) (tstamp b9c545d6-eeed-4035-bc2e-e594c40a185b))
  (fp_line (start -6.6 -2.1) (end -6.6 2.05) (layer "F.Fab") (width 0.1) (tstamp c10a47e5-6b5a-4ce7-b9c7-6e081f2b9502))
  (fp_arc (start -5.8 2.85) (mid -6.365685 2.615685) (end -6.6 2.05) (layer "F.Fab") (width 0.1) (tstamp 06ec9ace-a2ab-4e9f-8183-7e5af9407e18))
  (fp_arc (start -6.6 -2.1) (mid -6.365685 -2.665685) (end -5.8 -2.9) (layer "F.Fab") (width 0.1) (tstamp 1c8796d3-e7db-4ada-b040-f421139ccf23))
  (fp_arc (start 6.6 2.05) (mid 6.365685 2.615685) (end 5.8 2.85) (layer "F.Fab") (width 0.1) (tstamp 8775edf9-1e74-4a45-bc8e-8b9d360f9442))
  (fp_arc (start 5.8 -2.9) (mid 6.365685 -2.665685) (end 6.6 -2.1) (layer "F.Fab") (width 0.1) (tstamp f979d511-f243-49aa-aa7c-844b3c247926))
  (pad "1" thru_hole circle (at -3.5 -1.3) (size 1.5 1.5) (drill 0.92) (layers *.Cu *.Mask) (tstamp b65e6c42-3202-4d4e-a296-efcba7343b74))
  (pad "2" thru_hole circle (at -1 -1.3) (size 1.5 1.5) (drill 0.92) (layers *.Cu *.Mask) (remove_unused_layers) (keep_end_layers) (tstamp 571b4a41-6d3a-4ab4-a780-dee30e3c0deb))
  (pad "3" thru_hole circle (at 1 -1.3) (size 1.5 1.5) (drill 0.92) (layers *.Cu *.Mask) (remove_unused_layers) (keep_end_layers) (tstamp 19807ec2-9fca-4a98-84b4-e763ecfea730))
  (pad "4" thru_hole circle (at 3.5 -1.3) (size 1.5 1.5) (drill 0.92) (layers *.Cu *.Mask) (tstamp 13ef350e-c8af-4ca6-a129-19376b620034))
  (pad "5" thru_hole circle (at 6.57 1.41) (size 3.3 3.3) (drill 2.3) (layers *.Cu *.Mask) (tstamp 2a66bea1-e9f6-4b69-ad01-2084bf4b6043))
  (pad "5" thru_hole circle (at -6.57 1.41) (size 3.3 3.3) (drill 2.3) (layers *.Cu *.Mask) (tstamp db64df1f-0549-408b-96b3-110778ae722b))
  (model "${KICADLIB}/model/connector/TE_1734366-1.stp"
    (offset (xyz 0 0 15))
    (scale (xyz 1 1 1))
    (rotate (xyz 0 0 0))
  )
)
