(footprint "PinSocket_1x12_P2.54mm_Vertical" (version 20221018) (generator pcbnew)
  (layer "F.Cu")
  (descr "Through hole straight socket strip, 1x12, 2.54mm pitch, single row (from Kicad 4.0.7), script generated")
  (tags "Through hole socket strip THT 1x12 2.54mm single row")
  (attr through_hole)
  (fp_text reference "REF**" (at 0 -2.77) (layer "F.SilkS")
      (effects (font (size 1 1) (thickness 0.15)))
    (tstamp 82bb2504-5aea-42a1-81be-32fff6b70118)
  )
  (fp_text value "PinSocket_1x12_P2.54mm_Vertical" (at 0 30.71) (layer "F.Fab") hide
      (effects (font (size 1 1) (thickness 0.15)))
    (tstamp 44d05a70-6ef1-4fc1-9ae5-f551a818e1a9)
  )
  (fp_text user "^" (at -2.16 0 270 unlocked) (layer "F.SilkS")
      (effects (font (size 1 1) (thickness 0.15)))
    (tstamp 1bceb4a5-bd7f-4c7b-ad63-a6d608a81d6a)
  )
  (fp_text user "${REFERENCE}" (at 0 13.97 90) (layer "F.Fab")
      (effects (font (size 1 1) (thickness 0.15)))
    (tstamp 072c6f5e-e881-4bfb-93cc-b60d4ca8435a)
  )
  (fp_line (start -1.33 1.27) (end -1.33 29.27)
    (stroke (width 0.12) (type solid)) (layer "F.SilkS") (tstamp e846f7c2-4fd6-4059-9790-5be8ecc6cd41))
  (fp_line (start -1.33 1.27) (end 1.33 1.27)
    (stroke (width 0.12) (type solid)) (layer "F.SilkS") (tstamp 8cc15890-46cc-4b91-9568-bf79b236bd21))
  (fp_line (start -1.33 29.27) (end 1.33 29.27)
    (stroke (width 0.12) (type solid)) (layer "F.SilkS") (tstamp 04b4c0df-716f-42b0-bda0-865b548bf2fc))
  (fp_line (start 0 -1.33) (end 1.33 -1.33)
    (stroke (width 0.12) (type solid)) (layer "F.SilkS") (tstamp 030aebc5-3987-4a04-8ca2-600b13ac6329))
  (fp_line (start 1.33 -1.33) (end 1.33 0)
    (stroke (width 0.12) (type solid)) (layer "F.SilkS") (tstamp 896b41e6-f625-42b9-a0c3-483cd13ebc74))
  (fp_line (start 1.33 1.27) (end 1.33 29.27)
    (stroke (width 0.12) (type solid)) (layer "F.SilkS") (tstamp fbde3af2-79b8-49dd-8484-f0c64c697d3c))
  (fp_line (start -1.8 -1.8) (end 1.75 -1.8)
    (stroke (width 0.05) (type solid)) (layer "F.CrtYd") (tstamp 3825e7ef-30a7-43b7-a370-cf009a36c66d))
  (fp_line (start -1.8 29.7) (end -1.8 -1.8)
    (stroke (width 0.05) (type solid)) (layer "F.CrtYd") (tstamp 3595d460-947b-42d3-9d80-39ce238f13b4))
  (fp_line (start 1.75 -1.8) (end 1.75 29.7)
    (stroke (width 0.05) (type solid)) (layer "F.CrtYd") (tstamp b08c7966-8d78-454b-90f9-8b4855718393))
  (fp_line (start 1.75 29.7) (end -1.8 29.7)
    (stroke (width 0.05) (type solid)) (layer "F.CrtYd") (tstamp 066b5d7c-504c-4f4a-b4ce-8534f8dc7b46))
  (fp_line (start -1.27 -1.27) (end 0.635 -1.27)
    (stroke (width 0.1) (type solid)) (layer "F.Fab") (tstamp ab42e852-12d4-4830-b2e4-0aef97c14f48))
  (fp_line (start -1.27 29.21) (end -1.27 -1.27)
    (stroke (width 0.1) (type solid)) (layer "F.Fab") (tstamp 258785b8-3f43-455c-b377-2a2a95783168))
  (fp_line (start 0.635 -1.27) (end 1.27 -0.635)
    (stroke (width 0.1) (type solid)) (layer "F.Fab") (tstamp fc945445-415e-493d-b444-3247513248ed))
  (fp_line (start 1.27 -0.635) (end 1.27 29.21)
    (stroke (width 0.1) (type solid)) (layer "F.Fab") (tstamp 20553f39-666c-403e-92be-81524feb025d))
  (fp_line (start 1.27 29.21) (end -1.27 29.21)
    (stroke (width 0.1) (type solid)) (layer "F.Fab") (tstamp 01fca2d5-ab1f-4cd6-a0db-4d5610a3fec4))
  (pad "1" thru_hole rect (at 0 0) (size 1.7 1.7) (drill 1) (layers "*.Cu" "*.Mask") (remove_unused_layers) (keep_end_layers) (tstamp 0b5b685f-5584-4875-87b2-f32af5c3bef0))
  (pad "2" thru_hole oval (at 0 2.54) (size 1.7 1.7) (drill 1) (layers "*.Cu" "*.Mask") (remove_unused_layers) (keep_end_layers) (tstamp 578d8665-6fec-4220-8aba-3abce368fde0))
  (pad "3" thru_hole oval (at 0 5.08) (size 1.7 1.7) (drill 1) (layers "*.Cu" "*.Mask") (remove_unused_layers) (keep_end_layers) (tstamp 127368b4-2a92-4b59-98b7-96571b9f0146))
  (pad "4" thru_hole oval (at 0 7.62) (size 1.7 1.7) (drill 1) (layers "*.Cu" "*.Mask") (remove_unused_layers) (keep_end_layers) (tstamp b56d6f0f-25da-4777-9a9f-5e250b89dc65))
  (pad "5" thru_hole oval (at 0 10.16) (size 1.7 1.7) (drill 1) (layers "*.Cu" "*.Mask") (remove_unused_layers) (keep_end_layers) (tstamp 78a3ae1f-4364-4505-a259-a42a9227b70d))
  (pad "6" thru_hole oval (at 0 12.7) (size 1.7 1.7) (drill 1) (layers "*.Cu" "*.Mask") (remove_unused_layers) (keep_end_layers) (tstamp d3566761-aba9-4ea5-83eb-af06c394fe1b))
  (pad "7" thru_hole oval (at 0 15.24) (size 1.7 1.7) (drill 1) (layers "*.Cu" "*.Mask") (remove_unused_layers) (keep_end_layers) (tstamp 9696db24-db31-4e4e-b132-648627fd16c7))
  (pad "8" thru_hole oval (at 0 17.78) (size 1.7 1.7) (drill 1) (layers "*.Cu" "*.Mask") (remove_unused_layers) (keep_end_layers) (tstamp 588a8119-954c-4bcf-9adf-b8e56df37ccd))
  (pad "9" thru_hole oval (at 0 20.32) (size 1.7 1.7) (drill 1) (layers "*.Cu" "*.Mask") (remove_unused_layers) (keep_end_layers) (tstamp 7863365e-9aa2-4a16-be88-78ebf3eb9488))
  (pad "10" thru_hole oval (at 0 22.86) (size 1.7 1.7) (drill 1) (layers "*.Cu" "*.Mask") (remove_unused_layers) (keep_end_layers) (tstamp 53ea8ca7-7f07-41c5-8cf9-c210a984d63a))
  (pad "11" thru_hole oval (at 0 25.4) (size 1.7 1.7) (drill 1) (layers "*.Cu" "*.Mask") (remove_unused_layers) (keep_end_layers) (tstamp d241ef0f-8113-45ba-aadb-fce18d4e3a71))
  (pad "12" thru_hole oval (at 0 27.94) (size 1.7 1.7) (drill 1) (layers "*.Cu" "*.Mask") (remove_unused_layers) (keep_end_layers) (tstamp fb23fcf5-c009-40bd-bea6-07ceb7cd4de3))
  (model "${KICADLIB}/model/connector/PinSocket_1x12_P2.54mm_Vertical.step"
    (offset (xyz 0 0 0))
    (scale (xyz 1 1 1))
    (rotate (xyz 0 0 0))
  )
)
