(footprint "PinHeader_2x02_P2.54mm_Vertical" (version 20211014) (generator pcbnew)
  (layer "F.Cu")
  (tedit 6116C89E)
  (descr "Through hole straight pin header, 2x02, 2.54mm pitch, double rows")
  (tags "Through hole pin header THT 2x02 2.54mm double row")
  (attr through_hole)
  (fp_text reference "REF**" (at 1.27 -2.33) (layer "F.SilkS")
    (effects (font (size 1 1) (thickness 0.15)))
    (tstamp adcb4e6d-c75e-4274-b403-e6d88a59e784)
  )
  (fp_text value "PinHeader_2x02_P2.54mm_Vertical" (at 1.27 4.87) (layer "F.Fab") hide
    (effects (font (size 1 1) (thickness 0.15)))
    (tstamp c2053daf-721a-4313-91c1-5d1e12963d2d)
  )
  (fp_text user "${REFERENCE}" (at 1.27 1.27 90) (layer "F.Fab")
    (effects (font (size 1 1) (thickness 0.15)))
    (tstamp 5c00b062-5905-4b9e-8cbe-d95007a13d92)
  )
  (fp_line (start -1.33 3.87) (end 3.87 3.87) (layer "F.SilkS") (width 0.12) (tstamp 1bb06e36-027e-4ccc-8d3b-04121ebfd754))
  (fp_line (start -1.33 1.27) (end -1.33 3.87) (layer "F.SilkS") (width 0.12) (tstamp 232386b6-e7bd-409d-b645-a6b89e3ea7f7))
  (fp_line (start -1.33 1.27) (end 1.27 1.27) (layer "F.SilkS") (width 0.12) (tstamp 2b575f05-782c-414e-a6b2-0dc976701c52))
  (fp_line (start -1.33 0) (end -1.33 -1.33) (layer "F.SilkS") (width 0.12) (tstamp 723beea9-3d8d-40e3-8842-5c22c7652d4d))
  (fp_line (start 3.87 -1.33) (end 3.87 3.87) (layer "F.SilkS") (width 0.12) (tstamp 8cbe2e22-98e1-4b9e-afd6-b3e4bde91ecc))
  (fp_line (start 1.27 1.27) (end 1.27 -1.33) (layer "F.SilkS") (width 0.12) (tstamp 947e6c2f-4387-497f-b74b-deb5d3da76ee))
  (fp_line (start 1.27 -1.33) (end 3.87 -1.33) (layer "F.SilkS") (width 0.12) (tstamp aa4561de-3b81-4665-bb92-e59d53baf420))
  (fp_line (start -1.33 -1.33) (end 0 -1.33) (layer "F.SilkS") (width 0.12) (tstamp e0fcc1cc-da5e-4b83-b56f-159b0e038609))
  (fp_line (start 4.35 4.35) (end 4.35 -1.8) (layer "F.CrtYd") (width 0.05) (tstamp 28f007fd-ca98-44c9-960e-f4babd6c57d9))
  (fp_line (start -1.8 -1.8) (end -1.8 4.35) (layer "F.CrtYd") (width 0.05) (tstamp 3100bf44-21f7-47f2-9b01-a1eff891811c))
  (fp_line (start -1.8 4.35) (end 4.35 4.35) (layer "F.CrtYd") (width 0.05) (tstamp 93b8d240-4d39-402c-837a-e2c887e122ed))
  (fp_line (start 4.35 -1.8) (end -1.8 -1.8) (layer "F.CrtYd") (width 0.05) (tstamp ac5ef985-da0f-465b-b452-051343e60d79))
  (fp_line (start -1.27 3.81) (end -1.27 0) (layer "F.Fab") (width 0.1) (tstamp 2f5a1e7e-b4a3-41ae-ae44-bbad06872f57))
  (fp_line (start 0 -1.27) (end 3.81 -1.27) (layer "F.Fab") (width 0.1) (tstamp 7b5ac1b2-6e64-4446-9ca4-703e24c5bd49))
  (fp_line (start 3.81 -1.27) (end 3.81 3.81) (layer "F.Fab") (width 0.1) (tstamp ad7a63c5-3665-4823-aeb6-771d50259762))
  (fp_line (start -1.27 0) (end 0 -1.27) (layer "F.Fab") (width 0.1) (tstamp c159c8ec-8be5-4b97-87bb-b71a33b07834))
  (fp_line (start 3.81 3.81) (end -1.27 3.81) (layer "F.Fab") (width 0.1) (tstamp e776dd96-4b0f-46ed-82c4-2ba464558880))
  (pad "1" thru_hole rect (at 0 0) (size 1.7 1.7) (drill 1) (layers *.Cu *.Mask) (tstamp b0f5ecd0-0986-4845-b6ea-fe1fc1d6b227))
  (pad "2" thru_hole oval (at 2.54 0) (size 1.7 1.7) (drill 1) (layers *.Cu *.Mask) (tstamp 8d5b211c-70f8-4c2a-a332-a675154d3690))
  (pad "3" thru_hole oval (at 0 2.54) (size 1.7 1.7) (drill 1) (layers *.Cu *.Mask) (tstamp 1d5c9c43-8b06-46dc-afb8-0dab7eb58562))
  (pad "4" thru_hole oval (at 2.54 2.54) (size 1.7 1.7) (drill 1) (layers *.Cu *.Mask) (tstamp 8ffeaecb-a351-4db1-93c9-0a7d86c491fe))
  (model "${KICADLIB}/model/connector/PinHeader_2x02_P2.54mm_Vertical.step"
    (offset (xyz 0 0 0))
    (scale (xyz 1 1 1))
    (rotate (xyz 0 0 0))
  )
)
