(module "SOT-666" (layer F.Cu) (tedit 5EBAFF1E)
  (descr "SOT666")
  (tags "SOT-666")
  (attr smd)
  (fp_text reference "REF**" (at 0 -1.75) (layer F.SilkS)
    (effects (font (size 1 1) (thickness 0.15)))
  )
  (fp_text value "SOT-666" (at 0 1.75 180) (layer F.Fab) hide
    (effects (font (size 1 1) (thickness 0.15)))
  )
  (fp_line (start -1.3 1) (end 1.3 1) (layer F.CrtYd) (width 0.05))
  (fp_line (start -0.65 0.85) (end 0.65 0.85) (layer F.SilkS) (width 0.1))
  (fp_line (start 1.3 1) (end 1.3 -1) (layer F.CrtYd) (width 0.05))
  (fp_line (start 0.65 -0.85) (end -0.65 -0.85) (layer F.SilkS) (width 0.1))
  (fp_line (start -1.3 -1) (end -1.3 1) (layer F.CrtYd) (width 0.05))
  (fp_line (start -1.3 -1) (end 1.3 -1) (layer F.CrtYd) (width 0.05))
  (fp_text user "^" (at -1 -1.45 180 unlocked) (layer F.SilkS)
    (effects (font (size 1 1) (thickness 0.15)))
  )
  (fp_text user "${REFERENCE}" (at 0 0 90) (layer F.Fab)
    (effects (font (size 0.35 0.35) (thickness 0.075)))
  )
  (fp_line (start -0.65 0.85) (end 0.65 0.85) (layer F.Fab) (width 0.1))
  (fp_line (start 0.65 0.85) (end 0.65 -0.85) (layer F.Fab) (width 0.1))
  (fp_line (start 0.65 -0.85) (end -0.3 -0.85) (layer F.Fab) (width 0.1))
  (fp_line (start -0.3 -0.85) (end -0.65 -0.5) (layer F.Fab) (width 0.1))
  (fp_line (start -0.65 -0.5) (end -0.65 0.85) (layer F.Fab) (width 0.1))
  (pad "1" smd rect (at -0.85 -0.5375) (size 0.5 0.375) (layers "F.Cu" "F.Paste" "F.Mask") (tstamp 023c3993-5c63-4f10-8d6f-cdca48e89d48))
  (pad "3" smd rect (at -0.85 0.5375) (size 0.5 0.375) (layers "F.Cu" "F.Paste" "F.Mask") (tstamp c24e40c7-3ab9-439a-adf5-41fafd85a94b))
  (pad "5" smd rect (at 0.925 0) (size 0.65 0.3) (layers "F.Cu" "F.Paste" "F.Mask") (tstamp e01ed329-8d6d-4248-a581-61c27ef9914b))
  (pad "2" smd rect (at -0.925 0) (size 0.65 0.3) (layers "F.Cu" "F.Paste" "F.Mask") (tstamp d86d03c3-f3b7-41a6-b7ba-4d20239d50df))
  (pad "4" smd rect (at 0.85 0.5375) (size 0.5 0.375) (layers "F.Cu" "F.Paste" "F.Mask") (tstamp a4118af5-64ab-48cf-b28d-7047a002fead))
  (pad "6" smd rect (at 0.85 -0.5375) (size 0.5 0.375) (layers "F.Cu" "F.Paste" "F.Mask") (tstamp 64b4444b-e926-46d3-b57e-3ecd2bcfc7d2))
  (model "${KICADLIB}/model/SOT/SOT-666.step"
    (at (xyz 0 0 0))
    (scale (xyz 1 1 1))
    (rotate (xyz 0 0 0))
  )
)
