(footprint "Hammer"
	(version 20240108)
	(generator "pcbnew")
	(generator_version "8.0")
	(layer "F.Cu")
	(property "Reference" "REF**"
		(at 0 -1.7 0)
		(unlocked yes)
		(layer "F.SilkS")
		(hide yes)
		(uuid "231b289e-aeab-4dee-b4f6-9b83ae1bec6a")
		(effects
			(font
				(size 1 1)
				(thickness 0.15)
			)
		)
	)
	(property "Value" "Hammer"
		(at 0 3.65 0)
		(unlocked yes)
		(layer "F.Fab")
		(hide yes)
		(uuid "2ed147f7-08e6-4a24-8be2-f9052e8c0ea6")
		(effects
			(font
				(size 1 1)
				(thickness 0.15)
			)
		)
	)
	(property "Footprint" "Hammer"
		(at 0 2.3 0)
		(unlocked yes)
		(layer "F.Fab")
		(hide yes)
		(uuid "2cf18497-b0bb-4f52-a81d-8e99676ed6f0")
		(effects
			(font
				(size 1 1)
			)
		)
	)
	(property "Datasheet" ""
		(at 0 0 0)
		(unlocked yes)
		(layer "F.Fab")
		(hide yes)
		(uuid "30e393b9-3aee-4598-9468-6e0639ddcb1f")
		(effects
			(font
				(size 1.27 1.27)
			)
		)
	)
	(property "Description" ""
		(at 0 0 0)
		(unlocked yes)
		(layer "F.Fab")
		(hide yes)
		(uuid "59fe01e1-c4a6-40a8-8e09-32629d121022")
		(effects
			(font
				(size 1.27 1.27)
			)
		)
	)
	(attr exclude_from_pos_files exclude_from_bom)
	(fp_line
		(start -0.75 -0.05)
		(end 0.75 -0.05)
		(stroke
			(width 0.1)
			(type solid)
		)
		(layer "F.SilkS")
		(uuid "807b3cf6-81d2-4888-9b94-e1e260e340fe")
	)
	(fp_line
		(start 0.75 -0.95)
		(end -0.75 -0.95)
		(stroke
			(width 0.1)
			(type solid)
		)
		(layer "F.SilkS")
		(uuid "3e3cdce2-22f0-4dd3-b09c-ab251d572510")
	)
	(fp_poly
		(pts
			(xy -0.8 0) (xy -1 -0.2) (xy -1 -0.8) (xy -0.8 -1)
		)
		(stroke
			(width 0.01)
			(type solid)
		)
		(fill solid)
		(layer "F.Mask")
		(uuid "d993959d-1a31-4151-afcc-0e2d4b96dc5d")
	)
	(fp_poly
		(pts
			(xy 0.1 1.5) (xy -0.1 1.5) (xy -0.1 0) (xy 0.1 0)
		)
		(stroke
			(width 0.01)
			(type solid)
		)
		(fill solid)
		(layer "F.Mask")
		(uuid "097ecc12-7bf3-4ae1-8b6a-4b90a1b122f3")
	)
	(fp_poly
		(pts
			(xy 0.8 -1) (xy 0.999999 -0.8) (xy 1 -0.2) (xy 0.8 0)
		)
		(stroke
			(width 0.01)
			(type solid)
		)
		(fill solid)
		(layer "F.Mask")
		(uuid "d460bfea-79d9-4cb6-bea5-cf8cdd7a9c4f")
	)
	(fp_rect
		(start -1.1 -1.1)
		(end 1.1 1.6)
		(stroke
			(width 0.05)
			(type solid)
		)
		(fill none)
		(layer "F.CrtYd")
		(uuid "81030725-d016-4706-a577-ceb04b2b6fab")
	)
	(fp_rect
		(start 1 -1)
		(end -1 1.5)
		(stroke
			(width 0.1)
			(type solid)
		)
		(fill none)
		(layer "F.Fab")
		(uuid "03d7c2be-3c26-49d2-ad19-5cd71dc07d70")
	)
	(fp_text user "${REFERENCE}"
		(at 0 0 0)
		(layer "F.Fab")
		(uuid "994e6eb4-13c4-4909-8f58-f804846f1ffc")
		(effects
			(font
				(size 0.5 0.5)
				(thickness 0.1)
			)
		)
	)
)
