(module "JST_BM06B-SRSS-TB" (layer F.Cu) (tedit 5E949441)
  (attr smd)
  (fp_text reference "REF**" (at 0 -2.95 unlocked) (layer F.SilkS)
    (effects (font (size 1 1) (thickness 0.15)))
  )
  (fp_text value "JST_BM06B-SRSS-TB" (at 0 -0.05 unlocked) (layer F.Fab)
    (effects (font (size 1 1) (thickness 0.15)))
  )
  (fp_line (start 4.75 2.5) (end 4.75 -2.5) (layer F.CrtYd) (width 0.05))
  (fp_line (start -4.75 2.5) (end 4.75 2.5) (layer F.CrtYd) (width 0.05))
  (fp_line (start -4.75 -2.5) (end -4.75 2.5) (layer F.CrtYd) (width 0.05))
  (fp_line (start 4.75 -2.5) (end -4.75 -2.5) (layer F.CrtYd) (width 0.05))
  (fp_text user "^" (at -2.5 -2.95 180 unlocked) (layer F.SilkS)
    (effects (font (size 1 1) (thickness 0.15)))
  )
  (fp_line (start -3 1.6) (end 3 1.6) (layer F.SilkS) (width 0.1))
  (fp_line (start 2.95 -1.3) (end 4 -1.3) (layer F.SilkS) (width 0.1))
  (fp_line (start 4 -0.1) (end 4 -1.3) (layer F.SilkS) (width 0.1))
  (fp_line (start -4 -1.3) (end -2.95 -1.3) (layer F.SilkS) (width 0.1))
  (fp_line (start -4 -0.1) (end -4 -1.3) (layer F.SilkS) (width 0.1))
  (fp_line (start -4 -1.3) (end 4 -1.3) (layer F.Fab) (width 0.05))
  (fp_line (start 4 1.6) (end 4 -1.3) (layer F.Fab) (width 0.05))
  (fp_line (start -4 1.6) (end 4 1.6) (layer F.Fab) (width 0.05))
  (fp_line (start -4 -1.3) (end -4 1.6) (layer F.Fab) (width 0.05))
  (pad "" smd rect (at 3.8 1.1) (size 1.4 2.2) (layers "F.Cu" "F.Paste" "F.Mask")
    (solder_mask_margin -0.1) (solder_paste_margin -0.1) (tstamp 18aefafe-2846-4911-8ae1-f8cb9ddfffa6))
  (pad "" smd rect (at -3.8 1.1) (size 1.4 2.2) (layers "F.Cu" "F.Paste" "F.Mask")
    (solder_mask_margin -0.1) (solder_paste_margin -0.1) (tstamp c536af09-6935-42fa-956c-b617221345ac))
  (pad "6" smd rect (at 2.5 -1.4) (size 0.6 1.55) (layers "F.Cu" "F.Paste" "F.Mask") (tstamp 52acc87b-7bc6-48a6-a277-0771d79aa862))
  (pad "5" smd rect (at 1.5 -1.4) (size 0.6 1.55) (layers "F.Cu" "F.Paste" "F.Mask") (tstamp fa1b400c-cb59-4bf5-87be-d30b92d39103))
  (pad "4" smd rect (at 0.5 -1.4) (size 0.6 1.55) (layers "F.Cu" "F.Paste" "F.Mask") (tstamp 310100b0-79c0-40d5-8aff-ba64689ab1fb))
  (pad "3" smd rect (at -0.5 -1.4) (size 0.6 1.55) (layers "F.Cu" "F.Paste" "F.Mask") (tstamp 6ab5de58-fde6-42a1-802f-027a44647f68))
  (pad "2" smd rect (at -1.5 -1.4) (size 0.6 1.55) (layers "F.Cu" "F.Paste" "F.Mask") (tstamp 299786bf-7b27-4964-8111-44bbd2f4d70c))
  (pad "1" smd rect (at -2.5 -1.4) (size 0.6 1.55) (layers "F.Cu" "F.Paste" "F.Mask") (tstamp a542730f-9540-4c9b-86bb-add99fac05a1))
  (model "${KICADLIB}/model/connector/JST_BM06B-SRSS-TB.STEP"
    (offset (xyz 0 -0.9 0))
    (scale (xyz 1 1 1))
    (rotate (xyz -90 0 180))
  )
)
