(module "ER-CON50HT" (layer F.Cu) (tedit 5E55AB26)
  (attr smd)
  (fp_text reference "REF**" (at 15 2.75) (layer F.SilkS)
    (effects (font (size 1 1) (thickness 0.15)))
  )
  (fp_text value "ER-CON50HT" (at 0 2.75) (layer F.Fab) hide
    (effects (font (size 1 1) (thickness 0.15)))
  )
  (fp_line (start 15.5 -3) (end 15.5 -1.725) (layer F.SilkS) (width 0.1))
  (fp_line (start -15.5 -3) (end -15.5 -1.725) (layer F.SilkS) (width 0.1))
  (fp_line (start 15.5 -3) (end -15.5 -3) (layer F.SilkS) (width 0.1))
  (fp_line (start 12.725 2.775) (end 12.725 3.075) (layer F.SilkS) (width 0.1))
  (fp_line (start 12.575 2.925) (end 12.725 2.775) (layer F.SilkS) (width 0.1))
  (fp_line (start 12.725 3.075) (end 12.575 2.925) (layer F.SilkS) (width 0.1))
  (fp_text user "ER-TFT035-6" (at -0.1 0) (layer B.Fab) hide
    (effects (font (size 1 1) (thickness 0.15)) (justify mirror))
  )
  (fp_line (start -14.75 1.5) (end -14.75 2) (layer F.SilkS) (width 0.1))
  (fp_line (start -14.75 2) (end -12.5 2) (layer F.SilkS) (width 0.1))
  (fp_line (start 14.75 1.5) (end 14.75 2) (layer F.SilkS) (width 0.1))
  (fp_line (start 12.5 2) (end 14.75 2) (layer F.SilkS) (width 0.1))
  (pad "42" smd rect (at -8.25 2.5) (size 0.3 1.2) (layers "F.Cu" "F.Paste" "F.Mask"))
  (pad "45" smd rect (at -9.75 2.5) (size 0.3 1.2) (layers "F.Cu" "F.Paste" "F.Mask"))
  (pad "44" smd rect (at -9.25 2.5) (size 0.3 1.2) (layers "F.Cu" "F.Paste" "F.Mask"))
  (pad "" smd rect (at -14.6 -0.15) (size 2.8 2.8) (layers "F.Cu" "F.Paste" "F.Mask")
    (solder_mask_margin -0.2) (solder_paste_margin -0.3))
  (pad "49" smd rect (at -11.75 2.5) (size 0.3 1.2) (layers "F.Cu" "F.Paste" "F.Mask"))
  (pad "47" smd rect (at -10.75 2.5) (size 0.3 1.2) (layers "F.Cu" "F.Paste" "F.Mask"))
  (pad "46" smd rect (at -10.25 2.5) (size 0.3 1.2) (layers "F.Cu" "F.Paste" "F.Mask"))
  (pad "43" smd rect (at -8.75 2.5) (size 0.3 1.2) (layers "F.Cu" "F.Paste" "F.Mask"))
  (pad "41" smd rect (at -7.75 2.5) (size 0.3 1.2) (layers "F.Cu" "F.Paste" "F.Mask"))
  (pad "38" smd rect (at -6.25 2.5) (size 0.3 1.2) (layers "F.Cu" "F.Paste" "F.Mask"))
  (pad "31" smd rect (at -2.75 2.5) (size 0.3 1.2) (layers "F.Cu" "F.Paste" "F.Mask"))
  (pad "40" smd rect (at -7.25 2.5) (size 0.3 1.2) (layers "F.Cu" "F.Paste" "F.Mask"))
  (pad "39" smd rect (at -6.75 2.5) (size 0.3 1.2) (layers "F.Cu" "F.Paste" "F.Mask"))
  (pad "37" smd rect (at -5.75 2.5) (size 0.3 1.2) (layers "F.Cu" "F.Paste" "F.Mask"))
  (pad "34" smd rect (at -4.25 2.5) (size 0.3 1.2) (layers "F.Cu" "F.Paste" "F.Mask"))
  (pad "33" smd rect (at -3.75 2.5) (size 0.3 1.2) (layers "F.Cu" "F.Paste" "F.Mask"))
  (pad "30" smd rect (at -2.25 2.5) (size 0.3 1.2) (layers "F.Cu" "F.Paste" "F.Mask"))
  (pad "36" smd rect (at -5.25 2.5) (size 0.3 1.2) (layers "F.Cu" "F.Paste" "F.Mask"))
  (pad "32" smd rect (at -3.25 2.5) (size 0.3 1.2) (layers "F.Cu" "F.Paste" "F.Mask"))
  (pad "29" smd rect (at -1.75 2.5) (size 0.3 1.2) (layers "F.Cu" "F.Paste" "F.Mask"))
  (pad "35" smd rect (at -4.75 2.5) (size 0.3 1.2) (layers "F.Cu" "F.Paste" "F.Mask"))
  (pad "48" smd rect (at -11.25 2.5) (size 0.3 1.2) (layers "F.Cu" "F.Paste" "F.Mask"))
  (pad "50" smd rect (at -12.25 2.5) (size 0.3 1.2) (layers "F.Cu" "F.Paste" "F.Mask"))
  (pad "" smd rect (at 14.6 -0.15) (size 2.8 2.8) (layers "F.Cu" "F.Paste" "F.Mask")
    (solder_mask_margin -0.2) (solder_paste_margin -0.3))
  (pad "8" smd rect (at 8.75 2.5) (size 0.3 1.2) (layers "F.Cu" "F.Paste" "F.Mask"))
  (pad "13" smd rect (at 6.25 2.5) (size 0.3 1.2) (layers "F.Cu" "F.Paste" "F.Mask"))
  (pad "11" smd rect (at 7.25 2.5) (size 0.3 1.2) (layers "F.Cu" "F.Paste" "F.Mask"))
  (pad "5" smd rect (at 10.25 2.5) (size 0.3 1.2) (layers "F.Cu" "F.Paste" "F.Mask"))
  (pad "10" smd rect (at 7.75 2.5) (size 0.3 1.2) (layers "F.Cu" "F.Paste" "F.Mask"))
  (pad "4" smd rect (at 10.75 2.5) (size 0.3 1.2) (layers "F.Cu" "F.Paste" "F.Mask"))
  (pad "1" smd rect (at 12.25 2.5) (size 0.3 1.2) (layers "F.Cu" "F.Paste" "F.Mask"))
  (pad "9" smd rect (at 8.25 2.5) (size 0.3 1.2) (layers "F.Cu" "F.Paste" "F.Mask"))
  (pad "3" smd rect (at 11.25 2.5) (size 0.3 1.2) (layers "F.Cu" "F.Paste" "F.Mask"))
  (pad "14" smd rect (at 5.75 2.5) (size 0.3 1.2) (layers "F.Cu" "F.Paste" "F.Mask"))
  (pad "20" smd rect (at 2.75 2.5) (size 0.3 1.2) (layers "F.Cu" "F.Paste" "F.Mask"))
  (pad "23" smd rect (at 1.25 2.5) (size 0.3 1.2) (layers "F.Cu" "F.Paste" "F.Mask"))
  (pad "28" smd rect (at -1.25 2.5) (size 0.3 1.2) (layers "F.Cu" "F.Paste" "F.Mask"))
  (pad "22" smd rect (at 1.75 2.5) (size 0.3 1.2) (layers "F.Cu" "F.Paste" "F.Mask"))
  (pad "27" smd rect (at -0.75 2.5) (size 0.3 1.2) (layers "F.Cu" "F.Paste" "F.Mask"))
  (pad "7" smd rect (at 9.25 2.5) (size 0.3 1.2) (layers "F.Cu" "F.Paste" "F.Mask"))
  (pad "26" smd rect (at -0.25 2.5) (size 0.3 1.2) (layers "F.Cu" "F.Paste" "F.Mask"))
  (pad "25" smd rect (at 0.25 2.5) (size 0.3 1.2) (layers "F.Cu" "F.Paste" "F.Mask"))
  (pad "24" smd rect (at 0.75 2.5) (size 0.3 1.2) (layers "F.Cu" "F.Paste" "F.Mask"))
  (pad "21" smd rect (at 2.25 2.5) (size 0.3 1.2) (layers "F.Cu" "F.Paste" "F.Mask"))
  (pad "19" smd rect (at 3.25 2.5) (size 0.3 1.2) (layers "F.Cu" "F.Paste" "F.Mask"))
  (pad "15" smd rect (at 5.25 2.5) (size 0.3 1.2) (layers "F.Cu" "F.Paste" "F.Mask"))
  (pad "6" smd rect (at 9.75 2.5) (size 0.3 1.2) (layers "F.Cu" "F.Paste" "F.Mask"))
  (pad "16" smd rect (at 4.75 2.5) (size 0.3 1.2) (layers "F.Cu" "F.Paste" "F.Mask"))
  (pad "18" smd rect (at 3.75 2.5) (size 0.3 1.2) (layers "F.Cu" "F.Paste" "F.Mask"))
  (pad "17" smd rect (at 4.25 2.5) (size 0.3 1.2) (layers "F.Cu" "F.Paste" "F.Mask"))
  (pad "12" smd rect (at 6.75 2.5) (size 0.3 1.2) (layers "F.Cu" "F.Paste" "F.Mask"))
  (pad "2" smd rect (at 11.75 2.5) (size 0.3 1.2) (layers "F.Cu" "F.Paste" "F.Mask"))
  (model "${KICADLIB}/model/connector/Amphenol_62684-502100ALF.step"
    (offset (xyz 0 3 0))
    (scale (xyz 1 1 1))
    (rotate (xyz -90 0 180))
  )
)
