(module "Molex_788000001+MFF2" (layer F.Cu) (tedit 5EBB0498)
  (attr smd)
  (fp_text reference "REF**" (at -0.01 7.7 unlocked) (layer F.SilkS)
    (effects (font (size 1 1) (thickness 0.15)))
  )
  (fp_text value "Molex_788000001" (at 0.01 -7.7 unlocked) (layer F.Fab) hide
    (effects (font (size 1 1) (thickness 0.15)))
  )
  (fp_text user "${REFERENCE}" (at 0.45 -1.6 unlocked) (layer F.Fab)
    (effects (font (size 1 1) (thickness 0.15)))
  )
  (fp_line (start 3 -4.75) (end 3 1.25) (layer F.SilkS) (width 0.12))
  (fp_line (start 3.3 -5.45) (end 3.3 1.95) (layer F.CrtYd) (width 0.05))
  (fp_line (start 3.3 1.95) (end -2.3 1.95) (layer F.CrtYd) (width 0.05))
  (fp_line (start -2.3 1.95) (end -2.3 -5.45) (layer F.CrtYd) (width 0.05))
  (fp_line (start -2.3 -5.45) (end 3.3 -5.45) (layer F.CrtYd) (width 0.05))
  (fp_line (start -2 -4.75) (end -2 1.25) (layer F.SilkS) (width 0.12))
  (fp_line (start -8.48 -6.93) (end -8.48 6.93) (layer F.SilkS) (width 0.12))
  (fp_line (start -8.48 6.93) (end 8.48 6.93) (layer F.SilkS) (width 0.12))
  (fp_line (start 8.48 -6.93) (end -8.48 -6.93) (layer F.SilkS) (width 0.12))
  (fp_line (start 8.48 -6.93) (end 8.48 -1.73) (layer F.SilkS) (width 0.12))
  (fp_line (start 8.48 -0.69) (end 8.48 0.81) (layer F.SilkS) (width 0.12))
  (fp_line (start 8.48 6.93) (end 8.48 3.09) (layer F.SilkS) (width 0.12))
  (fp_text user "^" (at -7.62 2.53 270 unlocked) (layer F.SilkS)
    (effects (font (size 1 1) (thickness 0.15)))
  )
  (fp_line (start -9.5 8) (end -9.5 -8) (layer F.CrtYd) (width 0.05))
  (fp_line (start -9.5 -8) (end 9.5 -8) (layer F.CrtYd) (width 0.05))
  (fp_line (start 9.5 8) (end -9.5 8) (layer F.CrtYd) (width 0.05))
  (fp_line (start 9.5 -8) (end 9.5 8) (layer F.CrtYd) (width 0.05))
  (fp_text user "^" (at 2.5 -6 180 unlocked) (layer F.SilkS)
    (effects (font (size 1 1) (thickness 0.15)))
  )
  (fp_line (start -8.45 5.95) (end -8.45 -6.9) (layer F.Fab) (width 0.1))
  (fp_line (start 8.45 -6.9) (end 8.45 6.9) (layer F.Fab) (width 0.1))
  (fp_line (start -8.45 -6.9) (end 8.45 -6.9) (layer F.Fab) (width 0.1))
  (fp_line (start -7.5 6.9) (end -8.45 5.95) (layer F.Fab) (width 0.1))
  (fp_text user "" (at -0.01 0 unlocked) (layer F.Fab)
    (effects (font (size 1 1) (thickness 0.15)))
  )
  (fp_line (start 8.45 6.9) (end -7.5 6.9) (layer F.Fab) (width 0.1))
  (fp_line (start -2 1.25) (end 3 1.25) (layer F.Fab) (width 0.1))
  (fp_line (start 3 1.25) (end 3 -4) (layer F.Fab) (width 0.1))
  (fp_line (start 3 -4) (end 2.25 -4.75) (layer F.Fab) (width 0.1))
  (fp_line (start 2.25 -4.75) (end -2 -4.75) (layer F.Fab) (width 0.1))
  (fp_line (start -2 -4.75) (end -2 1.25) (layer F.Fab) (width 0.1))
  (pad "C7" smd rect (at 8.51 -1.21) (size 0.8 0.9) (layers "F.Cu" "F.Paste" "F.Mask") (tstamp 109ae15f-8375-4995-8f98-68bab242b142))
  (pad "C5" smd rect (at 8.51 2.57) (size 0.8 0.9) (layers "F.Cu" "F.Paste" "F.Mask") (tstamp 22b8b6ea-8ff1-48fa-8183-6c59c1c393b1))
  (pad "C6" smd rect (at 8.51 1.33) (size 0.8 0.9) (layers "F.Cu" "F.Paste" "F.Mask") (tstamp 7812c3f2-96c2-42ef-8d71-a4ab1d6eb825))
  (pad "C2" smd rect (at -6.43 1.33) (size 0.8 0.9) (layers "F.Cu" "F.Paste" "F.Mask") (tstamp cb63250c-0fd2-4000-bba8-831b687e364f))
  (pad "C1" smd rect (at -6.43 2.57) (size 0.8 0.9) (layers "F.Cu" "F.Paste" "F.Mask") (tstamp bf9ae142-4dc2-4e17-a624-1cff1d67db9c))
  (pad "C3" smd rect (at -6.43 -1.21) (size 0.8 0.9) (layers "F.Cu" "F.Paste" "F.Mask") (tstamp b79f5178-e600-480d-b375-8e059868639d))
  (pad "4" smd rect (at 6.66 6.26) (size 1.4 0.95) (layers "F.Cu" "F.Paste" "F.Mask") (tstamp c6091dbc-3f99-42cb-90fd-b44e77117afc))
  (pad "3" smd rect (at 6.66 -6.26) (size 1.4 0.95) (layers "F.Cu" "F.Paste" "F.Mask") (tstamp 0228558a-ba2d-4b8a-a578-c91b736a9ff9))
  (pad "2" smd rect (at -6.66 -5.42) (size 0.95 1.2) (layers "F.Cu" "F.Paste" "F.Mask") (tstamp 9497650e-d207-4fb8-9eb2-501062b78feb))
  (pad "1" smd rect (at -6.66 5.42) (size 0.95 1.2) (layers "F.Cu" "F.Paste" "F.Mask") (tstamp 28c7f2d1-e10e-4585-a2b4-f274334fa7c0))
  (pad "" smd rect (at 1.135 -4.65 180) (size 0.5 1.1) (layers "F.Cu" "F.Paste" "F.Mask") (tstamp 6825284e-e3ec-4af9-8db5-f39be1c4030f))
  (pad "C7" smd rect (at -0.135 -4.65 180) (size 0.5 1.1) (layers "F.Cu" "F.Paste" "F.Mask") (tstamp 1bb43c2d-38cf-4fa8-a9af-be9564812c6b))
  (pad "" smd rect (at -1.405 1.15 180) (size 0.5 1.1) (layers "F.Cu" "F.Paste" "F.Mask") (tstamp 4084e830-5009-452a-8f5b-51ec4599d792))
  (pad "C3" smd rect (at -0.135 1.15 180) (size 0.5 1.1) (layers "F.Cu" "F.Paste" "F.Mask") (tstamp 37169101-176b-4a3b-a7b8-5d4eb0796ebd))
  (pad "" smd rect (at 0.5 -1.75 180) (size 2 2) (layers "F.Cu" "F.Mask") (tstamp 0b83afdd-3b34-4dd4-856a-1bed6bc0222e))
  (pad "" smd rect (at 0 -1.25 180) (size 0.8 0.8) (layers "F.Paste") (tstamp 3efa44b5-6929-4beb-b796-347d08c10115))
  (pad "" smd rect (at -1.405 -4.65 180) (size 0.5 1.1) (layers "F.Cu" "F.Paste" "F.Mask") (tstamp 96b276f9-8e1f-47ed-8786-e8deb06bcbb3))
  (pad "" smd rect (at 1 -1.25 180) (size 0.8 0.8) (layers "F.Paste") (tstamp 147bdd3f-849b-43d7-81f2-af1e434688a1))
  (pad "C1" smd rect (at 2.405 1.15 180) (size 0.5 1.1) (layers "F.Cu" "F.Paste" "F.Mask") (tstamp e5e7a257-ac00-43a0-8740-ef4aad237810))
  (pad "" smd rect (at 0 -2.25 180) (size 0.8 0.8) (layers "F.Paste") (tstamp c2315e33-3147-4174-9a68-e3a5d805e385))
  (pad "" smd rect (at 1 -2.25 180) (size 0.8 0.8) (layers "F.Paste") (tstamp fa38f6eb-23f9-47bd-89b6-85be9b2104d7))
  (pad "C2" smd rect (at 1.135 1.15 180) (size 0.5 1.1) (layers "F.Cu" "F.Paste" "F.Mask") (tstamp a006bfdf-19be-456d-a3db-85aeae43b5e3))
  (pad "C5" smd rect (at 2.405 -4.65 180) (size 0.5 1.1) (layers "F.Cu" "F.Paste" "F.Mask") (tstamp bc8f7f5e-e480-4275-8de4-4cb525eb03f1))
  (model "${KICADLIB}/model/connector/Molex_788000001.stp"
    (offset (xyz 0.25 0 0.25))
    (scale (xyz 1 1 1))
    (rotate (xyz 0 0 0))
  )
  (model "${KICADLIB}/model/DFN/DFN127P600X500-9.step"
    (offset (xyz 0.5 1.7 0))
    (scale (xyz 1 1 1))
    (rotate (xyz 0 0 90))
  )
)
