(footprint "TE_2308107-4" (version 20210722) (generator pcbnew) (layer "F.Cu")
  (tedit 611BE5EF)
  (attr through_hole)
  (fp_text reference "REF**" (at 0 -5.4 unlocked) (layer "F.SilkS")
    (effects (font (size 1 1) (thickness 0.15)))
    (tstamp c77f9f75-e9cc-4958-94d2-0512a00702d1)
  )
  (fp_text value "TE_2308107-4" (at 0 1 unlocked) (layer "F.Fab") hide
    (effects (font (size 1 1) (thickness 0.15)))
    (tstamp 6513b211-af62-4c54-b0a5-37cf87824598)
  )
  (fp_text user "^" (at -68.9 4.4 unlocked) (layer "F.SilkS")
    (effects (font (size 1 1) (thickness 0.15)))
    (tstamp 460ba928-5baa-4129-b2d3-1debba8f2582)
  )
  (fp_text user "${REFERENCE}" (at 0 0 unlocked) (layer "F.Fab")
    (effects (font (size 1 1) (thickness 0.15)))
    (tstamp 9e122b1f-3a0a-40af-9441-3ba06e40bfa4)
  )
  (fp_rect (start -76.575 -3.25) (end 65.425 3.25) (layer "F.SilkS") (width 0.12) (fill none) (tstamp eda2d862-1737-4bdf-ba08-8b1c83131a34))
  (fp_rect (start -86.575 -4) (end 75.425 4) (layer "F.CrtYd") (width 0.05) (fill none) (tstamp 657a6b40-819e-44df-9139-7b051f0f1597))
  (pad "" np_thru_hole oval (at 0 0) (size 1.2 2.45) (drill oval 1.2 2.45) (layers F&B.Cu *.Mask) (tstamp 179f8019-86fe-4326-bb01-dce940247085))
  (pad "" np_thru_hole circle (at 63.4 0) (size 2.45 2.45) (drill 2.45) (layers F&B.Cu *.Mask) (tstamp 27c98260-c106-4a80-829d-723f097da28f))
  (pad "" np_thru_hole circle (at -74.55 0) (size 2.45 2.45) (drill 2.45) (layers F&B.Cu *.Mask) (tstamp d2a8b4bd-2d61-4a8c-9114-64297ceb75e1))
  (pad "1" thru_hole circle (at -68.9 2.7) (size 0.96 0.96) (drill 0.66) (layers *.Cu *.Mask) (tstamp ec1f6bde-d177-419a-9018-a3db8247d06b))
  (pad "2" thru_hole circle (at -68.05 1.1) (size 0.96 0.96) (drill 0.66) (layers *.Cu *.Mask) (tstamp 38963518-3152-4e04-af20-799825834c25))
  (pad "3" thru_hole circle (at -67.2 2.7) (size 0.96 0.96) (drill 0.66) (layers *.Cu *.Mask) (tstamp f0de2982-3a1d-4618-9118-e5be5747179d))
  (pad "4" thru_hole circle (at -66.35 1.1) (size 0.96 0.96) (drill 0.66) (layers *.Cu *.Mask) (tstamp 30f20044-6461-4c93-9c03-eb362117b2b4))
  (pad "5" thru_hole circle (at -65.5 2.7) (size 0.96 0.96) (drill 0.66) (layers *.Cu *.Mask) (tstamp 18761eb8-457f-410b-abb7-811691260b76))
  (pad "6" thru_hole circle (at -64.65 1.1) (size 0.96 0.96) (drill 0.66) (layers *.Cu *.Mask) (tstamp 3868e69b-09e6-42ab-945d-63f7e174fcde))
  (pad "7" thru_hole circle (at -63.8 2.7) (size 0.96 0.96) (drill 0.66) (layers *.Cu *.Mask) (tstamp fe9e5b43-839e-4617-8a4f-fc9c8b3f27db))
  (pad "8" thru_hole circle (at -62.95 1.1) (size 0.96 0.96) (drill 0.66) (layers *.Cu *.Mask) (tstamp 9a8d2ddc-cf27-4c04-9882-13850ea52023))
  (pad "9" thru_hole circle (at -62.1 2.7) (size 0.96 0.96) (drill 0.66) (layers *.Cu *.Mask) (tstamp dfa9787e-29ae-4894-ac28-905f9ee24cb8))
  (pad "10" thru_hole circle (at -61.25 1.1) (size 0.96 0.96) (drill 0.66) (layers *.Cu *.Mask) (tstamp 57f29270-b7d4-47df-b8b7-357a7c192889))
  (pad "11" thru_hole circle (at -60.4 2.7) (size 0.96 0.96) (drill 0.66) (layers *.Cu *.Mask) (tstamp cf073d3b-8efe-4466-a776-886a11159c91))
  (pad "12" thru_hole circle (at -59.55 1.1) (size 0.96 0.96) (drill 0.66) (layers *.Cu *.Mask) (tstamp 8fcd92f8-f841-494b-8c94-58e0f5b076d7))
  (pad "13" thru_hole circle (at -58.7 2.7) (size 0.96 0.96) (drill 0.66) (layers *.Cu *.Mask) (tstamp ff216838-5379-4791-9b62-4967c52a0101))
  (pad "14" thru_hole circle (at -57.85 1.1) (size 0.96 0.96) (drill 0.66) (layers *.Cu *.Mask) (tstamp 33196f09-6284-41cf-9429-600af656fa3b))
  (pad "15" thru_hole circle (at -57 2.7) (size 0.96 0.96) (drill 0.66) (layers *.Cu *.Mask) (tstamp 96b68eb3-95e3-4e25-8504-695c1db681f5))
  (pad "16" thru_hole circle (at -56.15 1.1) (size 0.96 0.96) (drill 0.66) (layers *.Cu *.Mask) (tstamp 9f1bc3ac-d9fd-4391-89ed-98dada8148fd))
  (pad "17" thru_hole circle (at -55.3 2.7) (size 0.96 0.96) (drill 0.66) (layers *.Cu *.Mask) (tstamp 6b9209cc-ca02-47cf-8884-c074ed85e169))
  (pad "18" thru_hole circle (at -54.45 1.1) (size 0.96 0.96) (drill 0.66) (layers *.Cu *.Mask) (tstamp 87a85b32-b739-4315-adc2-dc80de6fa321))
  (pad "19" thru_hole circle (at -53.6 2.7) (size 0.96 0.96) (drill 0.66) (layers *.Cu *.Mask) (tstamp 6a470078-bd70-48e8-b33d-d25f70157378))
  (pad "20" thru_hole circle (at -52.75 1.1) (size 0.96 0.96) (drill 0.66) (layers *.Cu *.Mask) (tstamp e63b5ee1-b046-4853-a2dc-9a96befcfdaa))
  (pad "21" thru_hole circle (at -51.9 2.7) (size 0.96 0.96) (drill 0.66) (layers *.Cu *.Mask) (tstamp df8f57fe-0426-446b-8d4a-c30401d47b5c))
  (pad "22" thru_hole circle (at -51.05 1.1) (size 0.96 0.96) (drill 0.66) (layers *.Cu *.Mask) (tstamp 95323047-e0cb-4794-9026-9393963d9e34))
  (pad "23" thru_hole circle (at -50.2 2.7) (size 0.96 0.96) (drill 0.66) (layers *.Cu *.Mask) (tstamp 6c29cd76-9da2-43a5-9b3d-51d3238a16a3))
  (pad "24" thru_hole circle (at -49.35 1.1) (size 0.96 0.96) (drill 0.66) (layers *.Cu *.Mask) (tstamp 6b04c630-f1f5-499e-9100-a20e91d6bde5))
  (pad "25" thru_hole circle (at -48.5 2.7) (size 0.96 0.96) (drill 0.66) (layers *.Cu *.Mask) (tstamp ac7bd207-88aa-4eaa-acb9-3820e8a1a686))
  (pad "26" thru_hole circle (at -47.65 1.1) (size 0.96 0.96) (drill 0.66) (layers *.Cu *.Mask) (tstamp 416bd66c-0a48-4010-9dde-cc9cdd50aede))
  (pad "27" thru_hole circle (at -46.8 2.7) (size 0.96 0.96) (drill 0.66) (layers *.Cu *.Mask) (tstamp 9379a8ea-c18c-4760-8110-ffd30da6cfdc))
  (pad "28" thru_hole circle (at -45.95 1.1) (size 0.96 0.96) (drill 0.66) (layers *.Cu *.Mask) (tstamp 28ab7db0-6446-4965-8dff-427cb8775c4a))
  (pad "29" thru_hole circle (at -45.1 2.7) (size 0.96 0.96) (drill 0.66) (layers *.Cu *.Mask) (tstamp 9d416338-8351-4002-b532-99ec9dcc1247))
  (pad "30" thru_hole circle (at -44.25 1.1) (size 0.96 0.96) (drill 0.66) (layers *.Cu *.Mask) (tstamp e7f36bb9-f0d6-450c-904c-f2d38cc8ef81))
  (pad "31" thru_hole circle (at -43.4 2.7) (size 0.96 0.96) (drill 0.66) (layers *.Cu *.Mask) (tstamp 2ddebf81-dd83-492c-9a2d-cb1bf19fb46b))
  (pad "32" thru_hole circle (at -42.55 1.1) (size 0.96 0.96) (drill 0.66) (layers *.Cu *.Mask) (tstamp 29a417ca-25db-471d-8b35-f7d5f45a6b7e))
  (pad "33" thru_hole circle (at -41.7 2.7) (size 0.96 0.96) (drill 0.66) (layers *.Cu *.Mask) (tstamp ab890c0a-08dd-4fb8-894c-750693fec36e))
  (pad "34" thru_hole circle (at -40.85 1.1) (size 0.96 0.96) (drill 0.66) (layers *.Cu *.Mask) (tstamp 9288b46a-7746-4556-8356-208d4bb2a91b))
  (pad "35" thru_hole circle (at -40 2.7) (size 0.96 0.96) (drill 0.66) (layers *.Cu *.Mask) (tstamp f3c29989-0e00-452b-a9d3-9a5bc9f49bb4))
  (pad "36" thru_hole circle (at -39.15 1.1) (size 0.96 0.96) (drill 0.66) (layers *.Cu *.Mask) (tstamp 8b6071eb-5172-44d6-901c-3699ef6d0ab6))
  (pad "37" thru_hole circle (at -38.3 2.7) (size 0.96 0.96) (drill 0.66) (layers *.Cu *.Mask) (tstamp bc1c7565-9342-401a-96b0-4ab72262188f))
  (pad "38" thru_hole circle (at -37.45 1.1) (size 0.96 0.96) (drill 0.66) (layers *.Cu *.Mask) (tstamp 20c3fc7a-397d-4e30-b2c4-030dfb5c2f6d))
  (pad "39" thru_hole circle (at -36.6 2.7) (size 0.96 0.96) (drill 0.66) (layers *.Cu *.Mask) (tstamp 7278478c-954b-4932-87ef-1a25823c905f))
  (pad "40" thru_hole circle (at -35.75 1.1) (size 0.96 0.96) (drill 0.66) (layers *.Cu *.Mask) (tstamp 48d81f08-c3be-4bc7-9e79-efed0d3d8e4d))
  (pad "41" thru_hole circle (at -34.9 2.7) (size 0.96 0.96) (drill 0.66) (layers *.Cu *.Mask) (tstamp 679b5a5c-79f8-4b5f-a9b4-c10945e308de))
  (pad "42" thru_hole circle (at -34.05 1.1) (size 0.96 0.96) (drill 0.66) (layers *.Cu *.Mask) (tstamp ea89f66c-fae3-4053-8ed7-602c169a81e6))
  (pad "43" thru_hole circle (at -33.2 2.7) (size 0.96 0.96) (drill 0.66) (layers *.Cu *.Mask) (tstamp 9f16ea97-3159-41b6-8dad-78ceaf95d093))
  (pad "44" thru_hole circle (at -32.35 1.1) (size 0.96 0.96) (drill 0.66) (layers *.Cu *.Mask) (tstamp d886ebe8-874c-42a3-84bb-20deeb8c5b12))
  (pad "45" thru_hole circle (at -31.5 2.7) (size 0.96 0.96) (drill 0.66) (layers *.Cu *.Mask) (tstamp 529feac2-f66d-43f7-8090-0f98a1fbf40f))
  (pad "46" thru_hole circle (at -30.65 1.1) (size 0.96 0.96) (drill 0.66) (layers *.Cu *.Mask) (tstamp ee6482c0-d02b-430b-a1e5-2bd62b622de5))
  (pad "47" thru_hole circle (at -29.8 2.7) (size 0.96 0.96) (drill 0.66) (layers *.Cu *.Mask) (tstamp 15244664-e635-41d9-a6e3-60fca878e1d9))
  (pad "48" thru_hole circle (at -28.95 1.1) (size 0.96 0.96) (drill 0.66) (layers *.Cu *.Mask) (tstamp 899697d8-75bc-484b-962a-36b84d31c5d3))
  (pad "49" thru_hole circle (at -28.1 2.7) (size 0.96 0.96) (drill 0.66) (layers *.Cu *.Mask) (tstamp 6d52d83f-a2a6-4189-ad73-109861d56c4e))
  (pad "50" thru_hole circle (at -27.25 1.1) (size 0.96 0.96) (drill 0.66) (layers *.Cu *.Mask) (tstamp c0e80de3-7fcc-495c-9e06-de0fe505377e))
  (pad "51" thru_hole circle (at -26.4 2.7) (size 0.96 0.96) (drill 0.66) (layers *.Cu *.Mask) (tstamp 838b27d1-7f65-49c2-9d15-28498df1c16e))
  (pad "52" thru_hole circle (at -25.55 1.1) (size 0.96 0.96) (drill 0.66) (layers *.Cu *.Mask) (tstamp 4c46b8eb-201d-4fb5-903d-44d4d16153b0))
  (pad "53" thru_hole circle (at -24.7 2.7) (size 0.96 0.96) (drill 0.66) (layers *.Cu *.Mask) (tstamp 681d5ab0-9551-448b-b936-01df2918bbbf))
  (pad "54" thru_hole circle (at -23.85 1.1) (size 0.96 0.96) (drill 0.66) (layers *.Cu *.Mask) (tstamp 44868859-a726-47b2-9021-f1d432475551))
  (pad "55" thru_hole circle (at -23 2.7) (size 0.96 0.96) (drill 0.66) (layers *.Cu *.Mask) (tstamp 31053543-a226-450a-a86d-5136aa504e05))
  (pad "56" thru_hole circle (at -22.15 1.1) (size 0.96 0.96) (drill 0.66) (layers *.Cu *.Mask) (tstamp e3d8f51a-2691-4502-86d1-5618fc8ed3e9))
  (pad "57" thru_hole circle (at -21.3 2.7) (size 0.96 0.96) (drill 0.66) (layers *.Cu *.Mask) (tstamp 8bbd5dd4-4b12-47b4-a5e0-88c3447ec822))
  (pad "58" thru_hole circle (at -20.45 1.1) (size 0.96 0.96) (drill 0.66) (layers *.Cu *.Mask) (tstamp 9ed7eed6-f901-42e8-a295-35447b21fb2b))
  (pad "59" thru_hole circle (at -19.6 2.7) (size 0.96 0.96) (drill 0.66) (layers *.Cu *.Mask) (tstamp 8150d416-b21c-467e-9f40-2e0a68a33870))
  (pad "60" thru_hole circle (at -18.75 1.1) (size 0.96 0.96) (drill 0.66) (layers *.Cu *.Mask) (tstamp 69975dfa-1dc5-4a2f-b44a-402a90815e59))
  (pad "61" thru_hole circle (at -17.9 2.7) (size 0.96 0.96) (drill 0.66) (layers *.Cu *.Mask) (tstamp 6439edba-3d90-40c2-ab5b-a77363ce3c86))
  (pad "62" thru_hole circle (at -17.05 1.1) (size 0.96 0.96) (drill 0.66) (layers *.Cu *.Mask) (tstamp b9db3e92-c362-45c7-b5fd-076a167a2705))
  (pad "63" thru_hole circle (at -16.2 2.7) (size 0.96 0.96) (drill 0.66) (layers *.Cu *.Mask) (tstamp e810f200-e6c2-4c78-be08-dfb3ee8ad552))
  (pad "64" thru_hole circle (at -15.35 1.1) (size 0.96 0.96) (drill 0.66) (layers *.Cu *.Mask) (tstamp b849cb5b-f511-40c2-b1bd-70ac4fc7854d))
  (pad "65" thru_hole circle (at -14.5 2.7) (size 0.96 0.96) (drill 0.66) (layers *.Cu *.Mask) (tstamp 060a3b8b-ef70-4835-b7ef-3d70d4b2a0a2))
  (pad "66" thru_hole circle (at -13.65 1.1) (size 0.96 0.96) (drill 0.66) (layers *.Cu *.Mask) (tstamp a183f75d-5330-4c08-ac9e-e34b8898b772))
  (pad "67" thru_hole circle (at -12.8 2.7) (size 0.96 0.96) (drill 0.66) (layers *.Cu *.Mask) (tstamp e71714e5-245f-4788-82e4-acc8eea2c744))
  (pad "68" thru_hole circle (at -11.95 1.1) (size 0.96 0.96) (drill 0.66) (layers *.Cu *.Mask) (tstamp 63443197-60e8-42df-8bc5-33bbe240dd82))
  (pad "69" thru_hole circle (at -11.1 2.7) (size 0.96 0.96) (drill 0.66) (layers *.Cu *.Mask) (tstamp e428b8b2-9789-41fb-9624-7fa7cb7eea99))
  (pad "70" thru_hole circle (at -10.25 1.1) (size 0.96 0.96) (drill 0.66) (layers *.Cu *.Mask) (tstamp 7ac95409-0de9-443d-9aa1-85db059c115b))
  (pad "71" thru_hole circle (at -9.4 2.7) (size 0.96 0.96) (drill 0.66) (layers *.Cu *.Mask) (tstamp 3fe61e61-006a-4342-9591-3f7117f201f8))
  (pad "72" thru_hole circle (at -8.55 1.1) (size 0.96 0.96) (drill 0.66) (layers *.Cu *.Mask) (tstamp 02710322-7535-44d0-b4dc-22cf146bb1d2))
  (pad "73" thru_hole circle (at -7.7 2.7) (size 0.96 0.96) (drill 0.66) (layers *.Cu *.Mask) (tstamp fff206c8-6977-41c4-ae37-95381b19f7f5))
  (pad "74" thru_hole circle (at -6.85 1.1) (size 0.96 0.96) (drill 0.66) (layers *.Cu *.Mask) (tstamp 906313db-4f76-428c-9d6c-356e936b1e5c))
  (pad "75" thru_hole circle (at -6 2.7) (size 0.96 0.96) (drill 0.66) (layers *.Cu *.Mask) (tstamp bbee12ae-7d58-4bc9-9f8a-5fb40a03bb1b))
  (pad "76" thru_hole circle (at -5.15 1.1) (size 0.96 0.96) (drill 0.66) (layers *.Cu *.Mask) (tstamp d2e3533a-c7a0-4fcc-8321-81156da1187a))
  (pad "77" thru_hole circle (at -4.3 2.7) (size 0.96 0.96) (drill 0.66) (layers *.Cu *.Mask) (tstamp 74d70ec9-6ef8-4a28-a0cf-57232b1e1519))
  (pad "78" thru_hole circle (at 1.65 1.1) (size 0.96 0.96) (drill 0.66) (layers *.Cu *.Mask) (tstamp d768e5dc-d9ec-4719-ac6f-8d68fdfeb079))
  (pad "79" thru_hole circle (at 2.5 2.7) (size 0.96 0.96) (drill 0.66) (layers *.Cu *.Mask) (tstamp 8a8bb27d-a54a-4c0b-9f2b-ea9a1b6fb0a6))
  (pad "80" thru_hole circle (at 3.35 1.1) (size 0.96 0.96) (drill 0.66) (layers *.Cu *.Mask) (tstamp 391c5760-f3d1-4579-b277-210b62a62b4e))
  (pad "81" thru_hole circle (at 4.2 2.7) (size 0.96 0.96) (drill 0.66) (layers *.Cu *.Mask) (tstamp 1da59f38-87f2-4cd3-9b0e-bb1902a69d7d))
  (pad "82" thru_hole circle (at 5.05 1.1) (size 0.96 0.96) (drill 0.66) (layers *.Cu *.Mask) (tstamp a8d9add8-1edc-4d45-a68d-18d574257d89))
  (pad "83" thru_hole circle (at 5.9 2.7) (size 0.96 0.96) (drill 0.66) (layers *.Cu *.Mask) (tstamp 7eaca461-a8b4-4a7e-a9b4-17251f54d5df))
  (pad "84" thru_hole circle (at 6.75 1.1) (size 0.96 0.96) (drill 0.66) (layers *.Cu *.Mask) (tstamp e4263ed6-714d-4c40-810e-39f9a03d8d82))
  (pad "85" thru_hole circle (at 7.6 2.7) (size 0.96 0.96) (drill 0.66) (layers *.Cu *.Mask) (tstamp 5d001f25-d4ea-4a5e-889b-e0bf89afffc7))
  (pad "86" thru_hole circle (at 8.45 1.1) (size 0.96 0.96) (drill 0.66) (layers *.Cu *.Mask) (tstamp dd348b8d-e212-4e2d-bc79-32f35c85bd3e))
  (pad "87" thru_hole circle (at 9.3 2.7) (size 0.96 0.96) (drill 0.66) (layers *.Cu *.Mask) (tstamp 6af902a1-432d-4fb1-91a3-68d5ca26179c))
  (pad "88" thru_hole circle (at 10.15 1.1) (size 0.96 0.96) (drill 0.66) (layers *.Cu *.Mask) (tstamp 2d7f2107-221c-4bec-b06b-a07e0e4bebc1))
  (pad "89" thru_hole circle (at 11 2.7) (size 0.96 0.96) (drill 0.66) (layers *.Cu *.Mask) (tstamp a461a20e-de2f-4d0c-8e08-2c240bf4fc89))
  (pad "90" thru_hole circle (at 11.85 1.1) (size 0.96 0.96) (drill 0.66) (layers *.Cu *.Mask) (tstamp 56c24fcb-3362-4a2b-aafc-ffa9859d98da))
  (pad "91" thru_hole circle (at 12.7 2.7) (size 0.96 0.96) (drill 0.66) (layers *.Cu *.Mask) (tstamp ed76063f-618f-4c9a-b6e1-2aada2b28230))
  (pad "92" thru_hole circle (at 13.55 1.1) (size 0.96 0.96) (drill 0.66) (layers *.Cu *.Mask) (tstamp dbed1af2-b7dd-4efc-a138-7bb1d2e47813))
  (pad "93" thru_hole circle (at 14.4 2.7) (size 0.96 0.96) (drill 0.66) (layers *.Cu *.Mask) (tstamp d89f8b62-9652-4105-83f4-d3d7cb72d59c))
  (pad "94" thru_hole circle (at 15.25 1.1) (size 0.96 0.96) (drill 0.66) (layers *.Cu *.Mask) (tstamp 0d636d88-730f-407e-b1fa-1e6ca136e4da))
  (pad "95" thru_hole circle (at 16.1 2.7) (size 0.96 0.96) (drill 0.66) (layers *.Cu *.Mask) (tstamp 3c411cf0-6ad6-45ec-9060-77b97019e1ea))
  (pad "96" thru_hole circle (at 16.95 1.1) (size 0.96 0.96) (drill 0.66) (layers *.Cu *.Mask) (tstamp a1b51f89-ee92-491a-93ce-46e4cd1363ec))
  (pad "97" thru_hole circle (at 17.8 2.7) (size 0.96 0.96) (drill 0.66) (layers *.Cu *.Mask) (tstamp 7445d248-a4aa-4efb-aab4-5de29c9b28c4))
  (pad "98" thru_hole circle (at 18.65 1.1) (size 0.96 0.96) (drill 0.66) (layers *.Cu *.Mask) (tstamp 72d0b002-570f-409c-8dc9-8b5478e39e80))
  (pad "99" thru_hole circle (at 19.5 2.7) (size 0.96 0.96) (drill 0.66) (layers *.Cu *.Mask) (tstamp 7a3ced03-0b5f-49fd-b915-ed71080d1ed9))
  (pad "100" thru_hole circle (at 20.35 1.1) (size 0.96 0.96) (drill 0.66) (layers *.Cu *.Mask) (tstamp 1b478f89-8f19-4b22-b079-9b9d7b4c4c19))
  (pad "101" thru_hole circle (at 21.2 2.7) (size 0.96 0.96) (drill 0.66) (layers *.Cu *.Mask) (tstamp fd9c5d4e-a377-4004-a662-8664ff82a551))
  (pad "102" thru_hole circle (at 22.05 1.1) (size 0.96 0.96) (drill 0.66) (layers *.Cu *.Mask) (tstamp 3467449d-3046-4e4d-8ace-84091fbf5895))
  (pad "103" thru_hole circle (at 22.9 2.7) (size 0.96 0.96) (drill 0.66) (layers *.Cu *.Mask) (tstamp 7f6e92fd-2e90-4085-80bf-e0b0dfa85b1a))
  (pad "104" thru_hole circle (at 23.75 1.1) (size 0.96 0.96) (drill 0.66) (layers *.Cu *.Mask) (tstamp 974054d1-76a0-4395-ba06-b0a52a07f446))
  (pad "105" thru_hole circle (at 24.6 2.7) (size 0.96 0.96) (drill 0.66) (layers *.Cu *.Mask) (tstamp 65788bd1-f8c0-415d-b96c-8b6f861c012e))
  (pad "106" thru_hole circle (at 25.45 1.1) (size 0.96 0.96) (drill 0.66) (layers *.Cu *.Mask) (tstamp 205ad425-537a-495f-89e0-4b520c47b502))
  (pad "107" thru_hole circle (at 26.3 2.7) (size 0.96 0.96) (drill 0.66) (layers *.Cu *.Mask) (tstamp ad9293f4-170c-4539-b066-46a9d1c1ac54))
  (pad "108" thru_hole circle (at 27.15 1.1) (size 0.96 0.96) (drill 0.66) (layers *.Cu *.Mask) (tstamp d6244f70-e4a3-4345-b52e-a079369cc338))
  (pad "109" thru_hole circle (at 28 2.7) (size 0.96 0.96) (drill 0.66) (layers *.Cu *.Mask) (tstamp 6ef0f645-fc99-4532-b491-d5663eca3689))
  (pad "110" thru_hole circle (at 28.85 1.1) (size 0.96 0.96) (drill 0.66) (layers *.Cu *.Mask) (tstamp 4b525665-ce78-4fb0-9379-339115382182))
  (pad "111" thru_hole circle (at 29.7 2.7) (size 0.96 0.96) (drill 0.66) (layers *.Cu *.Mask) (tstamp bd3172b2-a31f-4652-90db-5700b3168d36))
  (pad "112" thru_hole circle (at 30.55 1.1) (size 0.96 0.96) (drill 0.66) (layers *.Cu *.Mask) (tstamp 357d4979-dbd5-4397-9089-ac0b80880938))
  (pad "113" thru_hole circle (at 31.4 2.7) (size 0.96 0.96) (drill 0.66) (layers *.Cu *.Mask) (tstamp 579e9215-25a2-45b1-aa98-816267d4df3e))
  (pad "114" thru_hole circle (at 32.25 1.1) (size 0.96 0.96) (drill 0.66) (layers *.Cu *.Mask) (tstamp 6923c0b8-45d8-4442-b164-c74e25b974c1))
  (pad "115" thru_hole circle (at 33.1 2.7) (size 0.96 0.96) (drill 0.66) (layers *.Cu *.Mask) (tstamp e74678dc-a981-40bd-b5b3-936d5793abe3))
  (pad "116" thru_hole circle (at 33.95 1.1) (size 0.96 0.96) (drill 0.66) (layers *.Cu *.Mask) (tstamp 1d6aa4a9-6599-4dfc-9c5f-03478574d2e9))
  (pad "117" thru_hole circle (at 34.8 2.7) (size 0.96 0.96) (drill 0.66) (layers *.Cu *.Mask) (tstamp 618d2af7-fd50-46cd-ac0d-fd9bcf1bbcd6))
  (pad "118" thru_hole circle (at 35.65 1.1) (size 0.96 0.96) (drill 0.66) (layers *.Cu *.Mask) (tstamp 0c3c8951-a7c5-404c-b9c9-9a6a81f9da71))
  (pad "119" thru_hole circle (at 36.5 2.7) (size 0.96 0.96) (drill 0.66) (layers *.Cu *.Mask) (tstamp 67b91905-36ca-4d9b-a5e2-96e58a7bd6a9))
  (pad "120" thru_hole circle (at 37.35 1.1) (size 0.96 0.96) (drill 0.66) (layers *.Cu *.Mask) (tstamp 53cfb0a1-dd98-4ae0-a3cf-d4dfafa96eb4))
  (pad "121" thru_hole circle (at 38.2 2.7) (size 0.96 0.96) (drill 0.66) (layers *.Cu *.Mask) (tstamp 049c539c-f1be-47ec-aa51-743854adde8e))
  (pad "122" thru_hole circle (at 39.05 1.1) (size 0.96 0.96) (drill 0.66) (layers *.Cu *.Mask) (tstamp 89dce491-3f60-4ea0-ac20-db72b567af23))
  (pad "123" thru_hole circle (at 39.9 2.7) (size 0.96 0.96) (drill 0.66) (layers *.Cu *.Mask) (tstamp 63c2499c-8c8e-4164-843f-4396ddb31d24))
  (pad "124" thru_hole circle (at 40.75 1.1) (size 0.96 0.96) (drill 0.66) (layers *.Cu *.Mask) (tstamp 7881bd3c-0a59-43e8-81b7-c15c3f02b79d))
  (pad "125" thru_hole circle (at 41.6 2.7) (size 0.96 0.96) (drill 0.66) (layers *.Cu *.Mask) (tstamp 787f850d-8f6b-444f-8196-a401aa8798dc))
  (pad "126" thru_hole circle (at 42.45 1.1) (size 0.96 0.96) (drill 0.66) (layers *.Cu *.Mask) (tstamp 4386a4b9-2116-491e-97df-62b6f4bae946))
  (pad "127" thru_hole circle (at 43.3 2.7) (size 0.96 0.96) (drill 0.66) (layers *.Cu *.Mask) (tstamp 03a5e27b-7b57-4a3c-a4bf-5b800e1b8bc8))
  (pad "128" thru_hole circle (at 44.15 1.1) (size 0.96 0.96) (drill 0.66) (layers *.Cu *.Mask) (tstamp ffbf556a-b9bc-4a21-a55e-2c7bc91ee0b7))
  (pad "129" thru_hole circle (at 45 2.7) (size 0.96 0.96) (drill 0.66) (layers *.Cu *.Mask) (tstamp 63c82546-05ee-475a-adb6-3b3cda3f7883))
  (pad "130" thru_hole circle (at 45.85 1.1) (size 0.96 0.96) (drill 0.66) (layers *.Cu *.Mask) (tstamp 4827c358-b908-458f-a546-c1670e79c701))
  (pad "131" thru_hole circle (at 46.7 2.7) (size 0.96 0.96) (drill 0.66) (layers *.Cu *.Mask) (tstamp 5fa62025-d1f7-4ef7-ada6-a192c7954519))
  (pad "132" thru_hole circle (at 47.55 1.1) (size 0.96 0.96) (drill 0.66) (layers *.Cu *.Mask) (tstamp 4a2304ff-8cf6-40d3-911e-630632b2f8f6))
  (pad "133" thru_hole circle (at 48.4 2.7) (size 0.96 0.96) (drill 0.66) (layers *.Cu *.Mask) (tstamp 13cac0c5-9f47-431c-9080-157abc2fa6da))
  (pad "134" thru_hole circle (at 49.25 1.1) (size 0.96 0.96) (drill 0.66) (layers *.Cu *.Mask) (tstamp a08bdf0d-210b-453f-ab38-8bbfcee7f98f))
  (pad "135" thru_hole circle (at 50.1 2.7) (size 0.96 0.96) (drill 0.66) (layers *.Cu *.Mask) (tstamp f3fd3953-2a82-410f-bcc6-1f519b2070ab))
  (pad "136" thru_hole circle (at 50.95 1.1) (size 0.96 0.96) (drill 0.66) (layers *.Cu *.Mask) (tstamp 64249c55-fbe8-42b4-8b5d-e51915a8d1c7))
  (pad "137" thru_hole circle (at 51.8 2.7) (size 0.96 0.96) (drill 0.66) (layers *.Cu *.Mask) (tstamp e330f4cb-5a65-4484-a8ee-816362e5005b))
  (pad "138" thru_hole circle (at 52.65 1.1) (size 0.96 0.96) (drill 0.66) (layers *.Cu *.Mask) (tstamp 4efd4467-52fb-4c27-a93e-de15f0e6d531))
  (pad "139" thru_hole circle (at 53.5 2.7) (size 0.96 0.96) (drill 0.66) (layers *.Cu *.Mask) (tstamp 06520f45-6ba2-4be1-a5c2-589c14c4b380))
  (pad "140" thru_hole circle (at 54.35 1.1) (size 0.96 0.96) (drill 0.66) (layers *.Cu *.Mask) (tstamp 3b6ef10b-f0c1-46fc-908c-711be6af7d2e))
  (pad "141" thru_hole circle (at 55.2 2.7) (size 0.96 0.96) (drill 0.66) (layers *.Cu *.Mask) (tstamp e57f1d16-e9ab-4b15-9b16-aa06173331b2))
  (pad "142" thru_hole circle (at 56.05 1.1) (size 0.96 0.96) (drill 0.66) (layers *.Cu *.Mask) (tstamp 07e06fc8-25f5-4a8b-8b19-29eb69d0d758))
  (pad "143" thru_hole circle (at 56.9 2.7) (size 0.96 0.96) (drill 0.66) (layers *.Cu *.Mask) (tstamp fc81a01c-a84f-4a51-bbad-ee581e1ca69b))
  (pad "144" thru_hole circle (at 57.75 1.1) (size 0.96 0.96) (drill 0.66) (layers *.Cu *.Mask) (tstamp 8832c33f-3935-4177-aae6-3c96fb8bdeb1))
  (pad "145" thru_hole circle (at -68.9 -1.1) (size 0.96 0.96) (drill 0.66) (layers *.Cu *.Mask) (tstamp 65d7ea16-588a-4ed2-8805-01c4bbfae677))
  (pad "146" thru_hole circle (at -68.05 -2.7) (size 0.96 0.96) (drill 0.66) (layers *.Cu *.Mask) (tstamp 8d488680-4640-4c63-8091-84be36aa201c))
  (pad "147" thru_hole circle (at -67.2 -1.1) (size 0.96 0.96) (drill 0.66) (layers *.Cu *.Mask) (tstamp bb3c8ced-2dea-4ecc-9ba2-cfe05ad52a70))
  (pad "148" thru_hole circle (at -66.35 -2.7) (size 0.96 0.96) (drill 0.66) (layers *.Cu *.Mask) (tstamp d9a0ae13-c2b4-46cc-99c8-814db96cc7da))
  (pad "149" thru_hole circle (at -65.5 -1.1) (size 0.96 0.96) (drill 0.66) (layers *.Cu *.Mask) (tstamp a07afdc7-2130-4dc1-9366-6d9dd14b6b28))
  (pad "150" thru_hole circle (at -64.65 -2.7) (size 0.96 0.96) (drill 0.66) (layers *.Cu *.Mask) (tstamp 58c66576-97fe-4947-9c69-906aa1ef91a4))
  (pad "151" thru_hole circle (at -63.8 -1.1) (size 0.96 0.96) (drill 0.66) (layers *.Cu *.Mask) (tstamp 97779e56-288c-4f91-b969-f0e59faea3f0))
  (pad "152" thru_hole circle (at -62.95 -2.7) (size 0.96 0.96) (drill 0.66) (layers *.Cu *.Mask) (tstamp 3cab4f18-35c4-4f6c-aaba-8a1cae0939df))
  (pad "153" thru_hole circle (at -62.1 -1.1) (size 0.96 0.96) (drill 0.66) (layers *.Cu *.Mask) (tstamp ec0c1338-573b-4b2e-b32c-bf2f4f9fe655))
  (pad "154" thru_hole circle (at -61.25 -2.7) (size 0.96 0.96) (drill 0.66) (layers *.Cu *.Mask) (tstamp 33c8fc70-20b9-4c6e-a5ca-41680815a7bc))
  (pad "155" thru_hole circle (at -60.4 -1.1) (size 0.96 0.96) (drill 0.66) (layers *.Cu *.Mask) (tstamp 02dcde87-bdbf-41d8-87d7-f2d4fe4eb6cb))
  (pad "156" thru_hole circle (at -59.55 -2.7) (size 0.96 0.96) (drill 0.66) (layers *.Cu *.Mask) (tstamp 8011c1e0-c611-4b1a-b1d5-19f1925b1a75))
  (pad "157" thru_hole circle (at -58.7 -1.1) (size 0.96 0.96) (drill 0.66) (layers *.Cu *.Mask) (tstamp 42838cc5-2caa-4209-9bb5-e08381875a11))
  (pad "158" thru_hole circle (at -57.85 -2.7) (size 0.96 0.96) (drill 0.66) (layers *.Cu *.Mask) (tstamp 214a24e1-5b10-4fb1-b1ac-d4ca2d5be4af))
  (pad "159" thru_hole circle (at -57 -1.1) (size 0.96 0.96) (drill 0.66) (layers *.Cu *.Mask) (tstamp 7ac31185-a2cd-4883-ba44-8a5dee3bfced))
  (pad "160" thru_hole circle (at -56.15 -2.7) (size 0.96 0.96) (drill 0.66) (layers *.Cu *.Mask) (tstamp 633fc0dd-6c6e-45e8-86e6-ec2309424031))
  (pad "161" thru_hole circle (at -55.3 -1.1) (size 0.96 0.96) (drill 0.66) (layers *.Cu *.Mask) (tstamp 341225ad-90e8-4e8b-85b8-88a27ce03dcf))
  (pad "162" thru_hole circle (at -54.45 -2.7) (size 0.96 0.96) (drill 0.66) (layers *.Cu *.Mask) (tstamp 20e73f24-4f6d-483c-98af-b96cfb41ad40))
  (pad "163" thru_hole circle (at -53.6 -1.1) (size 0.96 0.96) (drill 0.66) (layers *.Cu *.Mask) (tstamp 25a29470-0e3e-4395-ac3f-04135f5a0260))
  (pad "164" thru_hole circle (at -52.75 -2.7) (size 0.96 0.96) (drill 0.66) (layers *.Cu *.Mask) (tstamp d52adc42-ceff-43b2-9548-2064bcbdc8c3))
  (pad "165" thru_hole circle (at -51.9 -1.1) (size 0.96 0.96) (drill 0.66) (layers *.Cu *.Mask) (tstamp ef941564-2300-4075-9503-d5640f84ec1a))
  (pad "166" thru_hole circle (at -51.05 -2.7) (size 0.96 0.96) (drill 0.66) (layers *.Cu *.Mask) (tstamp f342c6bb-180d-4e1d-831c-8cbfacb46494))
  (pad "167" thru_hole circle (at -50.2 -1.1) (size 0.96 0.96) (drill 0.66) (layers *.Cu *.Mask) (tstamp a28f8f7d-dae3-48cf-b207-b2de03716f2d))
  (pad "168" thru_hole circle (at -49.35 -2.7) (size 0.96 0.96) (drill 0.66) (layers *.Cu *.Mask) (tstamp 05e72d4f-4d10-4ffa-a9fb-a53c0217476d))
  (pad "169" thru_hole circle (at -48.5 -1.1) (size 0.96 0.96) (drill 0.66) (layers *.Cu *.Mask) (tstamp 02ac2434-7a18-4d3a-8097-f2dff9b4bb9e))
  (pad "170" thru_hole circle (at -47.65 -2.7) (size 0.96 0.96) (drill 0.66) (layers *.Cu *.Mask) (tstamp 2bf35306-6b29-450b-b6a6-2093df1baaf7))
  (pad "171" thru_hole circle (at -46.8 -1.1) (size 0.96 0.96) (drill 0.66) (layers *.Cu *.Mask) (tstamp 49d6c848-7f7b-44fe-ac07-1541c0c2a8f7))
  (pad "172" thru_hole circle (at -45.95 -2.7) (size 0.96 0.96) (drill 0.66) (layers *.Cu *.Mask) (tstamp 63ac0911-43d2-4b25-93fa-280605382b60))
  (pad "173" thru_hole circle (at -45.1 -1.1) (size 0.96 0.96) (drill 0.66) (layers *.Cu *.Mask) (tstamp 2ca9da6d-ce73-4568-9ec8-34b3547dbba4))
  (pad "174" thru_hole circle (at -44.25 -2.7) (size 0.96 0.96) (drill 0.66) (layers *.Cu *.Mask) (tstamp d12ab846-ab8a-4ac4-8fc9-b51abffd8c66))
  (pad "175" thru_hole circle (at -43.4 -1.1) (size 0.96 0.96) (drill 0.66) (layers *.Cu *.Mask) (tstamp 2247e165-3c71-402e-951a-f465a1b34a3f))
  (pad "176" thru_hole circle (at -42.55 -2.7) (size 0.96 0.96) (drill 0.66) (layers *.Cu *.Mask) (tstamp d684af3c-2949-4c50-a95f-c91b267d153e))
  (pad "177" thru_hole circle (at -41.7 -1.1) (size 0.96 0.96) (drill 0.66) (layers *.Cu *.Mask) (tstamp e0d04215-da36-436e-af1c-a60520df58b4))
  (pad "178" thru_hole circle (at -40.85 -2.7) (size 0.96 0.96) (drill 0.66) (layers *.Cu *.Mask) (tstamp 0a2a2081-1a42-4d01-ac77-dc2e3771f434))
  (pad "179" thru_hole circle (at -40 -1.1) (size 0.96 0.96) (drill 0.66) (layers *.Cu *.Mask) (tstamp b6ef42f8-5357-47e1-bead-4a310b5ad203))
  (pad "180" thru_hole circle (at -39.15 -2.7) (size 0.96 0.96) (drill 0.66) (layers *.Cu *.Mask) (tstamp 355625f8-6210-43d4-a40d-d8792c39a1bd))
  (pad "181" thru_hole circle (at -38.3 -1.1) (size 0.96 0.96) (drill 0.66) (layers *.Cu *.Mask) (tstamp 72371462-16c5-4edb-9e3f-dc888702b57f))
  (pad "182" thru_hole circle (at -37.45 -2.7) (size 0.96 0.96) (drill 0.66) (layers *.Cu *.Mask) (tstamp 8ce01bb8-0c0f-4670-a5f3-072ab2af3eb4))
  (pad "183" thru_hole circle (at -36.6 -1.1) (size 0.96 0.96) (drill 0.66) (layers *.Cu *.Mask) (tstamp 71267816-1d75-4156-acc5-49c29ffa8569))
  (pad "184" thru_hole circle (at -35.75 -2.7) (size 0.96 0.96) (drill 0.66) (layers *.Cu *.Mask) (tstamp 33a05f6c-7127-49f9-978f-864827fa5f77))
  (pad "185" thru_hole circle (at -34.9 -1.1) (size 0.96 0.96) (drill 0.66) (layers *.Cu *.Mask) (tstamp bf19a102-6c9d-415e-bcf0-fe0fd396e7a3))
  (pad "186" thru_hole circle (at -34.05 -2.7) (size 0.96 0.96) (drill 0.66) (layers *.Cu *.Mask) (tstamp 08da1fd2-aa0e-4859-8fe4-11555680587f))
  (pad "187" thru_hole circle (at -33.2 -1.1) (size 0.96 0.96) (drill 0.66) (layers *.Cu *.Mask) (tstamp 358b242b-506e-48dc-94f8-72a6dcdbb64b))
  (pad "188" thru_hole circle (at -32.35 -2.7) (size 0.96 0.96) (drill 0.66) (layers *.Cu *.Mask) (tstamp 4b16f15c-2fc4-4e3e-960a-23a6df3648cc))
  (pad "189" thru_hole circle (at -31.5 -1.1) (size 0.96 0.96) (drill 0.66) (layers *.Cu *.Mask) (tstamp 7da791d1-ace4-4650-8815-628d1e286359))
  (pad "190" thru_hole circle (at -30.65 -2.7) (size 0.96 0.96) (drill 0.66) (layers *.Cu *.Mask) (tstamp e618b91e-5d17-4bd8-b91e-99e431d860ff))
  (pad "191" thru_hole circle (at -29.8 -1.1) (size 0.96 0.96) (drill 0.66) (layers *.Cu *.Mask) (tstamp 639859e8-cda3-4a98-b3e7-a5114cb2508c))
  (pad "192" thru_hole circle (at -28.95 -2.7) (size 0.96 0.96) (drill 0.66) (layers *.Cu *.Mask) (tstamp b572a7b6-b280-4477-b1b1-d42d576196a1))
  (pad "193" thru_hole circle (at -28.1 -1.1) (size 0.96 0.96) (drill 0.66) (layers *.Cu *.Mask) (tstamp 9377dc6d-b5c8-4a46-a3bf-fe317fe21d40))
  (pad "194" thru_hole circle (at -27.25 -2.7) (size 0.96 0.96) (drill 0.66) (layers *.Cu *.Mask) (tstamp a2130f40-22cd-4627-b6e5-f00757bebe38))
  (pad "195" thru_hole circle (at -26.4 -1.1) (size 0.96 0.96) (drill 0.66) (layers *.Cu *.Mask) (tstamp 0747502b-aad8-49f9-8379-f210879d7ca2))
  (pad "196" thru_hole circle (at -25.55 -2.7) (size 0.96 0.96) (drill 0.66) (layers *.Cu *.Mask) (tstamp e94cf84a-edbd-45fb-a6dd-0c0c6305cb36))
  (pad "197" thru_hole circle (at -24.7 -1.1) (size 0.96 0.96) (drill 0.66) (layers *.Cu *.Mask) (tstamp c55cb4ed-9667-40c0-b190-6d905e8b6d41))
  (pad "198" thru_hole circle (at -23.85 -2.7) (size 0.96 0.96) (drill 0.66) (layers *.Cu *.Mask) (tstamp 17186de2-6f17-4361-8f68-f3c4fd1b9ef5))
  (pad "199" thru_hole circle (at -23 -1.1) (size 0.96 0.96) (drill 0.66) (layers *.Cu *.Mask) (tstamp 21e6ca6d-1889-4629-9982-f6bbf71d1f23))
  (pad "200" thru_hole circle (at -22.15 -2.7) (size 0.96 0.96) (drill 0.66) (layers *.Cu *.Mask) (tstamp 5e6abc5f-acb6-4771-bd3a-2ab1f55408a3))
  (pad "201" thru_hole circle (at -21.3 -1.1) (size 0.96 0.96) (drill 0.66) (layers *.Cu *.Mask) (tstamp 050f4982-2c46-428a-8789-b721430e0e88))
  (pad "202" thru_hole circle (at -20.45 -2.7) (size 0.96 0.96) (drill 0.66) (layers *.Cu *.Mask) (tstamp 9be9a0c3-58cb-4eb0-92a2-4377db0a8f35))
  (pad "203" thru_hole circle (at -19.6 -1.1) (size 0.96 0.96) (drill 0.66) (layers *.Cu *.Mask) (tstamp 2a87a027-d021-4352-b2f7-9c5de77c6b90))
  (pad "204" thru_hole circle (at -18.75 -2.7) (size 0.96 0.96) (drill 0.66) (layers *.Cu *.Mask) (tstamp 9937355f-5691-4fca-bdbf-ddbe8b6f5712))
  (pad "205" thru_hole circle (at -17.9 -1.1) (size 0.96 0.96) (drill 0.66) (layers *.Cu *.Mask) (tstamp 2758b384-a301-480e-bd42-0d579fdefd2b))
  (pad "206" thru_hole circle (at -17.05 -2.7) (size 0.96 0.96) (drill 0.66) (layers *.Cu *.Mask) (tstamp de8ce496-1c81-479b-a13b-a32aaa8dcec7))
  (pad "207" thru_hole circle (at -16.2 -1.1) (size 0.96 0.96) (drill 0.66) (layers *.Cu *.Mask) (tstamp 536b93a0-925c-494f-aa89-c678b8a99293))
  (pad "208" thru_hole circle (at -15.35 -2.7) (size 0.96 0.96) (drill 0.66) (layers *.Cu *.Mask) (tstamp 356d5923-28a4-47a6-9c39-9f372f68153c))
  (pad "209" thru_hole circle (at -14.5 -1.1) (size 0.96 0.96) (drill 0.66) (layers *.Cu *.Mask) (tstamp d269c10b-f7a9-4c94-9f63-8f00d1db47be))
  (pad "210" thru_hole circle (at -13.65 -2.7) (size 0.96 0.96) (drill 0.66) (layers *.Cu *.Mask) (tstamp 0e3b8318-d020-4c92-9741-f5fc70ba71bf))
  (pad "211" thru_hole circle (at -12.8 -1.1) (size 0.96 0.96) (drill 0.66) (layers *.Cu *.Mask) (tstamp 25fa1a29-372b-4719-ba3b-c16b7bb1f4ce))
  (pad "212" thru_hole circle (at -11.95 -2.7) (size 0.96 0.96) (drill 0.66) (layers *.Cu *.Mask) (tstamp 990a5557-6be8-4768-9ea3-1a65dd74d9d9))
  (pad "213" thru_hole circle (at -11.1 -1.1) (size 0.96 0.96) (drill 0.66) (layers *.Cu *.Mask) (tstamp 376fa8b3-af65-4784-93a3-2d416dab896f))
  (pad "214" thru_hole circle (at -10.25 -2.7) (size 0.96 0.96) (drill 0.66) (layers *.Cu *.Mask) (tstamp 86608136-fbb6-46a8-a952-c946b1ddc702))
  (pad "215" thru_hole circle (at -9.4 -1.1) (size 0.96 0.96) (drill 0.66) (layers *.Cu *.Mask) (tstamp 05e3c560-91d2-4096-984c-4f7bd8001428))
  (pad "216" thru_hole circle (at -8.55 -2.7) (size 0.96 0.96) (drill 0.66) (layers *.Cu *.Mask) (tstamp 5818f023-8ac4-4a99-b306-bc4206b917cb))
  (pad "217" thru_hole circle (at -7.7 -1.1) (size 0.96 0.96) (drill 0.66) (layers *.Cu *.Mask) (tstamp 85584624-ba98-4d08-a330-f0a0dc738829))
  (pad "218" thru_hole circle (at -6.85 -2.7) (size 0.96 0.96) (drill 0.66) (layers *.Cu *.Mask) (tstamp 7dc2c7db-bc5b-4270-aadf-39d04fb727eb))
  (pad "219" thru_hole circle (at -6 -1.1) (size 0.96 0.96) (drill 0.66) (layers *.Cu *.Mask) (tstamp 8b8dae6f-545c-4c8a-983d-22e9351d50b5))
  (pad "220" thru_hole circle (at -5.15 -2.7) (size 0.96 0.96) (drill 0.66) (layers *.Cu *.Mask) (tstamp 0de3c346-9879-4352-93b3-10259e47dd2b))
  (pad "221" thru_hole circle (at -4.3 -1.1) (size 0.96 0.96) (drill 0.66) (layers *.Cu *.Mask) (tstamp 7e20d34c-4d6e-458f-8e2e-3a9a84101db6))
  (pad "222" thru_hole circle (at 1.65 -2.7) (size 0.96 0.96) (drill 0.66) (layers *.Cu *.Mask) (tstamp 4690e5bd-ec82-487b-8aa8-5a5125bb8f0f))
  (pad "223" thru_hole circle (at 2.5 -1.1) (size 0.96 0.96) (drill 0.66) (layers *.Cu *.Mask) (tstamp 30ec784d-ad1c-4b5e-b65b-1ee54e0aab76))
  (pad "224" thru_hole circle (at 3.35 -2.7) (size 0.96 0.96) (drill 0.66) (layers *.Cu *.Mask) (tstamp ae9f9e07-2cd0-4ae0-968b-580603e9b797))
  (pad "225" thru_hole circle (at 4.2 -1.1) (size 0.96 0.96) (drill 0.66) (layers *.Cu *.Mask) (tstamp bd1942a3-9fd9-47eb-935e-d86382dddf21))
  (pad "226" thru_hole circle (at 5.05 -2.7) (size 0.96 0.96) (drill 0.66) (layers *.Cu *.Mask) (tstamp 60cb0c2f-f10a-4403-be08-d507d16990db))
  (pad "227" thru_hole circle (at 5.9 -1.1) (size 0.96 0.96) (drill 0.66) (layers *.Cu *.Mask) (tstamp 6491d469-ec82-4ae3-a0c9-b68d8621a831))
  (pad "228" thru_hole circle (at 6.75 -2.7) (size 0.96 0.96) (drill 0.66) (layers *.Cu *.Mask) (tstamp 9bc364cc-de69-430b-8243-7889ce796ff2))
  (pad "229" thru_hole circle (at 7.6 -1.1) (size 0.96 0.96) (drill 0.66) (layers *.Cu *.Mask) (tstamp 6a860690-c058-491f-a5d3-6a741ca7943b))
  (pad "230" thru_hole circle (at 8.45 -2.7) (size 0.96 0.96) (drill 0.66) (layers *.Cu *.Mask) (tstamp 5fe42d52-aeb5-44f9-b301-463170ae7299))
  (pad "231" thru_hole circle (at 9.3 -1.1) (size 0.96 0.96) (drill 0.66) (layers *.Cu *.Mask) (tstamp e57a1bf0-69ad-46da-bf21-28337e696dfb))
  (pad "232" thru_hole circle (at 10.15 -2.7) (size 0.96 0.96) (drill 0.66) (layers *.Cu *.Mask) (tstamp 5308315a-c9a4-4292-9289-92d42055d91e))
  (pad "233" thru_hole circle (at 11 -1.1) (size 0.96 0.96) (drill 0.66) (layers *.Cu *.Mask) (tstamp 9cee1828-44d4-4504-926a-65437e664381))
  (pad "234" thru_hole circle (at 11.85 -2.7) (size 0.96 0.96) (drill 0.66) (layers *.Cu *.Mask) (tstamp 603e7a51-43a5-4b98-afb8-81d8eb7a3d38))
  (pad "235" thru_hole circle (at 12.7 -1.1) (size 0.96 0.96) (drill 0.66) (layers *.Cu *.Mask) (tstamp e7cf6ae0-a8a7-4217-86cc-2b1d2403f07b))
  (pad "236" thru_hole circle (at 13.55 -2.7) (size 0.96 0.96) (drill 0.66) (layers *.Cu *.Mask) (tstamp e7a556d9-c509-4fbb-b364-12bfcdb6aeba))
  (pad "237" thru_hole circle (at 14.4 -1.1) (size 0.96 0.96) (drill 0.66) (layers *.Cu *.Mask) (tstamp 81fb958d-7b36-48ae-9c73-6b2a63559fc4))
  (pad "238" thru_hole circle (at 15.25 -2.7) (size 0.96 0.96) (drill 0.66) (layers *.Cu *.Mask) (tstamp cc081c69-26b5-494b-89ab-9e9306cfa3a8))
  (pad "239" thru_hole circle (at 16.1 -1.1) (size 0.96 0.96) (drill 0.66) (layers *.Cu *.Mask) (tstamp 82b47e2f-bfef-498d-8dd9-d4283b08630d))
  (pad "240" thru_hole circle (at 16.95 -2.7) (size 0.96 0.96) (drill 0.66) (layers *.Cu *.Mask) (tstamp d660af26-232e-4afb-a8e3-078e7deeab2c))
  (pad "241" thru_hole circle (at 17.8 -1.1) (size 0.96 0.96) (drill 0.66) (layers *.Cu *.Mask) (tstamp 6447fcd8-af8d-41c0-bd3b-1fdf1e76c45c))
  (pad "242" thru_hole circle (at 18.65 -2.7) (size 0.96 0.96) (drill 0.66) (layers *.Cu *.Mask) (tstamp e1916c94-c2db-478e-94cf-7e60f7d4d0da))
  (pad "243" thru_hole circle (at 19.5 -1.1) (size 0.96 0.96) (drill 0.66) (layers *.Cu *.Mask) (tstamp 3cd2d088-c60f-4735-b9f8-f36e8ab6757e))
  (pad "244" thru_hole circle (at 20.35 -2.7) (size 0.96 0.96) (drill 0.66) (layers *.Cu *.Mask) (tstamp a6000f3a-9036-4ef3-82b0-86efe5d6c220))
  (pad "245" thru_hole circle (at 21.2 -1.1) (size 0.96 0.96) (drill 0.66) (layers *.Cu *.Mask) (tstamp 7021faa2-de9d-4189-946c-471fb972fbee))
  (pad "246" thru_hole circle (at 22.05 -2.7) (size 0.96 0.96) (drill 0.66) (layers *.Cu *.Mask) (tstamp fc413cb2-aa4d-4133-8876-c35bc80d722b))
  (pad "247" thru_hole circle (at 22.9 -1.1) (size 0.96 0.96) (drill 0.66) (layers *.Cu *.Mask) (tstamp edd3d555-3637-4502-9c10-00f31c07a66d))
  (pad "248" thru_hole circle (at 23.75 -2.7) (size 0.96 0.96) (drill 0.66) (layers *.Cu *.Mask) (tstamp 90050809-65e4-4bbd-90a2-5e05645af86d))
  (pad "249" thru_hole circle (at 24.6 -1.1) (size 0.96 0.96) (drill 0.66) (layers *.Cu *.Mask) (tstamp 8bc62420-39af-4f97-a3e7-285997e96176))
  (pad "250" thru_hole circle (at 25.45 -2.7) (size 0.96 0.96) (drill 0.66) (layers *.Cu *.Mask) (tstamp 85da1664-1bc6-4bef-a205-f14c3f048178))
  (pad "251" thru_hole circle (at 26.3 -1.1) (size 0.96 0.96) (drill 0.66) (layers *.Cu *.Mask) (tstamp 3f0d3be8-e800-4db1-95c1-b1b8b7251e1b))
  (pad "252" thru_hole circle (at 27.15 -2.7) (size 0.96 0.96) (drill 0.66) (layers *.Cu *.Mask) (tstamp f45c6b90-ea33-448c-9c01-17394e33eb69))
  (pad "253" thru_hole circle (at 28 -1.1) (size 0.96 0.96) (drill 0.66) (layers *.Cu *.Mask) (tstamp 7496cdeb-e2de-4a3e-8c20-e3a26db9dc78))
  (pad "254" thru_hole circle (at 28.85 -2.7) (size 0.96 0.96) (drill 0.66) (layers *.Cu *.Mask) (tstamp 6645dbd0-74d2-4bf9-8234-570a01d390bd))
  (pad "255" thru_hole circle (at 29.7 -1.1) (size 0.96 0.96) (drill 0.66) (layers *.Cu *.Mask) (tstamp 538ecc9f-d2c1-4f20-8368-fa91ea462c61))
  (pad "256" thru_hole circle (at 30.55 -2.7) (size 0.96 0.96) (drill 0.66) (layers *.Cu *.Mask) (tstamp a71c39e6-4d1f-4b80-88ed-b9861ee413e4))
  (pad "257" thru_hole circle (at 31.4 -1.1) (size 0.96 0.96) (drill 0.66) (layers *.Cu *.Mask) (tstamp 1736e3b7-584b-4df0-92b0-07af04106e17))
  (pad "258" thru_hole circle (at 32.25 -2.7) (size 0.96 0.96) (drill 0.66) (layers *.Cu *.Mask) (tstamp f6d0573c-e42d-4cb0-9415-d91d0ca326df))
  (pad "259" thru_hole circle (at 33.1 -1.1) (size 0.96 0.96) (drill 0.66) (layers *.Cu *.Mask) (tstamp 7ecdbc00-7d24-41f0-8137-4c6dae8882ac))
  (pad "260" thru_hole circle (at 33.95 -2.7) (size 0.96 0.96) (drill 0.66) (layers *.Cu *.Mask) (tstamp cb95e4ec-8b91-497b-8e2b-5bd4f70ad188))
  (pad "261" thru_hole circle (at 34.8 -1.1) (size 0.96 0.96) (drill 0.66) (layers *.Cu *.Mask) (tstamp c8183da8-b2df-4ff6-9510-210e0138bc1d))
  (pad "262" thru_hole circle (at 35.65 -2.7) (size 0.96 0.96) (drill 0.66) (layers *.Cu *.Mask) (tstamp 4739fe47-f09d-45ef-ab47-2a8fb42fb171))
  (pad "263" thru_hole circle (at 36.5 -1.1) (size 0.96 0.96) (drill 0.66) (layers *.Cu *.Mask) (tstamp 2c46fea5-0145-4ad7-9f86-04c20396c116))
  (pad "264" thru_hole circle (at 37.35 -2.7) (size 0.96 0.96) (drill 0.66) (layers *.Cu *.Mask) (tstamp 34b67bfa-3eff-43fc-95b6-df1a572119a7))
  (pad "265" thru_hole circle (at 38.2 -1.1) (size 0.96 0.96) (drill 0.66) (layers *.Cu *.Mask) (tstamp 72dcf4e8-f506-4635-94b2-70828277fccb))
  (pad "266" thru_hole circle (at 39.05 -2.7) (size 0.96 0.96) (drill 0.66) (layers *.Cu *.Mask) (tstamp 26b25779-50e2-4442-8da3-a79e707edae8))
  (pad "267" thru_hole circle (at 39.9 -1.1) (size 0.96 0.96) (drill 0.66) (layers *.Cu *.Mask) (tstamp 04a74b25-18cc-46d9-85fb-5908a34f65d5))
  (pad "268" thru_hole circle (at 40.75 -2.7) (size 0.96 0.96) (drill 0.66) (layers *.Cu *.Mask) (tstamp e333f370-c025-4a84-b65c-d55373b12530))
  (pad "269" thru_hole circle (at 41.6 -1.1) (size 0.96 0.96) (drill 0.66) (layers *.Cu *.Mask) (tstamp 45fa166e-221b-4bb8-8c5b-3b1df03d46dd))
  (pad "270" thru_hole circle (at 42.45 -2.7) (size 0.96 0.96) (drill 0.66) (layers *.Cu *.Mask) (tstamp b03ac0a1-0edd-4292-b98a-5cdc45409213))
  (pad "271" thru_hole circle (at 43.3 -1.1) (size 0.96 0.96) (drill 0.66) (layers *.Cu *.Mask) (tstamp e520dcec-22c4-43b2-862c-f2b86429b168))
  (pad "272" thru_hole circle (at 44.15 -2.7) (size 0.96 0.96) (drill 0.66) (layers *.Cu *.Mask) (tstamp 2a8f3a4a-6092-49de-9cfe-1c5585aff106))
  (pad "273" thru_hole circle (at 45 -1.1) (size 0.96 0.96) (drill 0.66) (layers *.Cu *.Mask) (tstamp 8c30387a-1b83-4979-b96e-ac82e82816bd))
  (pad "274" thru_hole circle (at 45.85 -2.7) (size 0.96 0.96) (drill 0.66) (layers *.Cu *.Mask) (tstamp 0e7d4faa-dc5c-4f8e-b858-8be55cb5ea00))
  (pad "275" thru_hole circle (at 46.7 -1.1) (size 0.96 0.96) (drill 0.66) (layers *.Cu *.Mask) (tstamp 6949d9f0-7557-4d1b-bca0-53259adb027f))
  (pad "276" thru_hole circle (at 47.55 -2.7) (size 0.96 0.96) (drill 0.66) (layers *.Cu *.Mask) (tstamp c70b1577-689c-4e08-b80b-22953cb3f1ce))
  (pad "277" thru_hole circle (at 48.4 -1.1) (size 0.96 0.96) (drill 0.66) (layers *.Cu *.Mask) (tstamp bfce7af5-24af-4cb0-9ba8-42f8c2c3dd1f))
  (pad "278" thru_hole circle (at 49.25 -2.7) (size 0.96 0.96) (drill 0.66) (layers *.Cu *.Mask) (tstamp 993c92eb-76ad-40f0-83a6-47ad6345fa1f))
  (pad "279" thru_hole circle (at 50.1 -1.1) (size 0.96 0.96) (drill 0.66) (layers *.Cu *.Mask) (tstamp be8fb6ad-4023-4ce0-a934-324eba63a7dd))
  (pad "280" thru_hole circle (at 50.95 -2.7) (size 0.96 0.96) (drill 0.66) (layers *.Cu *.Mask) (tstamp 9e498138-1bd5-45e9-8366-0780363c90b2))
  (pad "281" thru_hole circle (at 51.8 -1.1) (size 0.96 0.96) (drill 0.66) (layers *.Cu *.Mask) (tstamp e638a393-2baa-452f-a014-aebbf30c7bca))
  (pad "282" thru_hole circle (at 52.65 -2.7) (size 0.96 0.96) (drill 0.66) (layers *.Cu *.Mask) (tstamp 07834c6c-456c-4208-97d2-7a089b9733e1))
  (pad "283" thru_hole circle (at 53.5 -1.1) (size 0.96 0.96) (drill 0.66) (layers *.Cu *.Mask) (tstamp 1bda3541-3c12-43bc-b733-3827d012a989))
  (pad "284" thru_hole circle (at 54.35 -2.7) (size 0.96 0.96) (drill 0.66) (layers *.Cu *.Mask) (tstamp 7d92d864-c3e0-4803-807c-76689485cfcf))
  (pad "285" thru_hole circle (at 55.2 -1.1) (size 0.96 0.96) (drill 0.66) (layers *.Cu *.Mask) (tstamp 4db1a89c-a453-4492-b76b-9bc18563dc22))
  (pad "286" thru_hole circle (at 56.05 -2.7) (size 0.96 0.96) (drill 0.66) (layers *.Cu *.Mask) (tstamp 97b9d4ff-7d1f-4b30-882f-42bc8075518b))
  (pad "287" thru_hole circle (at 56.9 -1.1) (size 0.96 0.96) (drill 0.66) (layers *.Cu *.Mask) (tstamp 2edf60ed-5354-443b-b80e-0ea5795b4395))
  (pad "288" thru_hole circle (at 57.75 -2.7) (size 0.96 0.96) (drill 0.66) (layers *.Cu *.Mask) (tstamp 94d5576d-7735-415d-8ba5-489c4005983d))
  (model "${KICADLIB}/model/connector/TE_2308107-4.stp"
    (offset (xyz -5.55 -0 20))
    (scale (xyz 1 1 1))
    (rotate (xyz 0 0 0))
  )
)
