(footprint "Molex_0484050003" (version 20210722) (generator pcbnew) (layer "F.Cu")
  (tedit 6116BAD3)
  (attr through_hole)
  (fp_text reference "REF**" (at 0 -5.5 unlocked) (layer "F.SilkS")
    (effects (font (size 1 1) (thickness 0.15)))
    (tstamp 5ce6b5ef-22e9-49cb-a26b-b0627aadf1c9)
  )
  (fp_text value "Molex_0484050003" (at 0 1 unlocked) (layer "F.Fab") hide
    (effects (font (size 1 1) (thickness 0.15)))
    (tstamp 673dc756-c86f-46da-bacf-2ea05084418a)
  )
  (fp_text user "^" (at -3.5 -0.675 unlocked) (layer "B.SilkS")
    (effects (font (size 1 1) (thickness 0.15)))
    (tstamp 7562a748-dc57-4ebc-a314-8987f38faef8)
  )
  (fp_text user "^" (at -7.9 -2 270 unlocked) (layer "F.SilkS")
    (effects (font (size 1 1) (thickness 0.15)))
    (tstamp 88e4165c-37ab-4860-bcd3-3d3c877d3a91)
  )
  (fp_text user "${REFERENCE}" (at 0 0 unlocked) (layer "F.Fab")
    (effects (font (size 1 1) (thickness 0.15)))
    (tstamp 5ac70eb4-1d9a-472b-aa11-2bee5b22fc5f)
  )
  (fp_line (start 6.9 -4.725) (end 6.9 -1.425) (layer "F.SilkS") (width 0.1) (tstamp 73544ee1-c070-4468-a1ec-ab9a6e5c36de))
  (fp_line (start -6.5 1.425) (end -6.5 11.775) (layer "F.SilkS") (width 0.1) (tstamp 8b80095d-5ef6-479f-a3c8-761f2e261285))
  (fp_line (start -6.9 -4.725) (end 6.9 -4.725) (layer "F.SilkS") (width 0.1) (tstamp 9176757a-2348-452d-8977-6abf5c417cb2))
  (fp_line (start -6.9 -4.725) (end -6.9 -1.425) (layer "F.SilkS") (width 0.1) (tstamp af511947-739e-4380-997e-f6e79348423b))
  (fp_line (start -6.5 11.775) (end 6.5 11.775) (layer "F.SilkS") (width 0.1) (tstamp eff1bf55-a8b0-4930-8e1d-6739b3f2931a))
  (fp_line (start 6.5 11.775) (end 6.5 1.425) (layer "F.SilkS") (width 0.1) (tstamp f8e5efb6-88df-44d1-9145-d3e81656ad57))
  (fp_line (start -6.575 11.775) (end 6.575 11.775) (layer "Dwgs.User") (width 0.12) (tstamp 9779daad-2209-4bb6-87f6-355ca7033b88))
  (fp_rect (start -8.1 -5.1) (end 8.1 12) (layer "F.CrtYd") (width 0.05) (fill none) (tstamp ad02823e-635d-473a-a976-b68b32d035b4))
  (fp_line (start 6.5 11.775) (end 6.5 -4.725) (layer "F.Fab") (width 0.1) (tstamp 24be41fd-6342-4e24-8c1f-6559a231ad2e))
  (fp_line (start -5.75 -4.725) (end -6.5 -3.975) (layer "F.Fab") (width 0.1) (tstamp 38f41b2e-0353-43c5-8f27-c2c31e66fb10))
  (fp_line (start 6.5 -4.725) (end -5.75 -4.725) (layer "F.Fab") (width 0.1) (tstamp 83c2c9e1-69ac-4afb-91bb-e9103c124cba))
  (fp_line (start -6.5 -3.975) (end -6.5 11.775) (layer "F.Fab") (width 0.1) (tstamp 998c7e68-e13c-4c85-bad2-b207afeb4cb2))
  (fp_line (start -6.5 11.775) (end 6.5 11.775) (layer "F.Fab") (width 0.1) (tstamp b0aa9c49-16a2-47a4-af6c-97e2d9fd716d))
  (pad "1" thru_hole circle (at -3.5 -2) (size 1.1 1.1) (drill 0.7) (layers *.Cu *.Mask) (tstamp 4c341e5b-beeb-48e2-a0e5-6a3a175122f8))
  (pad "2" thru_hole circle (at -1 -2) (size 1.1 1.1) (drill 0.7) (layers *.Cu *.Mask) (tstamp e1eee23a-0a2a-4acf-8db0-61d50c37b435))
  (pad "3" thru_hole circle (at 1 -2) (size 1.1 1.1) (drill 0.7) (layers *.Cu *.Mask) (tstamp 8b213bcc-578e-4f8d-b7b1-95a1401a52c2))
  (pad "4" thru_hole circle (at 3.5 -2) (size 1.1 1.1) (drill 0.7) (layers *.Cu *.Mask) (tstamp abbf46dd-0d12-4b1e-89e9-682f44ed0a5d))
  (pad "5" thru_hole circle (at 4 -3.5) (size 1.1 1.1) (drill 0.7) (layers *.Cu *.Mask) (tstamp 278220b7-64cc-429f-a2a4-d72c0623ff72))
  (pad "6" thru_hole circle (at 2 -3.5) (size 1.1 1.1) (drill 0.7) (layers *.Cu *.Mask) (tstamp a63172dd-7b46-491d-b17b-dc5a22e11489))
  (pad "7" thru_hole circle (at 0 -3.5) (size 1.1 1.1) (drill 0.7) (layers *.Cu *.Mask) (tstamp bfe230ce-5e0a-440b-a150-e7a4338f900b))
  (pad "8" thru_hole circle (at -2 -3.5) (size 1.1 1.1) (drill 0.7) (layers *.Cu *.Mask) (tstamp 2e4fe2ed-8fd4-444f-8993-24e62f1f13c1))
  (pad "9" thru_hole circle (at -4 -3.5) (size 1.1 1.1) (drill 0.7) (layers *.Cu *.Mask) (tstamp e4b6dcd4-6090-4042-bdac-0afd6d876f7e))
  (pad "10" thru_hole circle (at -6.575 0) (size 2.7 2.7) (drill 2.3) (layers *.Cu *.Mask) (tstamp 39ffe695-4383-4df1-b036-21213ca96310))
  (pad "10" thru_hole circle (at 6.575 0) (size 2.7 2.7) (drill 2.3) (layers *.Cu *.Mask) (tstamp 7103bac1-6bec-4fbd-b7a5-fd2904c3eb76))
  (model "${KICADLIB}/model/connector/Molex_484050003.stp"
    (offset (xyz 0 4.4 4.1))
    (scale (xyz 1 1 1))
    (rotate (xyz 0 0 180))
  )
)
