(footprint "QFN65P400X400-17_2.5CPAD" (version 20221018) (generator pcbnew)
  (layer "F.Cu")
  (descr "QFN, 16 Pin 2.5mm square central pad")
  (tags "QFN NoLead")
  (attr smd)
  (fp_text reference "REF**" (at 0 -3) (layer "F.SilkS")
      (effects (font (size 1 1) (thickness 0.15)))
    (tstamp a787aba6-6598-40b3-82da-710cfcf8bf2a)
  )
  (fp_text value "QFN65P400X400-17_1" (at 0 3.32) (layer "F.Fab") hide
      (effects (font (size 1 1) (thickness 0.15)))
    (tstamp 08ebeaec-9851-4345-acdc-7739f00a07c4)
  )
  (fp_text user "^" (at -3.1 -1 270 unlocked) (layer "F.SilkS")
      (effects (font (size 1 1) (thickness 0.15)))
    (tstamp 4fc9de57-db53-4765-a283-4ab5d54b31ca)
  )
  (fp_text user "${REFERENCE}" (at 0 0) (layer "F.Fab")
      (effects (font (size 0.8 0.8) (thickness 0.15)))
    (tstamp 89862985-b440-4283-a83e-489f0457f71a)
  )
  (fp_line (start -2 -2) (end -1.275 -2)
    (stroke (width 0.1) (type solid)) (layer "F.SilkS") (tstamp 75b3e860-eda3-41e8-8dba-396cd6130ad6))
  (fp_line (start -2 -1.275) (end -2 -2)
    (stroke (width 0.1) (type solid)) (layer "F.SilkS") (tstamp c97ac9e6-267e-495c-9e16-6838757c4006))
  (fp_line (start -2 2) (end -2 1.275)
    (stroke (width 0.1) (type solid)) (layer "F.SilkS") (tstamp c7daa16d-2cdc-48f9-84e1-6fd3b9ab8609))
  (fp_line (start -1.275 2) (end -2 2)
    (stroke (width 0.1) (type solid)) (layer "F.SilkS") (tstamp fcf53a3f-59b9-4ab4-bae0-543d7757d600))
  (fp_line (start 1.275 -2) (end 2 -2)
    (stroke (width 0.1) (type solid)) (layer "F.SilkS") (tstamp 4c4b3808-0b02-46c5-9db3-a1e1b017c66f))
  (fp_line (start 2 -2) (end 2 -1.275)
    (stroke (width 0.1) (type solid)) (layer "F.SilkS") (tstamp e349259d-1408-4a21-aa96-18305413de49))
  (fp_line (start 2 1.275) (end 2 2)
    (stroke (width 0.1) (type solid)) (layer "F.SilkS") (tstamp 0e37a1ae-bf06-4c70-ae4c-e7cee553b0b3))
  (fp_line (start 2 2) (end 1.275 2)
    (stroke (width 0.1) (type solid)) (layer "F.SilkS") (tstamp 04f09747-54bd-4ccb-936d-3baa80652154))
  (fp_rect (start -2.5 -2.5) (end 2.5 2.5)
    (stroke (width 0.05) (type solid)) (fill none) (layer "F.CrtYd") (tstamp 844915b2-b6e7-4758-945e-f5b5342afdba))
  (fp_poly
    (pts
      (xy -2 2)
      (xy 2 2)
      (xy 2 -2)
      (xy -1 -2)
      (xy -2 -1)
    )

    (stroke (width 0.1) (type solid)) (fill none) (layer "F.Fab") (tstamp 95b721b1-8448-44f8-87b0-c22c5689dbf0))
  (pad "" smd roundrect (at -0.675 -0.675) (size 1 1) (layers "F.Paste") (roundrect_rratio 0.04587155963) (tstamp d3cb9a36-d5dd-4cf4-858a-531ddce6b267))
  (pad "" smd roundrect (at -0.675 0.675) (size 1 1) (layers "F.Paste") (roundrect_rratio 0.04587155963) (tstamp 442943fd-01f6-4af7-980f-b08cd460a8c6))
  (pad "" smd roundrect (at 0.675 -0.675) (size 1 1) (layers "F.Paste") (roundrect_rratio 0.04587155963) (tstamp 13880912-e3e4-4c78-9c54-316894d87413))
  (pad "" smd roundrect (at 0.675 0.675) (size 1 1) (layers "F.Paste") (roundrect_rratio 0.04587155963) (tstamp 24b53978-9cb7-4b7f-9ebb-c3a91755b17f))
  (pad "1" smd roundrect (at -1.9625 -0.975) (size 0.825 0.3) (layers "F.Cu" "F.Paste" "F.Mask") (roundrect_rratio 0.1666666667) (tstamp 3f03ca51-b021-49af-9bf9-7d00a255a3df))
  (pad "2" smd roundrect (at -1.9625 -0.325) (size 0.825 0.3) (layers "F.Cu" "F.Paste" "F.Mask") (roundrect_rratio 0.1666666667) (tstamp 7b9b2c73-20af-4506-ac16-67fcceb9d3bc))
  (pad "3" smd roundrect (at -1.9625 0.325) (size 0.825 0.3) (layers "F.Cu" "F.Paste" "F.Mask") (roundrect_rratio 0.1666666667) (tstamp 1849ed68-a46f-419d-8c22-8fac75d0b7a2))
  (pad "4" smd roundrect (at -1.9625 0.975) (size 0.825 0.3) (layers "F.Cu" "F.Paste" "F.Mask") (roundrect_rratio 0.1666666667) (tstamp 717e7d85-0d2a-4693-8f22-f51b62819a6b))
  (pad "5" smd roundrect (at -0.975 1.9625) (size 0.3 0.825) (layers "F.Cu" "F.Paste" "F.Mask") (roundrect_rratio 0.1666666667) (tstamp 81154919-c865-4f40-a85c-bfbc88f7cc9f))
  (pad "6" smd roundrect (at -0.325 1.9625) (size 0.3 0.825) (layers "F.Cu" "F.Paste" "F.Mask") (roundrect_rratio 0.1666666667) (tstamp 0c3952fb-4675-47b5-b1c6-e9def5e76310))
  (pad "7" smd roundrect (at 0.325 1.9625) (size 0.3 0.825) (layers "F.Cu" "F.Paste" "F.Mask") (roundrect_rratio 0.1666666667) (tstamp 7635740f-8540-4dd8-a9a2-ecfd49385e72))
  (pad "8" smd roundrect (at 0.975 1.9625) (size 0.3 0.825) (layers "F.Cu" "F.Paste" "F.Mask") (roundrect_rratio 0.1666666667) (tstamp e7f8b495-855b-49e3-b7a6-ec625f4eac8c))
  (pad "9" smd roundrect (at 1.9625 0.975) (size 0.825 0.3) (layers "F.Cu" "F.Paste" "F.Mask") (roundrect_rratio 0.1666666667) (tstamp 314d738d-9204-42a9-aadd-6f637dc5258f))
  (pad "10" smd roundrect (at 1.9625 0.325) (size 0.825 0.3) (layers "F.Cu" "F.Paste" "F.Mask") (roundrect_rratio 0.1666666667) (tstamp aa42c1c0-2cb6-4fc2-b8ac-92e71a6e2bcf))
  (pad "11" smd roundrect (at 1.9625 -0.325) (size 0.825 0.3) (layers "F.Cu" "F.Paste" "F.Mask") (roundrect_rratio 0.1666666667) (tstamp 9c3e07f0-7836-4a1c-ac4c-9df88c4a26b4))
  (pad "12" smd roundrect (at 1.9625 -0.975) (size 0.825 0.3) (layers "F.Cu" "F.Paste" "F.Mask") (roundrect_rratio 0.1666666667) (tstamp f47ec2ec-a412-48b1-bd06-0154a1229a5e))
  (pad "13" smd roundrect (at 0.975 -1.9625) (size 0.3 0.825) (layers "F.Cu" "F.Paste" "F.Mask") (roundrect_rratio 0.1666666667) (tstamp 0e6cbce9-22b0-49b8-b4e5-7ed2e3427774))
  (pad "14" smd roundrect (at 0.325 -1.9625) (size 0.3 0.825) (layers "F.Cu" "F.Paste" "F.Mask") (roundrect_rratio 0.1666666667) (tstamp 6433d494-7dd2-429e-9c4b-55f42ef32403))
  (pad "15" smd roundrect (at -0.325 -1.9625) (size 0.3 0.825) (layers "F.Cu" "F.Paste" "F.Mask") (roundrect_rratio 0.1666666667) (tstamp 2ada0e38-f710-4570-a277-368dae3ef75e))
  (pad "16" smd roundrect (at -0.975 -1.9625) (size 0.3 0.825) (layers "F.Cu" "F.Paste" "F.Mask") (roundrect_rratio 0.1666666667) (tstamp 3c7ae5b6-701d-401e-a978-926efdcbd93b))
  (pad "17" smd roundrect (at 0 0) (size 2.5 2.5) (layers "F.Cu" "F.Mask") (roundrect_rratio 0.02) (tstamp eff22d6b-5603-4515-9399-1e6e9a96e69d))
  (model "${KICADLIB}/model/QFN/QFN65P400X400-17.step"
    (offset (xyz 0 0 0))
    (scale (xyz 1 1 1))
    (rotate (xyz 0 0 0))
  )
)
