(footprint "QFN50P400X400-25"
	(version 20240108)
	(generator "pcbnew")
	(generator_version "8.0")
	(layer "F.Cu")
	(property "Reference" "REF**"
		(at 0 -3.1 0)
		(layer "F.SilkS")
		(uuid "645275e5-12fc-4d5a-a875-b9355210be34")
		(effects
			(font
				(size 0.8 0.8)
				(thickness 0.15)
			)
		)
	)
	(property "Value" "QFN50P400X400-25"
		(at 0 3.425 0)
		(layer "F.Fab")
		(hide yes)
		(uuid "85d48a7d-d9f0-4fbd-b83e-908e92b512c4")
		(effects
			(font
				(size 1 1)
				(thickness 0.15)
			)
		)
	)
	(property "Footprint" "QFN50P400X400-25"
		(at 0 4.95 0)
		(unlocked yes)
		(layer "F.Fab")
		(hide yes)
		(uuid "29eeb320-c760-4aaf-91c5-f0c0f8677580")
		(effects
			(font
				(size 1.27 1.27)
			)
		)
	)
	(property "Datasheet" ""
		(at 0 0 0)
		(unlocked yes)
		(layer "F.Fab")
		(hide yes)
		(uuid "0bd3ffb8-c1e0-4df7-b03b-45ad3b3b3b78")
		(effects
			(font
				(size 1.27 1.27)
			)
		)
	)
	(property "Description" ""
		(at 0 0 0)
		(unlocked yes)
		(layer "F.Fab")
		(hide yes)
		(uuid "fb5e9dff-29dd-4473-afe2-93626388efa3")
		(effects
			(font
				(size 1.27 1.27)
			)
		)
	)
	(attr smd)
	(fp_line
		(start -2 -1.999999)
		(end -1.5 -2)
		(stroke
			(width 0.1)
			(type solid)
		)
		(layer "F.SilkS")
		(uuid "e8cabc05-dd7f-4c75-99ea-b616a3e6b4d3")
	)
	(fp_line
		(start -2 -1.5)
		(end -2 -1.999999)
		(stroke
			(width 0.1)
			(type solid)
		)
		(layer "F.SilkS")
		(uuid "d26e658d-f711-403c-ac11-7101577fea33")
	)
	(fp_line
		(start -1.999999 2)
		(end -2 1.5)
		(stroke
			(width 0.1)
			(type solid)
		)
		(layer "F.SilkS")
		(uuid "5c76a44e-3b21-4580-a0bd-9d2789ab568d")
	)
	(fp_line
		(start -1.5 2)
		(end -1.999999 2)
		(stroke
			(width 0.1)
			(type solid)
		)
		(layer "F.SilkS")
		(uuid "4dabf4d7-1fb2-47dc-8af5-487cb7b923ff")
	)
	(fp_line
		(start 1.5 -2)
		(end 1.999999 -2)
		(stroke
			(width 0.1)
			(type solid)
		)
		(layer "F.SilkS")
		(uuid "98317c0d-0944-4836-8bc1-225a16ce33a6")
	)
	(fp_line
		(start 1.999999 -2)
		(end 2 -1.5)
		(stroke
			(width 0.1)
			(type solid)
		)
		(layer "F.SilkS")
		(uuid "2e6b20f1-873d-4ea0-a296-cd01a4ff37b8")
	)
	(fp_line
		(start 2 1.5)
		(end 2 1.999999)
		(stroke
			(width 0.1)
			(type solid)
		)
		(layer "F.SilkS")
		(uuid "3d0f91e5-78d2-4766-9d1a-2cd7b0496c70")
	)
	(fp_line
		(start 2 1.999999)
		(end 1.5 2)
		(stroke
			(width 0.1)
			(type solid)
		)
		(layer "F.SilkS")
		(uuid "54b6d09a-be93-4fff-ba7c-ff69226cbc40")
	)
	(fp_line
		(start -2.7 -2.7)
		(end 2.7 -2.7)
		(stroke
			(width 0.05)
			(type solid)
		)
		(layer "F.CrtYd")
		(uuid "30b97395-b778-484e-a341-9df2ca1fb3b6")
	)
	(fp_line
		(start -2.7 2.7)
		(end -2.7 -2.7)
		(stroke
			(width 0.05)
			(type solid)
		)
		(layer "F.CrtYd")
		(uuid "173cb49b-0b69-4500-9462-33627898a031")
	)
	(fp_line
		(start 2.7 -2.7)
		(end 2.7 2.7)
		(stroke
			(width 0.05)
			(type solid)
		)
		(layer "F.CrtYd")
		(uuid "e368096a-7fdc-4a3d-a967-d7e6d17fa144")
	)
	(fp_line
		(start 2.7 2.7)
		(end -2.7 2.7)
		(stroke
			(width 0.05)
			(type solid)
		)
		(layer "F.CrtYd")
		(uuid "b399e5d1-c6e2-4b88-a675-8be309c059b4")
	)
	(fp_line
		(start -2 -1.55)
		(end -2 2)
		(stroke
			(width 0.1)
			(type solid)
		)
		(layer "F.Fab")
		(uuid "ac57ae48-6c02-4a4a-a927-18b76d360148")
	)
	(fp_line
		(start -2 2)
		(end 2 2)
		(stroke
			(width 0.1)
			(type solid)
		)
		(layer "F.Fab")
		(uuid "beb35754-5300-4889-a3ce-88d4dd132a1a")
	)
	(fp_line
		(start -1.55 -2)
		(end -2 -1.55)
		(stroke
			(width 0.1)
			(type solid)
		)
		(layer "F.Fab")
		(uuid "13cc7558-1c90-437c-a1e4-132335e030ab")
	)
	(fp_line
		(start 2 -2)
		(end -1.55 -2)
		(stroke
			(width 0.1)
			(type solid)
		)
		(layer "F.Fab")
		(uuid "57c755fe-ed8d-4bbc-94e5-74d27a0bf205")
	)
	(fp_line
		(start 2 2)
		(end 2 -2)
		(stroke
			(width 0.1)
			(type solid)
		)
		(layer "F.Fab")
		(uuid "ffb340e9-9177-4a8b-97bb-bfe60ca9b814")
	)
	(fp_text user "^"
		(at -3.2 -1.3 -90)
		(unlocked yes)
		(layer "F.SilkS")
		(uuid "c30fdf1c-fe04-4ee6-8b67-9fcc226372c9")
		(effects
			(font
				(size 1 1)
				(thickness 0.15)
			)
		)
	)
	(fp_text user "${REFERENCE}"
		(at 0 0 0)
		(layer "F.Fab")
		(uuid "ddbd7087-08df-4c18-9293-d78251562055")
		(effects
			(font
				(size 1 1)
				(thickness 0.15)
			)
		)
	)
	(pad "" smd roundrect
		(at -0.7 -0.7)
		(size 1 1)
		(layers "F.Paste")
		(roundrect_rratio 0.05)
		(solder_paste_margin -0.1)
		(uuid "a81a52e0-7efe-466e-9337-3eb800241b27")
	)
	(pad "" smd roundrect
		(at -0.7 0.7)
		(size 1 1)
		(layers "F.Paste")
		(roundrect_rratio 0.05)
		(solder_paste_margin -0.1)
		(uuid "0c8c3bb8-a2d5-49e7-99d2-71076f1618cb")
	)
	(pad "" smd roundrect
		(at 0.7 -0.7)
		(size 1 1)
		(layers "F.Paste")
		(roundrect_rratio 0.05)
		(solder_paste_margin -0.1)
		(uuid "858d4941-41cc-45ba-90ce-17b8415f7ddc")
	)
	(pad "" smd roundrect
		(at 0.7 0.7)
		(size 1 1)
		(layers "F.Paste")
		(roundrect_rratio 0.05)
		(solder_paste_margin -0.1)
		(uuid "404ccc4b-3ca0-4af3-87e7-a2355e63dfe4")
	)
	(pad "1" smd roundrect
		(at -2 -1.25 90)
		(size 0.3 0.85)
		(layers "F.Cu" "F.Paste" "F.Mask")
		(roundrect_rratio 0.1666666667)
		(uuid "df7c5e95-c37e-444f-9dbe-4982b181931b")
	)
	(pad "2" smd roundrect
		(at -2 -0.75 90)
		(size 0.3 0.85)
		(layers "F.Cu" "F.Paste" "F.Mask")
		(roundrect_rratio 0.1666666667)
		(uuid "35ae71bf-6ce0-4755-b956-b43ae702706a")
	)
	(pad "3" smd roundrect
		(at -2 -0.25 90)
		(size 0.3 0.85)
		(layers "F.Cu" "F.Paste" "F.Mask")
		(roundrect_rratio 0.1666666667)
		(uuid "075231b2-1438-4c1b-ae40-f05092a2107a")
	)
	(pad "4" smd roundrect
		(at -2 0.25 90)
		(size 0.3 0.85)
		(layers "F.Cu" "F.Paste" "F.Mask")
		(roundrect_rratio 0.1666666667)
		(uuid "f193a8b1-89bd-4c85-8509-12bb096d040a")
	)
	(pad "5" smd roundrect
		(at -2 0.75 90)
		(size 0.3 0.85)
		(layers "F.Cu" "F.Paste" "F.Mask")
		(roundrect_rratio 0.1666666667)
		(uuid "f2252e4f-319e-4f39-87ae-e6b752a22922")
	)
	(pad "6" smd roundrect
		(at -2 1.25 90)
		(size 0.3 0.85)
		(layers "F.Cu" "F.Paste" "F.Mask")
		(roundrect_rratio 0.1666666667)
		(uuid "ef2f609a-2870-4f0e-b95b-c84e43cab8a1")
	)
	(pad "7" smd roundrect
		(at -1.25 2)
		(size 0.3 0.85)
		(layers "F.Cu" "F.Paste" "F.Mask")
		(roundrect_rratio 0.1666666667)
		(uuid "951e88a7-66d4-43bb-acde-944621476bce")
	)
	(pad "8" smd roundrect
		(at -0.75 2)
		(size 0.3 0.85)
		(layers "F.Cu" "F.Paste" "F.Mask")
		(roundrect_rratio 0.1666666667)
		(uuid "3e309a3f-6db5-4557-bd98-5aeb842f0c58")
	)
	(pad "9" smd roundrect
		(at -0.25 2)
		(size 0.3 0.85)
		(layers "F.Cu" "F.Paste" "F.Mask")
		(roundrect_rratio 0.1666666667)
		(uuid "3dfcd49f-6d80-4f8a-a7b3-6a366d795e63")
	)
	(pad "10" smd roundrect
		(at 0.25 2)
		(size 0.3 0.85)
		(layers "F.Cu" "F.Paste" "F.Mask")
		(roundrect_rratio 0.1666666667)
		(uuid "6ea1fbd5-c711-445f-a9b7-8229a1827aac")
	)
	(pad "11" smd roundrect
		(at 0.75 2)
		(size 0.3 0.85)
		(layers "F.Cu" "F.Paste" "F.Mask")
		(roundrect_rratio 0.1666666667)
		(uuid "bf960b8b-7179-4123-b9b8-dd439b179aa3")
	)
	(pad "12" smd roundrect
		(at 1.25 2)
		(size 0.3 0.85)
		(layers "F.Cu" "F.Paste" "F.Mask")
		(roundrect_rratio 0.1666666667)
		(uuid "4f21bc49-48e5-46a3-b4c8-fc4fca8a56c0")
	)
	(pad "13" smd roundrect
		(at 2 1.25 90)
		(size 0.3 0.85)
		(layers "F.Cu" "F.Paste" "F.Mask")
		(roundrect_rratio 0.1666666667)
		(uuid "aadc1301-7d44-44b4-8121-6e970b4ac748")
	)
	(pad "14" smd roundrect
		(at 2 0.75 90)
		(size 0.3 0.85)
		(layers "F.Cu" "F.Paste" "F.Mask")
		(roundrect_rratio 0.1666666667)
		(uuid "b7d8b45f-6419-4a7c-b410-69965517ae1b")
	)
	(pad "15" smd roundrect
		(at 2 0.25 90)
		(size 0.3 0.85)
		(layers "F.Cu" "F.Paste" "F.Mask")
		(roundrect_rratio 0.1666666667)
		(uuid "d3490809-434d-4cbe-98c6-a7e6a5e21bd7")
	)
	(pad "16" smd roundrect
		(at 2 -0.25 90)
		(size 0.3 0.85)
		(layers "F.Cu" "F.Paste" "F.Mask")
		(roundrect_rratio 0.1666666667)
		(uuid "28775b6e-25b3-4fa2-b0e7-23b29e19f9a0")
	)
	(pad "17" smd roundrect
		(at 2 -0.75 90)
		(size 0.3 0.85)
		(layers "F.Cu" "F.Paste" "F.Mask")
		(roundrect_rratio 0.1666666667)
		(uuid "2684ba62-9a6f-47cb-9d90-6922016a141d")
	)
	(pad "18" smd roundrect
		(at 2 -1.25 90)
		(size 0.3 0.85)
		(layers "F.Cu" "F.Paste" "F.Mask")
		(roundrect_rratio 0.1666666667)
		(uuid "ac955e3e-b9a0-4d51-90da-0ed037f9317b")
	)
	(pad "19" smd roundrect
		(at 1.25 -2)
		(size 0.3 0.85)
		(layers "F.Cu" "F.Paste" "F.Mask")
		(roundrect_rratio 0.1666666667)
		(uuid "12333149-ed61-4f45-87a1-b5afdbdff980")
	)
	(pad "20" smd roundrect
		(at 0.75 -2)
		(size 0.3 0.85)
		(layers "F.Cu" "F.Paste" "F.Mask")
		(roundrect_rratio 0.1666666667)
		(uuid "32f7716f-8382-48b5-97c0-986120cca065")
	)
	(pad "21" smd roundrect
		(at 0.25 -2)
		(size 0.3 0.85)
		(layers "F.Cu" "F.Paste" "F.Mask")
		(roundrect_rratio 0.1666666667)
		(uuid "3d6244a2-6f3f-40c2-a0d3-07d49422b340")
	)
	(pad "22" smd roundrect
		(at -0.25 -2)
		(size 0.3 0.85)
		(layers "F.Cu" "F.Paste" "F.Mask")
		(roundrect_rratio 0.1666666667)
		(uuid "82188052-87e6-4c7d-846e-75b29f7a7b20")
	)
	(pad "23" smd roundrect
		(at -0.75 -2)
		(size 0.3 0.85)
		(layers "F.Cu" "F.Paste" "F.Mask")
		(roundrect_rratio 0.1666666667)
		(uuid "e812c4f3-b37d-465a-951e-1b56cf8e2607")
	)
	(pad "24" smd roundrect
		(at -1.25 -2)
		(size 0.3 0.85)
		(layers "F.Cu" "F.Paste" "F.Mask")
		(roundrect_rratio 0.1666666667)
		(uuid "eeea5a4f-1aeb-4403-b2da-78704f8b081b")
	)
	(pad "25" smd roundrect
		(at 0 0)
		(size 2.45 2.45)
		(layers "F.Cu" "F.Mask")
		(roundrect_rratio 0.02040816327)
		(solder_paste_margin -0.1)
		(uuid "6ac034cd-acbd-4077-918d-7daf0137c809")
	)
	(model "${KICADLIB}/model/QFN/QFN50P400X400-25.step"
		(offset
			(xyz 0 0 0)
		)
		(scale
			(xyz 1 1 1)
		)
		(rotate
			(xyz 0 0 0)
		)
	)
)
