(footprint "CON_uFL"
	(version 20240108)
	(generator "pcbnew")
	(generator_version "8.0")
	(layer "F.Cu")
	(property "Reference" "REF**"
		(at 0 -2.25 0)
		(layer "F.SilkS")
		(uuid "cc572b89-950f-48bf-a975-b4a2e4bab905")
		(effects
			(font
				(size 0.8 0.8)
				(thickness 0.15)
			)
		)
	)
	(property "Value" "CON_uFL"
		(at 0 4.75 0)
		(unlocked yes)
		(layer "F.Fab")
		(hide yes)
		(uuid "51da73a0-6c71-4ce8-90e1-8b44cfec2ad4")
		(effects
			(font
				(size 1 1)
				(thickness 0.15)
			)
		)
	)
	(property "Footprint" "CON_uFL"
		(at 0 3.1 0)
		(unlocked yes)
		(layer "F.Fab")
		(hide yes)
		(uuid "4d93d0cb-9a02-4450-9f06-892afd19cf39")
		(effects
			(font
				(size 1.27 1.27)
			)
		)
	)
	(property "Datasheet" ""
		(at 0 0 0)
		(unlocked yes)
		(layer "F.Fab")
		(hide yes)
		(uuid "e32f580d-938f-4f82-bb13-ef936b38ea8a")
		(effects
			(font
				(size 1.27 1.27)
			)
		)
	)
	(property "Description" ""
		(at 0 0 0)
		(unlocked yes)
		(layer "F.Fab")
		(hide yes)
		(uuid "68babb4f-1b31-42d5-aebe-cddb9ae4ad69")
		(effects
			(font
				(size 1.27 1.27)
			)
		)
	)
	(attr smd)
	(fp_line
		(start -1.3 -1.3)
		(end -1.3 -1.15)
		(stroke
			(width 0.1)
			(type solid)
		)
		(layer "F.SilkS")
		(uuid "44ad3787-7fbe-459c-9dc4-6cd1552707e9")
	)
	(fp_line
		(start -1.3 -1.3)
		(end -0.3 -1.3)
		(stroke
			(width 0.1)
			(type solid)
		)
		(layer "F.SilkS")
		(uuid "8cffd939-f663-4697-a0f8-d11e1c7c4432")
	)
	(fp_line
		(start -1.3 1.15)
		(end -1.3 1.3)
		(stroke
			(width 0.1)
			(type solid)
		)
		(layer "F.SilkS")
		(uuid "a219b587-5e87-46a7-805c-6acfc1a27978")
	)
	(fp_line
		(start -1.3 1.3)
		(end -0.55 1.3)
		(stroke
			(width 0.1)
			(type solid)
		)
		(layer "F.SilkS")
		(uuid "bbf8c979-2f3d-4b44-959c-4849c7914fbe")
	)
	(fp_line
		(start -0.3 -1.3)
		(end 1 -1.3)
		(stroke
			(width 0.1)
			(type solid)
		)
		(layer "F.SilkS")
		(uuid "d250ac7d-f38c-4254-a1ed-c2a752e84f55")
	)
	(fp_line
		(start 1 -1.3)
		(end 1.15 -1.15)
		(stroke
			(width 0.1)
			(type solid)
		)
		(layer "F.SilkS")
		(uuid "4b68c334-1e55-4af9-afc4-60703e527ba6")
	)
	(fp_line
		(start 1.3 1.15)
		(end 1.3 1.3)
		(stroke
			(width 0.1)
			(type solid)
		)
		(layer "F.SilkS")
		(uuid "e67f8b56-8c09-4cfb-b51a-2c59c59093a8")
	)
	(fp_line
		(start 1.3 1.3)
		(end 0.55 1.3)
		(stroke
			(width 0.1)
			(type solid)
		)
		(layer "F.SilkS")
		(uuid "a986adf6-4b01-4823-8d49-c3e6f13787fb")
	)
	(fp_line
		(start -1.9 -1.758058)
		(end 1.9 -1.758058)
		(stroke
			(width 0.05)
			(type solid)
		)
		(layer "F.CrtYd")
		(uuid "663393ac-b327-4cb1-bf86-de9fac0a42ce")
	)
	(fp_line
		(start -1.9 2.1)
		(end -1.9 -1.75)
		(stroke
			(width 0.05)
			(type solid)
		)
		(layer "F.CrtYd")
		(uuid "d163b34f-7657-4305-a4e4-21fb2c9245e2")
	)
	(fp_line
		(start 1.9 -1.75)
		(end 1.9 2.1)
		(stroke
			(width 0.05)
			(type solid)
		)
		(layer "F.CrtYd")
		(uuid "53e0d36a-60f6-496a-9c73-b5e1ecfcd751")
	)
	(fp_line
		(start 1.9 2.1)
		(end -1.9 2.1)
		(stroke
			(width 0.05)
			(type solid)
		)
		(layer "F.CrtYd")
		(uuid "84900528-dd73-405a-97ff-b30d5d4b4147")
	)
	(fp_line
		(start -1.5 -0.9)
		(end -1.3 -0.9)
		(stroke
			(width 0.1)
			(type solid)
		)
		(layer "F.Fab")
		(uuid "2ddbe0b1-292c-4ebc-9962-de4f196812f1")
	)
	(fp_line
		(start -1.5 0.9)
		(end -1.5 -0.9)
		(stroke
			(width 0.1)
			(type solid)
		)
		(layer "F.Fab")
		(uuid "edca5863-afa0-4b7b-ab71-36acfacfd7eb")
	)
	(fp_line
		(start -1.3 -1.3)
		(end -0.3 -1.3)
		(stroke
			(width 0.1)
			(type solid)
		)
		(layer "F.Fab")
		(uuid "80ffb7f3-d188-41e1-9543-411484b3026c")
	)
	(fp_line
		(start -1.3 -0.9)
		(end -1.3 -1.3)
		(stroke
			(width 0.1)
			(type solid)
		)
		(layer "F.Fab")
		(uuid "987b3726-ebba-40bb-8ddf-06479a6683c2")
	)
	(fp_line
		(start -1.3 0.9)
		(end -1.5 0.9)
		(stroke
			(width 0.1)
			(type solid)
		)
		(layer "F.Fab")
		(uuid "597a358e-fb54-4ce8-9e87-3162f5646ea9")
	)
	(fp_line
		(start -1.3 1.3)
		(end -1.3 0.9)
		(stroke
			(width 0.1)
			(type solid)
		)
		(layer "F.Fab")
		(uuid "c035a14d-fa70-455a-9032-df6a85daf06c")
	)
	(fp_line
		(start -0.3 -1.5)
		(end 0.3 -1.5)
		(stroke
			(width 0.1)
			(type solid)
		)
		(layer "F.Fab")
		(uuid "23a26db5-f70b-4103-9516-bb3cfccdd78a")
	)
	(fp_line
		(start -0.3 -1.3)
		(end -0.3 -1.5)
		(stroke
			(width 0.1)
			(type solid)
		)
		(layer "F.Fab")
		(uuid "0b64aa49-9f81-4d25-a497-ce382974c094")
	)
	(fp_line
		(start -0.3 1.3)
		(end -1.3 1.3)
		(stroke
			(width 0.1)
			(type solid)
		)
		(layer "F.Fab")
		(uuid "bb7b5dce-b41c-4f9a-b11d-90b31e037600")
	)
	(fp_line
		(start -0.3 1.5)
		(end -0.3 1.3)
		(stroke
			(width 0.1)
			(type solid)
		)
		(layer "F.Fab")
		(uuid "e2287188-6c87-4e36-8760-4ddc95784280")
	)
	(fp_line
		(start 0.3 -1.5)
		(end 0.3 -1.3)
		(stroke
			(width 0.1)
			(type solid)
		)
		(layer "F.Fab")
		(uuid "76ce9aff-f26a-4066-a66e-e43d1e0ebc4f")
	)
	(fp_line
		(start 0.3 -1.3)
		(end 1 -1.3)
		(stroke
			(width 0.1)
			(type solid)
		)
		(layer "F.Fab")
		(uuid "513a1fb4-d7c5-4476-9e17-46e960759cd4")
	)
	(fp_line
		(start 0.3 1.3)
		(end 0.3 1.5)
		(stroke
			(width 0.1)
			(type solid)
		)
		(layer "F.Fab")
		(uuid "4a524171-9a53-47af-8922-afefbedf849a")
	)
	(fp_line
		(start 0.3 1.5)
		(end -0.3 1.5)
		(stroke
			(width 0.1)
			(type solid)
		)
		(layer "F.Fab")
		(uuid "ec70a530-d124-4f0e-ab3d-710c4eed05f7")
	)
	(fp_line
		(start 1 -1.3)
		(end 1.3 -1)
		(stroke
			(width 0.1)
			(type solid)
		)
		(layer "F.Fab")
		(uuid "27d78983-3c6e-4287-a945-6c58b64c7bd1")
	)
	(fp_line
		(start 1.3 -0.9)
		(end 1.3 -1)
		(stroke
			(width 0.1)
			(type solid)
		)
		(layer "F.Fab")
		(uuid "eea19f42-7ac2-4167-a3d4-67b825ab5d5b")
	)
	(fp_line
		(start 1.3 -0.9)
		(end 1.5 -0.9)
		(stroke
			(width 0.1)
			(type solid)
		)
		(layer "F.Fab")
		(uuid "3940ec40-c378-4fe9-988f-f9aa4a5f93e5")
	)
	(fp_line
		(start 1.3 0.9)
		(end 1.3 1.3)
		(stroke
			(width 0.1)
			(type solid)
		)
		(layer "F.Fab")
		(uuid "8ec58595-cdd7-43ed-94cd-decb8238b17b")
	)
	(fp_line
		(start 1.3 1.3)
		(end 0.3 1.3)
		(stroke
			(width 0.1)
			(type solid)
		)
		(layer "F.Fab")
		(uuid "21b73715-30d0-4f3a-9778-9efa2dcd9cc1")
	)
	(fp_line
		(start 1.5 -0.9)
		(end 1.5 0.9)
		(stroke
			(width 0.1)
			(type solid)
		)
		(layer "F.Fab")
		(uuid "2b6d8f35-25cd-420f-8051-3d286a45c322")
	)
	(fp_line
		(start 1.5 0.9)
		(end 1.3 0.9)
		(stroke
			(width 0.1)
			(type solid)
		)
		(layer "F.Fab")
		(uuid "0b668720-4734-4c1d-ac9b-49e615588292")
	)
	(fp_text user "^"
		(at 1.25 1.75 90)
		(unlocked yes)
		(layer "F.SilkS")
		(uuid "b91b7a45-5ae3-45a5-a0e4-321590953e3c")
		(effects
			(font
				(size 1 1)
				(thickness 0.15)
			)
		)
	)
	(fp_text user "${REFERENCE}"
		(at 0 0 0)
		(layer "F.Fab")
		(uuid "5d68a6ac-4f39-4729-86ae-02531bd36ed1")
		(effects
			(font
				(size 0.5 0.5)
				(thickness 0.1)
			)
		)
	)
	(pad "1" smd roundrect
		(at 0 1.525)
		(size 1 1.05)
		(layers "F.Cu" "F.Paste" "F.Mask")
		(roundrect_rratio 0.05)
		(uuid "d327f2e9-cd42-489e-a6ad-817f771f9b8e")
	)
	(pad "2" smd roundrect
		(at -1.325 0)
		(size 1.05 2.2)
		(layers "F.Cu" "F.Paste" "F.Mask")
		(roundrect_rratio 0.04761904762)
		(uuid "a7d2ffd5-172c-4fdb-8b76-25447c5bf5f6")
	)
	(pad "2" smd roundrect
		(at 1.325 0)
		(size 1.05 2.2)
		(layers "F.Cu" "F.Paste" "F.Mask")
		(roundrect_rratio 0.04761904762)
		(uuid "9f8d7e15-3672-48bf-b9ca-3c7f3a1536ce")
	)
	(zone
		(net 0)
		(net_name "")
		(layer "F.Cu")
		(uuid "ecf4eb87-4038-4bab-ac22-6b51d3cf7aea")
		(hatch edge 0.508)
		(connect_pads
			(clearance 0)
		)
		(min_thickness 0.254)
		(filled_areas_thickness no)
		(keepout
			(tracks allowed)
			(vias not_allowed)
			(pads not_allowed)
			(copperpour not_allowed)
			(footprints allowed)
		)
		(fill
			(thermal_gap 0.508)
			(thermal_bridge_width 0.508)
		)
		(polygon
			(pts
				(xy 0.75 0.95) (xy -0.75 0.95) (xy -0.75 -1.1) (xy 0.75 -1.1)
			)
		)
	)
	(model "${KICADLIB}/model/connector/TE_1909763-1.stp"
		(offset
			(xyz 0 0 1.25)
		)
		(scale
			(xyz 1 1 1)
		)
		(rotate
			(xyz 0 0 0)
		)
	)
)
