(footprint "PinHeader_1x20_P1.27mm_Vertical" (version 20211014) (generator pcbnew)
  (layer "F.Cu")
  (tedit 6116C84C)
  (descr "Through hole straight pin header, 1x20, 1.27mm pitch, single row")
  (tags "Through hole pin header THT 1x20 1.27mm single row")
  (attr through_hole)
  (fp_text reference "REF**" (at 0 -1.695) (layer "F.SilkS")
    (effects (font (size 1 1) (thickness 0.15)))
    (tstamp 1e3380eb-ed4d-442e-b624-e55a2bd86edb)
  )
  (fp_text value "PinHeader_1x20_P1.27mm_Vertical" (at 0 25.825) (layer "F.Fab") hide
    (effects (font (size 1 1) (thickness 0.15)))
    (tstamp 05fa95d1-0894-49d3-9cfe-1d083d6004fa)
  )
  (fp_text user "${REFERENCE}" (at 0 12.065 90) (layer "F.Fab")
    (effects (font (size 1 1) (thickness 0.15)))
    (tstamp 4b9bb006-4006-4529-b191-98d5cd18d155)
  )
  (fp_line (start 0.563471 0.76) (end 1.11 0.76) (layer "F.SilkS") (width 0.12) (tstamp 0fa2afe0-3727-48a6-8ab8-19561e8c88db))
  (fp_line (start 1.11 0.76) (end 1.11 24.825) (layer "F.SilkS") (width 0.12) (tstamp 3e8c2e3d-f0c0-4f68-98bb-ccd3d1c649f4))
  (fp_line (start -1.11 -0.76) (end 0 -0.76) (layer "F.SilkS") (width 0.12) (tstamp 5a3a6b20-45fb-4f7f-8c6b-c294e42ff027))
  (fp_line (start -1.11 0) (end -1.11 -0.76) (layer "F.SilkS") (width 0.12) (tstamp 7d785096-53c4-4b26-b93c-e6311254a648))
  (fp_line (start -1.11 24.825) (end -0.30753 24.825) (layer "F.SilkS") (width 0.12) (tstamp 9104fe87-a9b6-4a7f-a87d-77e7226d4299))
  (fp_line (start 0.30753 24.825) (end 1.11 24.825) (layer "F.SilkS") (width 0.12) (tstamp c7eebe37-30c8-4188-a397-28b7e773c6bc))
  (fp_line (start -1.11 0.76) (end -1.11 24.825) (layer "F.SilkS") (width 0.12) (tstamp db46258d-7ab5-4c46-ba6a-960eb287052b))
  (fp_line (start -1.11 0.76) (end -0.563471 0.76) (layer "F.SilkS") (width 0.12) (tstamp eddbb4f0-77a3-4929-b9a1-a772526f5271))
  (fp_line (start 1.55 -1.15) (end -1.55 -1.15) (layer "F.CrtYd") (width 0.05) (tstamp 84167154-d713-48d4-ad2d-a2542a9e7940))
  (fp_line (start -1.55 -1.15) (end -1.55 25.3) (layer "F.CrtYd") (width 0.05) (tstamp 8c5ea00a-c1c8-431b-b5df-f53abecd1285))
  (fp_line (start -1.55 25.3) (end 1.55 25.3) (layer "F.CrtYd") (width 0.05) (tstamp cc93afbc-1ad1-43ad-b426-d8754eac7959))
  (fp_line (start 1.55 25.3) (end 1.55 -1.15) (layer "F.CrtYd") (width 0.05) (tstamp fc395ca0-276c-46a5-93af-08cd4f7cbf0f))
  (fp_line (start -1.05 24.765) (end -1.05 -0.11) (layer "F.Fab") (width 0.1) (tstamp 3573d287-44ae-430a-8024-c0290b74ad40))
  (fp_line (start 1.05 24.765) (end -1.05 24.765) (layer "F.Fab") (width 0.1) (tstamp 728be55e-13cc-4e53-a6c6-b22c9a60fbea))
  (fp_line (start 1.05 -0.635) (end 1.05 24.765) (layer "F.Fab") (width 0.1) (tstamp 8806c62f-c6ce-4a7d-a238-e7adb9a04c5a))
  (fp_line (start -0.525 -0.635) (end 1.05 -0.635) (layer "F.Fab") (width 0.1) (tstamp bdb56a36-99ec-4ce1-8069-0d3869578d7d))
  (fp_line (start -1.05 -0.11) (end -0.525 -0.635) (layer "F.Fab") (width 0.1) (tstamp cc76b0bf-e991-4efc-b981-7b7e673616f3))
  (pad "1" thru_hole rect (at 0 0) (size 1 1) (drill 0.65) (layers *.Cu *.Mask) (tstamp 900f596b-e3a1-4139-88cc-e39d97f752dd))
  (pad "2" thru_hole oval (at 0 1.27) (size 1 1) (drill 0.65) (layers *.Cu *.Mask) (tstamp b46e4e78-280f-4c95-a7f6-dd16a9866daa))
  (pad "3" thru_hole oval (at 0 2.54) (size 1 1) (drill 0.65) (layers *.Cu *.Mask) (tstamp 05493d95-2175-43c2-b873-b2a9a399bbe5))
  (pad "4" thru_hole oval (at 0 3.81) (size 1 1) (drill 0.65) (layers *.Cu *.Mask) (tstamp db2ca0e7-b788-4d60-800d-836fcaafe6fc))
  (pad "5" thru_hole oval (at 0 5.08) (size 1 1) (drill 0.65) (layers *.Cu *.Mask) (tstamp 35b43197-3203-42ea-8d5f-0d391847643b))
  (pad "6" thru_hole oval (at 0 6.35) (size 1 1) (drill 0.65) (layers *.Cu *.Mask) (tstamp 9e3f8827-3f08-4ec0-bf34-f4593c1ecdad))
  (pad "7" thru_hole oval (at 0 7.62) (size 1 1) (drill 0.65) (layers *.Cu *.Mask) (tstamp f98e01b1-9477-4b98-9833-bcfc8ce706f6))
  (pad "8" thru_hole oval (at 0 8.89) (size 1 1) (drill 0.65) (layers *.Cu *.Mask) (tstamp b44a06ce-8709-46ca-ad95-8ef377bdb0b8))
  (pad "9" thru_hole oval (at 0 10.16) (size 1 1) (drill 0.65) (layers *.Cu *.Mask) (tstamp e0f83d03-250e-496a-85bd-e413e32e7574))
  (pad "10" thru_hole oval (at 0 11.43) (size 1 1) (drill 0.65) (layers *.Cu *.Mask) (tstamp b06e8f3b-32ae-48d6-818d-a91069c10a9e))
  (pad "11" thru_hole oval (at 0 12.7) (size 1 1) (drill 0.65) (layers *.Cu *.Mask) (tstamp 9619c5aa-bb45-44ae-acaf-7209d301883c))
  (pad "12" thru_hole oval (at 0 13.97) (size 1 1) (drill 0.65) (layers *.Cu *.Mask) (tstamp 6dabc43c-6303-4455-abe3-ab511fdcd6f0))
  (pad "13" thru_hole oval (at 0 15.24) (size 1 1) (drill 0.65) (layers *.Cu *.Mask) (tstamp a8ae6151-b0ed-4470-aef1-3caf19fc7cf7))
  (pad "14" thru_hole oval (at 0 16.51) (size 1 1) (drill 0.65) (layers *.Cu *.Mask) (tstamp ce77efb4-1492-4a3b-b415-0076b4209c92))
  (pad "15" thru_hole oval (at 0 17.78) (size 1 1) (drill 0.65) (layers *.Cu *.Mask) (tstamp 9e3b5634-d190-4c23-995c-2864331a20ac))
  (pad "16" thru_hole oval (at 0 19.05) (size 1 1) (drill 0.65) (layers *.Cu *.Mask) (tstamp fdd84d7d-a1cf-4797-b70f-177003944384))
  (pad "17" thru_hole oval (at 0 20.32) (size 1 1) (drill 0.65) (layers *.Cu *.Mask) (tstamp 40c3b7cc-af68-40c4-9356-9d68a0054d2c))
  (pad "18" thru_hole oval (at 0 21.59) (size 1 1) (drill 0.65) (layers *.Cu *.Mask) (tstamp e1d45b42-06a7-44ed-aaf3-3a37512d3afb))
  (pad "19" thru_hole oval (at 0 22.86) (size 1 1) (drill 0.65) (layers *.Cu *.Mask) (tstamp 52e61e52-e8bc-4ff6-8b7b-924f48164ca1))
  (pad "20" thru_hole oval (at 0 24.13) (size 1 1) (drill 0.65) (layers *.Cu *.Mask) (tstamp ca0b0f4e-40c8-486e-9536-25cd9dfa87bc))
  (model "${KICADLIB}/model/connector/PinHeader_1x20_P1.27mm_Vertical.step"
    (offset (xyz 0 0 0))
    (scale (xyz 1 1 1))
    (rotate (xyz 0 0 0))
  )
)
