(footprint "ESMART_2.5mm_minimal" (version 20211014) (generator pcbnew)
  (layer "F.Cu")
  (tedit 62100576)
  (attr through_hole exclude_from_pos_files exclude_from_bom)
  (fp_text reference "G***" (at 0 0) (layer "F.SilkS") hide
    (effects (font (size 1.524 1.524) (thickness 0.3)))
    (tstamp 1efd6200-9655-40ab-9bf6-c03220ac1cb4)
  )
  (fp_text value "LOGO" (at 0.75 0) (layer "F.SilkS") hide
    (effects (font (size 1.524 1.524) (thickness 0.3)))
    (tstamp 2ffe3ea7-5d1c-4daf-a00a-160ed2e60bcc)
  )
  (fp_text user "E-SMART" (at 0 0 unlocked) (layer "F.Fab")
    (effects (font (size 0.5 0.5) (thickness 0.1)))
    (tstamp 2607f855-1e7d-49dc-b886-2c1b0ba75d75)
  )
  (fp_poly (pts
      (xy 0.427251 0.689923)
      (xy 0.750583 0.691775)
      (xy 0.9901 0.695977)
      (xy 1.158282 0.70344)
      (xy 1.26761 0.715074)
      (xy 1.330568 0.731793)
      (xy 1.359634 0.754506)
      (xy 1.367291 0.784126)
      (xy 1.367366 0.788806)
      (xy 1.329799 0.894688)
      (xy 1.241483 1.006365)
      (xy 1.194361 1.046197)
      (xy 1.13927 1.075917)
      (xy 1.060705 1.097002)
      (xy 0.943164 1.110929)
      (xy 0.771142 1.119175)
      (xy 0.529137 1.123216)
      (xy 0.201645 1.12453)
      (xy 0 1.124625)
      (xy -0.37531 1.124251)
      (xy -0.657216 1.122081)
      (xy -0.861091 1.116548)
      (xy -1.002311 1.106084)
      (xy -1.096249 1.089118)
      (xy -1.158281 1.064084)
      (xy -1.20378 1.029412)
      (xy -1.23386 0.998743)
      (xy -1.317919 0.881917)
      (xy -1.352121 0.781184)
      (xy -1.344185 0.752803)
      (xy -1.31214 0.730923)
      (xy -1.243634 0.71471)
      (xy -1.12631 0.703333)
      (xy -0.947814 0.695958)
      (xy -0.695793 0.691752)
      (xy -0.357891 0.689882)
      (xy 0.007622 0.689508)
    ) (layer "F.SilkS") (width 0) (fill solid) (tstamp 23250289-e098-4f14-bd78-5a4d58f25711))
  (fp_poly (pts
      (xy 0.427251 -0.234703)
      (xy 0.750583 -0.23285)
      (xy 0.9901 -0.228648)
      (xy 1.158282 -0.221186)
      (xy 1.26761 -0.209551)
      (xy 1.330568 -0.192833)
      (xy 1.359634 -0.170119)
      (xy 1.367291 -0.1405)
      (xy 1.367366 -0.135819)
      (xy 1.329799 -0.029937)
      (xy 1.241483 0.08174)
      (xy 1.194361 0.121572)
      (xy 1.13927 0.151292)
      (xy 1.060705 0.172377)
      (xy 0.943164 0.186304)
      (xy 0.771142 0.19455)
      (xy 0.529137 0.198591)
      (xy 0.201645 0.199905)
      (xy 0 0.2)
      (xy -0.37531 0.199626)
      (xy -0.657216 0.197456)
      (xy -0.861091 0.191923)
      (xy -1.002311 0.181458)
      (xy -1.096249 0.164493)
      (xy -1.158281 0.139458)
      (xy -1.20378 0.104786)
      (xy -1.23386 0.074118)
      (xy -1.317919 -0.042708)
      (xy -1.352121 -0.143441)
      (xy -1.344185 -0.171822)
      (xy -1.31214 -0.193703)
      (xy -1.243634 -0.209915)
      (xy -1.12631 -0.221292)
      (xy -0.947814 -0.228667)
      (xy -0.695793 -0.232873)
      (xy -0.357891 -0.234743)
      (xy 0.007622 -0.235118)
    ) (layer "F.SilkS") (width 0) (fill solid) (tstamp 273bd333-84da-422e-96a5-143595113b1e))
  (fp_poly (pts
      (xy 0.427251 -1.159328)
      (xy 0.750583 -1.157475)
      (xy 0.9901 -1.153273)
      (xy 1.158282 -1.145811)
      (xy 1.26761 -1.134176)
      (xy 1.330568 -1.117458)
      (xy 1.359634 -1.094745)
      (xy 1.367291 -1.065125)
      (xy 1.367366 -1.060444)
      (xy 1.329799 -0.954562)
      (xy 1.241483 -0.842886)
      (xy 1.194361 -0.803054)
      (xy 1.13927 -0.773333)
      (xy 1.060705 -0.752248)
      (xy 0.943164 -0.738321)
      (xy 0.771142 -0.730075)
      (xy 0.529137 -0.726034)
      (xy 0.201645 -0.724721)
      (xy 0 -0.724625)
      (xy -0.37531 -0.725)
      (xy -0.657216 -0.727169)
      (xy -0.861091 -0.732702)
      (xy -1.002311 -0.743167)
      (xy -1.096249 -0.760132)
      (xy -1.158281 -0.785167)
      (xy -1.20378 -0.819839)
      (xy -1.23386 -0.850508)
      (xy -1.317919 -0.967333)
      (xy -1.352121 -1.068066)
      (xy -1.344185 -1.096448)
      (xy -1.31214 -1.118328)
      (xy -1.243634 -1.13454)
      (xy -1.12631 -1.145917)
      (xy -0.947814 -1.153292)
      (xy -0.695793 -1.157498)
      (xy -0.357891 -1.159368)
      (xy 0.007622 -1.159743)
    ) (layer "F.SilkS") (width 0) (fill solid) (tstamp e1e2960d-a063-4ae1-8e21-2045d4a35a62))
  (fp_rect (start -1.9 -1.2) (end 1.9 1.3) (layer "F.CrtYd") (width 0.05) (fill none) (tstamp 9adc6e1f-9fc2-4115-b32d-4da435c756b9))
  (fp_rect (start 1.8 -1.1) (end -1.8 1.2) (layer "F.Fab") (width 0.1) (fill none) (tstamp 89c162de-8374-4cb6-9c74-abac2a052a8d))
)
