(module TE_RZ_NConly_5mm_relay (layer F.Cu) (tedit 5B06F6C2)
  (fp_text reference REF** (at 0 -7.19) (layer F.SilkS)
    (effects (font (size 1 1) (thickness 0.15)))
  )
  (fp_text value TE_RZ_NConly_5mm_relay (at 0 -5.5) (layer F.Fab)
    (effects (font (size 1 1) (thickness 0.15)))
  )
  (fp_line (start -14.5 6.35) (end -14.5 -6.35) (layer F.SilkS) (width 0.15))
  (fp_line (start -14.5 -6.35) (end 14.5 -6.35) (layer F.SilkS) (width 0.15))
  (fp_line (start 14.5 -6.35) (end 14.5 6.35) (layer F.SilkS) (width 0.15))
  (fp_line (start 14.5 6.35) (end -14.5 6.35) (layer F.SilkS) (width 0.15))
  (pad 11 thru_hole circle (at 8.15 3.75) (size 2 2) (drill 1.3) (layers *.Cu *.Mask))
  (pad 14 thru_hole circle (at 13.19 3.75) (size 2 2) (drill 1.3) (layers *.Cu *.Mask))
  (pad 11 thru_hole circle (at 8.15 -3.75) (size 2 2) (drill 1.3) (layers *.Cu *.Mask))
  (pad 14 thru_hole circle (at 13.19 -3.75) (size 2 2) (drill 1.3) (layers *.Cu *.Mask))
  (pad A1 thru_hole circle (at -12.01 -3.75) (size 2 2) (drill 1.3) (layers *.Cu *.Mask))
  (pad A2 thru_hole circle (at -12.01 3.75) (size 2 2) (drill 1.3) (layers *.Cu *.Mask))
  (model ${KICADLIB}/model/mechanical/TE_RZ_NConly_5mm_relay.step
    (at (xyz 0 0 0))
    (scale (xyz 1 1 1))
    (rotate (xyz 0 0 0))
  )
)
