(footprint "ANT_johanson_0900AT43A0070" (version 20211014) (generator pcbnew)
  (layer "F.Cu")
  (tedit 61CF4149)
  (attr smd)
  (fp_text reference "REF**" (at 0 -2) (layer "F.SilkS")
    (effects (font (size 1 1) (thickness 0.15)))
    (tstamp 89375b13-18a9-40ba-88cc-5f6dfafa73ca)
  )
  (fp_text value "ANT_johanson_0900AT43A0070" (at 0 2) (layer "F.Fab") hide
    (effects (font (size 1 1) (thickness 0.15)))
    (tstamp a37ddcd2-796f-4cd1-b776-a1d992aa4709)
  )
  (fp_text user "${REFERENCE}" (at 0 0 unlocked) (layer "F.Fab")
    (effects (font (size 1 1) (thickness 0.15)))
    (tstamp d7acd440-c3ef-47e9-a683-90951d1161c6)
  )
  (fp_line (start -1.5 -0.1) (end -1.5 0.1) (layer "F.SilkS") (width 0.15) (tstamp 0b1a55d4-8b8f-440d-bf25-8524b7784bc3))
  (fp_line (start -2.65 1) (end 2.65 1) (layer "F.SilkS") (width 0.15) (tstamp 58288589-be52-4479-8c01-25ab274fb0d4))
  (fp_line (start 2.65 -1) (end -2.65 -1) (layer "F.SilkS") (width 0.15) (tstamp 5f08df36-5395-4e0e-be45-8a4d726361df))
  (fp_line (start -2.4 0.1) (end -2.4 0) (layer "F.SilkS") (width 0.15) (tstamp 78f19054-7769-4bc0-994c-99e164912d95))
  (fp_line (start -2.3 0) (end -1.6 0) (layer "F.SilkS") (width 0.15) (tstamp 7cc38ff3-ca5e-4c73-af79-55b1de0a35a0))
  (fp_line (start -2.4 0) (end -2.4 -0.1) (layer "F.SilkS") (width 0.15) (tstamp 850189b0-e452-45f5-9531-dc8732f31392))
  (fp_line (start -1.5 0.1) (end -2.4 0.1) (layer "F.SilkS") (width 0.15) (tstamp dd69aa90-41ff-4783-9200-4105cb14cf33))
  (fp_line (start -2.4 -0.1) (end -1.5 -0.1) (layer "F.SilkS") (width 0.15) (tstamp eafd3b5d-e93d-47b2-9afa-3e24f5179c5e))
  (fp_line (start 4.1 -1.1) (end 4.1 1.15) (layer "F.CrtYd") (width 0.05) (tstamp 1db7d933-f7ba-4d0a-a22c-dca53cd570a2))
  (fp_line (start 4.1 1.15) (end -4.1 1.15) (layer "F.CrtYd") (width 0.05) (tstamp 205e81e8-4bb8-440d-8c4d-92c69551d6cb))
  (fp_line (start -4.1 -1.1) (end 4.1 -1.1) (layer "F.CrtYd") (width 0.05) (tstamp 38c6b9e6-a759-4027-a782-6d2e98595275))
  (fp_line (start -4.1 1.15) (end -4.1 -1.1) (layer "F.CrtYd") (width 0.05) (tstamp 589efc48-8e42-4c0a-be71-ddc124ff99e1))
  (fp_line (start 3.5 -1) (end 3.5 1) (layer "F.Fab") (width 0.1) (tstamp 01aaad61-51a6-415d-8ed8-7e54666b1e3d))
  (fp_line (start -3 -1) (end 3.5 -1) (layer "F.Fab") (width 0.1) (tstamp 1811179a-50a4-44e9-b26c-e5cccd0a3caf))
  (fp_line (start 3.5 1) (end -3.5 1) (layer "F.Fab") (width 0.1) (tstamp 2da29013-6eb9-4c67-a8a7-306f53a26157))
  (fp_line (start -3.5 1) (end -3.5 -0.5) (layer "F.Fab") (width 0.1) (tstamp c55f9113-fc5f-4d70-a54d-da849961c0b1))
  (fp_line (start -3.5 -0.5) (end -3 -1) (layer "F.Fab") (width 0.1) (tstamp cd013a6d-daf8-4f29-a75e-95b550c78177))
  (pad "1" smd rect (at -3.375 0) (size 1.25 2) (layers "F.Cu" "F.Paste" "F.Mask") (tstamp 822e02d6-5e7b-4fcf-b19b-f358ea1a4cda))
  (pad "2" smd rect (at 3.375 0) (size 1.25 2) (layers "F.Cu" "F.Paste" "F.Mask") (tstamp 6382df3c-852d-4587-b9cc-181d0f2142d0))
  (model "${KICADLIB}/model/RF/johanson_0900AT43A0070.step"
    (offset (xyz 0 0 0))
    (scale (xyz 1 1 1))
    (rotate (xyz 0 0 0))
  )
)
