(module "CUI_PJ-063BH" (layer F.Cu) (tedit 5F565AD8)
  (attr through_hole)
  (fp_text reference "REF**" (at 0 11.3 unlocked) (layer F.SilkS)
    (effects (font (size 1 1) (thickness 0.15)))
    (tstamp f6ead592-403b-418e-9d59-63c58b3d8f0e)
  )
  (fp_text value "CUI_PJ-063BH" (at 0 11.3 unlocked) (layer F.Fab) hide
    (effects (font (size 1 1) (thickness 0.15)))
    (tstamp 9cbc33f6-ed0d-4785-bc9d-12c647cce35e)
  )
  (fp_text user "^" (at 0 10.9 unlocked) (layer F.SilkS)
    (effects (font (size 1 1) (thickness 0.15)))
    (tstamp b1c22810-888c-4f3a-b74a-c514959ff5ae)
  )
  (fp_text user "${REFERENCE}" (at 0 0 unlocked) (layer F.Fab)
    (effects (font (size 1 1) (thickness 0.15)))
    (tstamp d6cf3fad-c15e-4fbd-a300-ee6c004d982c)
  )
  (fp_line (start -5 -3) (end 5 -3) (layer F.SilkS) (width 0.12) (tstamp 34db03cf-a136-42fb-b311-7e6fdce744a2))
  (fp_line (start -5 3.7) (end -5 10) (layer F.SilkS) (width 0.12) (tstamp 775dd0a9-5a40-47c8-ac71-1d909182ec7c))
  (fp_line (start 5 3.7) (end 5 10) (layer F.SilkS) (width 0.12) (tstamp b26d5ccc-82a5-466f-8b9a-6c31372aecd2))
  (fp_line (start 5 10) (end -5 10) (layer F.SilkS) (width 0.12) (tstamp b84ffaa1-01a8-4034-adc9-a81d81655e1e))
  (fp_line (start 5 -3) (end 5 0.3) (layer F.SilkS) (width 0.12) (tstamp b980d117-5ffb-4475-b0d6-070b6d438f15))
  (fp_line (start -5 0.3) (end -5 -3) (layer F.SilkS) (width 0.12) (tstamp e8acb863-4bb3-4ae8-ad51-275e98ef7f23))
  (fp_line (start -5.6 -1.999072) (end 5.6 -1.999072) (layer Eco1.User) (width 0.1) (tstamp 95d44335-0cb6-43dd-90c2-77f569baeb3c))
  (fp_rect (start -5.6 -3.2) (end 5.6 10.5) (layer F.CrtYd) (width 0.05) (tstamp 3527915f-74e1-44c6-a33d-d83569f5f178))
  (fp_line (start -1 10) (end -5 10) (layer F.Fab) (width 0.1) (tstamp 4ea1a5ea-7e5d-4044-aa15-8184d40a5609))
  (fp_line (start 1 10) (end 0 9) (layer F.Fab) (width 0.1) (tstamp a7497c40-9d39-42d9-9ba8-5bf77ac0b7b7))
  (fp_line (start -5 -3) (end 5 -3) (layer F.Fab) (width 0.1) (tstamp b953e833-4250-443a-9452-e0a8927496a6))
  (fp_line (start 5 10) (end 1 10) (layer F.Fab) (width 0.1) (tstamp bf11b38d-19b3-47b9-927f-ef52766b9b4d))
  (fp_line (start 0 9) (end -1 10) (layer F.Fab) (width 0.1) (tstamp e2b5ce39-d068-4f1d-84d0-9fd0a6148041))
  (fp_line (start 5 -3) (end 5 10) (layer F.Fab) (width 0.1) (tstamp ea0668d6-58e0-46c6-851d-55fc09168dc5))
  (fp_line (start -5 10) (end -5 -3) (layer F.Fab) (width 0.1) (tstamp f679c69b-a324-4efa-9c84-f709fd102052))
  (pad "" thru_hole oval (at -4.5 2 180) (size 1.8 3.3) (drill oval 1 2.5) (layers *.Cu *.Mask) (tstamp 210da9cd-8bc2-4161-a741-16eb086f392e))
  (pad "" thru_hole oval (at 4.5 2 180) (size 1.8 3.3) (drill oval 1 2.5) (layers *.Cu *.Mask) (tstamp 7aac6fc5-dc86-4760-a776-bf90475f077e))
  (pad "" thru_hole circle (at 0 0) (size 1.6 1.6) (drill 1.6) (layers *.Cu *.Mask) (tstamp 87eab72a-ccd8-4665-bd00-74a96591c5bd))
  (pad "1" thru_hole oval (at 0 9 90) (size 1.8 3.8) (drill oval 1 3) (layers *.Cu *.Mask) (tstamp f81e9d13-42bc-4e90-8417-5f6a52cf8a5c))
  (pad "2" thru_hole oval (at 0 3 90) (size 1.8 3.2) (drill oval 1 2.3) (layers *.Cu *.Mask) (tstamp c50b6493-7642-47f6-9774-6e888599e26b))
  (model "${KICADLIB}/model/connector/CUI_PJ-063BH.step"
    (offset (xyz 0 3 5))
    (scale (xyz 1 1 1))
    (rotate (xyz -90 0 180))
  )
)
