(footprint "Con_SMA_M_TH_Straight" (version 20210722) (generator pcbnew) (layer "F.Cu")
  (tedit 611EC558)
  (attr through_hole)
  (fp_text reference "${REFERENCE}" (at 0 -4.5) (layer "F.SilkS")
    (effects (font (size 1 1) (thickness 0.15)))
    (tstamp bff4df56-8936-4478-88f5-8d4c632c720f)
  )
  (fp_text value "Con_SMA_M_TH_Straight" (at 0 4.5) (layer "F.Fab") hide
    (effects (font (size 1 1) (thickness 0.15)))
    (tstamp 9c7eaad6-d630-4ae0-b8ad-84253deb3d5d)
  )
  (fp_text user "${REFERENCE}" (at 0 0 unlocked) (layer "F.Fab")
    (effects (font (size 1 1) (thickness 0.15)))
    (tstamp 1c3e800a-c512-4918-9015-d088c55cee1b)
  )
  (fp_line (start -3.2 -1.5) (end -3.2 1.5) (layer "F.SilkS") (width 0.15) (tstamp 5efa6350-caa2-482f-8137-8343d8b06ba8))
  (fp_line (start -1.5 3.2) (end 1.5 3.2) (layer "F.SilkS") (width 0.15) (tstamp 623d4306-3288-4743-a95a-cc4a33f07eee))
  (fp_line (start 3.2 1.5) (end 3.2 -1.5) (layer "F.SilkS") (width 0.15) (tstamp 70940fb5-8685-4795-8576-6c62200f59b1))
  (fp_line (start 1.5 -3.2) (end -1.5 -3.2) (layer "F.SilkS") (width 0.15) (tstamp 8a89e3c5-d581-44d8-85f4-0132a93d3c68))
  (fp_circle (center 0 0) (end 0 -2) (layer "F.SilkS") (width 0.15) (fill none) (tstamp f38b2662-c797-43f8-ae72-50da6022b667))
  (fp_line (start 6.54 -2.54) (end 6.54 2.54) (layer "Dwgs.User") (width 0.11) (tstamp 2c72b07e-a43e-4dcc-8031-35cde64e3954))
  (fp_line (start -2.54 -6.54) (end 2.54 -6.54) (layer "Dwgs.User") (width 0.11) (tstamp 95742b30-ed9c-4646-9dd2-f101a5363153))
  (fp_line (start 2.54 6.54) (end -2.54 6.54) (layer "Dwgs.User") (width 0.11) (tstamp b0476007-c49a-42f3-a755-6fc2c19ebb4d))
  (fp_line (start -6.54 2.54) (end -6.54 -2.54) (layer "Dwgs.User") (width 0.11) (tstamp e9cb08f8-2e97-4155-a09f-4955c9a1a403))
  (fp_arc (start 2.54 -2.54) (end 6.54 -2.54) (angle -90) (layer "Dwgs.User") (width 0.11) (tstamp 4682d221-be55-4d55-874f-5946651c9211))
  (fp_arc (start -2.54 -2.54) (end -2.54 -6.54) (angle -90) (layer "Dwgs.User") (width 0.11) (tstamp 58b15725-e1df-4518-9fea-741693b4de8b))
  (fp_arc (start -2.54 2.54) (end -6.54 2.54) (angle -90) (layer "Dwgs.User") (width 0.11) (tstamp c20a48fe-3900-45c0-a200-9d839f4ab944))
  (fp_arc (start 2.54 2.54) (end 2.54 6.54) (angle -90) (layer "Dwgs.User") (width 0.11) (tstamp ebce7437-3844-4df5-8fd4-012ce03e31f3))
  (fp_circle (center 0 0) (end -5 0) (layer "Cmts.User") (width 0.11) (fill none) (tstamp 0d9b688e-d993-443f-963f-6994401fb985))
  (pad "1" thru_hole circle (at 0 0) (size 2.2 2.2) (drill 1.5) (layers *.Cu *.Mask) (tstamp 4fa71b9c-fb00-4b19-adb0-fb74049edcb0))
  (pad "2" thru_hole circle (at -2.54 2.54) (size 2.2 2.2) (drill 1.6) (layers *.Cu *.Mask) (tstamp 1c8e830d-5ec1-4abf-bd52-e26bdd698bfa))
  (pad "2" thru_hole circle (at 2.54 -2.54) (size 2.2 2.2) (drill 1.6) (layers *.Cu *.Mask) (tstamp 90f9425b-8a71-4cc2-b66e-4d46f2d7dc20))
  (pad "2" thru_hole circle (at 2.54 2.54) (size 2.2 2.2) (drill 1.6) (layers *.Cu *.Mask) (tstamp d01ec14a-05c2-4897-b66e-916b0106004a))
  (pad "2" thru_hole circle (at -2.54 -2.54) (size 2.2 2.2) (drill 1.6) (layers *.Cu *.Mask) (tstamp d06daa55-f798-466b-ba6e-f7763df395d2))
  (model "${KICADLIB}/model/connector/Molex_733910070.stp"
    (offset (xyz 0 -155.5 -216))
    (scale (xyz 1 1 1))
    (rotate (xyz 0 -90 0))
  )
)
