(module "DFN127P600X500-9" (layer F.Cu) (tedit 5EBB077D)
  (descr "DD Package; 8-Lead Plastic DFN (6mm x 5mm) (see http://www.everspin.com/file/236/download)")
  (tags "dfn ")
  (attr smd)
  (fp_text reference "REF**" (at 0 -3.5) (layer F.SilkS)
    (effects (font (size 1 1) (thickness 0.15)))
  )
  (fp_text value "DFN127P600X500-9" (at 0 3.65) (layer F.Fab) hide
    (effects (font (size 1 1) (thickness 0.15)))
  )
  (fp_line (start -3 2.5) (end 3 2.5) (layer F.SilkS) (width 0.12))
  (fp_line (start -3 -2.5) (end 3 -2.5) (layer F.SilkS) (width 0.12))
  (fp_line (start -3.7 -2.8) (end 3.7 -2.8) (layer F.CrtYd) (width 0.05))
  (fp_line (start 3.7 -2.8) (end 3.7 2.8) (layer F.CrtYd) (width 0.05))
  (fp_line (start 3.7 2.8) (end -3.7 2.8) (layer F.CrtYd) (width 0.05))
  (fp_line (start -3.7 2.8) (end -3.7 -2.8) (layer F.CrtYd) (width 0.05))
  (fp_line (start -2 -2.5) (end 3 -2.5) (layer F.Fab) (width 0.1))
  (fp_line (start 3 -2.5) (end 3 2.5) (layer F.Fab) (width 0.1))
  (fp_line (start 3 2.5) (end -3 2.5) (layer F.Fab) (width 0.1))
  (fp_line (start -3 2.5) (end -3 -1.5) (layer F.Fab) (width 0.1))
  (fp_line (start -2 -2.5) (end -3 -1.5) (layer F.Fab) (width 0.1))
  (fp_text user "${REFERENCE}" (at 0 0) (layer F.Fab)
    (effects (font (size 1 1) (thickness 0.15)))
  )
  (fp_text user "^" (at -4.2 -1.9 270 unlocked) (layer F.SilkS)
    (effects (font (size 1 1) (thickness 0.15)))
  )
  (pad "9" smd rect (at 0 0 270) (size 2 2) (layers "F.Cu" "F.Mask") (tstamp bc15a37d-3797-4b69-81c5-8a90283a11fa))
  (pad "1" smd rect (at -2.9 -1.905 270) (size 0.5 1.1) (layers "F.Cu" "F.Paste" "F.Mask") (tstamp fea3fe20-12d1-4cb7-8415-f7a5c230b584))
  (pad "2" smd rect (at -2.9 -0.635 270) (size 0.5 1.1) (layers "F.Cu" "F.Paste" "F.Mask") (tstamp e44ade30-055e-4926-88e7-b988e50dfa40))
  (pad "3" smd rect (at -2.9 0.635 270) (size 0.5 1.1) (layers "F.Cu" "F.Paste" "F.Mask") (tstamp 77c29505-2287-4633-848a-728fc518fe9a))
  (pad "4" smd rect (at -2.9 1.905 270) (size 0.5 1.1) (layers "F.Cu" "F.Paste" "F.Mask") (tstamp 2d927ecf-524d-4dc5-89de-f1cb055d86d6))
  (pad "5" smd rect (at 2.9 1.905 270) (size 0.5 1.1) (layers "F.Cu" "F.Paste" "F.Mask") (tstamp 5f6bdd48-a516-4d52-8bf0-1904d2f176bb))
  (pad "6" smd rect (at 2.9 0.635 270) (size 0.5 1.1) (layers "F.Cu" "F.Paste" "F.Mask") (tstamp 652cef26-6e35-4d72-98bf-da23d51659bc))
  (pad "7" smd rect (at 2.9 -0.635 270) (size 0.5 1.1) (layers "F.Cu" "F.Paste" "F.Mask") (tstamp 58c4dec2-04d1-459b-9ef8-b8b39493c8a7))
  (pad "8" smd rect (at 2.9 -1.905 270) (size 0.5 1.1) (layers "F.Cu" "F.Paste" "F.Mask") (tstamp b078b338-5af1-40dd-8b67-3f6cce5ec24a))
  (pad "" smd rect (at 0.5 -0.5 270) (size 0.8 0.8) (layers "F.Paste") (tstamp 3da11f28-e22c-404a-8e2d-d4230b0a1c68))
  (pad "" smd rect (at -0.5 -0.5 270) (size 0.8 0.8) (layers "F.Paste") (tstamp 58e8c3a0-8296-4e17-b008-c2b2411e54b7))
  (pad "" smd rect (at -0.5 0.5 270) (size 0.8 0.8) (layers "F.Paste") (tstamp 23314cf6-6c01-49c8-a504-ac5efc8668e5))
  (pad "" smd rect (at 0.5 0.5 270) (size 0.8 0.8) (layers "F.Paste") (tstamp 8411bd05-e756-434f-bc0f-d5ed8f87a1c3))
  (model "${KICADLIB}/model/DFN/DFN127P600X500-9.step"
    (at (xyz 0 0 0))
    (scale (xyz 1 1 1))
    (rotate (xyz 0 0 0))
  )
)
