(footprint "Keystone_3568" (version 20211014) (generator pcbnew)
  (layer "F.Cu")
  (tedit 61AA489F)
  (attr through_hole)
  (fp_text reference "REF**" (at 0 -4.25 unlocked) (layer "F.SilkS")
    (effects (font (size 1 1) (thickness 0.15)))
    (tstamp 1a2e6b1e-e366-4036-a5b0-114f0309312b)
  )
  (fp_text value "Keystone_3568" (at 0 -4.25 unlocked) (layer "F.Fab") hide
    (effects (font (size 1 1) (thickness 0.15)))
    (tstamp 58406bfc-4599-4ce8-9d91-3c8564a15a94)
  )
  (fp_text user "${REFERENCE}" (at 0 0 unlocked) (layer "F.Fab")
    (effects (font (size 1 1) (thickness 0.15)))
    (tstamp 57f7d881-b0c6-41bc-95c1-82a164e51400)
  )
  (fp_rect (start -8 -3.4) (end -8 3.4) (layer "F.SilkS") (width 0.12) (fill none) (tstamp dbcb413c-a023-4493-9f55-31740df01bac))
  (fp_rect (start 8 3.4) (end 8 -3.4) (layer "F.SilkS") (width 0.12) (fill none) (tstamp e0dc3887-79ed-4208-85eb-128ff97389e1))
  (fp_rect (start 8 -3.4) (end -8 -3.4) (layer "F.SilkS") (width 0.12) (fill none) (tstamp e98e80bc-7832-40a1-96d2-100878304162))
  (fp_rect (start -8 3.4) (end 8 3.4) (layer "F.SilkS") (width 0.12) (fill none) (tstamp fe0f625d-492b-4769-82ab-45da2fd9a90a))
  (fp_line (start 10.35 -1.7) (end 10.35 1.7) (layer "Dwgs.User") (width 0.1) (tstamp 1b050bf3-527d-45da-856b-d55a1ee5d05a))
  (fp_line (start -10.35 1.7) (end -10.35 -1.7) (layer "Dwgs.User") (width 0.1) (tstamp 3dc489b5-abf2-42ae-bd5c-2c992cffdf20))
  (fp_line (start -4.95 -7.1) (end 4.95 -7.1) (layer "Dwgs.User") (width 0.1) (tstamp c56bf43a-e1a1-4650-a460-a600ff9318f0))
  (fp_line (start 4.95 7.1) (end -4.95 7.1) (layer "Dwgs.User") (width 0.1) (tstamp fcdd6adf-3a3e-43fc-92e9-9ba3be4e6c82))
  (fp_arc (start -4.95 7.1) (mid -8.768377 5.518377) (end -10.35 1.7) (layer "Dwgs.User") (width 0.1) (tstamp 164fc2eb-9b53-4e3a-96a2-3496ca3dc020))
  (fp_arc (start -10.35 -1.7) (mid -8.768377 -5.518377) (end -4.95 -7.1) (layer "Dwgs.User") (width 0.1) (tstamp 2ba2999b-3232-41b2-8461-b5838d7b86eb))
  (fp_arc (start 4.95 -7.1) (mid 8.768377 -5.518377) (end 10.35 -1.7) (layer "Dwgs.User") (width 0.1) (tstamp 6087ea1e-5d8a-49d0-9c87-097559e4c908))
  (fp_arc (start 10.35 1.7) (mid 8.768377 5.518377) (end 4.95 7.1) (layer "Dwgs.User") (width 0.1) (tstamp cb1c5012-e368-435a-9513-e069c080c582))
  (fp_rect (start -8.2 -3.6) (end 8.2 3.6) (layer "F.CrtYd") (width 0.05) (fill none) (tstamp b8c5aab1-a058-49de-896c-95a83e485ef1))
  (fp_line (start 8 -3.4) (end 8 3.4) (layer "F.Fab") (width 0.1) (tstamp 38e81105-0a71-4de8-8caa-84b97d003d1f))
  (fp_line (start -8 -2.5) (end -7.1 -3.4) (layer "F.Fab") (width 0.1) (tstamp 3e840deb-5370-42ad-bd86-d4e7af7627d9))
  (fp_line (start -8 3.4) (end -8 -2.5) (layer "F.Fab") (width 0.1) (tstamp 8017b4fd-560c-4268-90e6-2c0d00782c59))
  (fp_line (start -7.1 -3.4) (end 8 -3.4) (layer "F.Fab") (width 0.1) (tstamp b153c5b8-a6c0-4db0-b06f-f5c0e95e9213))
  (fp_line (start 8 3.4) (end -8 3.4) (layer "F.Fab") (width 0.1) (tstamp c7ea83f1-9032-4483-b0d1-f486feb9c60c))
  (pad "1" thru_hole circle (at -4.95 -1.7) (size 2.8 2.8) (drill 1.8) (layers *.Cu *.Mask) (remove_unused_layers) (keep_end_layers) (tstamp 4e11faab-6fd8-408f-88d5-be2964a56f9c))
  (pad "1" thru_hole circle (at -4.95 1.7) (size 2.8 2.8) (drill 1.8) (layers *.Cu *.Mask) (remove_unused_layers) (keep_end_layers) (tstamp 9e3ccba7-caf3-4a49-83b6-85cc4316c6de))
  (pad "2" thru_hole circle (at 4.95 1.7) (size 2.8 2.8) (drill 1.8) (layers *.Cu *.Mask) (remove_unused_layers) (keep_end_layers) (tstamp 3a12cfcb-add8-4560-bc80-b4733d9bdf90))
  (pad "2" thru_hole circle (at 4.95 -1.7) (size 2.8 2.8) (drill 1.8) (layers *.Cu *.Mask) (remove_unused_layers) (keep_end_layers) (tstamp b0892f3f-821d-45e2-b8c8-60a65ae43984))
  (model "${KICADLIB}/model/other/Keystone-PN3568.STEP"
    (offset (xyz -1.1 0.3 5.1))
    (scale (xyz 1 1 1))
    (rotate (xyz -90 0 0))
  )
  (model "${KICADLIB}/model/other/Fuse_CarMiniBladeType1.stp"
    (offset (xyz 0 0 9))
    (scale (xyz 1 1 1))
    (rotate (xyz 0 0 0))
  )
)
