(module "Osram_SFH7072" (layer F.Cu) (tedit 5ECDA774)
  (fp_text reference "REF**" (at 0 2.9 unlocked) (layer F.SilkS)
    (effects (font (size 1 1) (thickness 0.15)))
  )
  (fp_text value "Osram_SFH7072" (at 0 2.8 unlocked) (layer F.Fab) hide
    (effects (font (size 1 1) (thickness 0.15)))
  )
  (fp_text user "${REFERENCE}" (at 0 0 unlocked) (layer F.Fab)
    (effects (font (size 1 1) (thickness 0.15)))
  )
  (fp_line (start -3.9 -2.1) (end -3.9 2.1) (layer F.CrtYd) (width 0.05))
  (fp_line (start -3.9 2.1) (end 3.9 2.1) (layer F.CrtYd) (width 0.05))
  (fp_line (start 3.9 2.1) (end 3.9 -2.1) (layer F.CrtYd) (width 0.05))
  (fp_line (start 3.9 -2.1) (end -3.9 -2.1) (layer F.CrtYd) (width 0.05))
  (fp_line (start -3.75 -1.95) (end -3.75 1.95) (layer F.SilkS) (width 0.1))
  (fp_line (start -3.75 1.95) (end 3.75 1.95) (layer F.SilkS) (width 0.1))
  (fp_line (start 3.75 1.95) (end 3.75 -1.95) (layer F.SilkS) (width 0.1))
  (fp_line (start 3.75 -1.95) (end -3.75 -1.95) (layer F.SilkS) (width 0.1))
  (fp_line (start -3.75 -1.95) (end -3.75 1.55) (layer F.Fab) (width 0.1))
  (fp_line (start -3.35 1.95) (end 3.75 1.95) (layer F.Fab) (width 0.1))
  (fp_line (start 3.75 1.95) (end 3.75 -1.95) (layer F.Fab) (width 0.1))
  (fp_line (start 3.75 -1.95) (end -3.75 -1.95) (layer F.Fab) (width 0.1))
  (fp_line (start -3.35 1.95) (end -3.75 1.55) (layer F.Fab) (width 0.1))
  (fp_text user "^" (at -3.05 2.75 unlocked) (layer F.SilkS)
    (effects (font (size 1 1) (thickness 0.15)))
  )
  (pad "1" smd rect (at -3 1.25) (size 0.9 1) (layers "F.Cu" "F.Paste" "F.Mask")
    (solder_mask_margin -0.05) (tstamp eb15281f-3701-4ba6-b185-e889478284d2))
  (pad "2" smd rect (at -1.8 1.25) (size 0.9 1) (layers "F.Cu" "F.Paste" "F.Mask")
    (solder_mask_margin -0.05) (tstamp 5a4355d8-4a20-4117-8f87-b2391b12b216))
  (pad "3" smd rect (at -0.6 1.25) (size 0.9 1) (layers "F.Cu" "F.Paste" "F.Mask")
    (solder_mask_margin -0.05) (tstamp 0f3e7977-1b07-4d20-9b34-e5ea7f02e50b))
  (pad "4" smd rect (at 0.6 1.25) (size 0.9 1) (layers "F.Cu" "F.Paste" "F.Mask")
    (solder_mask_margin -0.05) (tstamp dc30675c-b75d-4d5e-a46c-e5564a81d62e))
  (pad "5" smd rect (at 1.8 1.25) (size 0.9 1) (layers "F.Cu" "F.Paste" "F.Mask")
    (solder_mask_margin -0.05) (tstamp 7a9ab35a-05e5-4f63-af9f-fefb623304d1))
  (pad "6" smd rect (at 3 1.25) (size 0.9 1) (layers "F.Cu" "F.Paste" "F.Mask")
    (solder_mask_margin -0.05) (tstamp 4adf0bb8-971a-4f86-b025-e51a781d61f1))
  (pad "7" smd rect (at 3 -1.25) (size 0.9 1) (layers "F.Cu" "F.Paste" "F.Mask")
    (solder_mask_margin -0.05) (tstamp 96407041-5944-4431-bb9e-9dbefbeaa1be))
  (pad "8" smd rect (at 1.8 -1.25) (size 0.9 1) (layers "F.Cu" "F.Paste" "F.Mask")
    (solder_mask_margin -0.05) (tstamp 28578ce3-f187-47e1-af0a-0bf736bb3fb2))
  (pad "9" smd rect (at 0.6 -1.25) (size 0.9 1) (layers "F.Cu" "F.Paste" "F.Mask")
    (solder_mask_margin -0.05) (tstamp 5bc8025c-d95f-4b70-9659-e5980937b0e5))
  (pad "10" smd rect (at -0.6 -1.25) (size 0.9 1) (layers "F.Cu" "F.Paste" "F.Mask")
    (solder_mask_margin -0.05) (tstamp 404de4e6-89f2-4a40-b21a-8547d6806bb4))
  (pad "11" smd rect (at -1.8 -1.25) (size 0.9 1) (layers "F.Cu" "F.Paste" "F.Mask")
    (solder_mask_margin -0.05) (tstamp db60e04a-b769-46e7-a679-0d004fd6e99d))
  (pad "12" smd rect (at -3 -1.25) (size 0.9 1) (layers "F.Cu" "F.Paste" "F.Mask")
    (solder_mask_margin -0.05) (tstamp e81b65ac-b764-4249-9a5d-7d62cef5a44a))
  (model "${KICADLIB}/model/other/Osram_SFH7072.step"
    (offset (xyz 0 0 0.05))
    (scale (xyz 1 1 1))
    (rotate (xyz 0 0 90))
  )
)
