(footprint "PinHeader_1x06_P1.27mm_Vertical" (version 20211014) (generator pcbnew)
  (layer "F.Cu")
  (tedit 6116C509)
  (descr "Through hole straight pin header, 1x06, 1.27mm pitch, single row")
  (tags "Through hole pin header THT 1x06 1.27mm single row")
  (attr through_hole)
  (fp_text reference "REF**" (at 0 -1.695) (layer "F.SilkS")
    (effects (font (size 1 1) (thickness 0.15)))
    (tstamp 7ed4335d-14f2-4e22-8033-7b21d969b2ac)
  )
  (fp_text value "PinHeader_1x06_P1.27mm_Vertical" (at 0 8.045) (layer "F.Fab") hide
    (effects (font (size 1 1) (thickness 0.15)))
    (tstamp 918aaca4-ad2a-43aa-ba00-49afb7d4c3a3)
  )
  (fp_text user "${REFERENCE}" (at 0 3.175 90) (layer "F.Fab")
    (effects (font (size 1 1) (thickness 0.15)))
    (tstamp 33fd6833-c2ac-4362-8294-aa7c1373a03f)
  )
  (fp_line (start -1.11 7.045) (end -0.30753 7.045) (layer "F.SilkS") (width 0.12) (tstamp 020f74d5-20fd-4564-a072-15f7afc7dbef))
  (fp_line (start 0.563471 0.76) (end 1.11 0.76) (layer "F.SilkS") (width 0.12) (tstamp 125bd835-7874-4044-addb-a0834182888b))
  (fp_line (start 1.11 0.76) (end 1.11 7.045) (layer "F.SilkS") (width 0.12) (tstamp 7cfe4506-b991-4fbe-958d-d298a41a551f))
  (fp_line (start -1.11 0.76) (end -0.563471 0.76) (layer "F.SilkS") (width 0.12) (tstamp 89884e76-49c1-4027-815f-048d874c93d2))
  (fp_line (start -1.11 0) (end -1.11 -0.76) (layer "F.SilkS") (width 0.12) (tstamp 8a05bde7-6bd1-4a56-bbb0-fef95f711451))
  (fp_line (start -1.11 -0.76) (end 0 -0.76) (layer "F.SilkS") (width 0.12) (tstamp 8b0f31b4-38be-49c4-8ef8-612df0e0a8ba))
  (fp_line (start 0.30753 7.045) (end 1.11 7.045) (layer "F.SilkS") (width 0.12) (tstamp a82f9e10-5681-4cc4-81b7-f2ae7058aa18))
  (fp_line (start -1.11 0.76) (end -1.11 7.045) (layer "F.SilkS") (width 0.12) (tstamp bc09589d-72a3-4b23-8343-5a99b1d782f7))
  (fp_line (start 1.55 7.5) (end 1.55 -1.15) (layer "F.CrtYd") (width 0.05) (tstamp 53a4a691-9f87-4cb8-8286-e6c0c7b42b73))
  (fp_line (start -1.55 -1.15) (end -1.55 7.5) (layer "F.CrtYd") (width 0.05) (tstamp 5869499a-cd89-4e7a-8cf6-7c6ab49e375a))
  (fp_line (start 1.55 -1.15) (end -1.55 -1.15) (layer "F.CrtYd") (width 0.05) (tstamp 9d2ab3c3-a00b-47e6-be2b-831cd5fdba78))
  (fp_line (start -1.55 7.5) (end 1.55 7.5) (layer "F.CrtYd") (width 0.05) (tstamp e8b6323d-2dfd-4ade-b9e2-8b9a27153265))
  (fp_line (start -1.05 -0.11) (end -0.525 -0.635) (layer "F.Fab") (width 0.1) (tstamp 045b0f1b-203a-4e8e-85c3-a51159d7a937))
  (fp_line (start -0.525 -0.635) (end 1.05 -0.635) (layer "F.Fab") (width 0.1) (tstamp 87cf4c4e-70ac-4137-b9e2-e1b43c0f5c55))
  (fp_line (start 1.05 -0.635) (end 1.05 6.985) (layer "F.Fab") (width 0.1) (tstamp 90101f02-4a26-4972-8aa8-e949e584853c))
  (fp_line (start -1.05 6.985) (end -1.05 -0.11) (layer "F.Fab") (width 0.1) (tstamp b4d001ad-9b1f-417c-8b6b-c1fbdef5cbbf))
  (fp_line (start 1.05 6.985) (end -1.05 6.985) (layer "F.Fab") (width 0.1) (tstamp d820ca01-35db-4e54-a113-b7491b7bf128))
  (pad "1" thru_hole rect (at 0 0) (size 1 1) (drill 0.65) (layers *.Cu *.Mask) (tstamp f693fa71-f153-47f3-9872-70c9a54154cb))
  (pad "2" thru_hole oval (at 0 1.27) (size 1 1) (drill 0.65) (layers *.Cu *.Mask) (tstamp 5c9504d4-01da-413e-858c-5b2f851afc51))
  (pad "3" thru_hole oval (at 0 2.54) (size 1 1) (drill 0.65) (layers *.Cu *.Mask) (tstamp 207edfa4-4625-45bd-93f1-053473e4c8eb))
  (pad "4" thru_hole oval (at 0 3.81) (size 1 1) (drill 0.65) (layers *.Cu *.Mask) (tstamp 7f458bc6-a93d-462b-bd78-ca9664edf638))
  (pad "5" thru_hole oval (at 0 5.08) (size 1 1) (drill 0.65) (layers *.Cu *.Mask) (tstamp 61f93e62-b358-4d6d-928c-28140027956b))
  (pad "6" thru_hole oval (at 0 6.35) (size 1 1) (drill 0.65) (layers *.Cu *.Mask) (tstamp 86f720b3-829a-47dd-8484-d20dd9e19749))
  (model "${KICADLIB}/model/connector/PinHeader_1x06_P1.27mm_Vertical.step"
    (offset (xyz 0 0 0))
    (scale (xyz 1 1 1))
    (rotate (xyz 0 0 0))
  )
)
