(footprint "BGA112N80P11X11_1000X1000X130" (version 20210228) (generator pcbnew) (layer "F.Cu")
  (tedit 60523958)
  (attr smd)
  (fp_text reference "REF**" (at 0 -6) (layer "F.SilkS")
    (effects (font (size 1 1) (thickness 0.15)))
    (tstamp 080740f9-9198-4d49-a2eb-0fd183cbf051)
  )
  (fp_text value "BGA112N80P11X11_1000X1000X130" (at 0 6) (layer "F.Fab") hide
    (effects (font (size 1 1) (thickness 0.15)))
    (tstamp a54da81b-e477-45d2-af74-13b351461e73)
  )
  (fp_text user "^" (at -5.8 -4 270 unlocked) (layer "F.SilkS")
    (effects (font (size 1 1) (thickness 0.15)))
    (tstamp 65a66158-ae30-4c04-9ca5-46523d8da4f2)
  )
  (fp_text user "${REFERENCE}" (at 0 0 unlocked) (layer "F.Fab")
    (effects (font (size 1 1) (thickness 0.15)))
    (tstamp d8e54dd2-47e4-4b63-82dc-2717314e5d78)
  )
  (fp_line (start -5 -5) (end -5 -2.65) (layer "F.SilkS") (width 0.15) (tstamp 284f65ae-7e41-4b63-8108-9f519f4498b9))
  (fp_line (start 5 5) (end 5 2.5) (layer "F.SilkS") (width 0.15) (tstamp 44266589-c365-458d-be0e-26ceff1817f9))
  (fp_line (start 5 -5) (end 5 -2.5) (layer "F.SilkS") (width 0.15) (tstamp 4980f982-7bab-468d-a934-3e6a787f6287))
  (fp_line (start -2.65 -5) (end -5 -5) (layer "F.SilkS") (width 0.15) (tstamp 6341e278-0788-4056-8f62-1e93fb7ca9fa))
  (fp_line (start -2.5 5) (end -5 5) (layer "F.SilkS") (width 0.15) (tstamp 634d04ed-e00b-467c-8960-28f5f5ec0f49))
  (fp_line (start -5 5) (end -5 2.5) (layer "F.SilkS") (width 0.15) (tstamp af18aa53-ff5d-4794-95ac-84307c39979d))
  (fp_line (start 2.5 5) (end 5 5) (layer "F.SilkS") (width 0.15) (tstamp b850173e-bc92-4efe-b73a-3859dc2e56ca))
  (fp_line (start 2.5 -5) (end 5 -5) (layer "F.SilkS") (width 0.15) (tstamp cbe6cc19-08d7-4926-8d1b-4c631190ec64))
  (fp_line (start -5.2 -5.2) (end 5.2 -5.2) (layer "F.CrtYd") (width 0.05) (tstamp 64fd7047-6ace-45ee-ac1d-6cb13389a3b5))
  (fp_line (start -5.2 5.2) (end -5.2 -5.2) (layer "F.CrtYd") (width 0.05) (tstamp be113e8c-0c2e-427d-9380-25a8891f31a2))
  (fp_line (start 5.2 5.2) (end -5.2 5.2) (layer "F.CrtYd") (width 0.05) (tstamp c172a9ee-6592-4409-b7f1-3c72a81a2004))
  (fp_line (start 5.2 -5.2) (end 5.2 5.2) (layer "F.CrtYd") (width 0.05) (tstamp d1fc19da-4ece-4b7a-8e1d-1ad5732d522f))
  (fp_line (start -5 5) (end 5 5) (layer "F.Fab") (width 0.1) (tstamp 34185d00-40cd-4333-ae26-40367facfd02))
  (fp_line (start 5 -5) (end -4 -5) (layer "F.Fab") (width 0.1) (tstamp 8c239ac3-8095-45bc-be63-f2831079f535))
  (fp_line (start -4 -5) (end -5 -4) (layer "F.Fab") (width 0.1) (tstamp 94e96c15-0698-4ec2-888f-dc4ee5c44c5d))
  (fp_line (start -5 -4) (end -5 5) (layer "F.Fab") (width 0.1) (tstamp d7874067-5fae-4c9c-a1ac-68581aad1ff1))
  (fp_line (start 5 5) (end 5 -5) (layer "F.Fab") (width 0.1) (tstamp fc14b708-2162-4aae-b1a0-127c4565aed7))
  (pad "A1" smd circle (at -4 -4) (size 0.4 0.4) (layers "F.Cu" "F.Paste" "F.Mask")
    (solder_mask_margin 0.05) (tstamp 33b37dfe-c21a-473a-9c3b-4b965701fe49))
  (pad "A2" smd circle (at -3.2 -4) (size 0.4 0.4) (layers "F.Cu" "F.Paste" "F.Mask")
    (solder_mask_margin 0.05) (tstamp 6d23ded3-edfe-49ee-9d50-6a109c1854e5))
  (pad "A3" smd circle (at -2.4 -4) (size 0.4 0.4) (layers "F.Cu" "F.Paste" "F.Mask")
    (solder_mask_margin 0.05) (tstamp 05e60def-9c11-4a6e-a2d0-84c3539c5f8a))
  (pad "A4" smd circle (at -1.6 -4) (size 0.4 0.4) (layers "F.Cu" "F.Paste" "F.Mask")
    (solder_mask_margin 0.05) (tstamp 4f059897-d064-4ad7-89d6-864b5376b17b))
  (pad "A5" smd circle (at -0.8 -4) (size 0.4 0.4) (layers "F.Cu" "F.Paste" "F.Mask")
    (solder_mask_margin 0.05) (tstamp 3507f25f-e0e1-4378-ab0e-89908dfe83fa))
  (pad "A6" smd circle (at 0 -4) (size 0.4 0.4) (layers "F.Cu" "F.Paste" "F.Mask")
    (solder_mask_margin 0.05) (tstamp c943e2bf-cbcd-4541-800f-020e6f6669cf))
  (pad "A7" smd circle (at 0.8 -4) (size 0.4 0.4) (layers "F.Cu" "F.Paste" "F.Mask")
    (solder_mask_margin 0.05) (tstamp 15ec2c7f-d084-4835-bc86-84bf3199e58d))
  (pad "A8" smd circle (at 1.6 -4) (size 0.4 0.4) (layers "F.Cu" "F.Paste" "F.Mask")
    (solder_mask_margin 0.05) (tstamp 69b791e8-e94f-4bf4-a571-89e04e78a084))
  (pad "A9" smd circle (at 2.4 -4) (size 0.4 0.4) (layers "F.Cu" "F.Paste" "F.Mask")
    (solder_mask_margin 0.05) (tstamp 73277a59-5a32-4831-b075-3263ffaa8b84))
  (pad "A10" smd circle (at 3.2 -4) (size 0.4 0.4) (layers "F.Cu" "F.Paste" "F.Mask")
    (solder_mask_margin 0.05) (tstamp 4cabbda5-d669-4202-a798-6f17b19a7303))
  (pad "A11" smd circle (at 4 -4) (size 0.4 0.4) (layers "F.Cu" "F.Paste" "F.Mask")
    (solder_mask_margin 0.05) (tstamp 69285e37-70c5-4bea-853d-d54743d70ad7))
  (pad "B1" smd circle (at -4 -3.2) (size 0.4 0.4) (layers "F.Cu" "F.Paste" "F.Mask")
    (solder_mask_margin 0.05) (tstamp 1de95a5d-a847-4807-8d19-c327200bf686))
  (pad "B2" smd circle (at -3.2 -3.2) (size 0.4 0.4) (layers "F.Cu" "F.Paste" "F.Mask")
    (solder_mask_margin 0.05) (tstamp 042edc1c-d848-41a5-8612-3e7dc050f7ec))
  (pad "B3" smd circle (at -2.4 -3.2) (size 0.4 0.4) (layers "F.Cu" "F.Paste" "F.Mask")
    (solder_mask_margin 0.05) (tstamp 26c8b6b1-c6e7-4294-bf7a-3fb8e6f70ce8))
  (pad "B4" smd circle (at -1.6 -3.2) (size 0.4 0.4) (layers "F.Cu" "F.Paste" "F.Mask")
    (solder_mask_margin 0.05) (tstamp d633c9b3-67d8-4caf-8238-94a45ae93d65))
  (pad "B5" smd circle (at -0.8 -3.2) (size 0.4 0.4) (layers "F.Cu" "F.Paste" "F.Mask")
    (solder_mask_margin 0.05) (tstamp 61c970c0-3a9e-409d-a56b-1c2902b78029))
  (pad "B6" smd circle (at 0 -3.2) (size 0.4 0.4) (layers "F.Cu" "F.Paste" "F.Mask")
    (solder_mask_margin 0.05) (tstamp 738a2632-4863-4403-b0e9-f1090509c1c8))
  (pad "B7" smd circle (at 0.8 -3.2) (size 0.4 0.4) (layers "F.Cu" "F.Paste" "F.Mask")
    (solder_mask_margin 0.05) (tstamp c6fce7ee-9ea9-4beb-81ab-b75d67ab4570))
  (pad "B8" smd circle (at 1.6 -3.2) (size 0.4 0.4) (layers "F.Cu" "F.Paste" "F.Mask")
    (solder_mask_margin 0.05) (tstamp 069bc4ab-c7e2-4fa7-b27d-2757fc16ab3d))
  (pad "B9" smd circle (at 2.4 -3.2) (size 0.4 0.4) (layers "F.Cu" "F.Paste" "F.Mask")
    (solder_mask_margin 0.05) (tstamp f6344da8-5d37-49fe-af10-def0db49a7da))
  (pad "B10" smd circle (at 3.2 -3.2) (size 0.4 0.4) (layers "F.Cu" "F.Paste" "F.Mask")
    (solder_mask_margin 0.05) (tstamp bc46579f-176d-41eb-91c7-3aee91f7e500))
  (pad "B11" smd circle (at 4 -3.2) (size 0.4 0.4) (layers "F.Cu" "F.Paste" "F.Mask")
    (solder_mask_margin 0.05) (tstamp b3ed0685-05e1-446d-8ccd-4b2f3965f037))
  (pad "C1" smd circle (at -4 -2.4) (size 0.4 0.4) (layers "F.Cu" "F.Paste" "F.Mask")
    (solder_mask_margin 0.05) (tstamp a9dfe79d-927b-4cdf-8ba0-f4b7dfe9dae5))
  (pad "C2" smd circle (at -3.2 -2.4) (size 0.4 0.4) (layers "F.Cu" "F.Paste" "F.Mask")
    (solder_mask_margin 0.05) (tstamp e6893225-4738-499b-8508-7140a4aff173))
  (pad "C3" smd circle (at -2.4 -2.4) (size 0.4 0.4) (layers "F.Cu" "F.Paste" "F.Mask")
    (solder_mask_margin 0.05) (tstamp e1213066-0a4f-4e18-b3a0-dea1821d403e))
  (pad "C4" smd circle (at -1.6 -2.4) (size 0.4 0.4) (layers "F.Cu" "F.Paste" "F.Mask")
    (solder_mask_margin 0.05) (tstamp a7c84383-8121-4287-a73d-d2b5565b7cfd))
  (pad "C5" smd circle (at -0.8 -2.4) (size 0.4 0.4) (layers "F.Cu" "F.Paste" "F.Mask")
    (solder_mask_margin 0.05) (tstamp bbe3a2bf-3c58-4495-bc09-d292e36235d3))
  (pad "C6" smd circle (at 0 -2.4) (size 0.4 0.4) (layers "F.Cu" "F.Paste" "F.Mask")
    (solder_mask_margin 0.05) (tstamp 38a47db6-67a2-4e0b-baf6-cb5a57e75962))
  (pad "C7" smd circle (at 0.8 -2.4) (size 0.4 0.4) (layers "F.Cu" "F.Paste" "F.Mask")
    (solder_mask_margin 0.05) (tstamp 6002b36d-65e8-4d58-b93b-17cd9f0b1150))
  (pad "C8" smd circle (at 1.6 -2.4) (size 0.4 0.4) (layers "F.Cu" "F.Paste" "F.Mask")
    (solder_mask_margin 0.05) (tstamp 8159537f-d78e-4ed9-be69-c8860dd87d81))
  (pad "C9" smd circle (at 2.4 -2.4) (size 0.4 0.4) (layers "F.Cu" "F.Paste" "F.Mask")
    (solder_mask_margin 0.05) (tstamp 60f7a8a2-aee6-469a-a6b3-0a4a24f9e472))
  (pad "C10" smd circle (at 3.2 -2.4) (size 0.4 0.4) (layers "F.Cu" "F.Paste" "F.Mask")
    (solder_mask_margin 0.05) (tstamp afb7f9bf-d79f-4514-b4ec-7f7a4e11ab20))
  (pad "C11" smd circle (at 4 -2.4) (size 0.4 0.4) (layers "F.Cu" "F.Paste" "F.Mask")
    (solder_mask_margin 0.05) (tstamp 99a5dbf2-7b41-42fd-961a-f36ab84ec988))
  (pad "D1" smd circle (at -4 -1.6) (size 0.4 0.4) (layers "F.Cu" "F.Paste" "F.Mask")
    (solder_mask_margin 0.05) (tstamp 2bc492b6-788a-40aa-aa62-65e68dd14147))
  (pad "D2" smd circle (at -3.2 -1.6) (size 0.4 0.4) (layers "F.Cu" "F.Paste" "F.Mask")
    (solder_mask_margin 0.05) (tstamp 39753bbb-e307-406c-a730-a5cb022f58ae))
  (pad "D3" smd circle (at -2.4 -1.6) (size 0.4 0.4) (layers "F.Cu" "F.Paste" "F.Mask")
    (solder_mask_margin 0.05) (tstamp 8baad5f0-202f-4129-bf0a-c969b2124c0f))
  (pad "D4" smd circle (at -1.6 -1.6) (size 0.4 0.4) (layers "F.Cu" "F.Paste" "F.Mask")
    (solder_mask_margin 0.05) (tstamp 16f7f305-d996-483e-b123-8462adb5552b))
  (pad "D5" smd circle (at -0.8 -1.6) (size 0.4 0.4) (layers "F.Cu" "F.Paste" "F.Mask")
    (solder_mask_margin 0.05) (tstamp 0f14f7ef-1bc7-4977-b351-70a3e71f748e))
  (pad "D6" smd circle (at 0 -1.6) (size 0.4 0.4) (layers "F.Cu" "F.Paste" "F.Mask")
    (solder_mask_margin 0.05) (tstamp 68d17cf6-530a-46ed-ae74-82a883bfa6be))
  (pad "D7" smd circle (at 0.8 -1.6) (size 0.4 0.4) (layers "F.Cu" "F.Paste" "F.Mask")
    (solder_mask_margin 0.05) (tstamp 641f5b37-6788-4d79-b3e8-2103e7ccbc17))
  (pad "D8" smd circle (at 1.6 -1.6) (size 0.4 0.4) (layers "F.Cu" "F.Paste" "F.Mask")
    (solder_mask_margin 0.05) (tstamp e11b0c25-9609-49f3-9d6f-e33ff4959695))
  (pad "D9" smd circle (at 2.4 -1.6) (size 0.4 0.4) (layers "F.Cu" "F.Paste" "F.Mask")
    (solder_mask_margin 0.05) (tstamp 6b38d11c-4f48-4c92-a2c6-c12271c638c9))
  (pad "D10" smd circle (at 3.2 -1.6) (size 0.4 0.4) (layers "F.Cu" "F.Paste" "F.Mask")
    (solder_mask_margin 0.05) (tstamp 2416e94c-239a-4b96-8c27-2caf177a65eb))
  (pad "D11" smd circle (at 4 -1.6) (size 0.4 0.4) (layers "F.Cu" "F.Paste" "F.Mask")
    (solder_mask_margin 0.05) (tstamp 9c705f21-025a-4bcb-a109-bda50489ad1c))
  (pad "E1" smd circle (at -4 -0.8) (size 0.4 0.4) (layers "F.Cu" "F.Paste" "F.Mask")
    (solder_mask_margin 0.05) (tstamp 89b64eda-ef06-4452-8833-b18f885f387e))
  (pad "E2" smd circle (at -3.2 -0.8) (size 0.4 0.4) (layers "F.Cu" "F.Paste" "F.Mask")
    (solder_mask_margin 0.05) (tstamp bb23da44-b97d-4e22-a962-c7d41b79f505))
  (pad "E3" smd circle (at -2.4 -0.8) (size 0.4 0.4) (layers "F.Cu" "F.Paste" "F.Mask")
    (solder_mask_margin 0.05) (tstamp 520a462e-8f52-439e-84fa-73d1e9b36ffb))
  (pad "E4" smd circle (at -1.6 -0.8) (size 0.4 0.4) (layers "F.Cu" "F.Paste" "F.Mask")
    (solder_mask_margin 0.05) (tstamp 1acd6931-0176-4e5f-9b24-863d20e8e1fb))
  (pad "E8" smd circle (at 1.6 -0.8) (size 0.4 0.4) (layers "F.Cu" "F.Paste" "F.Mask")
    (solder_mask_margin 0.05) (tstamp 01710fdf-86de-4364-9578-5a167eacba82))
  (pad "E9" smd circle (at 2.4 -0.8) (size 0.4 0.4) (layers "F.Cu" "F.Paste" "F.Mask")
    (solder_mask_margin 0.05) (tstamp cfda9eeb-a25e-41ca-b18f-505a435becc0))
  (pad "E10" smd circle (at 3.2 -0.8) (size 0.4 0.4) (layers "F.Cu" "F.Paste" "F.Mask")
    (solder_mask_margin 0.05) (tstamp b0a37828-1616-44a8-8903-8c81054fc3a4))
  (pad "E11" smd circle (at 4 -0.8) (size 0.4 0.4) (layers "F.Cu" "F.Paste" "F.Mask")
    (solder_mask_margin 0.05) (tstamp 4ee357df-8fae-475c-863b-9a5e51edf894))
  (pad "F1" smd circle (at -4 0) (size 0.4 0.4) (layers "F.Cu" "F.Paste" "F.Mask")
    (solder_mask_margin 0.05) (tstamp f107a470-078b-4411-ba1b-39a10ea11af0))
  (pad "F2" smd circle (at -3.2 0) (size 0.4 0.4) (layers "F.Cu" "F.Paste" "F.Mask")
    (solder_mask_margin 0.05) (tstamp c203ad34-8e9f-4ce1-af96-148a4e3b8a89))
  (pad "F3" smd circle (at -2.4 0) (size 0.4 0.4) (layers "F.Cu" "F.Paste" "F.Mask")
    (solder_mask_margin 0.05) (tstamp 8da1a2a3-9fdd-496b-8af6-3ce9b5931abb))
  (pad "F4" smd circle (at -1.6 0) (size 0.4 0.4) (layers "F.Cu" "F.Paste" "F.Mask")
    (solder_mask_margin 0.05) (tstamp 5ca017ac-d1b2-4283-a258-f97fd19fdf3f))
  (pad "F8" smd circle (at 1.6 0) (size 0.4 0.4) (layers "F.Cu" "F.Paste" "F.Mask")
    (solder_mask_margin 0.05) (tstamp f1fd28ea-3fcc-4bc8-b231-536abffaeec7))
  (pad "F9" smd circle (at 2.4 0) (size 0.4 0.4) (layers "F.Cu" "F.Paste" "F.Mask")
    (solder_mask_margin 0.05) (tstamp ddef877e-ee7f-4d4f-942d-4b4ec581af0b))
  (pad "F10" smd circle (at 3.2 0) (size 0.4 0.4) (layers "F.Cu" "F.Paste" "F.Mask")
    (solder_mask_margin 0.05) (tstamp 3f296618-3438-4fe4-b0bc-c633baf3e405))
  (pad "F11" smd circle (at 4 0) (size 0.4 0.4) (layers "F.Cu" "F.Paste" "F.Mask")
    (solder_mask_margin 0.05) (tstamp 709f5659-e041-4840-84c6-6bc39ac40e17))
  (pad "G1" smd circle (at -4 0.8) (size 0.4 0.4) (layers "F.Cu" "F.Paste" "F.Mask")
    (solder_mask_margin 0.05) (tstamp d40909ae-50d7-41e8-a078-a39912edc206))
  (pad "G2" smd circle (at -3.2 0.8) (size 0.4 0.4) (layers "F.Cu" "F.Paste" "F.Mask")
    (solder_mask_margin 0.05) (tstamp f5713b4c-a073-4d03-8ea5-4e1710be8b2c))
  (pad "G3" smd circle (at -2.4 0.8) (size 0.4 0.4) (layers "F.Cu" "F.Paste" "F.Mask")
    (solder_mask_margin 0.05) (tstamp 3f9b95a5-d098-4902-abe5-2d54c1fa187f))
  (pad "G4" smd circle (at -1.6 0.8) (size 0.4 0.4) (layers "F.Cu" "F.Paste" "F.Mask")
    (solder_mask_margin 0.05) (tstamp e120eeb3-d99e-4ed7-8824-30fc8be8b400))
  (pad "G8" smd circle (at 1.6 0.8) (size 0.4 0.4) (layers "F.Cu" "F.Paste" "F.Mask")
    (solder_mask_margin 0.05) (tstamp 648540ec-b482-4ad9-b584-58b1d477ff65))
  (pad "G9" smd circle (at 2.4 0.8) (size 0.4 0.4) (layers "F.Cu" "F.Paste" "F.Mask")
    (solder_mask_margin 0.05) (tstamp 491f5e51-eba5-4c97-afaa-1755dd4a85b2))
  (pad "G10" smd circle (at 3.2 0.8) (size 0.4 0.4) (layers "F.Cu" "F.Paste" "F.Mask")
    (solder_mask_margin 0.05) (tstamp 96ccefcd-016d-4bde-a2eb-b7feda350a2b))
  (pad "G11" smd circle (at 4 0.8) (size 0.4 0.4) (layers "F.Cu" "F.Paste" "F.Mask")
    (solder_mask_margin 0.05) (tstamp afee7ec8-a099-4b67-b3ee-e431d94f9aa0))
  (pad "H1" smd circle (at -4 1.6) (size 0.4 0.4) (layers "F.Cu" "F.Paste" "F.Mask")
    (solder_mask_margin 0.05) (tstamp ef5dd05c-757c-4799-9352-f8ba72de1f6c))
  (pad "H2" smd circle (at -3.2 1.6) (size 0.4 0.4) (layers "F.Cu" "F.Paste" "F.Mask")
    (solder_mask_margin 0.05) (tstamp c68b20c4-98aa-4b1e-ac2c-bf47a4dab065))
  (pad "H3" smd circle (at -2.4 1.6) (size 0.4 0.4) (layers "F.Cu" "F.Paste" "F.Mask")
    (solder_mask_margin 0.05) (tstamp 0653b879-25fa-481a-b83d-d02b925b7a22))
  (pad "H4" smd circle (at -1.6 1.6) (size 0.4 0.4) (layers "F.Cu" "F.Paste" "F.Mask")
    (solder_mask_margin 0.05) (tstamp 4bf634d6-ec1d-4a6d-8500-7428947ab728))
  (pad "H5" smd circle (at -0.8 1.6) (size 0.4 0.4) (layers "F.Cu" "F.Paste" "F.Mask")
    (solder_mask_margin 0.05) (tstamp fec2ba70-16cd-4f25-ab17-e7dd24fc821d))
  (pad "H6" smd circle (at 0 1.6) (size 0.4 0.4) (layers "F.Cu" "F.Paste" "F.Mask")
    (solder_mask_margin 0.05) (tstamp 42580eb6-5536-4983-8bd9-919ddc9a8c47))
  (pad "H7" smd circle (at 0.8 1.6) (size 0.4 0.4) (layers "F.Cu" "F.Paste" "F.Mask")
    (solder_mask_margin 0.05) (tstamp d22bcdc8-71cb-4f68-b0b3-8119b72e8d46))
  (pad "H8" smd circle (at 1.6 1.6) (size 0.4 0.4) (layers "F.Cu" "F.Paste" "F.Mask")
    (solder_mask_margin 0.05) (tstamp a4114bda-7cd7-45c3-a8f7-e43d06e977b6))
  (pad "H9" smd circle (at 2.4 1.6) (size 0.4 0.4) (layers "F.Cu" "F.Paste" "F.Mask")
    (solder_mask_margin 0.05) (tstamp fcb635d3-7804-4ddd-8c40-bfd21d754c96))
  (pad "H10" smd circle (at 3.2 1.6) (size 0.4 0.4) (layers "F.Cu" "F.Paste" "F.Mask")
    (solder_mask_margin 0.05) (tstamp eb5e5418-4a94-47ee-b910-c26ecf897702))
  (pad "H11" smd circle (at 4 1.6) (size 0.4 0.4) (layers "F.Cu" "F.Paste" "F.Mask")
    (solder_mask_margin 0.05) (tstamp 245a1066-29dd-47b8-8de5-36f8f26b8200))
  (pad "J1" smd circle (at -4 2.4) (size 0.4 0.4) (layers "F.Cu" "F.Paste" "F.Mask")
    (solder_mask_margin 0.05) (tstamp 4ad8c782-bd69-4205-8292-9f48529a4c15))
  (pad "J2" smd circle (at -3.2 2.4) (size 0.4 0.4) (layers "F.Cu" "F.Paste" "F.Mask")
    (solder_mask_margin 0.05) (tstamp df076692-51d8-4528-9aac-399710a7c645))
  (pad "J3" smd circle (at -2.4 2.4) (size 0.4 0.4) (layers "F.Cu" "F.Paste" "F.Mask")
    (solder_mask_margin 0.05) (tstamp 37ba50ad-a238-4eb2-9513-f09879bc4f3d))
  (pad "J4" smd circle (at -1.6 2.4) (size 0.4 0.4) (layers "F.Cu" "F.Paste" "F.Mask")
    (solder_mask_margin 0.05) (tstamp 1516ba29-7564-40c7-9f90-d41eda490c80))
  (pad "J5" smd circle (at -0.8 2.4) (size 0.4 0.4) (layers "F.Cu" "F.Paste" "F.Mask")
    (solder_mask_margin 0.05) (tstamp b71da510-05ae-4f34-a2b1-480015c994a8))
  (pad "J6" smd circle (at 0 2.4) (size 0.4 0.4) (layers "F.Cu" "F.Paste" "F.Mask")
    (solder_mask_margin 0.05) (tstamp 2739d04e-b4c0-49d0-ac49-187af1e96e2e))
  (pad "J7" smd circle (at 0.8 2.4) (size 0.4 0.4) (layers "F.Cu" "F.Paste" "F.Mask")
    (solder_mask_margin 0.05) (tstamp b95d7097-67c4-437f-a8da-e5d58b9e4dbe))
  (pad "J8" smd circle (at 1.6 2.4) (size 0.4 0.4) (layers "F.Cu" "F.Paste" "F.Mask")
    (solder_mask_margin 0.05) (tstamp f0efbde0-2f1c-422d-9f90-a79f38fff73a))
  (pad "J9" smd circle (at 2.4 2.4) (size 0.4 0.4) (layers "F.Cu" "F.Paste" "F.Mask")
    (solder_mask_margin 0.05) (tstamp c671eb13-fb25-4ba0-b5a5-01d62b7f8e9b))
  (pad "J10" smd circle (at 3.2 2.4) (size 0.4 0.4) (layers "F.Cu" "F.Paste" "F.Mask")
    (solder_mask_margin 0.05) (tstamp f2730e10-99e5-476a-aea0-876721d6347b))
  (pad "J11" smd circle (at 4 2.4) (size 0.4 0.4) (layers "F.Cu" "F.Paste" "F.Mask")
    (solder_mask_margin 0.05) (tstamp 0e6a453a-61b2-423e-8087-ca71ad46df0b))
  (pad "K1" smd circle (at -4 3.2) (size 0.4 0.4) (layers "F.Cu" "F.Paste" "F.Mask")
    (solder_mask_margin 0.05) (tstamp 9de23ade-bc26-4d94-b11a-3e8ecfc0e547))
  (pad "K2" smd circle (at -3.2 3.2) (size 0.4 0.4) (layers "F.Cu" "F.Paste" "F.Mask")
    (solder_mask_margin 0.05) (tstamp b0b629c2-ef1b-4c3e-8436-2acdc945e5d2))
  (pad "K3" smd circle (at -2.4 3.2) (size 0.4 0.4) (layers "F.Cu" "F.Paste" "F.Mask")
    (solder_mask_margin 0.05) (tstamp b852dbbe-c2a4-4dc5-bcb8-36075e56f5fe))
  (pad "K4" smd circle (at -1.6 3.2) (size 0.4 0.4) (layers "F.Cu" "F.Paste" "F.Mask")
    (solder_mask_margin 0.05) (tstamp 871f4d99-a5ed-4595-ace4-d2ad17c1dddd))
  (pad "K5" smd circle (at -0.8 3.2) (size 0.4 0.4) (layers "F.Cu" "F.Paste" "F.Mask")
    (solder_mask_margin 0.05) (tstamp f2a2bfc8-fc4f-46f1-8b69-2419dd1a7c0a))
  (pad "K6" smd circle (at 0 3.2) (size 0.4 0.4) (layers "F.Cu" "F.Paste" "F.Mask")
    (solder_mask_margin 0.05) (tstamp ea3885c9-f05b-4e9e-a67e-697aab95090e))
  (pad "K7" smd circle (at 0.8 3.2) (size 0.4 0.4) (layers "F.Cu" "F.Paste" "F.Mask")
    (solder_mask_margin 0.05) (tstamp a01f4403-6c0a-42af-9473-106645f4fab4))
  (pad "K8" smd circle (at 1.6 3.2) (size 0.4 0.4) (layers "F.Cu" "F.Paste" "F.Mask")
    (solder_mask_margin 0.05) (tstamp 1829ac0d-a119-4ac9-98ca-d6a4e74da0b6))
  (pad "K9" smd circle (at 2.4 3.2) (size 0.4 0.4) (layers "F.Cu" "F.Paste" "F.Mask")
    (solder_mask_margin 0.05) (tstamp ff1971ce-7653-44ed-877d-f5cfded6414d))
  (pad "K10" smd circle (at 3.2 3.2) (size 0.4 0.4) (layers "F.Cu" "F.Paste" "F.Mask")
    (solder_mask_margin 0.05) (tstamp b4962104-22e7-44aa-8037-bc650deebbc6))
  (pad "K11" smd circle (at 4 3.2) (size 0.4 0.4) (layers "F.Cu" "F.Paste" "F.Mask")
    (solder_mask_margin 0.05) (tstamp 9b740fb4-95ee-431b-8ae1-4df10d595d02))
  (pad "L1" smd circle (at -4 4) (size 0.4 0.4) (layers "F.Cu" "F.Paste" "F.Mask")
    (solder_mask_margin 0.05) (tstamp 8b96030a-b0a5-4ec3-a938-2fb682301b94))
  (pad "L2" smd circle (at -3.2 4) (size 0.4 0.4) (layers "F.Cu" "F.Paste" "F.Mask")
    (solder_mask_margin 0.05) (tstamp 3a56ca98-91cc-4922-897d-f660a9e63915))
  (pad "L3" smd circle (at -2.4 4) (size 0.4 0.4) (layers "F.Cu" "F.Paste" "F.Mask")
    (solder_mask_margin 0.05) (tstamp 45672f17-779e-46bd-86db-9c9b7d999484))
  (pad "L4" smd circle (at -1.6 4) (size 0.4 0.4) (layers "F.Cu" "F.Paste" "F.Mask")
    (solder_mask_margin 0.05) (tstamp 5e002d64-676d-43f9-90e0-ed62b03136a2))
  (pad "L5" smd circle (at -0.8 4) (size 0.4 0.4) (layers "F.Cu" "F.Paste" "F.Mask")
    (solder_mask_margin 0.05) (tstamp efd4f8b3-8a17-4810-8d5a-aec5cb30c573))
  (pad "L6" smd circle (at 0 4) (size 0.4 0.4) (layers "F.Cu" "F.Paste" "F.Mask")
    (solder_mask_margin 0.05) (tstamp 547ff4c4-268b-4cf4-b9ce-e154341c786f))
  (pad "L7" smd circle (at 0.8 4) (size 0.4 0.4) (layers "F.Cu" "F.Paste" "F.Mask")
    (solder_mask_margin 0.05) (tstamp daa29170-8400-4b1e-bc79-db2720784c21))
  (pad "L8" smd circle (at 1.6 4) (size 0.4 0.4) (layers "F.Cu" "F.Paste" "F.Mask")
    (solder_mask_margin 0.05) (tstamp fc8951c8-5dc0-4cad-807c-9dc86c5a80ab))
  (pad "L9" smd circle (at 2.4 4) (size 0.4 0.4) (layers "F.Cu" "F.Paste" "F.Mask")
    (solder_mask_margin 0.05) (tstamp fa5cc227-2aa2-4ba2-81b5-6aae303250e3))
  (pad "L10" smd circle (at 3.2 4) (size 0.4 0.4) (layers "F.Cu" "F.Paste" "F.Mask")
    (solder_mask_margin 0.05) (tstamp 675d50f8-3da3-4eb6-bbb2-da16e4e3b0ab))
  (pad "L11" smd circle (at 4 4) (size 0.4 0.4) (layers "F.Cu" "F.Paste" "F.Mask")
    (solder_mask_margin 0.05) (tstamp 246c6b4d-3fab-4c1a-a340-e99ce6c570f9))
  (model "${KICADLIB}/model/BGA/BGA112N80P11X11_1000X1000X130.step"
    (offset (xyz 0 0 0.21))
    (scale (xyz 1 1 1))
    (rotate (xyz 0 0 0))
  )
)
