(footprint "QFN50P250X300-14" (version 20221018) (generator pcbnew)
  (layer "F.Cu")
  (attr smd)
  (fp_text reference "REF**" (at 0 -2.2) (layer "F.SilkS")
      (effects (font (size 1 1) (thickness 0.15)))
    (tstamp 6fce2bd7-ece3-4015-80e0-54a055333a63)
  )
  (fp_text value "QFN50P250X300-14" (at 0.15 -11.85) (layer "F.Fab") hide
      (effects (font (size 1 1) (thickness 0.15)))
    (tstamp 84d38b58-73ba-4135-8808-40cf46972957)
  )
  (fp_text user "^" (at -2.46 -0.75 270 unlocked) (layer "F.SilkS")
      (effects (font (size 1 1) (thickness 0.15)))
    (tstamp 73823101-e124-427a-b3dc-460a418168c7)
  )
  (fp_text user "${REFERENCE}" (at 0 0.1) (layer "F.Fab")
      (effects (font (size 0.7 0.7) (thickness 0.1)))
    (tstamp b9e0cd1f-b5b0-4acc-a83b-c1d654ff1b4a)
  )
  (fp_line (start -1.5 -1.25) (end -1.5 -0.95)
    (stroke (width 0.1) (type solid)) (layer "F.SilkS") (tstamp d793e3a4-4361-4b27-848f-f7eb0b1af1f0))
  (fp_line (start -1.5 -1.25) (end -0.7 -1.25)
    (stroke (width 0.1) (type solid)) (layer "F.SilkS") (tstamp 8f64a6b0-9fb9-4056-a1b1-942b40eb59e6))
  (fp_line (start -1.5 1.25) (end -1.5 0.95)
    (stroke (width 0.1) (type solid)) (layer "F.SilkS") (tstamp 9e807cc4-d820-4aab-86a2-1bb7133d6fd3))
  (fp_line (start -1.5 1.25) (end -0.7 1.25)
    (stroke (width 0.1) (type solid)) (layer "F.SilkS") (tstamp 87808e06-d866-40ce-8d06-a8c5bb0d8dbf))
  (fp_line (start 1.5 -1.25) (end 0.7 -1.25)
    (stroke (width 0.1) (type solid)) (layer "F.SilkS") (tstamp 9a421449-2e26-4a2a-8904-df5221254a16))
  (fp_line (start 1.5 -1.25) (end 1.5 -0.95)
    (stroke (width 0.1) (type solid)) (layer "F.SilkS") (tstamp 363c5bdb-5d9a-4500-880c-76fd6a127035))
  (fp_line (start 1.5 1.25) (end 0.7 1.25)
    (stroke (width 0.1) (type solid)) (layer "F.SilkS") (tstamp 1a438b7c-e34f-4cc8-ab6b-9363d9e26744))
  (fp_line (start 1.5 1.25) (end 1.5 1.05)
    (stroke (width 0.1) (type solid)) (layer "F.SilkS") (tstamp 4815849d-81bd-4751-a80b-5a062fe12038))
  (fp_line (start -1.9 1.6) (end -1.9 -1.7)
    (stroke (width 0.05) (type solid)) (layer "F.CrtYd") (tstamp ac14bc5c-b01a-4acf-87ee-77857f35e2ca))
  (fp_line (start 1.9 -1.7) (end -1.9 -1.7)
    (stroke (width 0.05) (type solid)) (layer "F.CrtYd") (tstamp 964066da-0549-40e0-804c-d1323288b0f7))
  (fp_line (start 1.9 -1.7) (end 1.9 1.6)
    (stroke (width 0.05) (type solid)) (layer "F.CrtYd") (tstamp a308fe17-f930-4062-8c87-e2e399e70fe2))
  (fp_line (start 1.9 1.6) (end -1.9 1.6)
    (stroke (width 0.05) (type solid)) (layer "F.CrtYd") (tstamp 88784823-91bf-4b30-b3ef-7a0e5616971e))
  (fp_line (start -1.5 -0.75) (end -1.5 1.25)
    (stroke (width 0.1) (type solid)) (layer "F.Fab") (tstamp 5d9ce083-ec36-4a34-816c-af1d74a0dfe9))
  (fp_line (start -1.5 1.25) (end 1.5 1.25)
    (stroke (width 0.1) (type solid)) (layer "F.Fab") (tstamp 36cd1674-1471-4456-a08f-042203a167e4))
  (fp_line (start -1 -1.25) (end -1.5 -0.75)
    (stroke (width 0.1) (type solid)) (layer "F.Fab") (tstamp 5e60aaf1-e915-491d-8b58-0c7b80f31b07))
  (fp_line (start 1.5 -1.25) (end -1 -1.25)
    (stroke (width 0.1) (type solid)) (layer "F.Fab") (tstamp da73cf9c-ce38-4a54-b1c1-5e311a6c9f82))
  (fp_line (start 1.5 1.25) (end 1.5 -1.25)
    (stroke (width 0.1) (type solid)) (layer "F.Fab") (tstamp db95c36f-9b59-4bde-92f3-f344bae5f24d))
  (pad "1" smd roundrect (at -1.35 -0.75) (size 0.75 0.25) (layers "F.Cu" "F.Paste" "F.Mask") (roundrect_rratio 0.2) (tstamp 934b4af2-f772-43ef-adb3-13252a52b969))
  (pad "2" smd roundrect (at -1.35 -0.25) (size 0.75 0.25) (layers "F.Cu" "F.Paste" "F.Mask") (roundrect_rratio 0.2) (tstamp c88e09fb-9042-4070-9bf0-ea381d2d0287))
  (pad "3" smd roundrect (at -1.35 0.25) (size 0.75 0.25) (layers "F.Cu" "F.Paste" "F.Mask") (roundrect_rratio 0.2) (tstamp b5bd38a3-9472-4e9a-819c-c6d870a275af))
  (pad "4" smd roundrect (at -1.35 0.75) (size 0.75 0.25) (layers "F.Cu" "F.Paste" "F.Mask") (roundrect_rratio 0.2) (tstamp 3b81b8ee-2a95-4d1f-83f0-0566c25c43ad))
  (pad "5" smd roundrect (at -0.5 1.1 90) (size 0.75 0.25) (layers "F.Cu" "F.Paste" "F.Mask") (roundrect_rratio 0.2) (tstamp 72f5473c-c0d2-4b1b-bc4f-bb82f26d8384))
  (pad "6" smd roundrect (at 0 1.1 90) (size 0.75 0.25) (layers "F.Cu" "F.Paste" "F.Mask") (roundrect_rratio 0.2) (tstamp 6e7cef44-9c59-459a-974b-456006c254fe))
  (pad "7" smd roundrect (at 0.5 1.1 90) (size 0.75 0.25) (layers "F.Cu" "F.Paste" "F.Mask") (roundrect_rratio 0.2) (tstamp a59cf3a9-d963-41f0-a8d4-5cb5501cd71e))
  (pad "8" smd roundrect (at 1.35 0.75) (size 0.75 0.25) (layers "F.Cu" "F.Paste" "F.Mask") (roundrect_rratio 0.2) (tstamp 775dea52-1722-47d7-a7f1-5a4800ac01bf))
  (pad "9" smd roundrect (at 1.35 0.25) (size 0.75 0.25) (layers "F.Cu" "F.Paste" "F.Mask") (roundrect_rratio 0.2) (tstamp 16fd3eb4-a921-4027-a474-317eaf96354d))
  (pad "10" smd roundrect (at 1.35 -0.25) (size 0.75 0.25) (layers "F.Cu" "F.Paste" "F.Mask") (roundrect_rratio 0.2) (tstamp 282c5cf2-1cae-400d-ad4d-f0370cafcb52))
  (pad "11" smd roundrect (at 1.35 -0.75) (size 0.75 0.25) (layers "F.Cu" "F.Paste" "F.Mask") (roundrect_rratio 0.2) (tstamp 89a28ec3-a6ee-4f00-ae8d-0cfba5e7c0bd))
  (pad "12" smd roundrect (at 0.5 -1.1 90) (size 0.75 0.25) (layers "F.Cu" "F.Paste" "F.Mask") (roundrect_rratio 0.2) (tstamp 7ceb2243-5c63-4304-9172-c5bae264304f))
  (pad "13" smd roundrect (at 0 -1.1 90) (size 0.75 0.25) (layers "F.Cu" "F.Paste" "F.Mask") (roundrect_rratio 0.2) (tstamp 1329ce09-5baf-4427-bf00-f418e221b01a))
  (pad "14" smd roundrect (at -0.5 -1.1 90) (size 0.75 0.25) (layers "F.Cu" "F.Paste" "F.Mask") (roundrect_rratio 0.2) (tstamp 89a7d21e-2228-4540-bde7-6a3f24dc52ce))
  (model "${KICADLIB}/model/QFN/QFN50P250X300-14.step"
    (offset (xyz 0 0 0.01))
    (scale (xyz 1 1 1))
    (rotate (xyz 0 0 0))
  )
)
