(footprint "TDK_ALT4532M" (version 20221018) (generator pcbnew)
  (layer "F.Cu")
  (attr smd)
  (fp_text reference "REF**" (at 0 -2.25 unlocked) (layer "F.SilkS")
      (effects (font (size 1 1) (thickness 0.15)))
    (tstamp 9ff1251c-aaa4-46dd-a814-8ce8b9c84919)
  )
  (fp_text value "TDK_ALT4532M" (at 0 2.35 unlocked) (layer "F.Fab") hide
      (effects (font (size 1 1) (thickness 0.15)))
    (tstamp 17af3bb2-afd2-4b26-a0e0-de03dc24ac84)
  )
  (fp_text user "^" (at -3.32 1.35 270 unlocked) (layer "F.SilkS")
      (effects (font (size 1 1) (thickness 0.15)))
    (tstamp 2270e0cd-5230-47b0-acd8-45d78cd5ed64)
  )
  (fp_text user "${REFERENCE}" (at 0 0 unlocked) (layer "F.Fab")
      (effects (font (size 0.75 0.75) (thickness 0.15)))
    (tstamp af876f8e-840c-47a7-b63a-5cd2860ce2a4)
  )
  (fp_line (start -2.25 0.38) (end -2.25 -1.03)
    (stroke (width 0.1) (type solid)) (layer "F.SilkS") (tstamp a81ccf72-daaf-4594-a097-3bb9d7612525))
  (fp_line (start -1.3 -1.6) (end 1.32 -1.6)
    (stroke (width 0.1) (type solid)) (layer "F.SilkS") (tstamp d5ccafd3-0859-44dc-a75c-ca83ddbfecbf))
  (fp_line (start -1.3 1.6) (end 1.32 1.6)
    (stroke (width 0.1) (type solid)) (layer "F.SilkS") (tstamp b73613aa-f79d-40a4-b9cd-461b44c83fea))
  (fp_line (start 2.25 -0.38) (end 2.25 1.03)
    (stroke (width 0.1) (type solid)) (layer "F.SilkS") (tstamp a707dbf4-6c87-4e64-b630-d1667da60328))
  (fp_rect (start -2.65 -1.76) (end 2.65 1.76)
    (stroke (width 0.05) (type solid)) (fill none) (layer "F.CrtYd") (tstamp cab3070f-171d-484d-8b45-988c44fe6062))
  (fp_line (start -2.25 -1.6) (end 2.25 -1.6)
    (stroke (width 0.1) (type solid)) (layer "F.Fab") (tstamp 83b76c49-03bd-4747-a2b0-76876d06d645))
  (fp_line (start -2.25 1) (end -2.25 -1.6)
    (stroke (width 0.1) (type solid)) (layer "F.Fab") (tstamp 0f8de424-b873-4f44-ae34-dc420c0f011b))
  (fp_line (start -1.65 1.6) (end -2.25 1)
    (stroke (width 0.1) (type solid)) (layer "F.Fab") (tstamp 2a2f1fc2-2ba6-4799-9e94-07dcffeb92e4))
  (fp_line (start 2.25 -1.6) (end 2.25 1.6)
    (stroke (width 0.1) (type solid)) (layer "F.Fab") (tstamp 7b18da20-1c17-42c8-b176-b8e847fd11ad))
  (fp_line (start 2.25 1.6) (end -1.65 1.6)
    (stroke (width 0.1) (type solid)) (layer "F.Fab") (tstamp a07f46d7-e9a4-4f5d-8348-8d4d6e68698f))
  (pad "1" smd roundrect (at -1.97 1.35) (size 1.2 0.5) (layers "F.Cu" "F.Paste" "F.Mask") (roundrect_rratio 0.1) (tstamp 2b5aa593-6822-42a9-a198-e1218cb056e3))
  (pad "2" smd roundrect (at -1.97 0.7) (size 1.2 0.5) (layers "F.Cu" "F.Paste" "F.Mask") (roundrect_rratio 0.1) (tstamp 9e0d3ed2-5ac3-4b21-98e7-e1af67568cf3))
  (pad "3" smd roundrect (at -1.97 -1.35) (size 1.2 0.5) (layers "F.Cu" "F.Paste" "F.Mask") (roundrect_rratio 0.1) (tstamp c26557e8-994b-4d78-9241-d6f79ac5e3db))
  (pad "4" smd roundrect (at 1.99 -1.35) (size 1.2 0.5) (layers "F.Cu" "F.Paste" "F.Mask") (roundrect_rratio 0.1) (tstamp 07896824-2180-4586-b768-3697a5a5dea7))
  (pad "5" smd roundrect (at 1.99 -0.7) (size 1.2 0.5) (layers "F.Cu" "F.Paste" "F.Mask") (roundrect_rratio 0.1) (tstamp 342f4d07-63dc-40b8-862c-52edc5b8cf75))
  (pad "6" smd roundrect (at 1.99 1.35) (size 1.2 0.5) (layers "F.Cu" "F.Paste" "F.Mask") (roundrect_rratio 0.1) (tstamp dbdad143-b89e-4238-9242-6ce892b68182))
  (model "${KICADLIB}/model/passive/TDK_ALT3232M.step"
    (offset (xyz 0 0 0))
    (scale (xyz 1 1 1))
    (rotate (xyz 0 0 0))
  )
)
