(footprint "PinHeader_2x10_P1.27mm_Horizontal" (version 20210722) (generator pcbnew) (layer "F.Cu")
  (tedit 6116C8F4)
  (descr "Through hole angled pin header, 2x10, 1.27mm pitch, 4.0mm pin length, double rows")
  (tags "Through hole angled pin header THT 2x10 1.27mm double row")
  (attr through_hole)
  (fp_text reference "REF**" (at 3.0675 -1.635) (layer "F.SilkS")
    (effects (font (size 1 1) (thickness 0.15)))
    (tstamp 56a6e259-763d-4f32-84d6-cef757f4fc9b)
  )
  (fp_text value "PinHeader_2x10_P1.27mm_Horizontal" (at 3.0675 13.065) (layer "F.Fab") hide
    (effects (font (size 1 1) (thickness 0.15)))
    (tstamp 395164b6-ff55-4efb-b9eb-d93f28d6dfee)
  )
  (fp_text user "^" (at -1.7 0 270 unlocked) (layer "F.SilkS")
    (effects (font (size 1 1) (thickness 0.15)))
    (tstamp f327984d-0d2a-4cff-9343-3a64faae9c27)
  )
  (fp_text user "${REFERENCE}" (at 2.27 5.715 90) (layer "F.Fab")
    (effects (font (size 0.6 0.6) (thickness 0.09)))
    (tstamp 70a53d55-a62d-431c-a1a3-bc54e799350f)
  )
  (fp_line (start 6.83 0.26) (end 2.83 0.26) (layer "F.SilkS") (width 0.12) (tstamp 0061f286-fe09-4fe3-aaad-58afc4b2fb63))
  (fp_line (start 1.71 9.509677) (end 1.71 9.540323) (layer "F.SilkS") (width 0.12) (tstamp 0585e852-b5d2-4e9a-a8c1-96740a88be13))
  (fp_line (start 6.83 4.82) (end 6.83 5.34) (layer "F.SilkS") (width 0.12) (tstamp 09e1e285-392b-450e-a769-d165e1bf7290))
  (fp_line (start 2.83 2.28) (end 6.83 2.28) (layer "F.SilkS") (width 0.12) (tstamp 0c04728e-f18b-4683-a7a3-469b3cee88a0))
  (fp_line (start 6.83 -0.26) (end 6.83 0.26) (layer "F.SilkS") (width 0.12) (tstamp 0ea760bc-67c0-44f2-b103-ab6a88958057))
  (fp_line (start 2.83 -0.08) (end 6.83 -0.08) (layer "F.SilkS") (width 0.12) (tstamp 11844c48-e8fc-42b5-a16c-4f4259fe259b))
  (fp_line (start 1.71 10.779677) (end 1.71 10.810323) (layer "F.SilkS") (width 0.12) (tstamp 14515370-8938-4019-a3c8-aec6ab99f680))
  (fp_line (start 6.83 6.09) (end 6.83 6.61) (layer "F.SilkS") (width 0.12) (tstamp 23ec8930-e09f-4197-ab3b-0cad125cc6ef))
  (fp_line (start 6.83 2.28) (end 6.83 2.8) (layer "F.SilkS") (width 0.12) (tstamp 28c10df7-664d-496b-9d80-99ada18fcd20))
  (fp_line (start 2.83 -0.26) (end 6.83 -0.26) (layer "F.SilkS") (width 0.12) (tstamp 28cea01b-b8d5-40a1-930b-b3e2ebf04f88))
  (fp_line (start 2.83 0.16) (end 6.83 0.16) (layer "F.SilkS") (width 0.12) (tstamp 2fecd2e3-03e5-4a18-ab24-ead203530491))
  (fp_line (start 1.71 3.175) (end 2.83 3.175) (layer "F.SilkS") (width 0.12) (tstamp 333098d1-44c7-4155-b1c5-528fe22c26f9))
  (fp_line (start 6.83 11.69) (end 2.83 11.69) (layer "F.SilkS") (width 0.12) (tstamp 37c1a543-f287-4267-b722-29efaddcb2fe))
  (fp_line (start 6.83 7.88) (end 2.83 7.88) (layer "F.SilkS") (width 0.12) (tstamp 3a0c845c-4b99-4535-9e5d-b136189f6657))
  (fp_line (start 6.83 9.9) (end 6.83 10.42) (layer "F.SilkS") (width 0.12) (tstamp 4da22c03-1fc1-4f15-a15e-dbc4296c5f5b))
  (fp_line (start 6.83 9.15) (end 2.83 9.15) (layer "F.SilkS") (width 0.12) (tstamp 4f1a6ee3-0107-4920-92be-beafb761d42d))
  (fp_line (start 6.83 1.53) (end 2.83 1.53) (layer "F.SilkS") (width 0.12) (tstamp 533206d4-f889-4597-82b2-76284dcc6e1a))
  (fp_line (start 6.83 4.07) (end 2.83 4.07) (layer "F.SilkS") (width 0.12) (tstamp 5367efb0-f3cb-4d12-8e71-067902e29958))
  (fp_line (start 6.83 6.61) (end 2.83 6.61) (layer "F.SilkS") (width 0.12) (tstamp 5934b8da-7b30-453f-8db1-ea433c8ab526))
  (fp_line (start 6.83 3.55) (end 6.83 4.07) (layer "F.SilkS") (width 0.12) (tstamp 5b9a8c61-f216-4e09-8f5a-8d8f6e88037a))
  (fp_line (start 6.83 7.36) (end 6.83 7.88) (layer "F.SilkS") (width 0.12) (tstamp 5e0944a5-e031-4016-8ada-d334955f73ac))
  (fp_line (start 2.83 7.36) (end 6.83 7.36) (layer "F.SilkS") (width 0.12) (tstamp 6186c825-2749-4cf9-9480-5760e11b59f0))
  (fp_line (start 6.83 11.17) (end 6.83 11.69) (layer "F.SilkS") (width 0.12) (tstamp 63ef1a78-d7f9-40c7-a09c-d155cc8d0b26))
  (fp_line (start -0.76 0) (end -0.76 -0.76) (layer "F.SilkS") (width 0.12) (tstamp 6413140a-6b65-43b0-b952-3bd7371290cf))
  (fp_line (start 1.71 4.429677) (end 1.71 4.460323) (layer "F.SilkS") (width 0.12) (tstamp 6d19fff0-4243-4429-91d2-eeffdab70512))
  (fp_line (start 6.83 1.01) (end 6.83 1.53) (layer "F.SilkS") (width 0.12) (tstamp 6daaf4cb-3be8-4348-bbaf-d1c7b933c5d8))
  (fp_line (start 2.83 1.01) (end 6.83 1.01) (layer "F.SilkS") (width 0.12) (tstamp 70713def-1126-408a-99a4-dc200e4bb628))
  (fp_line (start 1.71 6.985) (end 2.83 6.985) (layer "F.SilkS") (width 0.12) (tstamp 787900c7-88d1-4d8b-bcfb-804959379288))
  (fp_line (start 1.71 5.699677) (end 1.71 5.730323) (layer "F.SilkS") (width 0.12) (tstamp 7bfd7886-6d34-40a0-8a87-8a3b81caadab))
  (fp_line (start 1.71 12.125) (end 1.71 12.049677) (layer "F.SilkS") (width 0.12) (tstamp 7f05e30a-8997-4fd3-8652-9b2f74713f83))
  (fp_line (start 2.83 6.09) (end 6.83 6.09) (layer "F.SilkS") (width 0.12) (tstamp 81c47dce-b9a0-4b90-a622-56666ca45d7d))
  (fp_line (start 2.83 -0.2) (end 6.83 -0.2) (layer "F.SilkS") (width 0.12) (tstamp 8adbb710-354a-4dde-a823-b0d04e383d80))
  (fp_line (start 6.83 8.63) (end 6.83 9.15) (layer "F.SilkS") (width 0.12) (tstamp 8c149bab-324f-49e6-a67e-41bb653ea147))
  (fp_line (start -0.76 -0.76) (end 0 -0.76) (layer "F.SilkS") (width 0.12) (tstamp 9226009d-a851-4b43-9e9c-1450f19a8f8b))
  (fp_line (start 1.71 8.255) (end 2.83 8.255) (layer "F.SilkS") (width 0.12) (tstamp a1e6b484-1969-46a5-858d-da4e915f7756))
  (fp_line (start 2.83 -0.695) (end 2.83 12.125) (layer "F.SilkS") (width 0.12) (tstamp a91c85f8-cceb-46a7-994b-b0f753e67681))
  (fp_line (start 1.71 -0.619677) (end 1.71 -0.695) (layer "F.SilkS") (width 0.12) (tstamp aba29932-f839-4e57-84ed-9ce909bd4d00))
  (fp_line (start 1.71 10.795) (end 2.83 10.795) (layer "F.SilkS") (width 0.12) (tstamp aec5c528-b408-4c40-ae9f-cc61f306d9cc))
  (fp_line (start 1.71 0.635) (end 2.83 0.635) (layer "F.SilkS") (width 0.12) (tstamp af6748d9-0b57-4584-85d1-8009c8c52827))
  (fp_line (start 1.71 5.715) (end 2.83 5.715) (layer "F.SilkS") (width 0.12) (tstamp b1578ceb-b27b-49c6-9795-c69ec78e2a69))
  (fp_line (start 1.71 1.889677) (end 1.71 1.920323) (layer "F.SilkS") (width 0.12) (tstamp b23dc576-696f-4459-ab94-d050ba21fa25))
  (fp_line (start 1.71 9.525) (end 2.83 9.525) (layer "F.SilkS") (width 0.12) (tstamp b7f4146e-3fcd-4690-99f9-eff245592660))
  (fp_line (start 1.71 8.239677) (end 1.71 8.270323) (layer "F.SilkS") (width 0.12) (tstamp b88d3efe-751d-40e2-9f35-a5cbb540283e))
  (fp_line (start 2.83 4.82) (end 6.83 4.82) (layer "F.SilkS") (width 0.12) (tstamp bd0549a2-181a-4910-be4d-1a2b08a1365b))
  (fp_line (start 1.71 0.619677) (end 1.71 0.650323) (layer "F.SilkS") (width 0.12) (tstamp c3bb6ebd-9f3e-436f-bcee-623f2bdcfa7b))
  (fp_line (start 6.83 10.42) (end 2.83 10.42) (layer "F.SilkS") (width 0.12) (tstamp c5e74c17-2338-4d04-aa6d-ef782734ff05))
  (fp_line (start 1.71 6.969677) (end 1.71 7.000323) (layer "F.SilkS") (width 0.12) (tstamp c946b77e-7064-4490-9a67-026aa98ce4dd))
  (fp_line (start 2.83 0.04) (end 6.83 0.04) (layer "F.SilkS") (width 0.12) (tstamp cdabf679-d6e0-47a1-829e-faec8f18d1cf))
  (fp_line (start 2.83 8.63) (end 6.83 8.63) (layer "F.SilkS") (width 0.12) (tstamp d1b3d63d-170e-4929-9a11-cb6ca59eab17))
  (fp_line (start 1.71 4.445) (end 2.83 4.445) (layer "F.SilkS") (width 0.12) (tstamp d2c01774-2739-4ef5-8909-abe33e534851))
  (fp_line (start 2.83 12.125) (end 1.71 12.125) (layer "F.SilkS") (width 0.12) (tstamp d56a31b5-b5a4-4b90-a634-a9104ab11720))
  (fp_line (start 6.83 2.8) (end 2.83 2.8) (layer "F.SilkS") (width 0.12) (tstamp d6aaec16-4b4e-4f11-a07a-c4ff8c53c75b))
  (fp_line (start 2.83 11.17) (end 6.83 11.17) (layer "F.SilkS") (width 0.12) (tstamp eb28134f-f4da-40e2-ba6a-0875141246c7))
  (fp_line (start 2.83 3.55) (end 6.83 3.55) (layer "F.SilkS") (width 0.12) (tstamp f1b43ca8-ab7a-4831-8a01-a0ed2d67c740))
  (fp_line (start 1.71 3.159677) (end 1.71 3.190323) (layer "F.SilkS") (width 0.12) (tstamp f4b330d3-a72c-4208-ad38-7e2e7e88bcd7))
  (fp_line (start 2.83 9.9) (end 6.83 9.9) (layer "F.SilkS") (width 0.12) (tstamp f5740742-817f-4057-98cc-78999de7f036))
  (fp_line (start 1.71 -0.695) (end 2.83 -0.695) (layer "F.SilkS") (width 0.12) (tstamp f5dd8df7-0d7c-441e-a8f0-eec06bbb4b0f))
  (fp_line (start 6.83 5.34) (end 2.83 5.34) (layer "F.SilkS") (width 0.12) (tstamp f8d495e6-b542-424e-9e75-d51e134c67a9))
  (fp_line (start 1.71 1.905) (end 2.83 1.905) (layer "F.SilkS") (width 0.12) (tstamp fa1dcb2f-f628-495d-95a3-b9542686bfb1))
  (fp_line (start -0.9 -0.9) (end -0.9 12.3) (layer "F.CrtYd") (width 0.05) (tstamp 04a7c257-327d-4d26-8b2a-0459ae49136c))
  (fp_line (start 7 -0.9) (end -0.9 -0.9) (layer "F.CrtYd") (width 0.05) (tstamp 13622b9b-eae5-4e13-8ae1-a500bd1dc585))
  (fp_line (start 7 12.3) (end 7 -0.9) (layer "F.CrtYd") (width 0.05) (tstamp 75e9b48d-1395-499d-8106-8d696a378f80))
  (fp_line (start -0.9 12.3) (end 7 12.3) (layer "F.CrtYd") (width 0.05) (tstamp bdee2bbf-2fe6-4d27-95b8-95c98393acad))
  (fp_line (start -0.2 9.09) (end 1.77 9.09) (layer "F.Fab") (width 0.1) (tstamp 00a4af18-07e2-4c50-9ed9-aa2872d0aab9))
  (fp_line (start 2.77 1.07) (end 6.77 1.07) (layer "F.Fab") (width 0.1) (tstamp 00e1e54c-770c-4f96-825b-6a2e53026d96))
  (fp_line (start 6.77 3.61) (end 6.77 4.01) (layer "F.Fab") (width 0.1) (tstamp 05b72aa5-7cdd-4246-ba62-62f593e2022a))
  (fp_line (start -0.2 7.42) (end 1.77 7.42) (layer "F.Fab") (width 0.1) (tstamp 06f15cc0-1154-4acc-9c38-eb3d91d1cb6f))
  (fp_line (start 2.77 -0.635) (end 2.77 12.065) (layer "F.Fab") (width 0.1) (tstamp 07816a87-872d-4426-ac79-16bad20efc9f))
  (fp_line (start -0.2 4.01) (end 1.77 4.01) (layer "F.Fab") (width 0.1) (tstamp 0b1a1c94-cdb7-4570-80ec-40c9ebb2985a))
  (fp_line (start -0.2 11.63) (end 1.77 11.63) (layer "F.Fab") (width 0.1) (tstamp 0c6ba542-5277-4b0e-bdfc-39ca8fc82f5a))
  (fp_line (start -0.2 11.23) (end 1.77 11.23) (layer "F.Fab") (width 0.1) (tstamp 0ce1279b-8679-4483-8eb7-7ba7cbb1afeb))
  (fp_line (start 2.77 5.28) (end 6.77 5.28) (layer "F.Fab") (width 0.1) (tstamp 0d68fc54-4bfc-45f9-b8b7-1de9bad4489e))
  (fp_line (start -0.2 1.07) (end -0.2 1.47) (layer "F.Fab") (width 0.1) (tstamp 0ffef24a-7ea2-4d30-b0b3-235fcfa430b1))
  (fp_line (start -0.2 1.07) (end 1.77 1.07) (layer "F.Fab") (width 0.1) (tstamp 128e90c8-0841-40f9-9ff1-b406c0e9118d))
  (fp_line (start -0.2 3.61) (end -0.2 4.01) (layer "F.Fab") (width 0.1) (tstamp 158df9c6-86a0-48a0-8b0e-3a74153121ff))
  (fp_line (start 2.77 12.065) (end 1.77 12.065) (layer "F.Fab") (width 0.1) (tstamp 1b6b2d92-58d2-4b11-8290-4010a2767133))
  (fp_line (start 2.77 6.15) (end 6.77 6.15) (layer "F.Fab") (width 0.1) (tstamp 23b1ce94-1657-4817-ab52-28408f3b7526))
  (fp_line (start 2.77 7.82) (end 6.77 7.82) (layer "F.Fab") (width 0.1) (tstamp 306ce5c1-7333-4675-af3c-48e23988814a))
  (fp_line (start 1.77 -0.385) (end 2.02 -0.635) (layer "F.Fab") (width 0.1) (tstamp 321795b1-60f8-4bbf-a0fa-c1dbf6fe058a))
  (fp_line (start -0.2 5.28) (end 1.77 5.28) (layer "F.Fab") (width 0.1) (tstamp 33e8ccc9-0636-42c2-8577-a81dcf3361d5))
  (fp_line (start -0.2 4.88) (end -0.2 5.28) (layer "F.Fab") (width 0.1) (tstamp 37cbb5fd-cb1e-47f4-b9b9-cf3605e3c290))
  (fp_line (start -0.2 9.96) (end 1.77 9.96) (layer "F.Fab") (width 0.1) (tstamp 3a0cb11d-92f9-443b-904f-c0b6a52a0abf))
  (fp_line (start 2.77 11.63) (end 6.77 11.63) (layer "F.Fab") (width 0.1) (tstamp 3a19ef40-d060-40c0-ad8d-7ae1a4c3ff98))
  (fp_line (start 2.77 9.09) (end 6.77 9.09) (layer "F.Fab") (width 0.1) (tstamp 422a6ae1-b29d-4bd8-8a90-0a20a211fc68))
  (fp_line (start 2.77 9.96) (end 6.77 9.96) (layer "F.Fab") (width 0.1) (tstamp 4ab985ab-1992-4577-903b-abc5a6f97b7f))
  (fp_line (start -0.2 6.55) (end 1.77 6.55) (layer "F.Fab") (width 0.1) (tstamp 4c687056-8324-4435-814a-49e1d7b040a6))
  (fp_line (start 6.77 2.34) (end 6.77 2.74) (layer "F.Fab") (width 0.1) (tstamp 5122a65e-668f-499f-ba10-1c421a572eeb))
  (fp_line (start -0.2 2.74) (end 1.77 2.74) (layer "F.Fab") (width 0.1) (tstamp 54e28137-8d8c-4839-8051-4d7f1ce5d480))
  (fp_line (start 2.77 7.42) (end 6.77 7.42) (layer "F.Fab") (width 0.1) (tstamp 5a03728c-1ebe-4722-996b-1f32b3d787e6))
  (fp_line (start -0.2 2.34) (end -0.2 2.74) (layer "F.Fab") (width 0.1) (tstamp 5e276b6b-5c57-4f6f-8c52-5be1021a5210))
  (fp_line (start 2.77 10.36) (end 6.77 10.36) (layer "F.Fab") (width 0.1) (tstamp 6173778a-1d84-4b61-a6a3-2642863bf67a))
  (fp_line (start -0.2 0.2) (end 1.77 0.2) (layer "F.Fab") (width 0.1) (tstamp 6288978d-fe88-4c14-88f1-5c7ae234a933))
  (fp_line (start 6.77 11.23) (end 6.77 11.63) (layer "F.Fab") (width 0.1) (tstamp 6348153c-95dd-4220-9989-9670829a007e))
  (fp_line (start 2.77 0.2) (end 6.77 0.2) (layer "F.Fab") (width 0.1) (tstamp 64a1d3d5-1042-4d68-b168-204d2b1365b3))
  (fp_line (start 2.77 4.01) (end 6.77 4.01) (layer "F.Fab") (width 0.1) (tstamp 6c065fdd-5ab0-4a2b-bf34-0622a3dc3854))
  (fp_line (start -0.2 4.88) (end 1.77 4.88) (layer "F.Fab") (width 0.1) (tstamp 707fe4c6-b1f0-4ea2-84b4-b543ae8c1227))
  (fp_line (start 2.77 2.74) (end 6.77 2.74) (layer "F.Fab") (width 0.1) (tstamp 716b7057-ff99-436e-96f3-4cd2cad58f9b))
  (fp_line (start 1.77 12.065) (end 1.77 -0.385) (layer "F.Fab") (width 0.1) (tstamp 751214f4-2db3-480a-afb2-e174f0749434))
  (fp_line (start 6.77 6.15) (end 6.77 6.55) (layer "F.Fab") (width 0.1) (tstamp 7784a09b-2c54-4185-b5b8-435919161221))
  (fp_line (start -0.2 8.69) (end 1.77 8.69) (layer "F.Fab") (width 0.1) (tstamp 7da92700-ba52-4a2b-9836-280540498275))
  (fp_line (start 2.77 2.34) (end 6.77 2.34) (layer "F.Fab") (width 0.1) (tstamp 807953b6-594a-4c60-8726-d8c491a8ed8b))
  (fp_line (start 2.77 1.47) (end 6.77 1.47) (layer "F.Fab") (width 0.1) (tstamp 818779f2-0f53-41f6-bd6f-69a3ec35a3be))
  (fp_line (start 6.77 -0.2) (end 6.77 0.2) (layer "F.Fab") (width 0.1) (tstamp 8bff80af-1b6b-473e-9d02-30af0b9a7de3))
  (fp_line (start -0.2 8.69) (end -0.2 9.09) (layer "F.Fab") (width 0.1) (tstamp 8d77eaf1-76b9-4876-b1ba-e415d5166c5f))
  (fp_line (start -0.2 -0.2) (end 1.77 -0.2) (layer "F.Fab") (width 0.1) (tstamp 941d8b26-7fbc-49c4-9043-07e0917b3333))
  (fp_line (start -0.2 6.15) (end -0.2 6.55) (layer "F.Fab") (width 0.1) (tstamp 95bd61e8-9cfd-47a2-9944-d6423f644a73))
  (fp_line (start 6.77 4.88) (end 6.77 5.28) (layer "F.Fab") (width 0.1) (tstamp 998b2e7f-8826-42d1-a3ef-9c019c88c74e))
  (fp_line (start -0.2 9.96) (end -0.2 10.36) (layer "F.Fab") (width 0.1) (tstamp 9f162168-d736-4348-a64a-370b74ef6cf9))
  (fp_line (start 2.77 3.61) (end 6.77 3.61) (layer "F.Fab") (width 0.1) (tstamp a4b3c254-6394-4d6f-8535-5dae1de7d689))
  (fp_line (start 6.77 8.69) (end 6.77 9.09) (layer "F.Fab") (width 0.1) (tstamp a5655bb3-368c-43ba-a4fc-8eb3537bcb37))
  (fp_line (start -0.2 6.15) (end 1.77 6.15) (layer "F.Fab") (width 0.1) (tstamp a7e2cabf-4f62-4de8-801a-46727033664b))
  (fp_line (start -0.2 11.23) (end -0.2 11.63) (layer "F.Fab") (width 0.1) (tstamp abba584c-abc4-4444-a995-83f726ee40ab))
  (fp_line (start 2.02 -0.635) (end 2.77 -0.635) (layer "F.Fab") (width 0.1) (tstamp b1231ae6-30ba-4b74-a305-b2b64a4a0690))
  (fp_line (start -0.2 3.61) (end 1.77 3.61) (layer "F.Fab") (width 0.1) (tstamp b3c6ee22-77bd-4a09-9b79-3d3d7f610745))
  (fp_line (start -0.2 7.82) (end 1.77 7.82) (layer "F.Fab") (width 0.1) (tstamp bac495d9-2938-4690-8741-220be79fe72b))
  (fp_line (start 2.77 6.55) (end 6.77 6.55) (layer "F.Fab") (width 0.1) (tstamp bac568b2-d2b3-4a93-8027-f2aa933bc1fc))
  (fp_line (start -0.2 7.42) (end -0.2 7.82) (layer "F.Fab") (width 0.1) (tstamp bd8feb45-29ac-4ad6-8cd0-5a885083db13))
  (fp_line (start -0.2 2.34) (end 1.77 2.34) (layer "F.Fab") (width 0.1) (tstamp cc656fad-8edf-4d3c-b1b2-86e06a0bf804))
  (fp_line (start 6.77 7.42) (end 6.77 7.82) (layer "F.Fab") (width 0.1) (tstamp d04f24c4-96bf-44ce-bd29-2ab764e9322a))
  (fp_line (start 2.77 8.69) (end 6.77 8.69) (layer "F.Fab") (width 0.1) (tstamp d58141b7-39ff-4489-9335-62581ed89179))
  (fp_line (start -0.2 10.36) (end 1.77 10.36) (layer "F.Fab") (width 0.1) (tstamp d830c16c-619b-48a6-9885-63db3cf1cb45))
  (fp_line (start 2.77 -0.2) (end 6.77 -0.2) (layer "F.Fab") (width 0.1) (tstamp d9c4b660-861f-4eee-90d1-83057f56dfe9))
  (fp_line (start 2.77 4.88) (end 6.77 4.88) (layer "F.Fab") (width 0.1) (tstamp df772fd9-eed7-41c7-b6de-dad41fa6fb2f))
  (fp_line (start 6.77 1.07) (end 6.77 1.47) (layer "F.Fab") (width 0.1) (tstamp e0ef1585-e65d-4063-b9cc-733d2017d615))
  (fp_line (start -0.2 -0.2) (end -0.2 0.2) (layer "F.Fab") (width 0.1) (tstamp e695468f-d41d-4457-80d2-1b68ff4a86e0))
  (fp_line (start 2.77 11.23) (end 6.77 11.23) (layer "F.Fab") (width 0.1) (tstamp e8d137d2-0d61-43bd-b726-8b24d883ad39))
  (fp_line (start -0.2 1.47) (end 1.77 1.47) (layer "F.Fab") (width 0.1) (tstamp f7b48b6c-62f6-4d3f-aed7-6fe2a457753c))
  (fp_line (start 6.77 9.96) (end 6.77 10.36) (layer "F.Fab") (width 0.1) (tstamp fd2a842b-fb09-4c5c-a768-d952063c7112))
  (pad "1" thru_hole rect (at 0 0) (size 1 1) (drill 0.65) (layers *.Cu *.Mask) (tstamp dd8e21ec-87e8-42a2-a725-901f4810e8a8))
  (pad "2" thru_hole oval (at 1.27 0) (size 1 1) (drill 0.65) (layers *.Cu *.Mask) (tstamp 5d1246a7-19bd-451b-b0b2-5a28f31099dd))
  (pad "3" thru_hole oval (at 0 1.27) (size 1 1) (drill 0.65) (layers *.Cu *.Mask) (tstamp b8db49d0-2a3d-4c66-b9b6-1c93e4ee0038))
  (pad "4" thru_hole oval (at 1.27 1.27) (size 1 1) (drill 0.65) (layers *.Cu *.Mask) (tstamp b17d0f26-437f-4b12-bd6d-4f32aa5ee435))
  (pad "5" thru_hole oval (at 0 2.54) (size 1 1) (drill 0.65) (layers *.Cu *.Mask) (tstamp 8f220d97-b54e-488e-9de4-ab810e0aef9c))
  (pad "6" thru_hole oval (at 1.27 2.54) (size 1 1) (drill 0.65) (layers *.Cu *.Mask) (tstamp f1c45171-9f96-44cf-93df-7159c52a7096))
  (pad "7" thru_hole oval (at 0 3.81) (size 1 1) (drill 0.65) (layers *.Cu *.Mask) (tstamp 7e7d5fd5-783d-47d9-935f-d34f093fecce))
  (pad "8" thru_hole oval (at 1.27 3.81) (size 1 1) (drill 0.65) (layers *.Cu *.Mask) (tstamp cca00138-9b35-4667-811e-56abcada9f11))
  (pad "9" thru_hole oval (at 0 5.08) (size 1 1) (drill 0.65) (layers *.Cu *.Mask) (tstamp 0c5d1aab-4e40-4f5c-b6df-651711b654ac))
  (pad "10" thru_hole oval (at 1.27 5.08) (size 1 1) (drill 0.65) (layers *.Cu *.Mask) (tstamp 2f5cc6b8-5cab-46d3-9041-07c42dfef15d))
  (pad "11" thru_hole oval (at 0 6.35) (size 1 1) (drill 0.65) (layers *.Cu *.Mask) (tstamp 4ed29ecc-d953-4980-8bc4-c65d65afe24a))
  (pad "12" thru_hole oval (at 1.27 6.35) (size 1 1) (drill 0.65) (layers *.Cu *.Mask) (tstamp 93b7827d-dd4c-479c-9a4d-490dde14de7f))
  (pad "13" thru_hole oval (at 0 7.62) (size 1 1) (drill 0.65) (layers *.Cu *.Mask) (tstamp acdf36ea-809e-4d9d-9f8d-0f47c57d7b2d))
  (pad "14" thru_hole oval (at 1.27 7.62) (size 1 1) (drill 0.65) (layers *.Cu *.Mask) (tstamp b868530d-81a6-46b0-a7dd-892afcf9beba))
  (pad "15" thru_hole oval (at 0 8.89) (size 1 1) (drill 0.65) (layers *.Cu *.Mask) (tstamp bfc39934-2de2-42e4-a679-20a774167cbd))
  (pad "16" thru_hole oval (at 1.27 8.89) (size 1 1) (drill 0.65) (layers *.Cu *.Mask) (tstamp ac0cb525-5d29-47a6-adbd-553f619ccd4c))
  (pad "17" thru_hole oval (at 0 10.16) (size 1 1) (drill 0.65) (layers *.Cu *.Mask) (tstamp d1daebba-85b5-4770-8ad7-69d032032102))
  (pad "18" thru_hole oval (at 1.27 10.16) (size 1 1) (drill 0.65) (layers *.Cu *.Mask) (tstamp 7389425e-7729-406e-bab8-573b44209a82))
  (pad "19" thru_hole oval (at 0 11.43) (size 1 1) (drill 0.65) (layers *.Cu *.Mask) (tstamp 47e92ae4-fee6-4c29-82fc-23495efbb0a2))
  (pad "20" thru_hole oval (at 1.27 11.43) (size 1 1) (drill 0.65) (layers *.Cu *.Mask) (tstamp 621cffd1-ea47-44cc-af2c-0ad8cbf46eaa))
  (model "${KICADLIB}/model/connector/PinHeader_2x10_P1.27mm_Horizontal.step"
    (offset (xyz 0 0 0))
    (scale (xyz 1 1 1))
    (rotate (xyz 0 0 0))
  )
)
