(module "Bourns_PEC16-2xxxF_OnlyShaft" (layer F.Cu) (tedit 5EC0812C)
  (fp_text reference "REF**" (at 0 -9.2 unlocked) (layer F.SilkS)
    (effects (font (size 1 1) (thickness 0.15)))
  )
  (fp_text value "Bourns_PEC16-2xxxF_OnlyShaft" (at 0 -7.5 unlocked) (layer F.Fab) hide
    (effects (font (size 1 1) (thickness 0.15)))
  )
  (fp_text user "${REFERENCE}" (at 0 0 unlocked) (layer F.Fab)
    (effects (font (size 1 1) (thickness 0.15)))
  )
  (fp_line (start -5.6 -8.3) (end 5.6 -8.3) (layer B.SilkS) (width 0.12))
  (fp_line (start -8 -5.9) (end -8 8.2) (layer B.SilkS) (width 0.12))
  (fp_line (start 8 -5.9) (end 8 8.2) (layer B.SilkS) (width 0.12))
  (fp_line (start 6.9 9.3) (end 3.5 9.3) (layer B.SilkS) (width 0.12))
  (fp_line (start -3.5 9.3) (end -6.9 9.3) (layer B.SilkS) (width 0.12))
  (fp_arc (start -6.9 8.2) (end -8 8.2) (angle -90) (layer B.SilkS) (width 0.12))
  (fp_arc (start 6.9 8.2) (end 6.9 9.3) (angle -90) (layer B.SilkS) (width 0.12))
  (fp_arc (start -5.6 -5.9) (end -5.6 -8.3) (angle -90) (layer B.SilkS) (width 0.12))
  (fp_line (start -2 12.5) (end 2 12.5) (layer B.SilkS) (width 0.12))
  (fp_line (start 2 12.5) (end 2 10.8) (layer B.SilkS) (width 0.12))
  (fp_line (start -2 12.5) (end -2 10.8) (layer B.SilkS) (width 0.12))
  (fp_arc (start -3.5 10.8) (end -2 10.8) (angle -90) (layer B.SilkS) (width 0.12))
  (fp_arc (start 3.5 10.8) (end 3.5 9.3) (angle -90) (layer B.SilkS) (width 0.12))
  (fp_arc (start 5.6 -5.9) (end 8 -5.9) (angle -90) (layer B.SilkS) (width 0.12))
  (fp_line (start 3 12.5) (end -3 12.5) (layer Eco1.User) (width 0.12))
  (pad "1" thru_hole circle (at 0 0) (size 13.5 13.5) (drill 9.3) (layers *.Cu *.Mask) (tstamp 71661fd7-c17e-4b25-ae35-20ddd0f7e0a7))
  (pad "" thru_hole circle (at 0 9) (size 3.3 3.3) (drill 3.3) (layers *.Cu *.Mask) (tstamp 39dbbd6c-65eb-494d-aef7-7fde39c1a3bc))
  (model "${KICADLIB}/model/mechanical/Bourns_PEC16-2X15F-SXXXX.stp"
    (offset (xyz 0 0 -4.3))
    (scale (xyz 1 1 1))
    (rotate (xyz -90 0 0))
  )
)
