(footprint "PinHeader_2x08_P2.54mm_Vertical_SMD" (version 20210824) (generator pcbnew) (layer "F.Cu")
  (tedit 613243D0)
  (descr "surface-mounted straight pin header, 2x08, 2.54mm pitch, double rows")
  (tags "Surface mounted pin header SMD 2x08 2.54mm double row")
  (attr smd)
  (fp_text reference "REF**" (at 0 -11.22) (layer "F.SilkS")
    (effects (font (size 1 1) (thickness 0.15)))
    (tstamp 5e03f9cf-29aa-4d3b-8b1b-42d8bc53a057)
  )
  (fp_text value "PinHeader_2x08_P2.54mm_Vertical_SMD" (at 0 11.22) (layer "F.Fab") hide
    (effects (font (size 1 1) (thickness 0.15)))
    (tstamp 39ef8af6-cc13-487f-8f7c-f2296870b74a)
  )
  (fp_text user "^" (at -5 -8.9 270 unlocked) (layer "F.SilkS")
    (effects (font (size 1 1) (thickness 0.15)))
    (tstamp b16e3f4f-51dd-4abc-8ddc-beb06afd2cee)
  )
  (fp_text user "${REFERENCE}" (at 0 0 90) (layer "F.Fab")
    (effects (font (size 1 1) (thickness 0.15)))
    (tstamp 894ebf0f-4e6b-4e44-a5fa-585bb5a1ad4c)
  )
  (fp_line (start -2.6 -8.13) (end -2.6 -7.11) (layer "F.SilkS") (width 0.12) (tstamp 007817bb-1ba3-4984-a630-86f8cca3a674))
  (fp_line (start -2.6 -3.05) (end -2.6 -2.03) (layer "F.SilkS") (width 0.12) (tstamp 150d2cbb-f616-42f7-9711-96e1524e813d))
  (fp_line (start 2.6 7.11) (end 2.6 8.13) (layer "F.SilkS") (width 0.12) (tstamp 1db7361d-f893-4fce-9df5-2c70b5cf2748))
  (fp_line (start -2.6 10.22) (end 2.6 10.22) (layer "F.SilkS") (width 0.12) (tstamp 227b38d2-f449-45a2-a987-80037705e3ca))
  (fp_line (start 2.6 -5.59) (end 2.6 -4.57) (layer "F.SilkS") (width 0.12) (tstamp 31573200-ba72-4a80-a970-3d19751ab18b))
  (fp_line (start 2.6 -3.05) (end 2.6 -2.03) (layer "F.SilkS") (width 0.12) (tstamp 360b3c48-94a5-48c3-bb52-81583278fba7))
  (fp_line (start -2.6 7.11) (end -2.6 8.13) (layer "F.SilkS") (width 0.12) (tstamp 3becde86-894b-40d0-82f8-16fc2a0b149d))
  (fp_line (start 2.6 9.65) (end 2.6 10.22) (layer "F.SilkS") (width 0.12) (tstamp 4425088b-f429-4e1b-9547-c03aea9cb5b3))
  (fp_line (start -2.6 4.57) (end -2.6 5.59) (layer "F.SilkS") (width 0.12) (tstamp 649afecc-6aff-4f92-8dbf-b0d0557cc5bb))
  (fp_line (start 2.6 -8.13) (end 2.6 -7.11) (layer "F.SilkS") (width 0.12) (tstamp 73f45797-2190-4be0-a6f7-e0d0c500002e))
  (fp_line (start -2.6 -10.22) (end 2.6 -10.22) (layer "F.SilkS") (width 0.12) (tstamp 7d9a2ea9-78bb-4aae-a372-0fdfba70c4f0))
  (fp_line (start 2.6 -0.51) (end 2.6 0.51) (layer "F.SilkS") (width 0.12) (tstamp a2af084a-ac00-483d-82ef-54d4ad6dbc1f))
  (fp_line (start -2.6 -5.59) (end -2.6 -4.57) (layer "F.SilkS") (width 0.12) (tstamp ac34a9bd-5f42-40d3-9e60-d2018e88dc80))
  (fp_line (start -2.6 -10.22) (end -2.6 -9.65) (layer "F.SilkS") (width 0.12) (tstamp b874c5f7-c556-4653-936e-a6105826694a))
  (fp_line (start 2.6 2.03) (end 2.6 3.05) (layer "F.SilkS") (width 0.12) (tstamp cb31738a-d167-42cd-83c1-e15489efe473))
  (fp_line (start -2.6 9.65) (end -2.6 10.22) (layer "F.SilkS") (width 0.12) (tstamp cc970415-d6ac-4641-8cc5-458e4302ed5b))
  (fp_line (start -2.6 2.03) (end -2.6 3.05) (layer "F.SilkS") (width 0.12) (tstamp d13f05cc-39c4-4c42-b73d-baa6663bb78e))
  (fp_line (start 2.6 4.57) (end 2.6 5.59) (layer "F.SilkS") (width 0.12) (tstamp d808027a-daf7-48ee-8c15-74649c77c171))
  (fp_line (start 2.6 -10.22) (end 2.6 -9.65) (layer "F.SilkS") (width 0.12) (tstamp dc80c514-028e-423e-b192-b0a1000277ea))
  (fp_line (start -2.6 -0.51) (end -2.6 0.51) (layer "F.SilkS") (width 0.12) (tstamp f01dc089-910e-4590-a41b-69d1a843d12d))
  (fp_rect (start -4.7 -10.8) (end 4.8 10.8) (layer "F.CrtYd") (width 0.05) (fill none) (tstamp 64dfc94f-1350-46f5-81f6-e8e3db616df2))
  (fp_line (start 2.54 3.49) (end 3.6 3.49) (layer "F.Fab") (width 0.1) (tstamp 06667234-bd0c-4666-9085-3f8a49c4eb3b))
  (fp_line (start 2.54 0.95) (end 3.6 0.95) (layer "F.Fab") (width 0.1) (tstamp 0b21c919-aba6-48a7-810e-be46f7e860c4))
  (fp_line (start 2.54 8.57) (end 3.6 8.57) (layer "F.Fab") (width 0.1) (tstamp 10062a59-3f80-42ab-8592-f81de8f027f7))
  (fp_line (start -3.6 -6.67) (end -3.6 -6.03) (layer "F.Fab") (width 0.1) (tstamp 102c870d-d76e-411b-8c5c-785eab504848))
  (fp_line (start 3.6 6.03) (end 3.6 6.67) (layer "F.Fab") (width 0.1) (tstamp 10e55fde-9df1-4f71-a14f-7d87a3620c8a))
  (fp_line (start 3.6 -6.67) (end 3.6 -6.03) (layer "F.Fab") (width 0.1) (tstamp 161ab355-111d-4b51-b1ab-6dbec260ac2c))
  (fp_line (start 3.6 -9.21) (end 3.6 -8.57) (layer "F.Fab") (width 0.1) (tstamp 1b7f1060-1e7c-4c97-8a75-f8ae101d3aaf))
  (fp_line (start -2.54 8.57) (end -3.6 8.57) (layer "F.Fab") (width 0.1) (tstamp 1bb82818-cd25-4ee5-aacb-be9b8dde61c9))
  (fp_line (start 3.6 8.57) (end 3.6 9.21) (layer "F.Fab") (width 0.1) (tstamp 1c526989-0618-406e-b6df-9b0174f97a12))
  (fp_line (start -3.6 0.95) (end -3.6 1.59) (layer "F.Fab") (width 0.1) (tstamp 1e91234c-fac5-4e4b-a7dc-52fc3f1ba9ec))
  (fp_line (start 2.54 10.16) (end -2.54 10.16) (layer "F.Fab") (width 0.1) (tstamp 29c2c395-f0cb-480e-99c3-993e43bb7199))
  (fp_line (start -3.6 -0.95) (end -2.54 -0.95) (layer "F.Fab") (width 0.1) (tstamp 29f3973d-7aaf-4705-9906-3637dea85506))
  (fp_line (start -2.54 -4.13) (end -3.6 -4.13) (layer "F.Fab") (width 0.1) (tstamp 2d1108cf-ceea-4bfb-897c-884417ec88ae))
  (fp_line (start 2.54 -4.13) (end 3.6 -4.13) (layer "F.Fab") (width 0.1) (tstamp 3cba5542-ca91-422c-8077-75bd3b7805a5))
  (fp_line (start -2.54 6.03) (end -3.6 6.03) (layer "F.Fab") (width 0.1) (tstamp 42807ad7-dc1f-4ee1-803b-8fbbfa23ab10))
  (fp_line (start -3.6 4.13) (end -2.54 4.13) (layer "F.Fab") (width 0.1) (tstamp 43075603-c34e-43fa-8dcf-02d950ca9d17))
  (fp_line (start -2.54 -6.67) (end -3.6 -6.67) (layer "F.Fab") (width 0.1) (tstamp 43ba7bc1-59a0-48e6-9c2c-891ea0313d5d))
  (fp_line (start -3.6 3.49) (end -3.6 4.13) (layer "F.Fab") (width 0.1) (tstamp 4526a99f-0920-43a1-902f-60b6e6aa0a93))
  (fp_line (start 3.6 1.59) (end 2.54 1.59) (layer "F.Fab") (width 0.1) (tstamp 45590bcc-e6d1-4703-88ea-7fe9874caa47))
  (fp_line (start -1.59 -10.16) (end 2.54 -10.16) (layer "F.Fab") (width 0.1) (tstamp 4b1588a0-e4f3-429a-9356-579b0a51e4ce))
  (fp_line (start -2.54 0.95) (end -3.6 0.95) (layer "F.Fab") (width 0.1) (tstamp 5d70e7aa-8ce5-4023-b0a1-e2db7e997a96))
  (fp_line (start -3.6 -8.57) (end -2.54 -8.57) (layer "F.Fab") (width 0.1) (tstamp 649f5fb6-c928-44f2-aa9b-110b1e87fb4f))
  (fp_line (start -3.6 6.03) (end -3.6 6.67) (layer "F.Fab") (width 0.1) (tstamp 64cbeb4b-c9ab-4e5d-a8ac-9244d54b1477))
  (fp_line (start 3.6 6.67) (end 2.54 6.67) (layer "F.Fab") (width 0.1) (tstamp 6ab6bd06-dde6-4924-a37f-f9b5ba733227))
  (fp_line (start -2.54 -9.21) (end -3.6 -9.21) (layer "F.Fab") (width 0.1) (tstamp 730a67ca-09db-40f9-9a84-65f8bf6f75f6))
  (fp_line (start 3.6 -6.03) (end 2.54 -6.03) (layer "F.Fab") (width 0.1) (tstamp 75093a30-e1af-4225-8329-e433c45f940b))
  (fp_line (start -2.54 10.16) (end -2.54 -9.21) (layer "F.Fab") (width 0.1) (tstamp 757ea986-772c-4f11-9444-6d69db02cfaf))
  (fp_line (start 2.54 -1.59) (end 3.6 -1.59) (layer "F.Fab") (width 0.1) (tstamp 81e96128-0908-493d-8ca8-7053285dfebc))
  (fp_line (start 3.6 3.49) (end 3.6 4.13) (layer "F.Fab") (width 0.1) (tstamp 8902d0fd-600d-4cf0-aa44-7438d0a1b7b9))
  (fp_line (start -3.6 9.21) (end -2.54 9.21) (layer "F.Fab") (width 0.1) (tstamp 90612c8f-3b12-48b7-88d4-3872de663b0d))
  (fp_line (start 2.54 6.03) (end 3.6 6.03) (layer "F.Fab") (width 0.1) (tstamp 9409a28d-5604-47aa-9a7e-c79b031b69a1))
  (fp_line (start 3.6 -3.49) (end 2.54 -3.49) (layer "F.Fab") (width 0.1) (tstamp 9b83202b-9c22-495c-8c83-e646c29f3f1d))
  (fp_line (start 3.6 4.13) (end 2.54 4.13) (layer "F.Fab") (width 0.1) (tstamp aa8974cc-5c3d-474d-81be-b4c5d8e3d48e))
  (fp_line (start 3.6 -1.59) (end 3.6 -0.95) (layer "F.Fab") (width 0.1) (tstamp aaaf263e-050d-4b27-aee1-b4e4ae72e80e))
  (fp_line (start 3.6 9.21) (end 2.54 9.21) (layer "F.Fab") (width 0.1) (tstamp b014a557-6076-4868-a9d7-f58cf0885d07))
  (fp_line (start -3.6 -9.21) (end -3.6 -8.57) (layer "F.Fab") (width 0.1) (tstamp bc839f06-9382-4dfd-b0d9-83a4f71d7277))
  (fp_line (start 3.6 -4.13) (end 3.6 -3.49) (layer "F.Fab") (width 0.1) (tstamp be16c4ed-f865-4b68-930d-e7ef81c7020f))
  (fp_line (start -3.6 -3.49) (end -2.54 -3.49) (layer "F.Fab") (width 0.1) (tstamp be501963-bd07-4729-bf6e-2fc609fc1c34))
  (fp_line (start -3.6 8.57) (end -3.6 9.21) (layer "F.Fab") (width 0.1) (tstamp bf4d92e1-e44d-414b-a322-a6adc8e66082))
  (fp_line (start 3.6 -0.95) (end 2.54 -0.95) (layer "F.Fab") (width 0.1) (tstamp c469ba96-a961-4064-b1f4-3ec8f4f84a1a))
  (fp_line (start -3.6 -4.13) (end -3.6 -3.49) (layer "F.Fab") (width 0.1) (tstamp c85a3067-3b2f-4782-8681-31d889fa913e))
  (fp_line (start 2.54 -10.16) (end 2.54 10.16) (layer "F.Fab") (width 0.1) (tstamp c9b7badc-7b49-45d0-a044-f091adc60473))
  (fp_line (start -2.54 -9.21) (end -1.59 -10.16) (layer "F.Fab") (width 0.1) (tstamp caf38b48-d573-40f4-8c57-38ae01194ae5))
  (fp_line (start -3.6 -1.59) (end -3.6 -0.95) (layer "F.Fab") (width 0.1) (tstamp cb1a6d32-5404-403e-bc0e-231da48c4315))
  (fp_line (start 2.54 -6.67) (end 3.6 -6.67) (layer "F.Fab") (width 0.1) (tstamp d37b93f4-4787-42a0-9b77-824fd0648d7a))
  (fp_line (start 3.6 0.95) (end 3.6 1.59) (layer "F.Fab") (width 0.1) (tstamp d4eac48e-e39c-4137-b8d7-a214f61dc22d))
  (fp_line (start -2.54 -1.59) (end -3.6 -1.59) (layer "F.Fab") (width 0.1) (tstamp deb0f4ff-3c7f-44e7-9355-fc08810bb798))
  (fp_line (start -2.54 3.49) (end -3.6 3.49) (layer "F.Fab") (width 0.1) (tstamp e024253b-af5e-4011-9807-a054948e915b))
  (fp_line (start -3.6 1.59) (end -2.54 1.59) (layer "F.Fab") (width 0.1) (tstamp e23ae4dc-1332-4f01-b2e4-d00c5865adf7))
  (fp_line (start 2.54 -9.21) (end 3.6 -9.21) (layer "F.Fab") (width 0.1) (tstamp e2461c80-74ce-4ee0-9c04-956ff88a585f))
  (fp_line (start 3.6 -8.57) (end 2.54 -8.57) (layer "F.Fab") (width 0.1) (tstamp e898a010-3f3f-47c2-9f43-abc54e969941))
  (fp_line (start -3.6 6.67) (end -2.54 6.67) (layer "F.Fab") (width 0.1) (tstamp f5c56db5-bf08-42df-97cc-e0f10340a204))
  (fp_line (start -3.6 -6.03) (end -2.54 -6.03) (layer "F.Fab") (width 0.1) (tstamp f75a0d1e-ab6c-48a8-a629-8c8487c3951e))
  (pad "1" smd rect (at -2.525 -8.89) (size 3.15 1) (layers "F.Cu" "F.Paste" "F.Mask") (tstamp 9ca6c97b-edcc-4995-9571-f9187967c08f))
  (pad "2" smd rect (at 2.525 -8.89) (size 3.15 1) (layers "F.Cu" "F.Paste" "F.Mask") (tstamp bba1e801-40c2-4588-a569-c399e8ecf2b9))
  (pad "3" smd rect (at -2.525 -6.35) (size 3.15 1) (layers "F.Cu" "F.Paste" "F.Mask") (tstamp 470e4338-1d8d-47d3-a2f4-3e29cff4e23a))
  (pad "4" smd rect (at 2.525 -6.35) (size 3.15 1) (layers "F.Cu" "F.Paste" "F.Mask") (tstamp a1396d0e-3ec5-467a-aa26-40de5e354a83))
  (pad "5" smd rect (at -2.525 -3.81) (size 3.15 1) (layers "F.Cu" "F.Paste" "F.Mask") (tstamp a10076fb-8471-4f9c-92dd-f238a1d8fd47))
  (pad "6" smd rect (at 2.525 -3.81) (size 3.15 1) (layers "F.Cu" "F.Paste" "F.Mask") (tstamp c26a5e6c-51be-4178-84bf-6284b258d8d6))
  (pad "7" smd rect (at -2.525 -1.27) (size 3.15 1) (layers "F.Cu" "F.Paste" "F.Mask") (tstamp a28f976d-8480-4ee9-aebd-3618b9664a76))
  (pad "8" smd rect (at 2.525 -1.27) (size 3.15 1) (layers "F.Cu" "F.Paste" "F.Mask") (tstamp f32d6268-9279-46a3-9252-0ab5d16c4cbf))
  (pad "9" smd rect (at -2.525 1.27) (size 3.15 1) (layers "F.Cu" "F.Paste" "F.Mask") (tstamp c74eff1d-7bfe-4ca0-95b5-b1773ba8e1ce))
  (pad "10" smd rect (at 2.525 1.27) (size 3.15 1) (layers "F.Cu" "F.Paste" "F.Mask") (tstamp 2c428b28-6238-44aa-902f-ccb23b62cfc2))
  (pad "11" smd rect (at -2.525 3.81) (size 3.15 1) (layers "F.Cu" "F.Paste" "F.Mask") (tstamp f155dd0d-d846-4e10-aa54-53ac71be1336))
  (pad "12" smd rect (at 2.525 3.81) (size 3.15 1) (layers "F.Cu" "F.Paste" "F.Mask") (tstamp 4c53bf11-7a70-46f1-9fd0-d7c8b015bdb1))
  (pad "13" smd rect (at -2.525 6.35) (size 3.15 1) (layers "F.Cu" "F.Paste" "F.Mask") (tstamp a61124b4-c415-4796-921c-191bf0219433))
  (pad "14" smd rect (at 2.525 6.35) (size 3.15 1) (layers "F.Cu" "F.Paste" "F.Mask") (tstamp da35b173-f89c-48f6-899d-01fe293ef47b))
  (pad "15" smd rect (at -2.525 8.89) (size 3.15 1) (layers "F.Cu" "F.Paste" "F.Mask") (tstamp f443dc4f-959e-4367-bcfd-8f963a2654f8))
  (pad "16" smd rect (at 2.525 8.89) (size 3.15 1) (layers "F.Cu" "F.Paste" "F.Mask") (tstamp c4c92983-f2a3-45b6-84da-4e0d90ab8653))
  (model "${KICADLIB}/model/connector/PinHeader_2x08_P2.54mm_Vertical_SMD.step"
    (offset (xyz 0 0 0))
    (scale (xyz 1 1 1))
    (rotate (xyz 0 0 0))
  )
)
