(footprint "QFN40P900X900X75-81" (version 20210925) (generator pcbnew) (layer "F.Cu")
  (tedit 616724F6)
  (attr smd)
  (fp_text reference "REF**" (at 0 -5.95) (layer "F.SilkS")
    (effects (font (size 1 1) (thickness 0.15)))
    (tstamp 2ae928a4-37eb-423a-831c-27a4d867c017)
  )
  (fp_text value "QFN40P900X900X75-81" (at 0 -7.2) (layer "F.Fab") hide
    (effects (font (size 1 1) (thickness 0.15)))
    (tstamp d58d94fe-77e3-4915-ad4b-f1f22e293c95)
  )
  (fp_text user "^" (at -5.7 -3.8 270 unlocked) (layer "F.SilkS")
    (effects (font (size 1 1) (thickness 0.15)))
    (tstamp 2d6ec352-6b4d-4fc5-bd21-999e4fe571c8)
  )
  (fp_text user "${REFERENCE}" (at 0 0 unlocked) (layer "F.Fab")
    (effects (font (size 1 1) (thickness 0.15)))
    (tstamp 5113280d-5216-4d7b-a925-0cfa86c7470e)
  )
  (fp_rect (start 3.25 -3.25) (end 1.75 -1.75) (layer "F.Paste") (width 0.1) (fill solid) (tstamp 093cf6aa-5c0b-4a74-b5ed-cfd4e06c91cc))
  (fp_rect (start 3.25 -1) (end 1.75 1) (layer "F.Paste") (width 0.1) (fill solid) (tstamp 431753c7-36ef-4c24-9299-d8e93cc4bc7b))
  (fp_rect (start 3.25 1.75) (end 1.75 3.25) (layer "F.Paste") (width 0.1) (fill solid) (tstamp 6061cc4a-5ae7-4388-b112-867ece60d0fa))
  (fp_rect (start -3.25 -3.25) (end -1.75 -1.75) (layer "F.Paste") (width 0.1) (fill solid) (tstamp 7d774487-c414-4197-b1a4-66469493dbd4))
  (fp_rect (start -1 -3.25) (end 1 -1.75) (layer "F.Paste") (width 0.1) (fill solid) (tstamp 8c6ccf2d-52ef-4c97-9024-3085256e1ee1))
  (fp_rect (start -3.25 -1) (end -1.75 1) (layer "F.Paste") (width 0.1) (fill solid) (tstamp 8db461cc-172c-4387-8ec9-c56b438ba0e9))
  (fp_rect (start -1 -1) (end 1 1) (layer "F.Paste") (width 0.1) (fill solid) (tstamp 95a5521e-31a6-444e-8c34-efbe08aeefd8))
  (fp_rect (start -3.25 1.75) (end -1.75 3.25) (layer "F.Paste") (width 0.1) (fill solid) (tstamp bc844fa3-6ad7-4a64-b043-eb422f5ed7c0))
  (fp_rect (start -1 1.75) (end 1 3.25) (layer "F.Paste") (width 0.1) (fill solid) (tstamp ce8ec47b-8c44-4b2a-a015-7999d3d9869a))
  (fp_line (start -4.5 -4.5) (end -4.05 -4.5) (layer "F.SilkS") (width 0.1) (tstamp 1a9718b3-615a-47f2-ab9b-1e40c746b2e1))
  (fp_line (start 4.5 4.5) (end 4.5 4.05) (layer "F.SilkS") (width 0.1) (tstamp 1f3a10a5-54ce-4a66-84aa-d49b01e77b16))
  (fp_line (start -4.5 4.5) (end -4.5 4.05) (layer "F.SilkS") (width 0.1) (tstamp 255a5066-e1ef-48b3-b02f-f3a8bb99d60e))
  (fp_line (start 4.05 4.5) (end 4.5 4.5) (layer "F.SilkS") (width 0.1) (tstamp 29b6597d-7b3a-4af3-8475-d7ecc4b8038a))
  (fp_line (start -4.5 -4.05) (end -4.5 -4.5) (layer "F.SilkS") (width 0.1) (tstamp 63116603-b2d1-4923-8865-1012dc4f54d4))
  (fp_line (start 4.05 -4.5) (end 4.5 -4.5) (layer "F.SilkS") (width 0.1) (tstamp af45e776-e7c7-43c6-b040-8506d8b39167))
  (fp_line (start -4.05 4.5) (end -4.5 4.5) (layer "F.SilkS") (width 0.1) (tstamp e19e0059-b35f-421d-8e04-aa57f14d09bd))
  (fp_line (start 4.5 -4.5) (end 4.5 -4.05) (layer "F.SilkS") (width 0.1) (tstamp e5344dce-339e-43fb-8f44-d82d3e955b30))
  (fp_line (start 4.95 4.95) (end -4.95 4.95) (layer "F.CrtYd") (width 0.05) (tstamp 1b637942-0b7d-4e42-a985-49825a2a8f1f))
  (fp_line (start 4.95 -4.95) (end 4.95 4.95) (layer "F.CrtYd") (width 0.05) (tstamp 4e6c44d7-1744-433c-9bbf-64fcf74c6e4c))
  (fp_line (start -4.95 -4.95) (end 4.95 -4.95) (layer "F.CrtYd") (width 0.05) (tstamp 693c1a0a-f2f7-4a2e-b04d-aaa980fa423d))
  (fp_line (start -4.95 4.95) (end -4.95 -4.95) (layer "F.CrtYd") (width 0.05) (tstamp d82edae0-f97d-4e79-bc0c-a995a1b88043))
  (fp_line (start -4.5 4.5) (end 4.5 4.5) (layer "F.Fab") (width 0.1) (tstamp 16dc054d-acfc-4847-b583-820e8caa2be1))
  (fp_line (start -4.5 -4) (end -4.5 4.5) (layer "F.Fab") (width 0.1) (tstamp 66fe6a80-637a-44c0-9e51-c2fb594c0aa2))
  (fp_line (start -4 -4.5) (end -4.5 -4) (layer "F.Fab") (width 0.1) (tstamp 874522ce-78cc-440a-967a-9dd8b6a45e83))
  (fp_line (start 4.5 4.5) (end 4.5 -4.5) (layer "F.Fab") (width 0.1) (tstamp 8dc8532a-5262-47fc-8923-fa8d855b8038))
  (fp_line (start 4.5 -4.5) (end -4 -4.5) (layer "F.Fab") (width 0.1) (tstamp cc885d87-f217-4efb-b407-1cb82acf7a7e))
  (pad "1" smd rect locked (at -4.5 -3.8 90) (size 0.2 0.85) (layers "F.Cu" "F.Paste" "F.Mask") (tstamp 5ad6e7e7-8c5a-48fb-917b-a3df950dde30))
  (pad "2" smd rect locked (at -4.5 -3.4 90) (size 0.2 0.85) (layers "F.Cu" "F.Paste" "F.Mask") (tstamp 5fba0586-d37f-4815-a54d-08b9a56deda0))
  (pad "3" smd rect locked (at -4.5 -3 90) (size 0.2 0.85) (layers "F.Cu" "F.Paste" "F.Mask") (tstamp 2589b1ae-ab1f-4066-9c23-fc8637f16c87))
  (pad "4" smd rect locked (at -4.5 -2.6 90) (size 0.2 0.85) (layers "F.Cu" "F.Paste" "F.Mask") (tstamp d18fc749-fa20-444d-8b0a-f81de9d03baf))
  (pad "5" smd rect locked (at -4.5 -2.2 90) (size 0.2 0.85) (layers "F.Cu" "F.Paste" "F.Mask") (tstamp 4719e8cc-5761-4d0c-93a2-7272f1c5ea73))
  (pad "6" smd rect locked (at -4.5 -1.8 90) (size 0.2 0.85) (layers "F.Cu" "F.Paste" "F.Mask") (tstamp a722e55e-0902-4760-b784-772364882856))
  (pad "7" smd rect locked (at -4.5 -1.4 90) (size 0.2 0.85) (layers "F.Cu" "F.Paste" "F.Mask") (tstamp 429ecc43-b0d2-429a-8730-140837ffa66e))
  (pad "8" smd rect locked (at -4.5 -1 90) (size 0.2 0.85) (layers "F.Cu" "F.Paste" "F.Mask") (tstamp cda57100-59bf-4b13-a538-641c1d44da6a))
  (pad "9" smd rect locked (at -4.5 -0.6 90) (size 0.2 0.85) (layers "F.Cu" "F.Paste" "F.Mask") (tstamp 1888cc1b-06ff-4b19-9354-673c4cd82dfa))
  (pad "10" smd rect locked (at -4.5 -0.2 90) (size 0.2 0.85) (layers "F.Cu" "F.Paste" "F.Mask") (tstamp 47ac2cf3-50d0-407a-9635-485f08bac656))
  (pad "11" smd rect locked (at -4.5 0.2 90) (size 0.2 0.85) (layers "F.Cu" "F.Paste" "F.Mask") (tstamp 04d1f927-e139-468d-8cf8-a55be438118e))
  (pad "12" smd rect locked (at -4.5 0.6 90) (size 0.2 0.85) (layers "F.Cu" "F.Paste" "F.Mask") (tstamp 6270593b-8d8a-4493-a32c-12b7a372ca3c))
  (pad "13" smd rect locked (at -4.5 1 90) (size 0.2 0.85) (layers "F.Cu" "F.Paste" "F.Mask") (tstamp be85716e-a4c1-4e15-85f2-a404e9dbd606))
  (pad "14" smd rect locked (at -4.5 1.4 90) (size 0.2 0.85) (layers "F.Cu" "F.Paste" "F.Mask") (tstamp 10381664-534e-4783-a302-639c045bac6d))
  (pad "15" smd rect locked (at -4.5 1.8 90) (size 0.2 0.85) (layers "F.Cu" "F.Paste" "F.Mask") (tstamp 4734d7c1-aecd-4be9-9473-83e541fe4b83))
  (pad "16" smd rect locked (at -4.5 2.2 90) (size 0.2 0.85) (layers "F.Cu" "F.Paste" "F.Mask") (tstamp 4b074ca8-41fe-4cc6-ac68-c02e9b7df26b))
  (pad "17" smd rect locked (at -4.5 2.6 90) (size 0.2 0.85) (layers "F.Cu" "F.Paste" "F.Mask") (tstamp 2f84f1a1-aa9a-455b-b75c-251dac84b544))
  (pad "18" smd rect locked (at -4.5 3 90) (size 0.2 0.85) (layers "F.Cu" "F.Paste" "F.Mask") (tstamp 74da2864-89bc-49d7-95fa-4aaf0016a352))
  (pad "19" smd rect locked (at -4.5 3.4 90) (size 0.2 0.85) (layers "F.Cu" "F.Paste" "F.Mask") (tstamp a5a16d3f-efc9-4ddc-9fea-1836d5b71b4d))
  (pad "20" smd rect locked (at -4.5 3.8 90) (size 0.2 0.85) (layers "F.Cu" "F.Paste" "F.Mask") (tstamp 7cc4519a-77c4-4652-9c63-74c11657b851))
  (pad "21" smd rect locked (at -3.8 4.5) (size 0.2 0.85) (layers "F.Cu" "F.Paste" "F.Mask") (tstamp 474003ef-ee89-4c3d-a279-7b154bd8398c))
  (pad "22" smd rect locked (at -3.4 4.5) (size 0.2 0.85) (layers "F.Cu" "F.Paste" "F.Mask") (tstamp 55ab5d99-2f17-4538-84e7-f04b663c36d5))
  (pad "23" smd rect locked (at -3 4.5) (size 0.2 0.85) (layers "F.Cu" "F.Paste" "F.Mask") (tstamp ab9513ef-ff21-4388-8715-42ab68c2bc9b))
  (pad "24" smd rect locked (at -2.6 4.5) (size 0.2 0.85) (layers "F.Cu" "F.Paste" "F.Mask") (tstamp afa5b334-1428-491e-9c38-edc5e137eab3))
  (pad "25" smd rect locked (at -2.2 4.5) (size 0.2 0.85) (layers "F.Cu" "F.Paste" "F.Mask") (tstamp 86688526-436f-4eb1-bb84-54863039c4aa))
  (pad "26" smd rect locked (at -1.8 4.5) (size 0.2 0.85) (layers "F.Cu" "F.Paste" "F.Mask") (tstamp 5096b38d-4016-458b-8d46-5cb1e0c73fdb))
  (pad "27" smd rect locked (at -1.4 4.5) (size 0.2 0.85) (layers "F.Cu" "F.Paste" "F.Mask") (tstamp e3056794-1203-4d4f-b7ec-76b13e07a26f))
  (pad "28" smd rect locked (at -1 4.5) (size 0.2 0.85) (layers "F.Cu" "F.Paste" "F.Mask") (tstamp d42ecbdf-985a-4e6c-8d2f-d566f31c55a5))
  (pad "29" smd rect locked (at -0.6 4.5) (size 0.2 0.85) (layers "F.Cu" "F.Paste" "F.Mask") (tstamp 37a21d4a-f87f-48bf-8a19-d1d7253a907e))
  (pad "30" smd rect locked (at -0.2 4.5) (size 0.2 0.85) (layers "F.Cu" "F.Paste" "F.Mask") (tstamp 2ef2dff8-bbbc-4f06-92ed-741559a98b99))
  (pad "31" smd rect locked (at 0.2 4.5) (size 0.2 0.85) (layers "F.Cu" "F.Paste" "F.Mask") (tstamp 2d282790-2d14-4664-9d88-7ed1d034a26f))
  (pad "32" smd rect locked (at 0.6 4.5) (size 0.2 0.85) (layers "F.Cu" "F.Paste" "F.Mask") (tstamp 54807b7f-e880-4116-9e89-8e221202fa33))
  (pad "33" smd rect locked (at 1 4.5) (size 0.2 0.85) (layers "F.Cu" "F.Paste" "F.Mask") (tstamp 98017df6-165c-44f0-810f-2d9362aae4ac))
  (pad "34" smd rect locked (at 1.4 4.5) (size 0.2 0.85) (layers "F.Cu" "F.Paste" "F.Mask") (tstamp f5131b88-e23e-4f38-a769-062a300506db))
  (pad "35" smd rect locked (at 1.8 4.5) (size 0.2 0.85) (layers "F.Cu" "F.Paste" "F.Mask") (tstamp 6f39fe83-399e-4c07-a94a-4c8640ccc6b9))
  (pad "36" smd rect locked (at 2.2 4.5) (size 0.2 0.85) (layers "F.Cu" "F.Paste" "F.Mask") (tstamp b928d930-5fe9-40aa-9101-9aefd350379a))
  (pad "37" smd rect locked (at 2.6 4.5) (size 0.2 0.85) (layers "F.Cu" "F.Paste" "F.Mask") (tstamp 134218f5-6f39-44e3-8803-f5bd0e75016a))
  (pad "38" smd rect locked (at 3 4.5) (size 0.2 0.85) (layers "F.Cu" "F.Paste" "F.Mask") (tstamp 213fd052-0015-49fb-8114-000127a2759f))
  (pad "39" smd rect locked (at 3.4 4.5) (size 0.2 0.85) (layers "F.Cu" "F.Paste" "F.Mask") (tstamp 75cfe853-6148-451f-930b-3d77373b24e2))
  (pad "40" smd rect locked (at 3.8 4.5) (size 0.2 0.85) (layers "F.Cu" "F.Paste" "F.Mask") (tstamp 368cc228-2457-448e-b20b-320a92966bb6))
  (pad "41" smd rect locked (at 4.5 3.8 90) (size 0.2 0.85) (layers "F.Cu" "F.Paste" "F.Mask") (tstamp 861244fd-cf79-4c0e-be7a-1d99d7ef1d93))
  (pad "42" smd rect locked (at 4.5 3.4 90) (size 0.2 0.85) (layers "F.Cu" "F.Paste" "F.Mask") (tstamp 269e3483-d0ad-436c-99a1-45467fdc8e6c))
  (pad "43" smd rect locked (at 4.5 3 90) (size 0.2 0.85) (layers "F.Cu" "F.Paste" "F.Mask") (tstamp 89070acc-cc52-4808-8652-2ab5fb1f01ba))
  (pad "44" smd rect locked (at 4.5 2.6 90) (size 0.2 0.85) (layers "F.Cu" "F.Paste" "F.Mask") (tstamp bbb7f529-2777-4d53-890e-9163ba93017b))
  (pad "45" smd rect locked (at 4.5 2.2 90) (size 0.2 0.85) (layers "F.Cu" "F.Paste" "F.Mask") (tstamp 93869629-40c5-46d4-9fe7-092d54f6a307))
  (pad "46" smd rect locked (at 4.5 1.8 90) (size 0.2 0.85) (layers "F.Cu" "F.Paste" "F.Mask") (tstamp ec3aabe8-2a36-4a87-b698-b9eadcd1ff98))
  (pad "47" smd rect locked (at 4.5 1.4 90) (size 0.2 0.85) (layers "F.Cu" "F.Paste" "F.Mask") (tstamp 8cbc0d03-33a9-487b-b600-24ed95e29f71))
  (pad "48" smd rect locked (at 4.5 1 90) (size 0.2 0.85) (layers "F.Cu" "F.Paste" "F.Mask") (tstamp 0dd7ea03-b4cc-49d0-968a-9a72c747b6bd))
  (pad "49" smd rect locked (at 4.5 0.6 90) (size 0.2 0.85) (layers "F.Cu" "F.Paste" "F.Mask") (tstamp 28fb0ec1-ee87-4e00-ab40-8bf1d2177e26))
  (pad "50" smd rect locked (at 4.5 0.2 90) (size 0.2 0.85) (layers "F.Cu" "F.Paste" "F.Mask") (tstamp 2c4523c9-18f3-4d7c-a62d-52693b026d87))
  (pad "51" smd rect locked (at 4.5 -0.2 90) (size 0.2 0.85) (layers "F.Cu" "F.Paste" "F.Mask") (tstamp 15ee87da-d96b-4f26-a495-d56ac0ac01f1))
  (pad "52" smd rect locked (at 4.5 -0.6 90) (size 0.2 0.85) (layers "F.Cu" "F.Paste" "F.Mask") (tstamp f24df72f-3d94-4a50-8c33-ebae4d1ef6a8))
  (pad "53" smd rect locked (at 4.5 -1 90) (size 0.2 0.85) (layers "F.Cu" "F.Paste" "F.Mask") (tstamp c24765c7-0a87-402d-86ce-e0c1fc4b3b5c))
  (pad "54" smd rect locked (at 4.5 -1.4 90) (size 0.2 0.85) (layers "F.Cu" "F.Paste" "F.Mask") (tstamp 6e0f7eec-24db-4c4e-83ea-bb614e4e5719))
  (pad "55" smd rect locked (at 4.5 -1.8 90) (size 0.2 0.85) (layers "F.Cu" "F.Paste" "F.Mask") (tstamp 3668ba8b-dcbf-4836-b5f5-95e41cf1e267))
  (pad "56" smd rect locked (at 4.5 -2.2 90) (size 0.2 0.85) (layers "F.Cu" "F.Paste" "F.Mask") (tstamp bec9540b-d735-47ec-a60f-4ec9581565c3))
  (pad "57" smd rect locked (at 4.5 -2.6 90) (size 0.2 0.85) (layers "F.Cu" "F.Paste" "F.Mask") (tstamp b0eeb431-b168-4849-ba55-5cd5b504a420))
  (pad "58" smd rect locked (at 4.5 -3 90) (size 0.2 0.85) (layers "F.Cu" "F.Paste" "F.Mask") (tstamp d66bc509-b523-451e-ab9f-c23b52f48160))
  (pad "59" smd rect locked (at 4.5 -3.4 90) (size 0.2 0.85) (layers "F.Cu" "F.Paste" "F.Mask") (tstamp 2be78455-7a24-48a8-8023-4f21916b8952))
  (pad "60" smd rect locked (at 4.5 -3.8 90) (size 0.2 0.85) (layers "F.Cu" "F.Paste" "F.Mask") (tstamp e79b5bb4-f6b6-4b95-b625-b0c7f49e85ca))
  (pad "61" smd rect locked (at 3.8 -4.5) (size 0.2 0.85) (layers "F.Cu" "F.Paste" "F.Mask") (tstamp ca6fc409-5c76-4dba-a956-9852f50e9726))
  (pad "62" smd rect locked (at 3.4 -4.5) (size 0.2 0.85) (layers "F.Cu" "F.Paste" "F.Mask") (tstamp 19920de1-184c-4ec0-8389-260794df799d))
  (pad "63" smd rect locked (at 3 -4.5) (size 0.2 0.85) (layers "F.Cu" "F.Paste" "F.Mask") (tstamp c9facae2-7be3-452a-ade2-58a3dbba2fb5))
  (pad "64" smd rect locked (at 2.6 -4.5) (size 0.2 0.85) (layers "F.Cu" "F.Paste" "F.Mask") (tstamp 23b7638c-484e-471a-8a23-733100e1d7f2))
  (pad "65" smd rect locked (at 2.2 -4.5) (size 0.2 0.85) (layers "F.Cu" "F.Paste" "F.Mask") (tstamp 432048e3-199f-413a-82e2-2df882b21b47))
  (pad "66" smd rect locked (at 1.8 -4.5) (size 0.2 0.85) (layers "F.Cu" "F.Paste" "F.Mask") (tstamp ded6b2aa-c37c-4aab-8d33-d6bacc86f048))
  (pad "67" smd rect locked (at 1.4 -4.5) (size 0.2 0.85) (layers "F.Cu" "F.Paste" "F.Mask") (tstamp c585b620-70d3-4306-b32d-c70153e4ef67))
  (pad "68" smd rect locked (at 1 -4.5) (size 0.2 0.85) (layers "F.Cu" "F.Paste" "F.Mask") (tstamp 37f918dd-5dd8-4d2a-a66b-cf731c5d0de0))
  (pad "69" smd rect locked (at 0.6 -4.5) (size 0.2 0.85) (layers "F.Cu" "F.Paste" "F.Mask") (tstamp f4a060e0-bc1e-4ebd-aa78-5d1db6285ff6))
  (pad "70" smd rect locked (at 0.2 -4.5) (size 0.2 0.85) (layers "F.Cu" "F.Paste" "F.Mask") (tstamp 24187f0f-6d63-4fd2-9db5-27e1de57a5e9))
  (pad "71" smd rect locked (at -0.2 -4.5) (size 0.2 0.85) (layers "F.Cu" "F.Paste" "F.Mask") (tstamp 97dc1144-46b8-458f-b411-df575291d2c2))
  (pad "72" smd rect locked (at -0.6 -4.5) (size 0.2 0.85) (layers "F.Cu" "F.Paste" "F.Mask") (tstamp c86fd485-95fb-4327-97b9-4dde19442e04))
  (pad "73" smd rect locked (at -1 -4.5) (size 0.2 0.85) (layers "F.Cu" "F.Paste" "F.Mask") (tstamp 5ab6aaa0-afb6-4b1a-8b9b-09b9e4913f6b))
  (pad "74" smd rect locked (at -1.4 -4.5) (size 0.2 0.85) (layers "F.Cu" "F.Paste" "F.Mask") (tstamp 93a42678-db4e-4399-83ff-47174075248d))
  (pad "75" smd rect locked (at -1.8 -4.5) (size 0.2 0.85) (layers "F.Cu" "F.Paste" "F.Mask") (tstamp 0b5425af-7d27-4f70-9d88-5f5cec071942))
  (pad "76" smd rect locked (at -2.2 -4.5) (size 0.2 0.85) (layers "F.Cu" "F.Paste" "F.Mask") (tstamp 41f6c788-c174-49d0-b601-8c30f6a05862))
  (pad "77" smd rect locked (at -2.6 -4.5) (size 0.2 0.85) (layers "F.Cu" "F.Paste" "F.Mask") (tstamp 3d33720f-94cf-4241-8000-e54a70472dfb))
  (pad "78" smd rect locked (at -3 -4.5) (size 0.2 0.85) (layers "F.Cu" "F.Paste" "F.Mask") (tstamp 214fe2f9-33e1-471b-81bf-f461d9b3c33f))
  (pad "79" smd rect locked (at -3.4 -4.5) (size 0.2 0.85) (layers "F.Cu" "F.Paste" "F.Mask") (tstamp 06829815-fce1-4e53-b3bc-ce1735948243))
  (pad "80" smd rect locked (at -3.8 -4.5) (size 0.2 0.85) (layers "F.Cu" "F.Paste" "F.Mask") (tstamp 1cc53f9c-a47c-4651-91b7-4c3c866fb5b3))
  (pad "81" smd rect locked (at 0 0) (size 6.6 6.6) (layers "F.Cu" "F.Mask")
    (solder_paste_margin -0.75) (tstamp 877e70e7-92c2-4977-9ce0-ee3aad5c454c))
  (model "${KICADLIB}/model/QFN/QFN40P900X900X75-81.stp"
    (offset (xyz 0 0 0))
    (scale (xyz 1 1 1))
    (rotate (xyz 0 0 0))
  )
)
