(module "Cinch_142-0701-301" (layer F.Cu) (tedit 5EBC3CD0)
  (attr smd)
  (fp_text reference "REF**" (at 0 4.7498 unlocked) (layer F.SilkS)
    (effects (font (size 1 1) (thickness 0.15)))
  )
  (fp_text value "Cinch_142-0701-301" (at 0 -0.5 unlocked) (layer F.SilkS) hide
    (effects (font (size 1 1) (thickness 0.15)))
  )
  (fp_line (start -3.9624 3.9624) (end -3.9624 -3.9624) (layer F.Fab) (width 0.1))
  (fp_line (start 3.9624 3.9624) (end -3.9624 3.9624) (layer F.Fab) (width 0.1))
  (fp_line (start 3.9624 3.1496) (end 3.9624 3.9624) (layer F.Fab) (width 0.1))
  (fp_line (start 6.7564 3.1496) (end 3.9624 3.1496) (layer F.Fab) (width 0.1))
  (fp_line (start 6.7564 3.6576) (end 6.7564 3.1496) (layer F.Fab) (width 0.1))
  (fp_line (start 11.1252 3.6576) (end 6.7564 3.6576) (layer F.Fab) (width 0.1))
  (fp_line (start 11.1252 3.1496) (end 11.1252 3.6576) (layer F.Fab) (width 0.1))
  (fp_line (start 11.8872 3.1496) (end 11.1252 3.1496) (layer F.Fab) (width 0.1))
  (fp_line (start 11.8872 -3.1496) (end 11.8872 3.1496) (layer F.Fab) (width 0.1))
  (fp_line (start 11.1252 -3.1496) (end 11.8872 -3.1496) (layer F.Fab) (width 0.1))
  (fp_line (start 11.1252 -3.6576) (end 11.1252 -3.1496) (layer F.Fab) (width 0.1))
  (fp_line (start 6.7564 -3.6576) (end 11.1252 -3.6576) (layer F.Fab) (width 0.1))
  (fp_line (start 6.7564 -3.1496) (end 6.7564 -3.6576) (layer F.Fab) (width 0.1))
  (fp_line (start 3.9624 -3.1496) (end 6.7564 -3.1496) (layer F.Fab) (width 0.1))
  (fp_line (start 3.9624 -3.9624) (end 3.9624 -3.1496) (layer F.Fab) (width 0.1))
  (fp_line (start -3.9624 -3.9624) (end 3.9624 -3.9624) (layer F.Fab) (width 0.1))
  (fp_text user "${REFERENCE}" (at 0 0 unlocked) (layer F.Fab)
    (effects (font (size 1 1) (thickness 0.15)))
  )
  (fp_line (start -4.191 4.191) (end -4.191 -4.191) (layer F.CrtYd) (width 0.05))
  (fp_line (start 4.191 4.191) (end -4.191 4.191) (layer F.CrtYd) (width 0.05))
  (fp_line (start 4.191 -4.191) (end 4.191 4.191) (layer F.CrtYd) (width 0.05))
  (fp_line (start -4.191 -4.191) (end 4.191 -4.191) (layer F.CrtYd) (width 0.05))
  (fp_line (start 11.1506 3.175) (end 11.1506 3.683) (layer F.SilkS) (width 0.1))
  (fp_line (start 11.9126 3.175) (end 11.1506 3.175) (layer F.SilkS) (width 0.1))
  (fp_line (start 11.9126 -3.175) (end 11.9126 3.175) (layer F.SilkS) (width 0.1))
  (fp_line (start 11.1506 -3.175) (end 11.9126 -3.175) (layer F.SilkS) (width 0.1))
  (fp_line (start 11.1506 -3.683) (end 11.1506 -3.175) (layer F.SilkS) (width 0.1))
  (fp_line (start 6.7564 -3.683) (end 6.7564 -3.175) (layer F.SilkS) (width 0.1))
  (fp_line (start 6.7564 -3.683) (end 11.1506 -3.683) (layer F.SilkS) (width 0.1))
  (fp_line (start 6.7564 3.683) (end 11.1506 3.683) (layer F.SilkS) (width 0.1))
  (fp_line (start 6.7564 3.175) (end 6.7564 3.683) (layer F.SilkS) (width 0.1))
  (fp_line (start 3.9624 3.175) (end 6.7564 3.175) (layer F.SilkS) (width 0.1))
  (fp_line (start 3.9624 -3.175) (end 6.7564 -3.175) (layer F.SilkS) (width 0.1))
  (fp_line (start -3.9624 3.9624) (end 3.9624 3.9624) (layer F.SilkS) (width 0.1))
  (fp_line (start -3.9624 -3.9624) (end -3.9624 3.9624) (layer F.SilkS) (width 0.1))
  (fp_line (start 3.9624 -3.9624) (end -3.9624 -3.9624) (layer F.SilkS) (width 0.1))
  (fp_line (start 3.9624 3.9624) (end 3.9624 -3.9624) (layer F.SilkS) (width 0.1))
  (pad "1" thru_hole circle (at 0 0) (size 2.159 2.159) (drill 1.5748) (layers *.Cu *.Mask) (tstamp 08f00ce8-3a1b-48a1-b67b-adee6cba77d3))
  (pad "2" thru_hole circle (at 2.54 -2.54) (size 2.286 2.286) (drill 1.7018) (layers *.Cu *.Mask) (tstamp 8cc385c5-d42a-4dcd-9bd3-ec4a239cf1a6))
  (pad "2" thru_hole circle (at -2.54 -2.54) (size 2.286 2.286) (drill 1.7018) (layers *.Cu *.Mask) (tstamp da637a29-d0cf-4dbe-b84e-b491a391824a))
  (pad "2" thru_hole circle (at -2.54 2.54) (size 2.286 2.286) (drill 1.7018) (layers *.Cu *.Mask) (tstamp 6dc79252-2a19-4dd0-bb3b-fe32adab77a2))
  (pad "2" thru_hole circle (at 2.54 2.54) (size 2.286 2.286) (drill 1.7018) (layers *.Cu *.Mask) (tstamp 34a1f5a0-b266-448b-b84c-10a9248bed20))
  (model "${KICADLIB}/model/connector/cinch_142-0701-301.stp"
    (offset (xyz 0 0 6.35))
    (scale (xyz 1 1 1))
    (rotate (xyz 0 0 0))
  )
)
