(footprint "LED_RGB_CREE_CLV1L-FKN" (version 20221018) (generator pcbnew)
  (layer "F.Cu")
  (attr smd)
  (fp_text reference "REF**" (at 0.05 -2.55) (layer "F.SilkS")
      (effects (font (size 1 1) (thickness 0.15)))
    (tstamp 49af2e77-ec5c-4990-8a80-74a974ad592d)
  )
  (fp_text value "LED_RGB_CREE_CLV1L-FKN" (at 0.05 -4.95) (layer "F.Fab")
      (effects (font (size 1 1) (thickness 0.15)))
    (tstamp 13bbc359-30c2-4f09-b2ee-0306635fdafd)
  )
  (fp_text user "^" (at -2.625 -0.7 -90 unlocked) (layer "F.SilkS")
      (effects (font (size 1 1) (thickness 0.15)))
    (tstamp c221970c-f6f9-41e9-ad01-5a4363112fa1)
  )
  (fp_text user "${REFERENCE}" (at 0 0 unlocked) (layer "F.Fab")
      (effects (font (size 0.6 0.6) (thickness 0.1)))
    (tstamp 3443ce71-5489-46fb-b892-f3240bc22260)
  )
  (fp_line (start -1.6 -1.2) (end -1.4 -1.4)
    (stroke (width 0.15) (type solid)) (layer "F.SilkS") (tstamp c0c506ed-5be0-415a-be73-8e66ab4bb62b))
  (fp_line (start -1.6 -0.2) (end -1.6 0.2)
    (stroke (width 0.15) (type solid)) (layer "F.SilkS") (tstamp a8ed7ef8-5f0a-4f80-8c66-c3ebb59ab3d6))
  (fp_line (start -1.6 1.4) (end -1.6 1.2)
    (stroke (width 0.15) (type solid)) (layer "F.SilkS") (tstamp 51cc4d70-ad8e-46d9-92db-ff494d2ef6d7))
  (fp_line (start -1.6 1.4) (end 1.6 1.4)
    (stroke (width 0.15) (type solid)) (layer "F.SilkS") (tstamp f73231b9-e394-46a3-b21b-99f4daa9c732))
  (fp_line (start 1.6 -1.4) (end -1.4 -1.4)
    (stroke (width 0.15) (type solid)) (layer "F.SilkS") (tstamp 098079bf-0961-454d-8a7f-8770ff473d4a))
  (fp_line (start 1.6 -1.4) (end 1.6 -1.2)
    (stroke (width 0.15) (type solid)) (layer "F.SilkS") (tstamp 1d040e74-ab86-499e-b136-cd9578c61e8a))
  (fp_line (start 1.6 -0.2) (end 1.6 0.2)
    (stroke (width 0.15) (type solid)) (layer "F.SilkS") (tstamp 9adc9a79-9686-435c-b38b-f80303f931d5))
  (fp_line (start 1.6 1.4) (end 1.6 1.2)
    (stroke (width 0.15) (type solid)) (layer "F.SilkS") (tstamp 158f05a2-56f5-47df-be14-4d4a6b9deda7))
  (fp_line (start -2.05 -1.55) (end 2.05 -1.55)
    (stroke (width 0.05) (type solid)) (layer "F.CrtYd") (tstamp e4aaf5e3-94ca-40c4-955f-75fdc727ea7d))
  (fp_line (start -2.05 1.55) (end -2.05 -1.55)
    (stroke (width 0.05) (type solid)) (layer "F.CrtYd") (tstamp 3928519d-2b43-47fe-a871-b80bbdb0423a))
  (fp_line (start 2.05 -1.55) (end 2.05 1.55)
    (stroke (width 0.05) (type solid)) (layer "F.CrtYd") (tstamp 0cbe0857-bf44-4f4d-a252-be17b59bbe9b))
  (fp_line (start 2.05 1.55) (end -2.05 1.55)
    (stroke (width 0.05) (type solid)) (layer "F.CrtYd") (tstamp 308f561d-92c4-4c83-9121-b2ec871b56bf))
  (fp_line (start -1.6 -1.1) (end -1.3 -1.4)
    (stroke (width 0.1) (type solid)) (layer "F.Fab") (tstamp 5e236ec9-7ab2-47f1-a6ca-cff430453db4))
  (fp_line (start -1.6 1.4) (end -1.6 -1.1)
    (stroke (width 0.1) (type solid)) (layer "F.Fab") (tstamp 113e75b5-7bbb-433b-aca0-d01990fcc3ff))
  (fp_line (start -1.3 -1.4) (end 1.6 -1.4)
    (stroke (width 0.1) (type solid)) (layer "F.Fab") (tstamp ccffb98c-c3b2-4f82-898a-14dba4fe34c1))
  (fp_line (start 1.6 -1.4) (end 1.6 1.4)
    (stroke (width 0.1) (type solid)) (layer "F.Fab") (tstamp 9c19232d-c2c0-408c-ba97-090bb9a93d26))
  (fp_line (start 1.6 1.4) (end -1.6 1.4)
    (stroke (width 0.1) (type solid)) (layer "F.Fab") (tstamp cc8aeaa8-104b-4b15-b5da-c6ad22881dbc))
  (pad "1" smd rect (at -1.4 -0.7) (size 1.1 0.8) (layers "F.Cu" "F.Paste" "F.Mask") (tstamp 05025d7f-6c57-4828-b89f-4dd68d72e0be))
  (pad "2" smd rect (at -1.4 0.7) (size 1.1 0.8) (layers "F.Cu" "F.Paste" "F.Mask") (tstamp 3492d3f3-ad7d-4173-8a66-e965a33b6d4b))
  (pad "3" smd rect (at 1.4 0.7) (size 1.1 0.8) (layers "F.Cu" "F.Paste" "F.Mask") (tstamp b42055ba-f607-4559-b800-9a874de4ba19))
  (pad "4" smd rect (at 1.4 -0.7) (size 1.1 0.8) (layers "F.Cu" "F.Paste" "F.Mask") (tstamp 341b8dba-635f-497a-b64e-6ac22bd0b747))
  (model "${KICADLIB}/model/LED/CREE_CLV1L-FKB.step"
    (offset (xyz 0 0 0))
    (scale (xyz 1 1 1))
    (rotate (xyz 0 0 0))
  )
)
