(footprint "MOUNTHOLE_M3_BUTTONHEAD" (version 20211014) (generator pcbnew)
  (layer "F.Cu")
  (tedit 60EC7010)
  (fp_text reference "REF**" (at 0 3.75) (layer "F.SilkS")
    (effects (font (size 1 1) (thickness 0.15)))
    (tstamp 5ddf4b8b-eb4a-492f-bccc-882d20c61a96)
  )
  (fp_text value "MOUNTHOLE_M3_BUTTONHEAD" (at 0 -1.15) (layer "F.Fab")
    (effects (font (size 1 1) (thickness 0.15)))
    (tstamp bcd30fdd-a020-4eab-8e21-c961d91cc547)
  )
  (fp_text user "${REFERENCE}" (at 0 1.4 unlocked) (layer "F.Fab")
    (effects (font (size 1 1) (thickness 0.15)))
    (tstamp f0c41673-7d70-460f-a4a2-88ee62ed2cb3)
  )
  (fp_circle (center 0 0) (end 5.5 0) (layer "Dwgs.User") (width 0.1) (fill none) (tstamp fefe3ee4-7276-4e65-96b0-e6e0aa2c235c))
  (fp_circle (center 0 0) (end 0 3.1) (layer "F.CrtYd") (width 0.05) (fill none) (tstamp 6b657a94-3535-486f-8863-a0fb7b22f1ad))
  (fp_circle (center 0 0) (end 0 -3) (layer "F.Fab") (width 0.1) (fill none) (tstamp 0027f755-51de-487e-91f7-e8ab5814f20a))
  (pad "" np_thru_hole circle (at 0 0) (size 6 6) (drill 3.3) (layers F&B.Cu *.Mask) (tstamp 09af684b-6e28-4c35-97ab-40ebb5027e49))
  (model "${KICADLIB}/model/mechanical/SCREW_M3-TORX-BUTTONHEAD_5MM_92832A214.STEP"
    (offset (xyz 0 0 1.63))
    (scale (xyz 1 1 1))
    (rotate (xyz 0 0 0))
  )
)
