(footprint "BGA64N80P8X8_700X700"
	(version 20240108)
	(generator "pcbnew")
	(generator_version "8.0")
	(layer "F.Cu")
	(property "Reference" "REF**"
		(at 0 -4.25 0)
		(layer "F.SilkS")
		(uuid "e5b7dd37-43a7-4dc7-9748-173b4d00dfc6")
		(effects
			(font
				(size 0.8 0.8)
				(thickness 0.15)
			)
		)
	)
	(property "Value" "BGA64N80P8X8_700X700"
		(at 0 8.1 0)
		(layer "F.Fab")
		(hide yes)
		(uuid "efa64320-7e8a-4904-8441-e6a56f4da391")
		(effects
			(font
				(size 1 1)
				(thickness 0.15)
			)
		)
	)
	(property "Footprint" "BGA64N80P8X8_700X700"
		(at 0 6.35 0)
		(unlocked yes)
		(layer "F.Fab")
		(hide yes)
		(uuid "c37a0cf8-93f6-4ea3-a35e-a38a020267de")
		(effects
			(font
				(size 1 1)
			)
		)
	)
	(property "Datasheet" ""
		(at 0 0 0)
		(unlocked yes)
		(layer "F.Fab")
		(hide yes)
		(uuid "b234c7b8-acff-45b3-a873-b6e8f04cb1c7")
		(effects
			(font
				(size 1.27 1.27)
			)
		)
	)
	(property "Description" ""
		(at 0 0 0)
		(unlocked yes)
		(layer "F.Fab")
		(hide yes)
		(uuid "ad78a9bf-da3d-4637-baec-2912ae9c9519")
		(effects
			(font
				(size 1.27 1.27)
			)
		)
	)
	(attr smd)
	(fp_rect
		(start 3.5 -3.5)
		(end -3.5 3.5)
		(stroke
			(width 0.1)
			(type solid)
		)
		(fill none)
		(layer "F.SilkS")
		(uuid "cf186831-e2fb-43c2-9e9e-ab30841ae5a1")
	)
	(fp_rect
		(start -3.75 -3.75)
		(end 3.75 3.75)
		(stroke
			(width 0.05)
			(type default)
		)
		(fill none)
		(layer "F.CrtYd")
		(uuid "ce01ce4f-54b6-41f5-8d12-ee7974f205ed")
	)
	(fp_poly
		(pts
			(xy 3.5 3.5) (xy -3.5 3.5) (xy -3.5 -3) (xy -3 -3.5) (xy 3.5 -3.5)
		)
		(stroke
			(width 0.1)
			(type solid)
		)
		(fill none)
		(layer "F.Fab")
		(uuid "39961aea-ee90-42d6-be43-3561578ab102")
	)
	(fp_text user "^"
		(at -4.65 -2.8 -90)
		(unlocked yes)
		(layer "F.SilkS")
		(uuid "69dac564-cdf4-4cc0-b103-88c011bd1a36")
		(effects
			(font
				(size 1 1)
				(thickness 0.15)
			)
		)
	)
	(fp_text user "BGA64N80P8X8_700X700"
		(at 0 4.65 0)
		(unlocked yes)
		(layer "F.Fab")
		(hide yes)
		(uuid "d6ffb4d3-d202-420d-8767-90d8a3d46e80")
		(effects
			(font
				(size 1 1)
				(thickness 0.15)
			)
		)
	)
	(fp_text user "${REFERENCE}"
		(at 0 0 0)
		(layer "F.Fab")
		(uuid "e9b8c0ce-7a52-40ff-a577-0d1b80bcc0de")
		(effects
			(font
				(size 1 1)
				(thickness 0.15)
			)
		)
	)
	(pad "A1" smd circle
		(at -2.8 -2.8)
		(size 0.4 0.4)
		(layers "F.Cu" "F.Paste" "F.Mask")
		(solder_mask_margin 0.05)
		(uuid "a73cabbd-1a3d-4995-b5a6-aa14bbf488c8")
	)
	(pad "A2" smd circle
		(at -2 -2.8)
		(size 0.4 0.4)
		(layers "F.Cu" "F.Paste" "F.Mask")
		(solder_mask_margin 0.05)
		(uuid "a73cabbd-1a3d-4995-b5a6-aa14bbf488c8")
	)
	(pad "A3" smd circle
		(at -1.2 -2.8)
		(size 0.4 0.4)
		(layers "F.Cu" "F.Paste" "F.Mask")
		(solder_mask_margin 0.05)
		(uuid "a73cabbd-1a3d-4995-b5a6-aa14bbf488c8")
	)
	(pad "A4" smd circle
		(at -0.4 -2.8)
		(size 0.4 0.4)
		(layers "F.Cu" "F.Paste" "F.Mask")
		(solder_mask_margin 0.05)
		(uuid "a73cabbd-1a3d-4995-b5a6-aa14bbf488c8")
	)
	(pad "A5" smd circle
		(at 0.4 -2.8)
		(size 0.4 0.4)
		(layers "F.Cu" "F.Paste" "F.Mask")
		(solder_mask_margin 0.05)
		(uuid "a73cabbd-1a3d-4995-b5a6-aa14bbf488c8")
	)
	(pad "A6" smd circle
		(at 1.2 -2.8)
		(size 0.4 0.4)
		(layers "F.Cu" "F.Paste" "F.Mask")
		(solder_mask_margin 0.05)
		(uuid "a73cabbd-1a3d-4995-b5a6-aa14bbf488c8")
	)
	(pad "A7" smd circle
		(at 2 -2.8)
		(size 0.4 0.4)
		(layers "F.Cu" "F.Paste" "F.Mask")
		(solder_mask_margin 0.05)
		(uuid "a73cabbd-1a3d-4995-b5a6-aa14bbf488c8")
	)
	(pad "A8" smd circle
		(at 2.8 -2.8)
		(size 0.4 0.4)
		(layers "F.Cu" "F.Paste" "F.Mask")
		(solder_mask_margin 0.05)
		(uuid "a73cabbd-1a3d-4995-b5a6-aa14bbf488c8")
	)
	(pad "B1" smd circle
		(at -2.8 -2)
		(size 0.4 0.4)
		(layers "F.Cu" "F.Paste" "F.Mask")
		(solder_mask_margin 0.05)
		(uuid "a73cabbd-1a3d-4995-b5a6-aa14bbf488c8")
	)
	(pad "B2" smd circle
		(at -2 -2)
		(size 0.4 0.4)
		(layers "F.Cu" "F.Paste" "F.Mask")
		(solder_mask_margin 0.05)
		(uuid "a73cabbd-1a3d-4995-b5a6-aa14bbf488c8")
	)
	(pad "B3" smd circle
		(at -1.2 -2)
		(size 0.4 0.4)
		(layers "F.Cu" "F.Paste" "F.Mask")
		(solder_mask_margin 0.05)
		(uuid "a73cabbd-1a3d-4995-b5a6-aa14bbf488c8")
	)
	(pad "B4" smd circle
		(at -0.4 -2)
		(size 0.4 0.4)
		(layers "F.Cu" "F.Paste" "F.Mask")
		(solder_mask_margin 0.05)
		(uuid "a73cabbd-1a3d-4995-b5a6-aa14bbf488c8")
	)
	(pad "B5" smd circle
		(at 0.4 -2)
		(size 0.4 0.4)
		(layers "F.Cu" "F.Paste" "F.Mask")
		(solder_mask_margin 0.05)
		(uuid "a73cabbd-1a3d-4995-b5a6-aa14bbf488c8")
	)
	(pad "B6" smd circle
		(at 1.2 -2)
		(size 0.4 0.4)
		(layers "F.Cu" "F.Paste" "F.Mask")
		(solder_mask_margin 0.05)
		(uuid "a73cabbd-1a3d-4995-b5a6-aa14bbf488c8")
	)
	(pad "B7" smd circle
		(at 2 -2)
		(size 0.4 0.4)
		(layers "F.Cu" "F.Paste" "F.Mask")
		(solder_mask_margin 0.05)
		(uuid "a73cabbd-1a3d-4995-b5a6-aa14bbf488c8")
	)
	(pad "B8" smd circle
		(at 2.8 -2)
		(size 0.4 0.4)
		(layers "F.Cu" "F.Paste" "F.Mask")
		(solder_mask_margin 0.05)
		(uuid "a73cabbd-1a3d-4995-b5a6-aa14bbf488c8")
	)
	(pad "C1" smd circle
		(at -2.8 -1.2)
		(size 0.4 0.4)
		(layers "F.Cu" "F.Paste" "F.Mask")
		(solder_mask_margin 0.05)
		(uuid "a73cabbd-1a3d-4995-b5a6-aa14bbf488c8")
	)
	(pad "C2" smd circle
		(at -2 -1.2)
		(size 0.4 0.4)
		(layers "F.Cu" "F.Paste" "F.Mask")
		(solder_mask_margin 0.05)
		(uuid "a73cabbd-1a3d-4995-b5a6-aa14bbf488c8")
	)
	(pad "C3" smd circle
		(at -1.2 -1.2)
		(size 0.4 0.4)
		(layers "F.Cu" "F.Paste" "F.Mask")
		(solder_mask_margin 0.05)
		(uuid "a73cabbd-1a3d-4995-b5a6-aa14bbf488c8")
	)
	(pad "C4" smd circle
		(at -0.4 -1.2)
		(size 0.4 0.4)
		(layers "F.Cu" "F.Paste" "F.Mask")
		(solder_mask_margin 0.05)
		(uuid "a73cabbd-1a3d-4995-b5a6-aa14bbf488c8")
	)
	(pad "C5" smd circle
		(at 0.4 -1.2)
		(size 0.4 0.4)
		(layers "F.Cu" "F.Paste" "F.Mask")
		(solder_mask_margin 0.05)
		(uuid "a73cabbd-1a3d-4995-b5a6-aa14bbf488c8")
	)
	(pad "C6" smd circle
		(at 1.2 -1.2)
		(size 0.4 0.4)
		(layers "F.Cu" "F.Paste" "F.Mask")
		(solder_mask_margin 0.05)
		(uuid "a73cabbd-1a3d-4995-b5a6-aa14bbf488c8")
	)
	(pad "C7" smd circle
		(at 2 -1.2)
		(size 0.4 0.4)
		(layers "F.Cu" "F.Paste" "F.Mask")
		(solder_mask_margin 0.05)
		(uuid "a73cabbd-1a3d-4995-b5a6-aa14bbf488c8")
	)
	(pad "C8" smd circle
		(at 2.8 -1.2)
		(size 0.4 0.4)
		(layers "F.Cu" "F.Paste" "F.Mask")
		(solder_mask_margin 0.05)
		(uuid "a73cabbd-1a3d-4995-b5a6-aa14bbf488c8")
	)
	(pad "D1" smd circle
		(at -2.8 -0.4)
		(size 0.4 0.4)
		(layers "F.Cu" "F.Paste" "F.Mask")
		(solder_mask_margin 0.05)
		(uuid "a73cabbd-1a3d-4995-b5a6-aa14bbf488c8")
	)
	(pad "D2" smd circle
		(at -2 -0.4)
		(size 0.4 0.4)
		(layers "F.Cu" "F.Paste" "F.Mask")
		(solder_mask_margin 0.05)
		(uuid "a73cabbd-1a3d-4995-b5a6-aa14bbf488c8")
	)
	(pad "D3" smd circle
		(at -1.2 -0.4)
		(size 0.4 0.4)
		(layers "F.Cu" "F.Paste" "F.Mask")
		(solder_mask_margin 0.05)
		(uuid "a73cabbd-1a3d-4995-b5a6-aa14bbf488c8")
	)
	(pad "D4" smd circle
		(at -0.4 -0.4)
		(size 0.4 0.4)
		(layers "F.Cu" "F.Paste" "F.Mask")
		(solder_mask_margin 0.05)
		(uuid "a73cabbd-1a3d-4995-b5a6-aa14bbf488c8")
	)
	(pad "D5" smd circle
		(at 0.4 -0.4)
		(size 0.4 0.4)
		(layers "F.Cu" "F.Paste" "F.Mask")
		(solder_mask_margin 0.05)
		(uuid "a73cabbd-1a3d-4995-b5a6-aa14bbf488c8")
	)
	(pad "D6" smd circle
		(at 1.2 -0.4)
		(size 0.4 0.4)
		(layers "F.Cu" "F.Paste" "F.Mask")
		(solder_mask_margin 0.05)
		(uuid "a73cabbd-1a3d-4995-b5a6-aa14bbf488c8")
	)
	(pad "D7" smd circle
		(at 2 -0.4)
		(size 0.4 0.4)
		(layers "F.Cu" "F.Paste" "F.Mask")
		(solder_mask_margin 0.05)
		(uuid "a73cabbd-1a3d-4995-b5a6-aa14bbf488c8")
	)
	(pad "D8" smd circle
		(at 2.8 -0.4)
		(size 0.4 0.4)
		(layers "F.Cu" "F.Paste" "F.Mask")
		(solder_mask_margin 0.05)
		(uuid "a73cabbd-1a3d-4995-b5a6-aa14bbf488c8")
	)
	(pad "E1" smd circle
		(at -2.8 0.4)
		(size 0.4 0.4)
		(layers "F.Cu" "F.Paste" "F.Mask")
		(solder_mask_margin 0.05)
		(uuid "a73cabbd-1a3d-4995-b5a6-aa14bbf488c8")
	)
	(pad "E2" smd circle
		(at -2 0.4)
		(size 0.4 0.4)
		(layers "F.Cu" "F.Paste" "F.Mask")
		(solder_mask_margin 0.05)
		(uuid "a73cabbd-1a3d-4995-b5a6-aa14bbf488c8")
	)
	(pad "E3" smd circle
		(at -1.2 0.4)
		(size 0.4 0.4)
		(layers "F.Cu" "F.Paste" "F.Mask")
		(solder_mask_margin 0.05)
		(uuid "a73cabbd-1a3d-4995-b5a6-aa14bbf488c8")
	)
	(pad "E4" smd circle
		(at -0.4 0.4)
		(size 0.4 0.4)
		(layers "F.Cu" "F.Paste" "F.Mask")
		(solder_mask_margin 0.05)
		(uuid "a73cabbd-1a3d-4995-b5a6-aa14bbf488c8")
	)
	(pad "E5" smd circle
		(at 0.4 0.4)
		(size 0.4 0.4)
		(layers "F.Cu" "F.Paste" "F.Mask")
		(solder_mask_margin 0.05)
		(uuid "a73cabbd-1a3d-4995-b5a6-aa14bbf488c8")
	)
	(pad "E6" smd circle
		(at 1.2 0.4)
		(size 0.4 0.4)
		(layers "F.Cu" "F.Paste" "F.Mask")
		(solder_mask_margin 0.05)
		(uuid "a73cabbd-1a3d-4995-b5a6-aa14bbf488c8")
	)
	(pad "E7" smd circle
		(at 2 0.4)
		(size 0.4 0.4)
		(layers "F.Cu" "F.Paste" "F.Mask")
		(solder_mask_margin 0.05)
		(uuid "a73cabbd-1a3d-4995-b5a6-aa14bbf488c8")
	)
	(pad "E8" smd circle
		(at 2.8 0.4)
		(size 0.4 0.4)
		(layers "F.Cu" "F.Paste" "F.Mask")
		(solder_mask_margin 0.05)
		(uuid "a73cabbd-1a3d-4995-b5a6-aa14bbf488c8")
	)
	(pad "F1" smd circle
		(at -2.8 1.2)
		(size 0.4 0.4)
		(layers "F.Cu" "F.Paste" "F.Mask")
		(solder_mask_margin 0.05)
		(uuid "a73cabbd-1a3d-4995-b5a6-aa14bbf488c8")
	)
	(pad "F2" smd circle
		(at -2 1.2)
		(size 0.4 0.4)
		(layers "F.Cu" "F.Paste" "F.Mask")
		(solder_mask_margin 0.05)
		(uuid "a73cabbd-1a3d-4995-b5a6-aa14bbf488c8")
	)
	(pad "F3" smd circle
		(at -1.2 1.2)
		(size 0.4 0.4)
		(layers "F.Cu" "F.Paste" "F.Mask")
		(solder_mask_margin 0.05)
		(uuid "a73cabbd-1a3d-4995-b5a6-aa14bbf488c8")
	)
	(pad "F4" smd circle
		(at -0.4 1.2)
		(size 0.4 0.4)
		(layers "F.Cu" "F.Paste" "F.Mask")
		(solder_mask_margin 0.05)
		(uuid "a73cabbd-1a3d-4995-b5a6-aa14bbf488c8")
	)
	(pad "F5" smd circle
		(at 0.4 1.2)
		(size 0.4 0.4)
		(layers "F.Cu" "F.Paste" "F.Mask")
		(solder_mask_margin 0.05)
		(uuid "a73cabbd-1a3d-4995-b5a6-aa14bbf488c8")
	)
	(pad "F6" smd circle
		(at 1.2 1.2)
		(size 0.4 0.4)
		(layers "F.Cu" "F.Paste" "F.Mask")
		(solder_mask_margin 0.05)
		(uuid "a73cabbd-1a3d-4995-b5a6-aa14bbf488c8")
	)
	(pad "F7" smd circle
		(at 2 1.2)
		(size 0.4 0.4)
		(layers "F.Cu" "F.Paste" "F.Mask")
		(solder_mask_margin 0.05)
		(uuid "a73cabbd-1a3d-4995-b5a6-aa14bbf488c8")
	)
	(pad "F8" smd circle
		(at 2.8 1.2)
		(size 0.4 0.4)
		(layers "F.Cu" "F.Paste" "F.Mask")
		(solder_mask_margin 0.05)
		(uuid "a73cabbd-1a3d-4995-b5a6-aa14bbf488c8")
	)
	(pad "G1" smd circle
		(at -2.8 2)
		(size 0.4 0.4)
		(layers "F.Cu" "F.Paste" "F.Mask")
		(solder_mask_margin 0.05)
		(uuid "a73cabbd-1a3d-4995-b5a6-aa14bbf488c8")
	)
	(pad "G2" smd circle
		(at -2 2)
		(size 0.4 0.4)
		(layers "F.Cu" "F.Paste" "F.Mask")
		(solder_mask_margin 0.05)
		(uuid "a73cabbd-1a3d-4995-b5a6-aa14bbf488c8")
	)
	(pad "G3" smd circle
		(at -1.2 2)
		(size 0.4 0.4)
		(layers "F.Cu" "F.Paste" "F.Mask")
		(solder_mask_margin 0.05)
		(uuid "a73cabbd-1a3d-4995-b5a6-aa14bbf488c8")
	)
	(pad "G4" smd circle
		(at -0.4 2)
		(size 0.4 0.4)
		(layers "F.Cu" "F.Paste" "F.Mask")
		(solder_mask_margin 0.05)
		(uuid "a73cabbd-1a3d-4995-b5a6-aa14bbf488c8")
	)
	(pad "G5" smd circle
		(at 0.4 2)
		(size 0.4 0.4)
		(layers "F.Cu" "F.Paste" "F.Mask")
		(solder_mask_margin 0.05)
		(uuid "a73cabbd-1a3d-4995-b5a6-aa14bbf488c8")
	)
	(pad "G6" smd circle
		(at 1.2 2)
		(size 0.4 0.4)
		(layers "F.Cu" "F.Paste" "F.Mask")
		(solder_mask_margin 0.05)
		(uuid "a73cabbd-1a3d-4995-b5a6-aa14bbf488c8")
	)
	(pad "G7" smd circle
		(at 2 2)
		(size 0.4 0.4)
		(layers "F.Cu" "F.Paste" "F.Mask")
		(solder_mask_margin 0.05)
		(uuid "a73cabbd-1a3d-4995-b5a6-aa14bbf488c8")
	)
	(pad "G8" smd circle
		(at 2.8 2)
		(size 0.4 0.4)
		(layers "F.Cu" "F.Paste" "F.Mask")
		(solder_mask_margin 0.05)
		(uuid "a73cabbd-1a3d-4995-b5a6-aa14bbf488c8")
	)
	(pad "H1" smd circle
		(at -2.8 2.8)
		(size 0.4 0.4)
		(layers "F.Cu" "F.Paste" "F.Mask")
		(solder_mask_margin 0.05)
		(uuid "a73cabbd-1a3d-4995-b5a6-aa14bbf488c8")
	)
	(pad "H2" smd circle
		(at -2 2.8)
		(size 0.4 0.4)
		(layers "F.Cu" "F.Paste" "F.Mask")
		(solder_mask_margin 0.05)
		(uuid "a73cabbd-1a3d-4995-b5a6-aa14bbf488c8")
	)
	(pad "H3" smd circle
		(at -1.2 2.8)
		(size 0.4 0.4)
		(layers "F.Cu" "F.Paste" "F.Mask")
		(solder_mask_margin 0.05)
		(uuid "a73cabbd-1a3d-4995-b5a6-aa14bbf488c8")
	)
	(pad "H4" smd circle
		(at -0.4 2.8)
		(size 0.4 0.4)
		(layers "F.Cu" "F.Paste" "F.Mask")
		(solder_mask_margin 0.05)
		(uuid "a73cabbd-1a3d-4995-b5a6-aa14bbf488c8")
	)
	(pad "H5" smd circle
		(at 0.4 2.8)
		(size 0.4 0.4)
		(layers "F.Cu" "F.Paste" "F.Mask")
		(solder_mask_margin 0.05)
		(uuid "a73cabbd-1a3d-4995-b5a6-aa14bbf488c8")
	)
	(pad "H6" smd circle
		(at 1.2 2.8)
		(size 0.4 0.4)
		(layers "F.Cu" "F.Paste" "F.Mask")
		(solder_mask_margin 0.05)
		(uuid "a73cabbd-1a3d-4995-b5a6-aa14bbf488c8")
	)
	(pad "H7" smd circle
		(at 2 2.8)
		(size 0.4 0.4)
		(layers "F.Cu" "F.Paste" "F.Mask")
		(solder_mask_margin 0.05)
		(uuid "a73cabbd-1a3d-4995-b5a6-aa14bbf488c8")
	)
	(pad "H8" smd circle
		(at 2.8 2.8)
		(size 0.4 0.4)
		(layers "F.Cu" "F.Paste" "F.Mask")
		(solder_mask_margin 0.05)
		(uuid "a73cabbd-1a3d-4995-b5a6-aa14bbf488c8")
	)
	(model "${KICADLIB}/model/BGA/BGA64N80P8X8_700X700X140.step"
		(offset
			(xyz 0 0 0)
		)
		(scale
			(xyz 1 1 1)
		)
		(rotate
			(xyz 0 0 0)
		)
	)
)
