(footprint "SOT-563" (version 20221018) (generator pcbnew)
  (layer "F.Cu")
  (descr "SOT563")
  (tags "SOT-563")
  (attr smd)
  (fp_text reference "REF**" (at 0 -1.7) (layer "F.SilkS")
      (effects (font (size 1 1) (thickness 0.15)))
    (tstamp 46ab33a8-5b6f-4e35-84ca-828a16175e24)
  )
  (fp_text value "SOT-563" (at 0 1.75) (layer "F.Fab") hide
      (effects (font (size 1 1) (thickness 0.15)))
    (tstamp 31dd822a-c423-4f45-87bd-2c8a07bd5c84)
  )
  (fp_text user "^" (at -1 -1.4 180 unlocked) (layer "F.SilkS")
      (effects (font (size 1 1) (thickness 0.15)))
    (tstamp c1368a55-c527-47f6-8b3f-f2d48c6fbcac)
  )
  (fp_text user "${REFERENCE}" (at 0 0 90) (layer "F.Fab")
      (effects (font (size 0.35 0.35) (thickness 0.0625)))
    (tstamp 33545a63-2e4a-4252-8890-7cd209d659fc)
  )
  (fp_line (start -0.65 -0.85) (end -0.65 -0.75)
    (stroke (width 0.1) (type default)) (layer "F.SilkS") (tstamp 29c692db-7654-4b80-820e-3d6add067c43))
  (fp_line (start -0.65 0.85) (end -0.65 0.75)
    (stroke (width 0.1) (type default)) (layer "F.SilkS") (tstamp 9a88d264-db6d-4081-9d25-1e7425456cfd))
  (fp_line (start 0.65 -0.85) (end -0.65 -0.85)
    (stroke (width 0.1) (type solid)) (layer "F.SilkS") (tstamp d74c7911-02fa-4290-974d-650a828d8f05))
  (fp_line (start 0.65 -0.85) (end 0.65 -0.75)
    (stroke (width 0.1) (type default)) (layer "F.SilkS") (tstamp fb30812a-9646-4736-bce1-e1745ab71011))
  (fp_line (start 0.65 0.85) (end -0.65 0.85)
    (stroke (width 0.1) (type solid)) (layer "F.SilkS") (tstamp bfe94081-ad60-4061-bb41-cb0a1b8fbff5))
  (fp_line (start 0.65 0.85) (end 0.65 0.75)
    (stroke (width 0.1) (type default)) (layer "F.SilkS") (tstamp 9915ec82-a786-453d-8f2b-ace12a68ac2d))
  (fp_line (start -1 -0.95) (end -1 0.95)
    (stroke (width 0.05) (type solid)) (layer "F.CrtYd") (tstamp b3e5f8d7-720a-4bd4-ac39-199825deb887))
  (fp_line (start -1 -0.95) (end 1 -0.95)
    (stroke (width 0.05) (type solid)) (layer "F.CrtYd") (tstamp d65f030f-2601-415d-85fd-aa6c1d965d5f))
  (fp_line (start 1 0.95) (end -1 0.95)
    (stroke (width 0.05) (type solid)) (layer "F.CrtYd") (tstamp 1f7715cd-6e02-40a0-9c4f-6344666a8671))
  (fp_line (start 1 0.95) (end 1 -0.95)
    (stroke (width 0.05) (type solid)) (layer "F.CrtYd") (tstamp 0698b54c-3b8f-425b-9604-52974202f14a))
  (fp_line (start -0.65 -0.55) (end -0.65 0.85)
    (stroke (width 0.1) (type solid)) (layer "F.Fab") (tstamp 81526ebe-76ca-41ed-a8b9-c8b48cf5a784))
  (fp_line (start -0.65 0.85) (end 0.65 0.85)
    (stroke (width 0.1) (type solid)) (layer "F.Fab") (tstamp c50a8e08-abd1-4044-b72a-0db78ce492c6))
  (fp_line (start -0.35 -0.85) (end -0.65 -0.55)
    (stroke (width 0.1) (type solid)) (layer "F.Fab") (tstamp 4ab47555-3121-4b21-9ba3-899784f0101f))
  (fp_line (start 0.65 -0.85) (end -0.35 -0.85)
    (stroke (width 0.1) (type solid)) (layer "F.Fab") (tstamp fe524a0f-3f72-4898-b11d-5a2d97c66376))
  (fp_line (start 0.65 0.85) (end 0.65 -0.85)
    (stroke (width 0.1) (type solid)) (layer "F.Fab") (tstamp 497398e3-73cd-494a-ba13-e0c84c7f0154))
  (pad "1" smd roundrect (at -0.69 -0.5) (size 0.5 0.3) (layers "F.Cu" "F.Paste" "F.Mask") (roundrect_rratio 0.1666666667) (tstamp be10929c-7620-4d38-8a4e-f378789cd198))
  (pad "2" smd roundrect (at -0.69 0) (size 0.5 0.3) (layers "F.Cu" "F.Paste" "F.Mask") (roundrect_rratio 0.1666666667) (tstamp 2bb38c01-203b-42df-ac0b-14450a930784))
  (pad "3" smd roundrect (at -0.69 0.5) (size 0.5 0.3) (layers "F.Cu" "F.Paste" "F.Mask") (roundrect_rratio 0.1666666667) (tstamp b817b93a-39ba-47b5-a56c-4936f2e1c704))
  (pad "4" smd roundrect (at 0.69 0.5) (size 0.5 0.3) (layers "F.Cu" "F.Paste" "F.Mask") (roundrect_rratio 0.1666666667) (tstamp 35c9aa2a-c6fa-4d48-863d-039708e5ef7e))
  (pad "5" smd roundrect (at 0.69 0) (size 0.5 0.3) (layers "F.Cu" "F.Paste" "F.Mask") (roundrect_rratio 0.1666666667) (tstamp 5fb0cb13-4ee9-4d0e-9992-854af76a6a49))
  (pad "6" smd roundrect (at 0.69 -0.5) (size 0.5 0.3) (layers "F.Cu" "F.Paste" "F.Mask") (roundrect_rratio 0.1666666667) (tstamp 7111f167-43d4-4c2a-889f-6a9cb632523e))
  (model "${KICADLIB}/model/SOT/SOT-563.step"
    (offset (xyz 0 0 0))
    (scale (xyz 1 1 1))
    (rotate (xyz 0 0 0))
  )
)
