(module "SOT-553" (layer F.Cu) (tedit 5EBAFE30)
  (descr "SOT553")
  (tags "SOT-553")
  (attr smd)
  (fp_text reference "REF**" (at 0 -1.7) (layer F.SilkS)
    (effects (font (size 1 1) (thickness 0.15)))
  )
  (fp_text value "SOT-553" (at 0 1.75) (layer F.Fab) hide
    (effects (font (size 1 1) (thickness 0.15)))
  )
  (fp_line (start 0.65 -0.85) (end -0.65 -0.85) (layer F.SilkS) (width 0.1))
  (fp_line (start 0.99 0.95) (end 0.99 -0.95) (layer F.CrtYd) (width 0.05))
  (fp_line (start 0.99 0.95) (end -0.99 0.95) (layer F.CrtYd) (width 0.05))
  (fp_line (start 0.65 0.85) (end -0.65 0.85) (layer F.SilkS) (width 0.1))
  (fp_line (start -0.99 -0.95) (end 0.99 -0.95) (layer F.CrtYd) (width 0.05))
  (fp_line (start -0.99 -0.95) (end -0.99 0.95) (layer F.CrtYd) (width 0.05))
  (fp_text user "^" (at -1 -1.4 180 unlocked) (layer F.SilkS)
    (effects (font (size 1 1) (thickness 0.15)))
  )
  (fp_text user "${REFERENCE}" (at 0 0 90) (layer F.Fab)
    (effects (font (size 0.35 0.35) (thickness 0.0625)))
  )
  (fp_line (start -0.65 0.85) (end 0.65 0.85) (layer F.Fab) (width 0.1))
  (fp_line (start 0.65 0.85) (end 0.65 -0.85) (layer F.Fab) (width 0.1))
  (fp_line (start 0.65 -0.85) (end -0.4 -0.85) (layer F.Fab) (width 0.1))
  (fp_line (start -0.4 -0.85) (end -0.65 -0.6) (layer F.Fab) (width 0.1))
  (fp_line (start -0.65 -0.6) (end -0.65 0.85) (layer F.Fab) (width 0.1))
  (pad "1" smd rect (at -0.69 -0.5) (size 0.5 0.35) (layers "F.Cu" "F.Paste" "F.Mask") (tstamp cb4b9e0e-4341-48b0-ad3d-af11f20cc702))
  (pad "3" smd rect (at -0.69 0.5) (size 0.5 0.35) (layers "F.Cu" "F.Paste" "F.Mask") (tstamp 7a7db77d-514e-4c6e-b394-d669af054ae5))
  (pad "2" smd rect (at -0.69 0) (size 0.5 0.35) (layers "F.Cu" "F.Paste" "F.Mask") (tstamp 2d3dbed2-c7a8-405d-ad18-0ea93d9bcb5d))
  (pad "5" smd rect (at 0.69 -0.5) (size 0.5 0.35) (layers "F.Cu" "F.Paste" "F.Mask") (tstamp 07762fa1-8ea6-4ab0-951d-96a20bc4c9fd))
  (pad "4" smd rect (at 0.69 0.5) (size 0.5 0.35) (layers "F.Cu" "F.Paste" "F.Mask") (tstamp d42332da-d006-4257-89c5-95d8b06caa34))
  (model "${KICADLIB}/model/SOT/SOT-553.step"
    (at (xyz 0 0 0))
    (scale (xyz 1 1 1))
    (rotate (xyz 0 0 0))
  )
)
