(footprint "CUI_PJ-051AH" (version 20211014) (generator pcbnew)
  (layer "F.Cu")
  (tedit 622FEB6E)
  (attr through_hole)
  (fp_text reference "REF**" (at 0 8.7 unlocked) (layer "F.SilkS")
    (effects (font (size 1 1) (thickness 0.15)))
    (tstamp 5174dc44-08c3-466f-8310-9273327523b2)
  )
  (fp_text value "CUI_PJ-051AH" (at 0 8.7 unlocked) (layer "F.Fab") hide
    (effects (font (size 1 1) (thickness 0.15)))
    (tstamp 2e36eea2-c53d-417d-a86f-691303060c19)
  )
  (fp_text user "^" (at -3.3 8.45 unlocked) (layer "B.SilkS")
    (effects (font (size 1 1) (thickness 0.15)) (justify mirror))
    (tstamp 73043fbf-b7bc-46f2-a926-4f9a8b533533)
  )
  (fp_text user "^" (at -3.3 8.45 unlocked) (layer "F.SilkS")
    (effects (font (size 1 1) (thickness 0.15)))
    (tstamp cc93b877-2660-4524-a154-dcbba7a38791)
  )
  (fp_text user "${REFERENCE}" (at 0 0 unlocked) (layer "F.Fab")
    (effects (font (size 1 1) (thickness 0.15)))
    (tstamp 7627367f-eb07-48a1-8de4-65e4943a2a65)
  )
  (fp_line (start -3.595 0.697109) (end -3.595 4.697109) (layer "F.SilkS") (width 0.12) (tstamp 08e894b1-6f9d-4b0e-928e-021cebd6c4b9))
  (fp_line (start 6.095923 0.698947) (end 6.1 5.2) (layer "F.SilkS") (width 0.12) (tstamp 99120c7e-2eac-489d-8f52-601076ab7267))
  (fp_line (start -3.6 -4) (end 6.1 -4) (layer "F.SilkS") (width 0.12) (tstamp a670d895-f581-4e33-ab4b-811c2921708b))
  (fp_line (start -3.6 -2.7) (end -3.6 -4) (layer "F.SilkS") (width 0.12) (tstamp be1f10f0-386c-426f-91bf-35898ec1197a))
  (fp_line (start 4.5 7.48917) (end 0.8 7.48917) (layer "F.SilkS") (width 0.12) (tstamp c00c4194-e37a-452a-b4d4-4cf3724d87a3))
  (fp_line (start -0.8 7.5) (end -2.5 7.5) (layer "F.SilkS") (width 0.12) (tstamp d34fa182-b507-4f50-8fb5-029ba40995d1))
  (fp_line (start 6.1 -4) (end 6.1 -2.7) (layer "F.SilkS") (width 0.12) (tstamp df850ae9-1978-4ac6-86f9-907f500479d6))
  (fp_line (start -4.7 -3) (end 7.2 -3) (layer "Eco1.User") (width 0.1) (tstamp 308d1bb1-d237-43e7-ad3f-e41f715e2d49))
  (fp_line (start 6.4 1.6) (end 6.4 7.4) (layer "F.CrtYd") (width 0.05) (tstamp 11608aeb-8035-4b70-8f60-4acc92d4a8c4))
  (fp_line (start -4.7 -4.2) (end 7.2 -4.2) (layer "F.CrtYd") (width 0.05) (tstamp 40d26e64-3eb2-4595-9e94-1178c8dfe7ef))
  (fp_line (start -3.9 1.6) (end -4.7 0.8) (layer "F.CrtYd") (width 0.05) (tstamp 4e9044bc-7c80-4331-8ed0-f44cff6c7cd8))
  (fp_line (start 6.4 7.4) (end 5.9 7.9) (layer "F.CrtYd") (width 0.05) (tstamp 55928c55-661a-4bd6-9440-6427dd40c1ce))
  (fp_line (start -4.4 7.3) (end -3.8 7.9) (layer "F.CrtYd") (width 0.05) (tstamp 592f5e45-e975-4930-868e-20977dc52c82))
  (fp_line (start -3.9 4.3) (end -4.4 4.8) (layer "F.CrtYd") (width 0.05) (tstamp 8fea5908-0ccc-4063-856e-0dc341c01926))
  (fp_line (start 7.2 -4.2) (end 7.2 0.8) (layer "F.CrtYd") (width 0.05) (tstamp 90df8952-1685-4f28-87bf-39f3fe4cb987))
  (fp_line (start 7.2 0.8) (end 6.4 1.6) (layer "F.CrtYd") (width 0.05) (tstamp 9dd9391b-38f9-4bc6-99a3-9ced187bd3bc))
  (fp_line (start -4.4 4.8) (end -4.4 7.3) (layer "F.CrtYd") (width 0.05) (tstamp be3076de-eb38-4c2c-9954-7050643ec659))
  (fp_line (start 5.9 7.9) (end -3.8 7.9) (layer "F.CrtYd") (width 0.05) (tstamp c25bdade-3fa9-4fc6-b6df-5bf4b07ac41b))
  (fp_line (start -3.9 1.6) (end -3.9 4.3) (layer "F.CrtYd") (width 0.05) (tstamp dbf6f01e-616d-4697-a8fc-196442f9b0a2))
  (fp_line (start -4.7 -4.2) (end -4.7 0.8) (layer "F.CrtYd") (width 0.05) (tstamp e0439f10-53f2-457f-8c70-03c45d427016))
  (fp_line (start -2.5 7.5) (end -3.6 6.4) (layer "F.Fab") (width 0.1) (tstamp 1249aa92-1199-467d-883a-ac82f1dc4f9d))
  (fp_line (start 6.1 7.5) (end -2.5 7.5) (layer "F.Fab") (width 0.1) (tstamp 3bf20adb-19d0-4a47-aef5-0a9766ce7fa2))
  (fp_line (start -3.6 -4) (end 6.1 -4) (layer "F.Fab") (width 0.1) (tstamp 3f1dfd55-ae5f-4321-b519-bb5d5f7ed1f6))
  (fp_line (start 6.1 -4) (end 6.1 7.5) (layer "F.Fab") (width 0.1) (tstamp cf1ba77f-9a70-4e1d-bf57-ef239e13c659))
  (fp_line (start -3.6 6.4) (end -3.6 -4) (layer "F.Fab") (width 0.1) (tstamp ff06b9f0-be43-41c6-bca7-81363905f1b0))
  (pad "" thru_hole oval (at 6.2 -1) (size 1.6 3.1) (drill oval 0.8 2.3) (layers *.Cu *.Mask) (tstamp 00a901ab-7ddb-4b8c-b375-d63fb5f085b9))
  (pad "" thru_hole oval (at -3.7 -1) (size 1.6 3.1) (drill oval 0.8 2.3) (layers *.Cu *.Mask) (tstamp 20e2fb5e-f437-4b00-9a3f-f7065cbb2bcf))
  (pad "" np_thru_hole circle (at 0 0) (size 2.5 2.5) (drill 2.5) (layers F&B.Cu *.Mask) (tstamp b2640b9c-fb84-4380-b69a-7aad6aa55abb))
  (pad "1" thru_hole oval (at -3.3 6.3) (size 1.6 2.8) (drill oval 0.8 2) (layers *.Cu *.Mask) (tstamp c544657e-3407-44b7-8055-5321a0b0cdd5))
  (pad "2" thru_hole oval (at 5.3 6.3) (size 1.6 2.8) (drill oval 0.8 2) (layers *.Cu *.Mask) (tstamp d323b509-49fc-4eb8-b806-1f4bb272eb27))
  (pad "3" thru_hole oval (at 0.1 6.3) (size 1.6 2.8) (drill oval 0.8 2) (layers *.Cu *.Mask) (tstamp f80a647a-4702-4d35-9942-125da7a20da0))
  (model "${KICADLIB}/model/connector/CUI_PJ-051AH.step"
    (offset (xyz 1.25 4 0))
    (scale (xyz 1 1 1))
    (rotate (xyz -90 0 180))
  )
  (model "${KICADLIB}/model/mechanical/CABLE_Barrel2.1x5.5mm.STEP" hide
    (offset (xyz 0 7.1 3.5))
    (scale (xyz 1 1 1))
    (rotate (xyz -90 0 0))
  )
)
