(kicad_sch (version 20211123) (generator eeschema)

  (uuid a7c410a7-92a2-4328-8929-c609420626f7)

  (paper "A4")

  (title_block
    (title "${name}-Schematic")
    (date "2022-10-25")
    (rev "${revision}")
    (company "${corp}")
    (comment 1 "${author}")
  )

  (lib_symbols
  )


  (sheet_instances
    (path "/" (page "1"))
  )
)
