(module "SSOP65P530X1020-28" (layer F.Cu) (tedit 5EE95F7A)
  (descr "28-Lead Plastic Shrink Small Outline (SS)-5.30 mm Body [SSOP] (see Microchip Packaging Specification 00000049BS.pdf)")
  (tags "SSOP 0.65")
  (attr smd)
  (fp_text reference "REF**" (at 0 -6.25) (layer F.SilkS)
    (effects (font (size 1 1) (thickness 0.15)))
  )
  (fp_text value "SSOP-28_5.3x10.2mm_P0.65mm" (at 0 6.25) (layer F.Fab) hide
    (effects (font (size 1 1) (thickness 0.15)))
  )
  (fp_line (start -1.65 -5.1) (end 2.65 -5.1) (layer F.Fab) (width 0.1))
  (fp_line (start 2.65 -5.1) (end 2.65 5.1) (layer F.Fab) (width 0.1))
  (fp_line (start 2.65 5.1) (end -2.65 5.1) (layer F.Fab) (width 0.1))
  (fp_line (start -2.65 5.1) (end -2.65 -4.1) (layer F.Fab) (width 0.1))
  (fp_line (start -2.65 -4.1) (end -1.65 -5.1) (layer F.Fab) (width 0.1))
  (fp_line (start -4.75 -5.5) (end -4.75 5.5) (layer F.CrtYd) (width 0.05))
  (fp_line (start 4.75 -5.5) (end 4.75 5.5) (layer F.CrtYd) (width 0.05))
  (fp_line (start -4.75 -5.5) (end 4.75 -5.5) (layer F.CrtYd) (width 0.05))
  (fp_line (start -4.75 5.5) (end 4.75 5.5) (layer F.CrtYd) (width 0.05))
  (fp_text user "${REFERENCE}" (at 0 0 270) (layer F.Fab)
    (effects (font (size 0.8 0.8) (thickness 0.15)))
  )
  (fp_text user "^" (at -5.2 -4.225 270 unlocked) (layer F.SilkS)
    (effects (font (size 1 1) (thickness 0.15)))
  )
  (fp_line (start -2.65 4.5) (end -2.65 5.1) (layer F.SilkS) (width 0.1))
  (fp_line (start -2.65 5.1) (end 2.65 5.1) (layer F.SilkS) (width 0.1))
  (fp_line (start 2.65 5.1) (end 2.65 4.5) (layer F.SilkS) (width 0.1))
  (fp_line (start 2.65 -4.525) (end 2.65 -5.1) (layer F.SilkS) (width 0.1))
  (fp_line (start 2.65 -5.1) (end -2.65 -5.1) (layer F.SilkS) (width 0.1))
  (fp_line (start -2.65 -5.1) (end -2.65 -4.1) (layer F.SilkS) (width 0.1))
  (pad "1" smd rect (at -3.6 -4.225) (size 1.75 0.45) (layers "F.Cu" "F.Paste" "F.Mask") (tstamp 0a8d5783-5d8d-4f22-af94-326c8995b91b))
  (pad "2" smd rect (at -3.6 -3.575) (size 1.75 0.45) (layers "F.Cu" "F.Paste" "F.Mask") (tstamp 34485623-573a-4f3f-bdf7-f2ba086ceb42))
  (pad "3" smd rect (at -3.6 -2.925) (size 1.75 0.45) (layers "F.Cu" "F.Paste" "F.Mask") (tstamp 816b3e42-50ea-4ed7-b244-3eb0667c16d6))
  (pad "4" smd rect (at -3.6 -2.275) (size 1.75 0.45) (layers "F.Cu" "F.Paste" "F.Mask") (tstamp a11d04ab-1a45-444d-a41e-3c2322d51465))
  (pad "5" smd rect (at -3.6 -1.625) (size 1.75 0.45) (layers "F.Cu" "F.Paste" "F.Mask") (tstamp ac84d515-5c78-48fd-a25a-e3b5335b75bc))
  (pad "6" smd rect (at -3.6 -0.975) (size 1.75 0.45) (layers "F.Cu" "F.Paste" "F.Mask") (tstamp fadfc2d8-4767-4393-92e9-cf372ce98675))
  (pad "7" smd rect (at -3.6 -0.325) (size 1.75 0.45) (layers "F.Cu" "F.Paste" "F.Mask") (tstamp ae3b456a-e2d8-4f7b-9796-e60d29eb44ad))
  (pad "8" smd rect (at -3.6 0.325) (size 1.75 0.45) (layers "F.Cu" "F.Paste" "F.Mask") (tstamp 0cde18f6-5446-4695-9889-930b4a9625d5))
  (pad "9" smd rect (at -3.6 0.975) (size 1.75 0.45) (layers "F.Cu" "F.Paste" "F.Mask") (tstamp fefba779-f65d-4464-a0c1-c695b8bcfe15))
  (pad "10" smd rect (at -3.6 1.625) (size 1.75 0.45) (layers "F.Cu" "F.Paste" "F.Mask") (tstamp f737ad85-da21-4c07-ad9d-fdca3a8f754f))
  (pad "11" smd rect (at -3.6 2.275) (size 1.75 0.45) (layers "F.Cu" "F.Paste" "F.Mask") (tstamp 928655aa-4397-4311-a7c1-8f152c1f3d21))
  (pad "12" smd rect (at -3.6 2.925) (size 1.75 0.45) (layers "F.Cu" "F.Paste" "F.Mask") (tstamp af7bbb26-2ee8-475c-867b-07b6c7e31c61))
  (pad "13" smd rect (at -3.6 3.575) (size 1.75 0.45) (layers "F.Cu" "F.Paste" "F.Mask") (tstamp f68495f6-992a-4c71-9f4d-da4652e7ac9a))
  (pad "14" smd rect (at -3.6 4.225) (size 1.75 0.45) (layers "F.Cu" "F.Paste" "F.Mask") (tstamp 47a8e994-615a-4ad1-854a-8319ad341581))
  (pad "15" smd rect (at 3.6 4.225) (size 1.75 0.45) (layers "F.Cu" "F.Paste" "F.Mask") (tstamp 2369951e-7afb-43fc-ae5f-53cb379b1095))
  (pad "16" smd rect (at 3.6 3.575) (size 1.75 0.45) (layers "F.Cu" "F.Paste" "F.Mask") (tstamp 67c55589-44e3-4fb5-8795-4ea837654446))
  (pad "17" smd rect (at 3.6 2.925) (size 1.75 0.45) (layers "F.Cu" "F.Paste" "F.Mask") (tstamp 7471e67a-b386-43a8-9660-d3cde837d97f))
  (pad "18" smd rect (at 3.6 2.275) (size 1.75 0.45) (layers "F.Cu" "F.Paste" "F.Mask") (tstamp 53995538-cb67-4489-bfce-968110f25fc7))
  (pad "19" smd rect (at 3.6 1.625) (size 1.75 0.45) (layers "F.Cu" "F.Paste" "F.Mask") (tstamp 41570fb4-adf9-4fe3-8b4e-245e859c437a))
  (pad "20" smd rect (at 3.6 0.975) (size 1.75 0.45) (layers "F.Cu" "F.Paste" "F.Mask") (tstamp 2048bb69-474a-4c0b-a8d8-4e56cb8b8e00))
  (pad "21" smd rect (at 3.6 0.325) (size 1.75 0.45) (layers "F.Cu" "F.Paste" "F.Mask") (tstamp cdc383cb-32a4-4fa6-b96f-dcde38a9119c))
  (pad "22" smd rect (at 3.6 -0.325) (size 1.75 0.45) (layers "F.Cu" "F.Paste" "F.Mask") (tstamp 6e4a7de8-8cbb-4dda-834a-56ce9c93eb0c))
  (pad "23" smd rect (at 3.6 -0.975) (size 1.75 0.45) (layers "F.Cu" "F.Paste" "F.Mask") (tstamp 110dd92e-d1dc-4070-8a48-965453e961cc))
  (pad "24" smd rect (at 3.6 -1.625) (size 1.75 0.45) (layers "F.Cu" "F.Paste" "F.Mask") (tstamp 29021b50-3b48-4ad8-b3b6-8d6e58e28f5d))
  (pad "25" smd rect (at 3.6 -2.275) (size 1.75 0.45) (layers "F.Cu" "F.Paste" "F.Mask") (tstamp 4c74729c-aabb-43e3-8434-bff3ef1c994f))
  (pad "26" smd rect (at 3.6 -2.925) (size 1.75 0.45) (layers "F.Cu" "F.Paste" "F.Mask") (tstamp 2e36ee6a-e124-4f92-9021-93d6fe829135))
  (pad "27" smd rect (at 3.6 -3.575) (size 1.75 0.45) (layers "F.Cu" "F.Paste" "F.Mask") (tstamp 7671c202-e473-4073-b704-97da833b9e46))
  (pad "28" smd rect (at 3.6 -4.225) (size 1.75 0.45) (layers "F.Cu" "F.Paste" "F.Mask") (tstamp 1687a56f-36c7-44c6-8861-3514976bdc72))
  (model "${KICADLIB}/model/SO/SSOP65P530X1020-28.step"
    (at (xyz 0 0 0))
    (scale (xyz 1 1 1))
    (rotate (xyz 0 0 0))
  )
)
