(footprint "Diode_SMA" (version 20201116) (generator pcbnew) placed (layer "F.Cu")
  (tedit 5FD0E455)
  (descr "Diode SMA")
  (tags "Diode SMA")
  (attr smd)
  (fp_text reference "REF**" (at 0 -2.25) (layer "F.SilkS")
    (effects (font (size 1 1) (thickness 0.15)))
    (tstamp aeba66e0-5328-4b2f-aeaa-35f4cb1966b2)
  )
  (fp_text value "Diode_SMA" (at 0 2.1) (layer "F.Fab") hide
    (effects (font (size 1 1) (thickness 0.15)))
    (tstamp b4f0ab33-2d02-4698-bf14-d12dd534d960)
  )
  (fp_text user "${REFERENCE}" (at 0 0 unlocked) (layer "F.Fab")
    (effects (font (size 1 1) (thickness 0.15)))
    (tstamp 7e0b6aa1-50da-454a-824a-841cbc664f73)
  )
  (fp_poly (pts (xy -2.5 0.8)
    (xy -3.2 0.8)
    (xy -3.2 -0.8)
    (xy -2.5 -0.8)) (layer "F.Paste") (width 0.1) (fill solid) (tstamp 3a9cb54f-5675-4bd5-bd5b-186c494d480e))
  (fp_poly (pts (xy -1.7 -0.8)
    (xy -0.8 -0.799998)
    (xy -0.8 0.8)
    (xy -1.700002 0.8)) (layer "F.Paste") (width 0.1) (fill solid) (tstamp 3fe8a60e-83d8-4881-b2bb-957c50ac9fba))
  (fp_poly (pts (xy 2.5 -0.799998)
    (xy 3.2 -0.799998)
    (xy 3.2 0.8)
    (xy 2.5 0.8)) (layer "F.Paste") (width 0.1) (fill solid) (tstamp 41319bca-7758-4096-b59b-daa20a9499d5))
  (fp_poly (pts (xy 1.7 0.8)
    (xy 0.8 0.799998)
    (xy 0.8 -0.8)
    (xy 1.700002 -0.799998)) (layer "F.Paste") (width 0.1) (fill solid) (tstamp 97a0cfb9-10ec-4c6a-acc3-8d28ca53e65f))
  (fp_line (start -3.24914 1.4) (end 2.25044 1.4) (layer "F.SilkS") (width 0.15) (tstamp 80c0467f-b107-44d2-80d7-e5076b086bb6))
  (fp_line (start -3.25 -1.4) (end 2.25044 -1.4) (layer "F.SilkS") (width 0.15) (tstamp b4bbbb4c-6485-48d3-a88a-703a203427cf))
  (fp_line (start -3.24914 1.4) (end -3.25 -1.4) (layer "F.SilkS") (width 0.15) (tstamp da62be82-4c2f-4676-a3fe-75c6f4c3b481))
  (fp_line (start 3.5 -1.6) (end 3.5 1.6) (layer "F.CrtYd") (width 0.05) (tstamp 51df617e-f7f1-4128-b184-b9663deef7d8))
  (fp_line (start -3.5 -1.6) (end 3.5 -1.6) (layer "F.CrtYd") (width 0.05) (tstamp 9584f0e6-0142-46a8-949c-44229ddee530))
  (fp_line (start 3.5 1.6) (end -3.5 1.6) (layer "F.CrtYd") (width 0.05) (tstamp b96aabe0-e7f8-418c-a3fe-6a0dea2ca852))
  (fp_line (start -3.5 1.6) (end -3.5 -1.6) (layer "F.CrtYd") (width 0.05) (tstamp c4a5ffc7-dabd-49d5-8945-93111657de6b))
  (fp_line (start -3.25 -1.4) (end -3.25 1.4) (layer "F.Fab") (width 0.05) (tstamp f70ec3f7-04d6-4bb3-b62d-541ecd73695d))
  (pad "1" smd rect (at -1.99898 0) (size 2.49936 1.80086) (layers "F.Cu" "F.Mask") (tstamp 0c952b80-d27e-4a54-bf4f-0f8757f1274f))
  (pad "2" smd rect (at 1.99898 0) (size 2.49936 1.80086) (layers "F.Cu" "F.Mask") (tstamp 7c1da339-ec1a-4964-ae4c-798dab0b3143))
  (model "${KICADLIB}/model/diode/Diode_SMA.step"
    (offset (xyz 0 0 0))
    (scale (xyz 1 1 1))
    (rotate (xyz 0 0 0))
  )
)
