(footprint "Vishay_IHLP-4040DZ-11" (version 20210228) (generator pcbnew) (layer "F.Cu")
  (tedit 605249ED)
  (attr smd)
  (fp_text reference "REF**" (at -5.87 4.59 270 unlocked) (layer "F.SilkS")
    (effects (font (size 1 1) (thickness 0.15)))
    (tstamp 36c36f09-dfcf-4ad8-8858-3a978cf8198a)
  )
  (fp_text value "Vishay_IHLP-4040DZ-11" (at -0.05 3.45 unlocked) (layer "F.Fab") hide
    (effects (font (size 1 1) (thickness 0.15)))
    (tstamp edef04ff-884c-479e-be83-5197a129ba29)
  )
  (fp_text user "${REFERENCE}" (at 0 0 unlocked) (layer "F.Fab")
    (effects (font (size 1 1) (thickness 0.15)))
    (tstamp 5a8acaa4-8bdd-4387-8d97-8fc6f980bd9a)
  )
  (fp_poly (pts (xy 6.1 -0.299996)
    (xy 2.9 -0.299998)
    (xy 2.900002 -2.5)
    (xy 6.1 -2.499998)) (layer "F.Paste") (width 0.01) (fill solid) (tstamp 1dfd33e7-3b06-4939-870e-41e57799c466))
  (fp_poly (pts (xy 2.9 0.3)
    (xy 6.1 0.3)
    (xy 6.1 2.5)
    (xy 2.9 2.5)) (layer "F.Paste") (width 0.01) (fill solid) (tstamp 3fb6389d-3739-4a5a-b406-2026a55744a7))
  (fp_poly (pts (xy -2.9 -0.3)
    (xy -6.1 -0.3)
    (xy -6.1 -2.5)
    (xy -2.9 -2.5)) (layer "F.Paste") (width 0.01) (fill solid) (tstamp 8babd049-791e-4b57-94cc-a5c321ea6d8c))
  (fp_poly (pts (xy -6.1 0.299998)
    (xy -2.9 0.3)
    (xy -2.900002 2.5)
    (xy -6.1 2.5)) (layer "F.Paste") (width 0.01) (fill solid) (tstamp caca8a17-be52-4e3b-8ec9-69d57a38b623))
  (fp_line (start -4.78 5.08) (end 4.78 5.08) (layer "F.SilkS") (width 0.12) (tstamp 1a515589-81d3-4a98-a7f5-bcfd550d8534))
  (fp_line (start 4.78 -5.08) (end -4.78 -5.08) (layer "F.SilkS") (width 0.12) (tstamp 58d9c9d2-77d0-4bb5-bd5a-e3ef22dadb14))
  (fp_line (start 5.08 4.78) (end 5.08 2.58) (layer "F.SilkS") (width 0.12) (tstamp 6a202cdc-f4c2-4485-b84d-0390c7c99f35))
  (fp_line (start 5.08 -4.78) (end 5.08 -2.56) (layer "F.SilkS") (width 0.12) (tstamp 9169a394-ac54-4e28-9e62-00a8af0330d5))
  (fp_line (start -5.08 -4.78) (end -5.08 -2.58) (layer "F.SilkS") (width 0.12) (tstamp ca368567-de58-4762-b802-c1fcd86c932b))
  (fp_line (start -5.08 4.78) (end -5.08 2.56) (layer "F.SilkS") (width 0.12) (tstamp f972f0b6-2581-4a18-a275-56ad75ade166))
  (fp_arc (start 4.78 4.78) (end 4.78 5.08) (angle -90) (layer "F.SilkS") (width 0.12) (tstamp 56efd477-7c19-48c0-bcf6-2036dea1f848))
  (fp_arc (start -4.78 4.78) (end -5.08 4.78) (angle -90) (layer "F.SilkS") (width 0.12) (tstamp 9977c17d-a1f7-40c6-b3bb-1f0e5888f8ae))
  (fp_arc (start 4.78 -4.78) (end 5.08 -4.78) (angle -90) (layer "F.SilkS") (width 0.12) (tstamp b1288587-a38f-4d81-b8b1-dd188b38db67))
  (fp_arc (start -4.78 -4.78) (end -4.78 -5.08) (angle -90) (layer "F.SilkS") (width 0.12) (tstamp ba686695-cd7e-42c4-b1d5-9177b3690e56))
  (fp_line (start -6.3 -5.3) (end 6.3 -5.3) (layer "F.CrtYd") (width 0.05) (tstamp 0364c03a-5599-49d3-89fe-1596231f1121))
  (fp_line (start -6.3 5.3) (end -6.3 -5.3) (layer "F.CrtYd") (width 0.05) (tstamp 17097683-b8a4-4df9-8d9e-a1fd2b44db31))
  (fp_line (start 6.3 5.3) (end -6.3 5.3) (layer "F.CrtYd") (width 0.05) (tstamp de0ff421-f87a-415e-a7b7-853f76102b7f))
  (fp_line (start 6.3 -5.3) (end 6.3 5.3) (layer "F.CrtYd") (width 0.05) (tstamp f93d2e43-b21c-47b2-b0de-c545e9dced6e))
  (fp_line (start -5.08 -0.4) (end -4.68 0) (layer "F.Fab") (width 0.1) (tstamp 0b080180-649b-46cc-a5fe-785e4821f84a))
  (fp_line (start -5.08 -4.78) (end -5.08 -0.4) (layer "F.Fab") (width 0.1) (tstamp 52b35f0e-fcf8-4027-8c3f-138b0e8886b2))
  (fp_line (start 4.78 -5.08) (end -4.78 -5.08) (layer "F.Fab") (width 0.1) (tstamp 53422daf-06ae-4166-9056-11aac69671e5))
  (fp_line (start 5.08 -4.78) (end 5.080001 4.780001) (layer "F.Fab") (width 0.1) (tstamp c8124c51-503c-4f7e-96e2-1cf20ae321c7))
  (fp_line (start -5.08 0.4) (end -4.68 0) (layer "F.Fab") (width 0.1) (tstamp ea807c56-ab5c-48fd-b408-f5d111978762))
  (fp_line (start -5.08 4.78) (end -5.08 0.4) (layer "F.Fab") (width 0.1) (tstamp f2528f13-1973-44d6-95a3-0711ec69145e))
  (fp_line (start -4.78 5.08) (end 4.78 5.08) (layer "F.Fab") (width 0.1) (tstamp f4b7dccd-3e7d-4249-ae20-af3dc7a696c3))
  (fp_arc (start -4.78 4.780001) (end -5.08 4.78) (angle -90) (layer "F.Fab") (width 0.1) (tstamp 10410147-27f7-43ef-b7be-81be08de917f))
  (fp_arc (start -4.780001 -4.78) (end -4.78 -5.08) (angle -90) (layer "F.Fab") (width 0.1) (tstamp 98c69ff6-41c2-45a6-a1a3-9882609b4161))
  (fp_arc (start 4.780001 4.78) (end 4.78 5.08) (angle -90) (layer "F.Fab") (width 0.1) (tstamp e5a11301-02d3-4d9e-b3c8-238e39f5033e))
  (fp_arc (start 4.78 -4.780001) (end 5.08 -4.78) (angle -90) (layer "F.Fab") (width 0.1) (tstamp f2d27cb3-e1a1-4178-ac2f-1214029a9b80))
  (pad "1" smd rect (at -4.5 0) (size 3.2 5) (layers "F.Cu" "F.Mask") (tstamp 051e5bb4-3470-4e43-8abb-d45a9800b119))
  (pad "2" smd rect (at 4.5 0) (size 3.2 5) (layers "F.Cu" "F.Mask") (tstamp cbc42fca-17da-4557-ba78-e042fa86da62))
  (model "${KICADLIB}/model/passive/Vishay_IHLP4040DZ(.22-1.5uH).STEP"
    (offset (xyz -3.3 3.52 -2.5))
    (scale (xyz 1 1 1))
    (rotate (xyz -90 0 0))
  )
)
