(footprint "PinHeader_1x17_P1.27mm_Vertical" (version 20211014) (generator pcbnew)
  (layer "F.Cu")
  (tedit 6116C831)
  (descr "Through hole straight pin header, 1x17, 1.27mm pitch, single row")
  (tags "Through hole pin header THT 1x17 1.27mm single row")
  (attr through_hole)
  (fp_text reference "REF**" (at 0 -1.695) (layer "F.SilkS")
    (effects (font (size 1 1) (thickness 0.15)))
    (tstamp f80fa3ee-e6d1-4d22-baf1-ba0ea999533b)
  )
  (fp_text value "PinHeader_1x17_P1.27mm_Vertical" (at 0 22.015) (layer "F.Fab") hide
    (effects (font (size 1 1) (thickness 0.15)))
    (tstamp ddc580c6-e278-4b98-8446-536ab109ba49)
  )
  (fp_text user "${REFERENCE}" (at 0 10.16 90) (layer "F.Fab")
    (effects (font (size 1 1) (thickness 0.15)))
    (tstamp bb745445-1c29-4d41-abf0-1e4aebb05b11)
  )
  (fp_line (start 0.563471 0.76) (end 1.11 0.76) (layer "F.SilkS") (width 0.12) (tstamp 0afad556-1d18-4c73-ac87-11f02ae4ad22))
  (fp_line (start -1.11 0.76) (end -1.11 21.015) (layer "F.SilkS") (width 0.12) (tstamp 3c25b03b-0e41-4188-9fde-5f4c857ca26b))
  (fp_line (start -1.11 0) (end -1.11 -0.76) (layer "F.SilkS") (width 0.12) (tstamp 52afe4dd-088b-4d9d-8ad3-53635c2008eb))
  (fp_line (start 0.30753 21.015) (end 1.11 21.015) (layer "F.SilkS") (width 0.12) (tstamp 6f2a9133-d947-4d0a-a0b6-9f56baf6e18a))
  (fp_line (start -1.11 -0.76) (end 0 -0.76) (layer "F.SilkS") (width 0.12) (tstamp b1795b55-11b3-40d1-825e-00af7619be8e))
  (fp_line (start 1.11 0.76) (end 1.11 21.015) (layer "F.SilkS") (width 0.12) (tstamp c3f9a85f-98fb-466c-8889-76ebd192dbc7))
  (fp_line (start -1.11 0.76) (end -0.563471 0.76) (layer "F.SilkS") (width 0.12) (tstamp c9a6dd72-e07c-45d6-86a4-5bcb699645ad))
  (fp_line (start -1.11 21.015) (end -0.30753 21.015) (layer "F.SilkS") (width 0.12) (tstamp fc7ec284-ce82-4294-9fd1-41dc67387767))
  (fp_line (start -1.55 -1.15) (end -1.55 21.5) (layer "F.CrtYd") (width 0.05) (tstamp 1a49a8e0-3e03-4f4e-9a1d-bb5b1a6cf9fd))
  (fp_line (start -1.55 21.5) (end 1.55 21.5) (layer "F.CrtYd") (width 0.05) (tstamp 88dadcc7-e8b9-4bc5-87cf-509e4d7bde41))
  (fp_line (start 1.55 -1.15) (end -1.55 -1.15) (layer "F.CrtYd") (width 0.05) (tstamp d13c643e-99c0-4ba7-afa1-ea8d62536e9d))
  (fp_line (start 1.55 21.5) (end 1.55 -1.15) (layer "F.CrtYd") (width 0.05) (tstamp d7978b6f-57ba-4e60-857b-8aaeeb2ca0f3))
  (fp_line (start 1.05 20.955) (end -1.05 20.955) (layer "F.Fab") (width 0.1) (tstamp 0eee5471-159d-43a5-87f0-82f08b6a1719))
  (fp_line (start -1.05 20.955) (end -1.05 -0.11) (layer "F.Fab") (width 0.1) (tstamp 543b4c06-35ea-4517-aa22-a56375809bcf))
  (fp_line (start 1.05 -0.635) (end 1.05 20.955) (layer "F.Fab") (width 0.1) (tstamp 9b02b89e-244c-4860-84a1-17e06c63c2dd))
  (fp_line (start -1.05 -0.11) (end -0.525 -0.635) (layer "F.Fab") (width 0.1) (tstamp c338a386-5112-4316-84a7-0efcb024e89e))
  (fp_line (start -0.525 -0.635) (end 1.05 -0.635) (layer "F.Fab") (width 0.1) (tstamp d018ada2-0d36-4624-817b-d691eb8d4854))
  (pad "1" thru_hole rect (at 0 0) (size 1 1) (drill 0.65) (layers *.Cu *.Mask) (tstamp 53dc835c-1c13-4bb0-8a76-b6cb0b7888bc))
  (pad "2" thru_hole oval (at 0 1.27) (size 1 1) (drill 0.65) (layers *.Cu *.Mask) (tstamp 346c63d2-f609-4f33-a70c-e5dd56e86082))
  (pad "3" thru_hole oval (at 0 2.54) (size 1 1) (drill 0.65) (layers *.Cu *.Mask) (tstamp c16aea25-fa5f-4bcf-b62b-5375cd3c7d82))
  (pad "4" thru_hole oval (at 0 3.81) (size 1 1) (drill 0.65) (layers *.Cu *.Mask) (tstamp 34aca6ad-b50a-417a-ae10-c862bc00a103))
  (pad "5" thru_hole oval (at 0 5.08) (size 1 1) (drill 0.65) (layers *.Cu *.Mask) (tstamp 132db90b-9420-4364-b55d-e376911d880e))
  (pad "6" thru_hole oval (at 0 6.35) (size 1 1) (drill 0.65) (layers *.Cu *.Mask) (tstamp e85a0238-a409-48e4-9810-88238cd51f2d))
  (pad "7" thru_hole oval (at 0 7.62) (size 1 1) (drill 0.65) (layers *.Cu *.Mask) (tstamp dbedac0b-7428-4c71-af25-8077d125f7ca))
  (pad "8" thru_hole oval (at 0 8.89) (size 1 1) (drill 0.65) (layers *.Cu *.Mask) (tstamp 0b91589d-c3ca-4152-8d0e-e388a8b1a1dd))
  (pad "9" thru_hole oval (at 0 10.16) (size 1 1) (drill 0.65) (layers *.Cu *.Mask) (tstamp 51f9e0d7-1535-4753-b3d8-c3972d61eaff))
  (pad "10" thru_hole oval (at 0 11.43) (size 1 1) (drill 0.65) (layers *.Cu *.Mask) (tstamp dcc5a61c-d38e-48c8-8a3d-f613eb0fa0e1))
  (pad "11" thru_hole oval (at 0 12.7) (size 1 1) (drill 0.65) (layers *.Cu *.Mask) (tstamp 31b67d2a-fde4-41ad-afe5-801ce40e97f2))
  (pad "12" thru_hole oval (at 0 13.97) (size 1 1) (drill 0.65) (layers *.Cu *.Mask) (tstamp 87b44bbe-0875-4ce3-8980-3fccd041c3c9))
  (pad "13" thru_hole oval (at 0 15.24) (size 1 1) (drill 0.65) (layers *.Cu *.Mask) (tstamp cec32c25-3b4f-464f-b658-1a0064bea9a6))
  (pad "14" thru_hole oval (at 0 16.51) (size 1 1) (drill 0.65) (layers *.Cu *.Mask) (tstamp c46775ec-6411-451f-afba-a31a5cec65cf))
  (pad "15" thru_hole oval (at 0 17.78) (size 1 1) (drill 0.65) (layers *.Cu *.Mask) (tstamp aec02b4a-352d-4b6d-83ab-55f21413b3e0))
  (pad "16" thru_hole oval (at 0 19.05) (size 1 1) (drill 0.65) (layers *.Cu *.Mask) (tstamp ff7906c4-6c1e-4767-993f-5bfed565ee30))
  (pad "17" thru_hole oval (at 0 20.32) (size 1 1) (drill 0.65) (layers *.Cu *.Mask) (tstamp 89785e48-0c08-4bea-b61a-018eca5f55ca))
  (model "${KICADLIB}/model/connector/PinHeader_1x17_P1.27mm_Vertical.step"
    (offset (xyz 0 0 0))
    (scale (xyz 1 1 1))
    (rotate (xyz 0 0 0))
  )
)
