(module "BGA216N80P15X15_1300X1300X110" (layer F.Cu) (tedit 5F2CD409)
  (descr "TFBGA-216, 15x15 raster, 13x13mm package, pitch 0.8mm; see section 6.8 of http://www.st.com/resource/en/datasheet/stm32f746zg.pdf")
  (tags "BGA 216 0.8")
  (attr smd)
  (fp_text reference "REF**" (at 0 -7.5) (layer F.SilkS)
    (effects (font (size 1 1) (thickness 0.15)))
    (tstamp 8a32ba29-c443-4c25-a516-38c645ee8800)
  )
  (fp_text value "TFBGA-216_13x13mm_Layout15x15_P0.8mm" (at 0 7.5) (layer F.Fab) hide
    (effects (font (size 1 1) (thickness 0.15)))
    (tstamp cba3f9ba-27ae-491a-bf68-cde37c7fe820)
  )
  (fp_text user "^" (at -7.4 -5.6 270 unlocked) (layer F.SilkS)
    (effects (font (size 1 1) (thickness 0.15)))
    (tstamp ffd34a00-3d1b-436f-b23c-13fa056be1a2)
  )
  (fp_text user "${REFERENCE}" (at 0 0) (layer F.Fab)
    (effects (font (size 1 1) (thickness 0.15)))
    (tstamp b202b8f9-d021-4fba-ba7c-c53bdc1e1a40)
  )
  (fp_line (start -6.5 6.5) (end -6.5 -6.5) (layer F.SilkS) (width 0.12) (tstamp 13dfa386-e21e-4b5d-8a2f-6db1be9697e5))
  (fp_line (start 6.5 -6.5) (end 6.5 6.5) (layer F.SilkS) (width 0.12) (tstamp 429ac126-f960-4195-a039-ff42da892390))
  (fp_line (start -6.5 -6.5) (end 6.5 -6.5) (layer F.SilkS) (width 0.12) (tstamp 7acee8db-251d-4868-b838-1b682698269e))
  (fp_line (start 6.5 6.5) (end -6.5 6.5) (layer F.SilkS) (width 0.12) (tstamp 8b51df2d-5010-4f41-abdb-979784c9cf91))
  (fp_line (start -6.9 7) (end 7 7) (layer F.CrtYd) (width 0.05) (tstamp 063793f5-d783-4fe3-b1d8-c22d7ba6bba0))
  (fp_line (start -7 -7) (end -6.9 7) (layer F.CrtYd) (width 0.05) (tstamp 0713fea1-bffa-48f1-acdb-5b5c886ba9e6))
  (fp_line (start 7 7) (end 7 -7) (layer F.CrtYd) (width 0.05) (tstamp af34d004-625d-4fe9-9fb5-d78e3ca0f245))
  (fp_line (start 7 -7) (end -7 -7) (layer F.CrtYd) (width 0.05) (tstamp bbc0f662-c590-4f1a-bebe-930342867d94))
  (fp_line (start -6.5 -5.5) (end -5.5 -6.5) (layer F.Fab) (width 0.1) (tstamp 4bf7cde3-a224-46ed-a559-75acb664eee9))
  (fp_line (start 6.5 6.5) (end -6.5 6.5) (layer F.Fab) (width 0.1) (tstamp c44e96fd-a43e-4d89-bb66-cff5abfe0530))
  (fp_line (start -5.5 -6.5) (end 6.5 -6.5) (layer F.Fab) (width 0.1) (tstamp cf7d18b6-8704-4c8c-9112-b66091697fe1))
  (fp_line (start 6.5 -6.5) (end 6.5 6.5) (layer F.Fab) (width 0.1) (tstamp d1337e47-7136-4367-a4bb-ea4ca8ecd6ab))
  (fp_line (start -6.5 6.5) (end -6.5 -5.5) (layer F.Fab) (width 0.1) (tstamp ed361029-2597-4e3c-a096-c6f4762bf231))
  (pad "A1" smd circle (at -5.6 -5.6) (size 0.4 0.4) (layers "F.Cu" "F.Paste" "F.Mask")
    (solder_mask_margin 0.05) (tstamp 261cfda6-f5be-4022-b878-25cc79a194de))
  (pad "A2" smd circle (at -4.8 -5.6) (size 0.4 0.4) (layers "F.Cu" "F.Paste" "F.Mask")
    (solder_mask_margin 0.05) (tstamp 7e2c3a9b-4b99-4c3e-bea9-6b424934a78f))
  (pad "A3" smd circle (at -4 -5.6) (size 0.4 0.4) (layers "F.Cu" "F.Paste" "F.Mask")
    (solder_mask_margin 0.05) (tstamp 6b37558a-3ca4-45b3-be4f-4fb7bb3b2b7c))
  (pad "A4" smd circle (at -3.2 -5.6) (size 0.4 0.4) (layers "F.Cu" "F.Paste" "F.Mask")
    (solder_mask_margin 0.05) (tstamp 10630596-cc05-4159-bab0-6b0de5e9ca5d))
  (pad "A5" smd circle (at -2.4 -5.6) (size 0.4 0.4) (layers "F.Cu" "F.Paste" "F.Mask")
    (solder_mask_margin 0.05) (tstamp 48bcc4ec-dd63-4445-97c3-11f57bf69fdf))
  (pad "A6" smd circle (at -1.6 -5.6) (size 0.4 0.4) (layers "F.Cu" "F.Paste" "F.Mask")
    (solder_mask_margin 0.05) (tstamp 21a86ba8-02ca-4b1c-810f-afa78dcc57ee))
  (pad "A7" smd circle (at -0.8 -5.6) (size 0.4 0.4) (layers "F.Cu" "F.Paste" "F.Mask")
    (solder_mask_margin 0.05) (tstamp df2c74d4-43be-44fc-bfc1-61a0c1a19693))
  (pad "A8" smd circle (at 0 -5.6) (size 0.4 0.4) (layers "F.Cu" "F.Paste" "F.Mask")
    (solder_mask_margin 0.05) (tstamp 83688dac-c8d4-4ce7-bb28-e71b88a30802))
  (pad "A9" smd circle (at 0.8 -5.6) (size 0.4 0.4) (layers "F.Cu" "F.Paste" "F.Mask")
    (solder_mask_margin 0.05) (tstamp 55cf2e54-ef87-4642-b3c9-441ee9c54cb4))
  (pad "A10" smd circle (at 1.6 -5.6) (size 0.4 0.4) (layers "F.Cu" "F.Paste" "F.Mask")
    (solder_mask_margin 0.05) (tstamp bd7a6418-7af1-4e32-8e46-10ed0f12f1b1))
  (pad "A11" smd circle (at 2.4 -5.6) (size 0.4 0.4) (layers "F.Cu" "F.Paste" "F.Mask")
    (solder_mask_margin 0.05) (tstamp eec1fac5-4fcc-485d-ad00-9ebe3375fe6f))
  (pad "A12" smd circle (at 3.2 -5.6) (size 0.4 0.4) (layers "F.Cu" "F.Paste" "F.Mask")
    (solder_mask_margin 0.05) (tstamp cc2b8ec0-3c2b-4582-b461-dd977f8205c6))
  (pad "A13" smd circle (at 4 -5.6) (size 0.4 0.4) (layers "F.Cu" "F.Paste" "F.Mask")
    (solder_mask_margin 0.05) (tstamp e6b6669a-fcaa-441f-9ec3-5adb27289e02))
  (pad "A14" smd circle (at 4.8 -5.6) (size 0.4 0.4) (layers "F.Cu" "F.Paste" "F.Mask")
    (solder_mask_margin 0.05) (tstamp 844660bb-f79b-46f1-8b57-4b3cbd0348d8))
  (pad "A15" smd circle (at 5.6 -5.6) (size 0.4 0.4) (layers "F.Cu" "F.Paste" "F.Mask")
    (solder_mask_margin 0.05) (tstamp a30992a2-8fa8-4bec-af3f-af99b6e2d260))
  (pad "B1" smd circle (at -5.6 -4.8) (size 0.4 0.4) (layers "F.Cu" "F.Paste" "F.Mask")
    (solder_mask_margin 0.05) (tstamp bf52b2b9-6065-4e63-b5b9-313c0ee9c523))
  (pad "B2" smd circle (at -4.8 -4.8) (size 0.4 0.4) (layers "F.Cu" "F.Paste" "F.Mask")
    (solder_mask_margin 0.05) (tstamp 50fc5b83-e580-4551-b4d9-4e44cbe434a1))
  (pad "B3" smd circle (at -4 -4.8) (size 0.4 0.4) (layers "F.Cu" "F.Paste" "F.Mask")
    (solder_mask_margin 0.05) (tstamp ac477a5d-10cb-4591-a2a3-bc32cdfb2043))
  (pad "B4" smd circle (at -3.2 -4.8) (size 0.4 0.4) (layers "F.Cu" "F.Paste" "F.Mask")
    (solder_mask_margin 0.05) (tstamp afa45b57-a02a-4742-9c36-5958aefd3271))
  (pad "B5" smd circle (at -2.4 -4.8) (size 0.4 0.4) (layers "F.Cu" "F.Paste" "F.Mask")
    (solder_mask_margin 0.05) (tstamp a4b76fb2-bbd4-40bc-ac87-5b932363674e))
  (pad "B6" smd circle (at -1.6 -4.8) (size 0.4 0.4) (layers "F.Cu" "F.Paste" "F.Mask")
    (solder_mask_margin 0.05) (tstamp 1073c318-35e6-4afd-9e06-c428d21a9625))
  (pad "B7" smd circle (at -0.8 -4.8) (size 0.4 0.4) (layers "F.Cu" "F.Paste" "F.Mask")
    (solder_mask_margin 0.05) (tstamp 20b9ae91-6daf-4833-9597-6a94972942d1))
  (pad "B8" smd circle (at 0 -4.8) (size 0.4 0.4) (layers "F.Cu" "F.Paste" "F.Mask")
    (solder_mask_margin 0.05) (tstamp bf9a54a4-27ff-4dfb-93b4-3d3569d7f3d6))
  (pad "B9" smd circle (at 0.8 -4.8) (size 0.4 0.4) (layers "F.Cu" "F.Paste" "F.Mask")
    (solder_mask_margin 0.05) (tstamp 101a19df-f0aa-42cd-8ab7-1562208ee56f))
  (pad "B10" smd circle (at 1.6 -4.8) (size 0.4 0.4) (layers "F.Cu" "F.Paste" "F.Mask")
    (solder_mask_margin 0.05) (tstamp 246050a8-41ef-4027-bee4-7ab950b8b98c))
  (pad "B11" smd circle (at 2.4 -4.8) (size 0.4 0.4) (layers "F.Cu" "F.Paste" "F.Mask")
    (solder_mask_margin 0.05) (tstamp a0e0bac8-d50b-4625-b231-9754be7cebbf))
  (pad "B12" smd circle (at 3.2 -4.8) (size 0.4 0.4) (layers "F.Cu" "F.Paste" "F.Mask")
    (solder_mask_margin 0.05) (tstamp 3b3eded8-bf4b-422a-8625-74e8e2ed9964))
  (pad "B13" smd circle (at 4 -4.8) (size 0.4 0.4) (layers "F.Cu" "F.Paste" "F.Mask")
    (solder_mask_margin 0.05) (tstamp 4bd2b3bd-70a4-4441-bbd3-ee79d435ae70))
  (pad "B14" smd circle (at 4.8 -4.8) (size 0.4 0.4) (layers "F.Cu" "F.Paste" "F.Mask")
    (solder_mask_margin 0.05) (tstamp c8f45359-4120-4cbe-80d9-f9b3292b470c))
  (pad "B15" smd circle (at 5.6 -4.8) (size 0.4 0.4) (layers "F.Cu" "F.Paste" "F.Mask")
    (solder_mask_margin 0.05) (tstamp 5c490dda-caeb-4a30-9d3d-304c810578f7))
  (pad "C1" smd circle (at -5.6 -4) (size 0.4 0.4) (layers "F.Cu" "F.Paste" "F.Mask")
    (solder_mask_margin 0.05) (tstamp 7ff629b1-15c3-42db-bff8-e4e9b27d3268))
  (pad "C2" smd circle (at -4.8 -4) (size 0.4 0.4) (layers "F.Cu" "F.Paste" "F.Mask")
    (solder_mask_margin 0.05) (tstamp 5f474323-6364-4790-9141-9c7e69669418))
  (pad "C3" smd circle (at -4 -4) (size 0.4 0.4) (layers "F.Cu" "F.Paste" "F.Mask")
    (solder_mask_margin 0.05) (tstamp c8049e65-2f25-425e-bd08-18644ca4145c))
  (pad "C4" smd circle (at -3.2 -4) (size 0.4 0.4) (layers "F.Cu" "F.Paste" "F.Mask")
    (solder_mask_margin 0.05) (tstamp 7c407733-986c-4b51-aedd-f302c65d4e79))
  (pad "C5" smd circle (at -2.4 -4) (size 0.4 0.4) (layers "F.Cu" "F.Paste" "F.Mask")
    (solder_mask_margin 0.05) (tstamp 966a6529-4a63-4077-88fc-82f7445a6464))
  (pad "C6" smd circle (at -1.6 -4) (size 0.4 0.4) (layers "F.Cu" "F.Paste" "F.Mask")
    (solder_mask_margin 0.05) (tstamp fa51e286-385b-4c6e-b476-62c28b0addd5))
  (pad "C7" smd circle (at -0.8 -4) (size 0.4 0.4) (layers "F.Cu" "F.Paste" "F.Mask")
    (solder_mask_margin 0.05) (tstamp 13bb4113-aa5e-4073-b73e-de80c5eb1dd8))
  (pad "C8" smd circle (at 0 -4) (size 0.4 0.4) (layers "F.Cu" "F.Paste" "F.Mask")
    (solder_mask_margin 0.05) (tstamp 6e304291-791e-40e5-ba9b-402b4064ebeb))
  (pad "C9" smd circle (at 0.8 -4) (size 0.4 0.4) (layers "F.Cu" "F.Paste" "F.Mask")
    (solder_mask_margin 0.05) (tstamp 68bcf951-8528-4939-83ca-b640ed337645))
  (pad "C10" smd circle (at 1.6 -4) (size 0.4 0.4) (layers "F.Cu" "F.Paste" "F.Mask")
    (solder_mask_margin 0.05) (tstamp 3b87fb32-72bb-448f-9df4-3075994ccae9))
  (pad "C11" smd circle (at 2.4 -4) (size 0.4 0.4) (layers "F.Cu" "F.Paste" "F.Mask")
    (solder_mask_margin 0.05) (tstamp 6bd37d2d-2f75-486c-8e0d-df05ec5582b5))
  (pad "C12" smd circle (at 3.2 -4) (size 0.4 0.4) (layers "F.Cu" "F.Paste" "F.Mask")
    (solder_mask_margin 0.05) (tstamp c915e99a-b0f1-4408-af8f-702178f258a7))
  (pad "C13" smd circle (at 4 -4) (size 0.4 0.4) (layers "F.Cu" "F.Paste" "F.Mask")
    (solder_mask_margin 0.05) (tstamp 980eeeef-518e-417f-816f-669d2675bece))
  (pad "C14" smd circle (at 4.8 -4) (size 0.4 0.4) (layers "F.Cu" "F.Paste" "F.Mask")
    (solder_mask_margin 0.05) (tstamp 790bc16e-23e5-4436-b11c-6168971f45f1))
  (pad "C15" smd circle (at 5.6 -4) (size 0.4 0.4) (layers "F.Cu" "F.Paste" "F.Mask")
    (solder_mask_margin 0.05) (tstamp 07be61c2-89a9-496e-9658-822cff60e112))
  (pad "D1" smd circle (at -5.6 -3.2) (size 0.4 0.4) (layers "F.Cu" "F.Paste" "F.Mask")
    (solder_mask_margin 0.05) (tstamp 6b6ba3d5-01df-4353-80cf-82c5f94d9857))
  (pad "D2" smd circle (at -4.8 -3.2) (size 0.4 0.4) (layers "F.Cu" "F.Paste" "F.Mask")
    (solder_mask_margin 0.05) (tstamp dff62fb3-150a-47e0-a82a-18535255af2f))
  (pad "D3" smd circle (at -4 -3.2) (size 0.4 0.4) (layers "F.Cu" "F.Paste" "F.Mask")
    (solder_mask_margin 0.05) (tstamp cee20888-4b95-4b19-a134-b57d5ee87a9b))
  (pad "D4" smd circle (at -3.2 -3.2) (size 0.4 0.4) (layers "F.Cu" "F.Paste" "F.Mask")
    (solder_mask_margin 0.05) (tstamp 7f8b34eb-d2a6-4d96-ba8d-c029da1de707))
  (pad "D5" smd circle (at -2.4 -3.2) (size 0.4 0.4) (layers "F.Cu" "F.Paste" "F.Mask")
    (solder_mask_margin 0.05) (tstamp f48ee8b0-ed8a-400e-84f3-16902cb2e51a))
  (pad "D6" smd circle (at -1.6 -3.2) (size 0.4 0.4) (layers "F.Cu" "F.Paste" "F.Mask")
    (solder_mask_margin 0.05) (tstamp 7927ecef-718d-4201-a5ee-a69b5774c25a))
  (pad "D7" smd circle (at -0.8 -3.2) (size 0.4 0.4) (layers "F.Cu" "F.Paste" "F.Mask")
    (solder_mask_margin 0.05) (tstamp bfe30977-b72e-4b62-829b-ba1836325523))
  (pad "D8" smd circle (at 0 -3.2) (size 0.4 0.4) (layers "F.Cu" "F.Paste" "F.Mask")
    (solder_mask_margin 0.05) (tstamp adc71cb2-32fa-4b7a-a17b-698eef8b2ef4))
  (pad "D9" smd circle (at 0.8 -3.2) (size 0.4 0.4) (layers "F.Cu" "F.Paste" "F.Mask")
    (solder_mask_margin 0.05) (tstamp 27d34f55-8cb0-4148-a155-dfc780d2299a))
  (pad "D10" smd circle (at 1.6 -3.2) (size 0.4 0.4) (layers "F.Cu" "F.Paste" "F.Mask")
    (solder_mask_margin 0.05) (tstamp 6fcdc0f8-1e92-4210-8245-a8548fd0ebf8))
  (pad "D11" smd circle (at 2.4 -3.2) (size 0.4 0.4) (layers "F.Cu" "F.Paste" "F.Mask")
    (solder_mask_margin 0.05) (tstamp 1fd5ae2f-ca1a-4107-ae50-8e062820e02b))
  (pad "D12" smd circle (at 3.2 -3.2) (size 0.4 0.4) (layers "F.Cu" "F.Paste" "F.Mask")
    (solder_mask_margin 0.05) (tstamp a5adbf2c-41b8-4729-93f3-89af943aed01))
  (pad "D13" smd circle (at 4 -3.2) (size 0.4 0.4) (layers "F.Cu" "F.Paste" "F.Mask")
    (solder_mask_margin 0.05) (tstamp 1fd90c17-5daa-4f36-9e86-9920567ffb98))
  (pad "D14" smd circle (at 4.8 -3.2) (size 0.4 0.4) (layers "F.Cu" "F.Paste" "F.Mask")
    (solder_mask_margin 0.05) (tstamp ea14b9b0-4edc-4b15-9a02-c3da26d6fd9d))
  (pad "D15" smd circle (at 5.6 -3.2) (size 0.4 0.4) (layers "F.Cu" "F.Paste" "F.Mask")
    (solder_mask_margin 0.05) (tstamp c11afec9-4a54-4fdc-afbe-2949401e9d01))
  (pad "E1" smd circle (at -5.6 -2.4) (size 0.4 0.4) (layers "F.Cu" "F.Paste" "F.Mask")
    (solder_mask_margin 0.05) (tstamp 34c78928-7ae3-40f7-91bb-2cf5b30b8297))
  (pad "E2" smd circle (at -4.8 -2.4) (size 0.4 0.4) (layers "F.Cu" "F.Paste" "F.Mask")
    (solder_mask_margin 0.05) (tstamp 877393e8-68d0-487f-9c91-fff72a8e81c5))
  (pad "E3" smd circle (at -4 -2.4) (size 0.4 0.4) (layers "F.Cu" "F.Paste" "F.Mask")
    (solder_mask_margin 0.05) (tstamp 3db8128e-8c3f-44eb-9c74-06949198cb96))
  (pad "E4" smd circle (at -3.2 -2.4) (size 0.4 0.4) (layers "F.Cu" "F.Paste" "F.Mask")
    (solder_mask_margin 0.05) (tstamp 3a3432c4-dcc5-4572-b099-38dc37c16fc2))
  (pad "E5" smd circle (at -2.4 -2.4) (size 0.4 0.4) (layers "F.Cu" "F.Paste" "F.Mask")
    (solder_mask_margin 0.05) (tstamp 30b04ce1-ed5b-4957-9be9-601ea1878174))
  (pad "E6" smd circle (at -1.6 -2.4) (size 0.4 0.4) (layers "F.Cu" "F.Paste" "F.Mask")
    (solder_mask_margin 0.05) (tstamp 15138a13-a83d-4669-91f9-62742e787e62))
  (pad "E7" smd circle (at -0.8 -2.4) (size 0.4 0.4) (layers "F.Cu" "F.Paste" "F.Mask")
    (solder_mask_margin 0.05) (tstamp 7fefb905-e966-49e8-8c97-edebea4368b9))
  (pad "E8" smd circle (at 0 -2.4) (size 0.4 0.4) (layers "F.Cu" "F.Paste" "F.Mask")
    (solder_mask_margin 0.05) (tstamp 48f1cd50-d038-40ad-ade6-ff3917e8f96c))
  (pad "E9" smd circle (at 0.8 -2.4) (size 0.4 0.4) (layers "F.Cu" "F.Paste" "F.Mask")
    (solder_mask_margin 0.05) (tstamp 3c6af952-7010-44dc-9ca0-d34ea6fde80d))
  (pad "E10" smd circle (at 1.6 -2.4) (size 0.4 0.4) (layers "F.Cu" "F.Paste" "F.Mask")
    (solder_mask_margin 0.05) (tstamp de795a05-9ff7-4263-bf14-dc6271060968))
  (pad "E11" smd circle (at 2.4 -2.4) (size 0.4 0.4) (layers "F.Cu" "F.Paste" "F.Mask")
    (solder_mask_margin 0.05) (tstamp 1d6c457c-c7db-461c-9c7b-7b54a5628134))
  (pad "E12" smd circle (at 3.2 -2.4) (size 0.4 0.4) (layers "F.Cu" "F.Paste" "F.Mask")
    (solder_mask_margin 0.05) (tstamp f7801d9e-566d-4b20-b5a3-f63743861090))
  (pad "E13" smd circle (at 4 -2.4) (size 0.4 0.4) (layers "F.Cu" "F.Paste" "F.Mask")
    (solder_mask_margin 0.05) (tstamp d2cdecf0-3292-49d1-b28c-44a880ab7c81))
  (pad "E14" smd circle (at 4.8 -2.4) (size 0.4 0.4) (layers "F.Cu" "F.Paste" "F.Mask")
    (solder_mask_margin 0.05) (tstamp 568770b6-8309-4239-9989-f59f30f96d45))
  (pad "E15" smd circle (at 5.6 -2.4) (size 0.4 0.4) (layers "F.Cu" "F.Paste" "F.Mask")
    (solder_mask_margin 0.05) (tstamp bac6e3d3-1cbb-45cf-b7b3-ad3dae7d329b))
  (pad "F1" smd circle (at -5.6 -1.6) (size 0.4 0.4) (layers "F.Cu" "F.Paste" "F.Mask")
    (solder_mask_margin 0.05) (tstamp a6fdbf86-1c60-457f-997b-27a969a6365e))
  (pad "F2" smd circle (at -4.8 -1.6) (size 0.4 0.4) (layers "F.Cu" "F.Paste" "F.Mask")
    (solder_mask_margin 0.05) (tstamp 5b3dc23e-bf21-4ba8-b89c-602c653c3455))
  (pad "F3" smd circle (at -4 -1.6) (size 0.4 0.4) (layers "F.Cu" "F.Paste" "F.Mask")
    (solder_mask_margin 0.05) (tstamp e5c607fd-7045-4c5f-8ed9-a5deb9606fdc))
  (pad "F4" smd circle (at -3.2 -1.6) (size 0.4 0.4) (layers "F.Cu" "F.Paste" "F.Mask")
    (solder_mask_margin 0.05) (tstamp e3aef7d3-9b14-473e-9d8e-83d6dc6045ae))
  (pad "F5" smd circle (at -2.4 -1.6) (size 0.4 0.4) (layers "F.Cu" "F.Paste" "F.Mask")
    (solder_mask_margin 0.05) (tstamp 0005765d-b559-40fd-93e5-3aa43d78efce))
  (pad "F6" smd circle (at -1.6 -1.6) (size 0.4 0.4) (layers "F.Cu" "F.Paste" "F.Mask")
    (solder_mask_margin 0.05) (tstamp 1f0db946-a0ac-47c7-8ca8-d16f386ec01a))
  (pad "F7" smd circle (at -0.8 -1.6) (size 0.4 0.4) (layers "F.Cu" "F.Paste" "F.Mask")
    (solder_mask_margin 0.05) (tstamp 64070e05-cda1-4bcd-9d8c-6d1e766cb80b))
  (pad "F8" smd circle (at 0 -1.6) (size 0.4 0.4) (layers "F.Cu" "F.Paste" "F.Mask")
    (solder_mask_margin 0.05) (tstamp 6b534d10-2457-4c1c-9f1d-9b817b7c065c))
  (pad "F9" smd circle (at 0.8 -1.6) (size 0.4 0.4) (layers "F.Cu" "F.Paste" "F.Mask")
    (solder_mask_margin 0.05) (tstamp 3f5be3da-48a4-482b-add3-593aac7a72a3))
  (pad "F10" smd circle (at 1.6 -1.6) (size 0.4 0.4) (layers "F.Cu" "F.Paste" "F.Mask")
    (solder_mask_margin 0.05) (tstamp bb26569b-0a9a-4d75-9e73-eb49198bb902))
  (pad "F11" smd circle (at 2.4 -1.6) (size 0.4 0.4) (layers "F.Cu" "F.Paste" "F.Mask")
    (solder_mask_margin 0.05) (tstamp a8e77acd-6b6e-4e94-9427-73e59878602f))
  (pad "F12" smd circle (at 3.2 -1.6) (size 0.4 0.4) (layers "F.Cu" "F.Paste" "F.Mask")
    (solder_mask_margin 0.05) (tstamp 3450d1f5-4b81-482a-a81c-90911790814d))
  (pad "F13" smd circle (at 4 -1.6) (size 0.4 0.4) (layers "F.Cu" "F.Paste" "F.Mask")
    (solder_mask_margin 0.05) (tstamp 5eae0660-f841-455b-98fe-5b890a5971b6))
  (pad "F14" smd circle (at 4.8 -1.6) (size 0.4 0.4) (layers "F.Cu" "F.Paste" "F.Mask")
    (solder_mask_margin 0.05) (tstamp 417de36b-02f6-4b56-a818-40b53a3fa644))
  (pad "F15" smd circle (at 5.6 -1.6) (size 0.4 0.4) (layers "F.Cu" "F.Paste" "F.Mask")
    (solder_mask_margin 0.05) (tstamp 749c869e-56e5-41fe-9de7-04f40692b9b6))
  (pad "G1" smd circle (at -5.6 -0.8) (size 0.4 0.4) (layers "F.Cu" "F.Paste" "F.Mask")
    (solder_mask_margin 0.05) (tstamp 5d28fa65-349d-4f65-a800-2685673b1e17))
  (pad "G2" smd circle (at -4.8 -0.8) (size 0.4 0.4) (layers "F.Cu" "F.Paste" "F.Mask")
    (solder_mask_margin 0.05) (tstamp 42f7d837-f6ca-4299-86c8-537721627b79))
  (pad "G3" smd circle (at -4 -0.8) (size 0.4 0.4) (layers "F.Cu" "F.Paste" "F.Mask")
    (solder_mask_margin 0.05) (tstamp 429a1179-f427-4f04-a220-4ac597372683))
  (pad "G4" smd circle (at -3.2 -0.8) (size 0.4 0.4) (layers "F.Cu" "F.Paste" "F.Mask")
    (solder_mask_margin 0.05) (tstamp c2d07d9c-eb0e-4e5d-99da-b85d3284b49e))
  (pad "G5" smd circle (at -2.4 -0.8) (size 0.4 0.4) (layers "F.Cu" "F.Paste" "F.Mask")
    (solder_mask_margin 0.05) (tstamp a871b418-b76f-40ec-85fb-9067f8e3406f))
  (pad "G6" smd circle (at -1.6 -0.8) (size 0.4 0.4) (layers "F.Cu" "F.Paste" "F.Mask")
    (solder_mask_margin 0.05) (tstamp 465618db-721a-4382-95af-9449504342c2))
  (pad "G10" smd circle (at 1.6 -0.8) (size 0.4 0.4) (layers "F.Cu" "F.Paste" "F.Mask")
    (solder_mask_margin 0.05) (tstamp 184db19b-03d3-470c-b77f-a3310f264099))
  (pad "G11" smd circle (at 2.4 -0.8) (size 0.4 0.4) (layers "F.Cu" "F.Paste" "F.Mask")
    (solder_mask_margin 0.05) (tstamp 07da652e-7847-476e-afea-fac53bde4755))
  (pad "G12" smd circle (at 3.2 -0.8) (size 0.4 0.4) (layers "F.Cu" "F.Paste" "F.Mask")
    (solder_mask_margin 0.05) (tstamp 9274fc89-d4d5-46ec-89bb-1b6dad411ea9))
  (pad "G13" smd circle (at 4 -0.8) (size 0.4 0.4) (layers "F.Cu" "F.Paste" "F.Mask")
    (solder_mask_margin 0.05) (tstamp 8d6866cd-78e5-49f8-a691-2136982ad65e))
  (pad "G14" smd circle (at 4.8 -0.8) (size 0.4 0.4) (layers "F.Cu" "F.Paste" "F.Mask")
    (solder_mask_margin 0.05) (tstamp d663dc2b-39be-41ff-85f7-a9338814d51d))
  (pad "G15" smd circle (at 5.6 -0.8) (size 0.4 0.4) (layers "F.Cu" "F.Paste" "F.Mask")
    (solder_mask_margin 0.05) (tstamp c24448e2-4c1e-4163-b9fc-f9b48ff59258))
  (pad "H1" smd circle (at -5.6 0) (size 0.4 0.4) (layers "F.Cu" "F.Paste" "F.Mask")
    (solder_mask_margin 0.05) (tstamp be1da5fa-7b31-41b0-9df8-db47c7acad67))
  (pad "H2" smd circle (at -4.8 0) (size 0.4 0.4) (layers "F.Cu" "F.Paste" "F.Mask")
    (solder_mask_margin 0.05) (tstamp 5d1e3adf-2865-4eaf-9f8f-c7c9d2e610fd))
  (pad "H3" smd circle (at -4 0) (size 0.4 0.4) (layers "F.Cu" "F.Paste" "F.Mask")
    (solder_mask_margin 0.05) (tstamp d4d6d4df-c242-488f-aedc-8710eaad2e83))
  (pad "H4" smd circle (at -3.2 0) (size 0.4 0.4) (layers "F.Cu" "F.Paste" "F.Mask")
    (solder_mask_margin 0.05) (tstamp 5f3f0463-6835-4d03-a0b9-6eb9f1c88143))
  (pad "H5" smd circle (at -2.4 0) (size 0.4 0.4) (layers "F.Cu" "F.Paste" "F.Mask")
    (solder_mask_margin 0.05) (tstamp f26fe0f8-356e-4770-aea0-7f554195a31e))
  (pad "H6" smd circle (at -1.6 0) (size 0.4 0.4) (layers "F.Cu" "F.Paste" "F.Mask")
    (solder_mask_margin 0.05) (tstamp 4f71d19d-0606-4b3b-a64a-ba7c9365954d))
  (pad "H10" smd circle (at 1.6 0) (size 0.4 0.4) (layers "F.Cu" "F.Paste" "F.Mask")
    (solder_mask_margin 0.05) (tstamp b7533713-5329-4a43-8999-91d19f53cadd))
  (pad "H11" smd circle (at 2.4 0) (size 0.4 0.4) (layers "F.Cu" "F.Paste" "F.Mask")
    (solder_mask_margin 0.05) (tstamp 3370eaae-ddc8-4383-870a-b34f336bed36))
  (pad "H12" smd circle (at 3.2 0) (size 0.4 0.4) (layers "F.Cu" "F.Paste" "F.Mask")
    (solder_mask_margin 0.05) (tstamp bd6c5368-c613-465f-8b88-9530bb958c40))
  (pad "H13" smd circle (at 4 0) (size 0.4 0.4) (layers "F.Cu" "F.Paste" "F.Mask")
    (solder_mask_margin 0.05) (tstamp 8c8f1c66-72ea-41cb-912c-322edf1ed06f))
  (pad "H14" smd circle (at 4.8 0) (size 0.4 0.4) (layers "F.Cu" "F.Paste" "F.Mask")
    (solder_mask_margin 0.05) (tstamp bbfd3142-468b-421d-a8e3-1dcb1af7c7df))
  (pad "H15" smd circle (at 5.6 0) (size 0.4 0.4) (layers "F.Cu" "F.Paste" "F.Mask")
    (solder_mask_margin 0.05) (tstamp 04a44845-7a52-48a7-9d92-3783dd4261a8))
  (pad "J1" smd circle (at -5.6 0.8) (size 0.4 0.4) (layers "F.Cu" "F.Paste" "F.Mask")
    (solder_mask_margin 0.05) (tstamp e9a2bc92-dab3-4fea-8866-0d095087b8ec))
  (pad "J2" smd circle (at -4.8 0.8) (size 0.4 0.4) (layers "F.Cu" "F.Paste" "F.Mask")
    (solder_mask_margin 0.05) (tstamp 6cb2a1b3-3f25-4b74-82e7-68ab34e6a75f))
  (pad "J3" smd circle (at -4 0.8) (size 0.4 0.4) (layers "F.Cu" "F.Paste" "F.Mask")
    (solder_mask_margin 0.05) (tstamp 3ec5d7e5-2e84-4992-90eb-8f058e008325))
  (pad "J4" smd circle (at -3.2 0.8) (size 0.4 0.4) (layers "F.Cu" "F.Paste" "F.Mask")
    (solder_mask_margin 0.05) (tstamp fd56933d-64b1-4c43-8a18-509213a77fa7))
  (pad "J5" smd circle (at -2.4 0.8) (size 0.4 0.4) (layers "F.Cu" "F.Paste" "F.Mask")
    (solder_mask_margin 0.05) (tstamp d7fc8b5a-d462-4a6c-927c-cb28679bfe88))
  (pad "J6" smd circle (at -1.6 0.8) (size 0.4 0.4) (layers "F.Cu" "F.Paste" "F.Mask")
    (solder_mask_margin 0.05) (tstamp 55e64358-bddb-406b-9559-8076ac5f8c39))
  (pad "J10" smd circle (at 1.6 0.8) (size 0.4 0.4) (layers "F.Cu" "F.Paste" "F.Mask")
    (solder_mask_margin 0.05) (tstamp a5aafab5-99ef-4fd9-8584-08b9663e42fd))
  (pad "J11" smd circle (at 2.4 0.8) (size 0.4 0.4) (layers "F.Cu" "F.Paste" "F.Mask")
    (solder_mask_margin 0.05) (tstamp c6a3eaba-b6be-4ad8-87ed-cb5e50e78619))
  (pad "J12" smd circle (at 3.2 0.8) (size 0.4 0.4) (layers "F.Cu" "F.Paste" "F.Mask")
    (solder_mask_margin 0.05) (tstamp 253fce40-c0d2-47f1-8fd3-abc1f38e8499))
  (pad "J13" smd circle (at 4 0.8) (size 0.4 0.4) (layers "F.Cu" "F.Paste" "F.Mask")
    (solder_mask_margin 0.05) (tstamp 0169a833-38dc-4513-b89a-f6d5c8f0e08f))
  (pad "J14" smd circle (at 4.8 0.8) (size 0.4 0.4) (layers "F.Cu" "F.Paste" "F.Mask")
    (solder_mask_margin 0.05) (tstamp 89da02b1-a003-4489-a12e-19463c3d4a78))
  (pad "J15" smd circle (at 5.6 0.8) (size 0.4 0.4) (layers "F.Cu" "F.Paste" "F.Mask")
    (solder_mask_margin 0.05) (tstamp fd3cc8c8-52e6-4b71-99e8-c7cb4c10165e))
  (pad "K1" smd circle (at -5.6 1.6) (size 0.4 0.4) (layers "F.Cu" "F.Paste" "F.Mask")
    (solder_mask_margin 0.05) (tstamp bfa49b37-f859-4d20-947d-7c430d6073a9))
  (pad "K2" smd circle (at -4.8 1.6) (size 0.4 0.4) (layers "F.Cu" "F.Paste" "F.Mask")
    (solder_mask_margin 0.05) (tstamp c4139784-5546-4ee6-b3a3-25e7cad10235))
  (pad "K3" smd circle (at -4 1.6) (size 0.4 0.4) (layers "F.Cu" "F.Paste" "F.Mask")
    (solder_mask_margin 0.05) (tstamp 8c20f5b0-0f30-4235-a6ad-c5371ae991d0))
  (pad "K4" smd circle (at -3.2 1.6) (size 0.4 0.4) (layers "F.Cu" "F.Paste" "F.Mask")
    (solder_mask_margin 0.05) (tstamp 8d32b518-52aa-4914-98aa-ac7547364da4))
  (pad "K5" smd circle (at -2.4 1.6) (size 0.4 0.4) (layers "F.Cu" "F.Paste" "F.Mask")
    (solder_mask_margin 0.05) (tstamp 69cda3fd-07ca-4bf3-a8e1-60798d14eefc))
  (pad "K6" smd circle (at -1.6 1.6) (size 0.4 0.4) (layers "F.Cu" "F.Paste" "F.Mask")
    (solder_mask_margin 0.05) (tstamp 0fa095ae-3bab-4b33-b2c1-099ba437597e))
  (pad "K7" smd circle (at -0.8 1.6) (size 0.4 0.4) (layers "F.Cu" "F.Paste" "F.Mask")
    (solder_mask_margin 0.05) (tstamp 23d67efc-92b0-4e8c-8755-d87d2aa20207))
  (pad "K8" smd circle (at 0 1.6) (size 0.4 0.4) (layers "F.Cu" "F.Paste" "F.Mask")
    (solder_mask_margin 0.05) (tstamp a60cea9d-236b-497e-9e67-2dbcac117a82))
  (pad "K9" smd circle (at 0.8 1.6) (size 0.4 0.4) (layers "F.Cu" "F.Paste" "F.Mask")
    (solder_mask_margin 0.05) (tstamp 9c31524f-fb76-4978-bcce-2bd7c8aa3959))
  (pad "K10" smd circle (at 1.6 1.6) (size 0.4 0.4) (layers "F.Cu" "F.Paste" "F.Mask")
    (solder_mask_margin 0.05) (tstamp d51d6e4e-feb7-4372-b5fb-0bb37b194004))
  (pad "K11" smd circle (at 2.4 1.6) (size 0.4 0.4) (layers "F.Cu" "F.Paste" "F.Mask")
    (solder_mask_margin 0.05) (tstamp bd00263a-542e-4192-8988-268bc8f72f43))
  (pad "K12" smd circle (at 3.2 1.6) (size 0.4 0.4) (layers "F.Cu" "F.Paste" "F.Mask")
    (solder_mask_margin 0.05) (tstamp 764ab1be-277e-4fa9-a7bf-55bbf3ef81c3))
  (pad "K13" smd circle (at 4 1.6) (size 0.4 0.4) (layers "F.Cu" "F.Paste" "F.Mask")
    (solder_mask_margin 0.05) (tstamp b9dc4862-68d2-40ed-ad7b-f7596e377669))
  (pad "K14" smd circle (at 4.8 1.6) (size 0.4 0.4) (layers "F.Cu" "F.Paste" "F.Mask")
    (solder_mask_margin 0.05) (tstamp 7d6869ce-0b46-485b-8e96-dd679883c3af))
  (pad "K15" smd circle (at 5.6 1.6) (size 0.4 0.4) (layers "F.Cu" "F.Paste" "F.Mask")
    (solder_mask_margin 0.05) (tstamp bbf37912-b114-47fa-8a99-02827936a659))
  (pad "L1" smd circle (at -5.6 2.4) (size 0.4 0.4) (layers "F.Cu" "F.Paste" "F.Mask")
    (solder_mask_margin 0.05) (tstamp 7c0a51ca-d68e-4478-99df-0130a49822c1))
  (pad "L2" smd circle (at -4.8 2.4) (size 0.4 0.4) (layers "F.Cu" "F.Paste" "F.Mask")
    (solder_mask_margin 0.05) (tstamp b48e3f48-382e-451a-8cbe-9111f4faa2be))
  (pad "L3" smd circle (at -4 2.4) (size 0.4 0.4) (layers "F.Cu" "F.Paste" "F.Mask")
    (solder_mask_margin 0.05) (tstamp 9fa0a7d5-69ed-4d3b-b857-f5b7858eaaa1))
  (pad "L4" smd circle (at -3.2 2.4) (size 0.4 0.4) (layers "F.Cu" "F.Paste" "F.Mask")
    (solder_mask_margin 0.05) (tstamp 580349a3-595e-4801-a7be-f20a8088d3f7))
  (pad "L5" smd circle (at -2.4 2.4) (size 0.4 0.4) (layers "F.Cu" "F.Paste" "F.Mask")
    (solder_mask_margin 0.05) (tstamp a9efdaf0-4423-4bf7-af18-898a44198111))
  (pad "L6" smd circle (at -1.6 2.4) (size 0.4 0.4) (layers "F.Cu" "F.Paste" "F.Mask")
    (solder_mask_margin 0.05) (tstamp eddd7ed9-d9e0-41a0-b796-acb609877e45))
  (pad "L7" smd circle (at -0.8 2.4) (size 0.4 0.4) (layers "F.Cu" "F.Paste" "F.Mask")
    (solder_mask_margin 0.05) (tstamp f4dbd369-8d4c-44a1-b512-042e891ec682))
  (pad "L8" smd circle (at 0 2.4) (size 0.4 0.4) (layers "F.Cu" "F.Paste" "F.Mask")
    (solder_mask_margin 0.05) (tstamp 8341cb6c-3445-469d-9879-3b340bfc933e))
  (pad "L9" smd circle (at 0.8 2.4) (size 0.4 0.4) (layers "F.Cu" "F.Paste" "F.Mask")
    (solder_mask_margin 0.05) (tstamp a34060f4-f18d-4605-8c4d-9e23a1ef3a7f))
  (pad "L10" smd circle (at 1.6 2.4) (size 0.4 0.4) (layers "F.Cu" "F.Paste" "F.Mask")
    (solder_mask_margin 0.05) (tstamp b1e4a6b5-943a-41ee-8a3e-6f0f07e12085))
  (pad "L11" smd circle (at 2.4 2.4) (size 0.4 0.4) (layers "F.Cu" "F.Paste" "F.Mask")
    (solder_mask_margin 0.05) (tstamp f4b4ce70-4782-47af-b294-b5cf48540feb))
  (pad "L12" smd circle (at 3.2 2.4) (size 0.4 0.4) (layers "F.Cu" "F.Paste" "F.Mask")
    (solder_mask_margin 0.05) (tstamp ae6ca11d-8712-43c8-b81f-7b0ac4472d08))
  (pad "L13" smd circle (at 4 2.4) (size 0.4 0.4) (layers "F.Cu" "F.Paste" "F.Mask")
    (solder_mask_margin 0.05) (tstamp 1b9ce0fe-a429-48ee-bf00-aa769629eb27))
  (pad "L14" smd circle (at 4.8 2.4) (size 0.4 0.4) (layers "F.Cu" "F.Paste" "F.Mask")
    (solder_mask_margin 0.05) (tstamp 20e7c5e2-e123-49bd-98ec-4a80e3cbc807))
  (pad "L15" smd circle (at 5.6 2.4) (size 0.4 0.4) (layers "F.Cu" "F.Paste" "F.Mask")
    (solder_mask_margin 0.05) (tstamp 5c177a8d-b4da-4cc0-915f-646e1af15646))
  (pad "M1" smd circle (at -5.6 3.2) (size 0.4 0.4) (layers "F.Cu" "F.Paste" "F.Mask")
    (solder_mask_margin 0.05) (tstamp 6cbf1d09-7b39-43a1-b4c7-f3a0cfebd11b))
  (pad "M2" smd circle (at -4.8 3.2) (size 0.4 0.4) (layers "F.Cu" "F.Paste" "F.Mask")
    (solder_mask_margin 0.05) (tstamp 5883d511-d102-4d84-ba96-2a370bcdbf72))
  (pad "M3" smd circle (at -4 3.2) (size 0.4 0.4) (layers "F.Cu" "F.Paste" "F.Mask")
    (solder_mask_margin 0.05) (tstamp 64ab204c-eff0-44cf-9c04-e5a05892b678))
  (pad "M4" smd circle (at -3.2 3.2) (size 0.4 0.4) (layers "F.Cu" "F.Paste" "F.Mask")
    (solder_mask_margin 0.05) (tstamp 145a4a4f-93fc-43dc-8272-93fd5659d0a0))
  (pad "M5" smd circle (at -2.4 3.2) (size 0.4 0.4) (layers "F.Cu" "F.Paste" "F.Mask")
    (solder_mask_margin 0.05) (tstamp d5cbfe99-3d51-44c9-8dcc-144fe477a3b1))
  (pad "M6" smd circle (at -1.6 3.2) (size 0.4 0.4) (layers "F.Cu" "F.Paste" "F.Mask")
    (solder_mask_margin 0.05) (tstamp 030ef8b6-9e94-4aa0-9df5-597c7b3c133b))
  (pad "M7" smd circle (at -0.8 3.2) (size 0.4 0.4) (layers "F.Cu" "F.Paste" "F.Mask")
    (solder_mask_margin 0.05) (tstamp 0ad80407-09f2-4523-80e1-90d684273de2))
  (pad "M8" smd circle (at 0 3.2) (size 0.4 0.4) (layers "F.Cu" "F.Paste" "F.Mask")
    (solder_mask_margin 0.05) (tstamp 350b5f6d-3788-4aac-8e23-df81363c02bf))
  (pad "M9" smd circle (at 0.8 3.2) (size 0.4 0.4) (layers "F.Cu" "F.Paste" "F.Mask")
    (solder_mask_margin 0.05) (tstamp d5d70335-843b-45d8-bacc-3a735c0a04a7))
  (pad "M10" smd circle (at 1.6 3.2) (size 0.4 0.4) (layers "F.Cu" "F.Paste" "F.Mask")
    (solder_mask_margin 0.05) (tstamp 59fe7ed5-09f4-4dc2-8e5d-2befcf3a6893))
  (pad "M11" smd circle (at 2.4 3.2) (size 0.4 0.4) (layers "F.Cu" "F.Paste" "F.Mask")
    (solder_mask_margin 0.05) (tstamp e3be300c-2ce7-4352-b35a-6aa0a1ab28c2))
  (pad "M12" smd circle (at 3.2 3.2) (size 0.4 0.4) (layers "F.Cu" "F.Paste" "F.Mask")
    (solder_mask_margin 0.05) (tstamp b42e204a-7490-4390-8a4b-33060da1d2e5))
  (pad "M13" smd circle (at 4 3.2) (size 0.4 0.4) (layers "F.Cu" "F.Paste" "F.Mask")
    (solder_mask_margin 0.05) (tstamp f0359f03-ebc6-4019-8aff-a266a61905dc))
  (pad "M14" smd circle (at 4.8 3.2) (size 0.4 0.4) (layers "F.Cu" "F.Paste" "F.Mask")
    (solder_mask_margin 0.05) (tstamp 0b60da83-3462-4c63-9e24-c3f7f822fc45))
  (pad "M15" smd circle (at 5.6 3.2) (size 0.4 0.4) (layers "F.Cu" "F.Paste" "F.Mask")
    (solder_mask_margin 0.05) (tstamp 08a0d05e-f95e-45a7-9313-048faa357221))
  (pad "N1" smd circle (at -5.6 4) (size 0.4 0.4) (layers "F.Cu" "F.Paste" "F.Mask")
    (solder_mask_margin 0.05) (tstamp 8243e384-a284-4ecf-a931-5a4eec5d5e6c))
  (pad "N2" smd circle (at -4.8 4) (size 0.4 0.4) (layers "F.Cu" "F.Paste" "F.Mask")
    (solder_mask_margin 0.05) (tstamp 146e1496-6f4d-4002-bdcc-6b8800176166))
  (pad "N3" smd circle (at -4 4) (size 0.4 0.4) (layers "F.Cu" "F.Paste" "F.Mask")
    (solder_mask_margin 0.05) (tstamp dd65bbf6-8a30-48e7-9324-3884eb8e3851))
  (pad "N4" smd circle (at -3.2 4) (size 0.4 0.4) (layers "F.Cu" "F.Paste" "F.Mask")
    (solder_mask_margin 0.05) (tstamp 5c454c5f-886d-4149-86ba-56e541940df1))
  (pad "N5" smd circle (at -2.4 4) (size 0.4 0.4) (layers "F.Cu" "F.Paste" "F.Mask")
    (solder_mask_margin 0.05) (tstamp de51a0b7-c0b4-405c-be5a-6c68998aaf34))
  (pad "N6" smd circle (at -1.6 4) (size 0.4 0.4) (layers "F.Cu" "F.Paste" "F.Mask")
    (solder_mask_margin 0.05) (tstamp 98465ff5-8102-48f8-8849-c1552c89f0cf))
  (pad "N7" smd circle (at -0.8 4) (size 0.4 0.4) (layers "F.Cu" "F.Paste" "F.Mask")
    (solder_mask_margin 0.05) (tstamp f0886d3f-837f-46e7-99c4-5ebe77300cfd))
  (pad "N8" smd circle (at 0 4) (size 0.4 0.4) (layers "F.Cu" "F.Paste" "F.Mask")
    (solder_mask_margin 0.05) (tstamp 6e49542a-e376-4620-a32c-eaf60fe1c302))
  (pad "N9" smd circle (at 0.8 4) (size 0.4 0.4) (layers "F.Cu" "F.Paste" "F.Mask")
    (solder_mask_margin 0.05) (tstamp aa4b86cb-17c7-474c-bfcd-d22e3091b6d4))
  (pad "N10" smd circle (at 1.6 4) (size 0.4 0.4) (layers "F.Cu" "F.Paste" "F.Mask")
    (solder_mask_margin 0.05) (tstamp f6f5215b-d11e-4617-a5f1-86531721b94d))
  (pad "N11" smd circle (at 2.4 4) (size 0.4 0.4) (layers "F.Cu" "F.Paste" "F.Mask")
    (solder_mask_margin 0.05) (tstamp ab62f184-d724-4806-ad35-c1dae3b6b58e))
  (pad "N12" smd circle (at 3.2 4) (size 0.4 0.4) (layers "F.Cu" "F.Paste" "F.Mask")
    (solder_mask_margin 0.05) (tstamp d771bdaf-893d-41e9-8260-894297d23533))
  (pad "N13" smd circle (at 4 4) (size 0.4 0.4) (layers "F.Cu" "F.Paste" "F.Mask")
    (solder_mask_margin 0.05) (tstamp 0674c4e1-efa7-4ddb-92c3-021f67f57865))
  (pad "N14" smd circle (at 4.8 4) (size 0.4 0.4) (layers "F.Cu" "F.Paste" "F.Mask")
    (solder_mask_margin 0.05) (tstamp 264c2a14-9f62-4bdf-8201-e37b9de693d4))
  (pad "N15" smd circle (at 5.6 4) (size 0.4 0.4) (layers "F.Cu" "F.Paste" "F.Mask")
    (solder_mask_margin 0.05) (tstamp 51a44b07-bbde-43ec-9d35-f4d0f434deeb))
  (pad "P1" smd circle (at -5.6 4.8) (size 0.4 0.4) (layers "F.Cu" "F.Paste" "F.Mask")
    (solder_mask_margin 0.05) (tstamp f3a759cb-56c2-449e-98fd-1bbe4f9c2025))
  (pad "P2" smd circle (at -4.8 4.8) (size 0.4 0.4) (layers "F.Cu" "F.Paste" "F.Mask")
    (solder_mask_margin 0.05) (tstamp 826251ae-1d7e-4bf3-92fc-f1b76bcc832f))
  (pad "P3" smd circle (at -4 4.8) (size 0.4 0.4) (layers "F.Cu" "F.Paste" "F.Mask")
    (solder_mask_margin 0.05) (tstamp ae0afbc2-75db-4962-88ed-fbab9f297221))
  (pad "P4" smd circle (at -3.2 4.8) (size 0.4 0.4) (layers "F.Cu" "F.Paste" "F.Mask")
    (solder_mask_margin 0.05) (tstamp cf44c1be-20be-4b61-86ff-d0ca0350590e))
  (pad "P5" smd circle (at -2.4 4.8) (size 0.4 0.4) (layers "F.Cu" "F.Paste" "F.Mask")
    (solder_mask_margin 0.05) (tstamp 11dc7931-f141-4242-95d5-a5349d2420ec))
  (pad "P6" smd circle (at -1.6 4.8) (size 0.4 0.4) (layers "F.Cu" "F.Paste" "F.Mask")
    (solder_mask_margin 0.05) (tstamp 5059fda1-e3dc-4bdb-8372-0d6614eb7846))
  (pad "P7" smd circle (at -0.8 4.8) (size 0.4 0.4) (layers "F.Cu" "F.Paste" "F.Mask")
    (solder_mask_margin 0.05) (tstamp cbdfd6bb-7fc6-47ca-b422-a3c359778027))
  (pad "P8" smd circle (at 0 4.8) (size 0.4 0.4) (layers "F.Cu" "F.Paste" "F.Mask")
    (solder_mask_margin 0.05) (tstamp e5f4186e-0974-42c1-a3ff-6fc3ccbe07f4))
  (pad "P9" smd circle (at 0.8 4.8) (size 0.4 0.4) (layers "F.Cu" "F.Paste" "F.Mask")
    (solder_mask_margin 0.05) (tstamp e865ed9d-fb7f-4922-b0c3-f46f42294e3b))
  (pad "P10" smd circle (at 1.6 4.8) (size 0.4 0.4) (layers "F.Cu" "F.Paste" "F.Mask")
    (solder_mask_margin 0.05) (tstamp 17e8c6a1-b8d9-4794-9739-b445ebc7a2b4))
  (pad "P11" smd circle (at 2.4 4.8) (size 0.4 0.4) (layers "F.Cu" "F.Paste" "F.Mask")
    (solder_mask_margin 0.05) (tstamp 38cacd01-2529-41b8-a2e9-45b1f1b39c83))
  (pad "P12" smd circle (at 3.2 4.8) (size 0.4 0.4) (layers "F.Cu" "F.Paste" "F.Mask")
    (solder_mask_margin 0.05) (tstamp 182b7c33-875b-4ab0-b5bf-6f240be62af3))
  (pad "P13" smd circle (at 4 4.8) (size 0.4 0.4) (layers "F.Cu" "F.Paste" "F.Mask")
    (solder_mask_margin 0.05) (tstamp 46aa1b5a-aedc-4adf-98fe-73ac3d8c2a53))
  (pad "P14" smd circle (at 4.8 4.8) (size 0.4 0.4) (layers "F.Cu" "F.Paste" "F.Mask")
    (solder_mask_margin 0.05) (tstamp 5577c4e3-5967-43dc-aa30-3f499b88aee1))
  (pad "P15" smd circle (at 5.6 4.8) (size 0.4 0.4) (layers "F.Cu" "F.Paste" "F.Mask")
    (solder_mask_margin 0.05) (tstamp 59efc77f-f5af-4caa-bb4e-cc7eed4a1fb9))
  (pad "R1" smd circle (at -5.6 5.6) (size 0.4 0.4) (layers "F.Cu" "F.Paste" "F.Mask")
    (solder_mask_margin 0.05) (tstamp 9982c374-69f1-42db-b0ff-2f8ceb20aeb8))
  (pad "R2" smd circle (at -4.8 5.6) (size 0.4 0.4) (layers "F.Cu" "F.Paste" "F.Mask")
    (solder_mask_margin 0.05) (tstamp 564d1dd7-d7e5-4096-b669-b84913a8ade7))
  (pad "R3" smd circle (at -4 5.6) (size 0.4 0.4) (layers "F.Cu" "F.Paste" "F.Mask")
    (solder_mask_margin 0.05) (tstamp f00e82f8-1210-4475-b2a6-f01f0d14a84e))
  (pad "R4" smd circle (at -3.2 5.6) (size 0.4 0.4) (layers "F.Cu" "F.Paste" "F.Mask")
    (solder_mask_margin 0.05) (tstamp 6b59fdd6-d98e-4325-86d3-aaba0cd892d1))
  (pad "R5" smd circle (at -2.4 5.6) (size 0.4 0.4) (layers "F.Cu" "F.Paste" "F.Mask")
    (solder_mask_margin 0.05) (tstamp 02ba19ab-3935-481e-86d7-24f955bf6e57))
  (pad "R6" smd circle (at -1.6 5.6) (size 0.4 0.4) (layers "F.Cu" "F.Paste" "F.Mask")
    (solder_mask_margin 0.05) (tstamp 1eed43c1-1b26-411c-bd2c-43d735e877b1))
  (pad "R7" smd circle (at -0.8 5.6) (size 0.4 0.4) (layers "F.Cu" "F.Paste" "F.Mask")
    (solder_mask_margin 0.05) (tstamp c07c0aec-f007-459e-9bb0-43ed212371a4))
  (pad "R8" smd circle (at 0 5.6) (size 0.4 0.4) (layers "F.Cu" "F.Paste" "F.Mask")
    (solder_mask_margin 0.05) (tstamp 2f15ed01-b25c-4b8a-8b4f-145108ac3973))
  (pad "R9" smd circle (at 0.8 5.6) (size 0.4 0.4) (layers "F.Cu" "F.Paste" "F.Mask")
    (solder_mask_margin 0.05) (tstamp 7c5671bc-8252-4166-886f-a7feaa710656))
  (pad "R10" smd circle (at 1.6 5.6) (size 0.4 0.4) (layers "F.Cu" "F.Paste" "F.Mask")
    (solder_mask_margin 0.05) (tstamp fcb8fa00-26ec-4bda-8cb6-1f04075e6642))
  (pad "R11" smd circle (at 2.4 5.6) (size 0.4 0.4) (layers "F.Cu" "F.Paste" "F.Mask")
    (solder_mask_margin 0.05) (tstamp d3ec8af0-ba57-4371-b00a-88510bc30745))
  (pad "R12" smd circle (at 3.2 5.6) (size 0.4 0.4) (layers "F.Cu" "F.Paste" "F.Mask")
    (solder_mask_margin 0.05) (tstamp 3f8ded7f-2ebb-4832-8400-f1751220454b))
  (pad "R13" smd circle (at 4 5.6) (size 0.4 0.4) (layers "F.Cu" "F.Paste" "F.Mask")
    (solder_mask_margin 0.05) (tstamp e5c1d444-61d7-4dcc-b8b3-b1fa314f0f19))
  (pad "R14" smd circle (at 4.8 5.6) (size 0.4 0.4) (layers "F.Cu" "F.Paste" "F.Mask")
    (solder_mask_margin 0.05) (tstamp a38035ca-fb09-43f0-bbfe-007bb75f1660))
  (pad "R15" smd circle (at 5.6 5.6) (size 0.4 0.4) (layers "F.Cu" "F.Paste" "F.Mask")
    (solder_mask_margin 0.05) (tstamp a607fdbe-2fb8-472b-8192-f40f2a036218))
  (model "${KICADLIB}/model/BGA/BGA216N80P15X15_1300X1300X110.step"
    (offset (xyz 0 0 0))
    (scale (xyz 1 1 1))
    (rotate (xyz 0 0 0))
  )
)
