(footprint "PinHeader_2x09_P2.54mm_Vertical" (version 20211014) (generator pcbnew)
  (layer "F.Cu")
  (tedit 6116C8F0)
  (descr "Through hole straight pin header, 2x09, 2.54mm pitch, double rows")
  (tags "Through hole pin header THT 2x09 2.54mm double row")
  (attr through_hole)
  (fp_text reference "REF**" (at 1.27 -2.33) (layer "F.SilkS")
    (effects (font (size 1 1) (thickness 0.15)))
    (tstamp 55eddb0e-c43b-4c0e-b888-d065f8cf8c79)
  )
  (fp_text value "PinHeader_2x09_P2.54mm_Vertical" (at 1.27 22.65) (layer "F.Fab") hide
    (effects (font (size 1 1) (thickness 0.15)))
    (tstamp cff8d948-0072-4bff-a76f-38fa8967c123)
  )
  (fp_text user "${REFERENCE}" (at 1.27 10.16 90) (layer "F.Fab")
    (effects (font (size 1 1) (thickness 0.15)))
    (tstamp 9ed24b26-2bac-4fbf-a836-77c6f99596e8)
  )
  (fp_line (start -1.33 0) (end -1.33 -1.33) (layer "F.SilkS") (width 0.12) (tstamp 0d39b1a1-d121-4a2e-b920-bb29f6bf6523))
  (fp_line (start 1.27 -1.33) (end 3.87 -1.33) (layer "F.SilkS") (width 0.12) (tstamp 4d7e2cb7-e210-45b5-97c9-7bfe64b817e9))
  (fp_line (start -1.33 -1.33) (end 0 -1.33) (layer "F.SilkS") (width 0.12) (tstamp 63145bfa-c3f9-42eb-8586-08bcb98a6343))
  (fp_line (start -1.33 1.27) (end -1.33 21.65) (layer "F.SilkS") (width 0.12) (tstamp 6f901b9b-d8e2-468e-80cf-9c5b099ec8b1))
  (fp_line (start -1.33 1.27) (end 1.27 1.27) (layer "F.SilkS") (width 0.12) (tstamp 9832ef3e-f605-4dbc-af4c-f5763365d7e0))
  (fp_line (start 3.87 -1.33) (end 3.87 21.65) (layer "F.SilkS") (width 0.12) (tstamp b9ca3317-eaa6-41e0-b6c5-9cba5bb4902c))
  (fp_line (start 1.27 1.27) (end 1.27 -1.33) (layer "F.SilkS") (width 0.12) (tstamp dc967293-3337-4760-9da7-961b1f8dc35c))
  (fp_line (start -1.33 21.65) (end 3.87 21.65) (layer "F.SilkS") (width 0.12) (tstamp ee076ff1-7788-427d-ac1b-cc6519a45fef))
  (fp_line (start -1.8 -1.8) (end -1.8 22.1) (layer "F.CrtYd") (width 0.05) (tstamp 0ff93887-034a-4007-910f-aefaea794560))
  (fp_line (start 4.35 22.1) (end 4.35 -1.8) (layer "F.CrtYd") (width 0.05) (tstamp 249d94bd-d0f9-42ad-9d7c-125b6a4e7fd9))
  (fp_line (start 4.35 -1.8) (end -1.8 -1.8) (layer "F.CrtYd") (width 0.05) (tstamp 6330c639-d9e5-4a8f-a69d-9edffe22474a))
  (fp_line (start -1.8 22.1) (end 4.35 22.1) (layer "F.CrtYd") (width 0.05) (tstamp 99d444c3-6977-4ff5-ad6b-5d495fbcc749))
  (fp_line (start 3.81 21.59) (end -1.27 21.59) (layer "F.Fab") (width 0.1) (tstamp 16586c76-d397-458a-ab5b-737ab825f0ae))
  (fp_line (start 3.81 -1.27) (end 3.81 21.59) (layer "F.Fab") (width 0.1) (tstamp 1bca02bd-94c9-49f7-9f0c-e95cad841124))
  (fp_line (start -1.27 21.59) (end -1.27 0) (layer "F.Fab") (width 0.1) (tstamp 45b8fb50-2841-4eec-b8d9-3de4bbf3a5af))
  (fp_line (start 0 -1.27) (end 3.81 -1.27) (layer "F.Fab") (width 0.1) (tstamp 6ffe43a6-af26-4d44-bdc9-4da640a9cfe8))
  (fp_line (start -1.27 0) (end 0 -1.27) (layer "F.Fab") (width 0.1) (tstamp b4043df8-27dd-4cb1-8756-5e917383884f))
  (pad "1" thru_hole rect (at 0 0) (size 1.7 1.7) (drill 1) (layers *.Cu *.Mask) (tstamp 18b6463b-f51a-4e9a-bb81-51561fecf4a6))
  (pad "2" thru_hole oval (at 2.54 0) (size 1.7 1.7) (drill 1) (layers *.Cu *.Mask) (tstamp 01bc7362-09dd-49a6-9c9c-47bc3cf3f829))
  (pad "3" thru_hole oval (at 0 2.54) (size 1.7 1.7) (drill 1) (layers *.Cu *.Mask) (tstamp d749091e-cb08-4d85-acec-746b8ea2d5d9))
  (pad "4" thru_hole oval (at 2.54 2.54) (size 1.7 1.7) (drill 1) (layers *.Cu *.Mask) (tstamp d9a5d4a8-9849-4957-9e47-f93ee6a65e03))
  (pad "5" thru_hole oval (at 0 5.08) (size 1.7 1.7) (drill 1) (layers *.Cu *.Mask) (tstamp ec3bfd10-d2b5-44f7-b4f0-2d8a413ded77))
  (pad "6" thru_hole oval (at 2.54 5.08) (size 1.7 1.7) (drill 1) (layers *.Cu *.Mask) (tstamp 2ba7be73-6103-4770-90c7-894941da21a6))
  (pad "7" thru_hole oval (at 0 7.62) (size 1.7 1.7) (drill 1) (layers *.Cu *.Mask) (tstamp 4ea51da1-9d13-49c1-acaa-1ec1f95bd5a4))
  (pad "8" thru_hole oval (at 2.54 7.62) (size 1.7 1.7) (drill 1) (layers *.Cu *.Mask) (tstamp 4df2d949-ee42-4d45-85ac-2614da0ffd05))
  (pad "9" thru_hole oval (at 0 10.16) (size 1.7 1.7) (drill 1) (layers *.Cu *.Mask) (tstamp 59962772-7e57-4e9d-9684-c2cfc0515283))
  (pad "10" thru_hole oval (at 2.54 10.16) (size 1.7 1.7) (drill 1) (layers *.Cu *.Mask) (tstamp 8a4a118c-096b-4585-bea9-aaf4ecac2953))
  (pad "11" thru_hole oval (at 0 12.7) (size 1.7 1.7) (drill 1) (layers *.Cu *.Mask) (tstamp 0842e409-fb8f-4986-8d8a-64db2c9f3b89))
  (pad "12" thru_hole oval (at 2.54 12.7) (size 1.7 1.7) (drill 1) (layers *.Cu *.Mask) (tstamp 69e96599-959b-4042-8c38-eea610641225))
  (pad "13" thru_hole oval (at 0 15.24) (size 1.7 1.7) (drill 1) (layers *.Cu *.Mask) (tstamp 2a991a5c-2e16-43b1-af74-748ed2afb802))
  (pad "14" thru_hole oval (at 2.54 15.24) (size 1.7 1.7) (drill 1) (layers *.Cu *.Mask) (tstamp 9c1cac1b-2775-4941-bc6a-137023a77a34))
  (pad "15" thru_hole oval (at 0 17.78) (size 1.7 1.7) (drill 1) (layers *.Cu *.Mask) (tstamp 23269ed8-d067-4f2f-a127-2c019426f70b))
  (pad "16" thru_hole oval (at 2.54 17.78) (size 1.7 1.7) (drill 1) (layers *.Cu *.Mask) (tstamp d84612c8-e3a7-49bf-8bbe-1e68eb50d979))
  (pad "17" thru_hole oval (at 0 20.32) (size 1.7 1.7) (drill 1) (layers *.Cu *.Mask) (tstamp a5833f39-9bee-4b08-8651-08b9c8af1faf))
  (pad "18" thru_hole oval (at 2.54 20.32) (size 1.7 1.7) (drill 1) (layers *.Cu *.Mask) (tstamp 88fb7cec-1be7-4873-ad01-31c1859d9dbf))
  (model "${KICADLIB}/model/connector/PinHeader_2x09_P2.54mm_Vertical.step"
    (offset (xyz 0 0 0))
    (scale (xyz 1 1 1))
    (rotate (xyz 0 0 0))
  )
)
