(module "SOT-543" (layer F.Cu) (tedit 5EBAFE43)
  (descr "SOT-543 4 lead surface package")
  (tags "SOT-543 SC-107A EMD4")
  (attr smd)
  (fp_text reference "REF**" (at 0 -1.6) (layer F.SilkS)
    (effects (font (size 1 1) (thickness 0.15)))
  )
  (fp_text value "SOT-543" (at 0 1.7) (layer F.Fab) hide
    (effects (font (size 1 1) (thickness 0.15)))
  )
  (fp_text user "${REFERENCE}" (at 0 0 90) (layer F.Fab)
    (effects (font (size 0.3 0.3) (thickness 0.065)))
  )
  (fp_text user "^" (at -1 -1.4 180 unlocked) (layer F.SilkS)
    (effects (font (size 1 1) (thickness 0.15)))
  )
  (fp_line (start -1.05 -0.9) (end -1.05 0.9) (layer F.CrtYd) (width 0.05))
  (fp_line (start -1.05 -0.9) (end 1.05 -0.9) (layer F.CrtYd) (width 0.05))
  (fp_line (start 0.5 0.8) (end -0.5 0.8) (layer F.SilkS) (width 0.1))
  (fp_line (start 1.05 0.9) (end -1.05 0.9) (layer F.CrtYd) (width 0.05))
  (fp_line (start 1.05 0.9) (end 1.05 -0.9) (layer F.CrtYd) (width 0.05))
  (fp_line (start 0.5 -0.8) (end -0.5 -0.8) (layer F.SilkS) (width 0.1))
  (fp_line (start -0.5 0.8) (end 0.5 0.8) (layer F.Fab) (width 0.1))
  (fp_line (start 0.5 0.8) (end 0.5 -0.8) (layer F.Fab) (width 0.1))
  (fp_line (start 0.5 -0.8) (end -0.25 -0.8) (layer F.Fab) (width 0.1))
  (fp_line (start -0.25 -0.8) (end -0.5 -0.55) (layer F.Fab) (width 0.1))
  (fp_line (start -0.5 -0.55) (end -0.5 0.8) (layer F.Fab) (width 0.1))
  (pad "1" smd rect (at -0.72 -0.5 270) (size 0.27 0.55) (layers "F.Cu" "F.Paste" "F.Mask") (tstamp b8c658a6-0196-4106-915e-114de1f7e867))
  (pad "2" smd rect (at -0.72 0.5 270) (size 0.27 0.55) (layers "F.Cu" "F.Paste" "F.Mask") (tstamp 0030f657-f317-4954-a0b3-3b18a805f48b))
  (pad "3" smd rect (at 0.72 0.5 270) (size 0.27 0.55) (layers "F.Cu" "F.Paste" "F.Mask") (tstamp 24a3ce0d-1d74-4b55-a263-8611644810f7))
  (pad "4" smd rect (at 0.72 -0.5 270) (size 0.27 0.55) (layers "F.Cu" "F.Paste" "F.Mask") (tstamp ea9a8054-9569-4284-9448-f2cd19a2412c))
  (model "${KICADLIB}/model/SOT/SOT-543.step"
    (at (xyz 0 0 0))
    (scale (xyz 1 1 1))
    (rotate (xyz 0 0 0))
  )
)
