(footprint "PinHeader_1x20_P2.54mm_Vertical" (version 20211014) (generator pcbnew)
  (layer "F.Cu")
  (tedit 6116C850)
  (descr "Through hole straight pin header, 1x20, 2.54mm pitch, single row")
  (tags "Through hole pin header THT 1x20 2.54mm single row")
  (attr through_hole)
  (fp_text reference "REF**" (at 0 -2.33) (layer "F.SilkS")
    (effects (font (size 1 1) (thickness 0.15)))
    (tstamp 283557a4-bf25-4ca0-84da-fcb964935d73)
  )
  (fp_text value "PinHeader_1x20_P2.54mm_Vertical" (at 0 50.59) (layer "F.Fab") hide
    (effects (font (size 1 1) (thickness 0.15)))
    (tstamp 53336168-bf38-40dd-a14f-2d1dcaa49abb)
  )
  (fp_text user "${REFERENCE}" (at 0 24.13 90) (layer "F.Fab")
    (effects (font (size 1 1) (thickness 0.15)))
    (tstamp 0ad2b98d-8393-47f2-af96-c0538c827e0c)
  )
  (fp_line (start -1.33 -1.33) (end 0 -1.33) (layer "F.SilkS") (width 0.12) (tstamp 19d0e9c0-d7bb-451d-9fe5-100f410a6326))
  (fp_line (start 1.33 1.27) (end 1.33 49.59) (layer "F.SilkS") (width 0.12) (tstamp 360197bf-d24a-4f0d-a8b0-fcc1491f87f8))
  (fp_line (start -1.33 0) (end -1.33 -1.33) (layer "F.SilkS") (width 0.12) (tstamp 3c7f425f-ef89-4725-adce-1f4b963d0f4a))
  (fp_line (start -1.33 49.59) (end 1.33 49.59) (layer "F.SilkS") (width 0.12) (tstamp 5a2f08f1-2742-4a1e-b25c-57c41d48f043))
  (fp_line (start -1.33 1.27) (end 1.33 1.27) (layer "F.SilkS") (width 0.12) (tstamp a2f4e2d8-e3dd-42a0-926f-3da21953c2fb))
  (fp_line (start -1.33 1.27) (end -1.33 49.59) (layer "F.SilkS") (width 0.12) (tstamp aa758cba-2301-44e9-a3c8-67f72b44b951))
  (fp_line (start -1.8 50.05) (end 1.8 50.05) (layer "F.CrtYd") (width 0.05) (tstamp 27cd9a6e-1a7f-4ad8-a345-ef9740ae7fa3))
  (fp_line (start 1.8 50.05) (end 1.8 -1.8) (layer "F.CrtYd") (width 0.05) (tstamp 3f7818d2-ed09-4705-b1e1-395f412b7c0d))
  (fp_line (start -1.8 -1.8) (end -1.8 50.05) (layer "F.CrtYd") (width 0.05) (tstamp 93f1cc54-173d-4aa7-89e2-18fc5ad36180))
  (fp_line (start 1.8 -1.8) (end -1.8 -1.8) (layer "F.CrtYd") (width 0.05) (tstamp e59d5c2e-92fe-424c-89e7-5ab7db23acf8))
  (fp_line (start 1.27 49.53) (end -1.27 49.53) (layer "F.Fab") (width 0.1) (tstamp 187cebb9-924f-425e-b16e-87eda66bc5e9))
  (fp_line (start -0.635 -1.27) (end 1.27 -1.27) (layer "F.Fab") (width 0.1) (tstamp 3f2c4828-cb6a-43f1-a91f-5e6389ad93f3))
  (fp_line (start 1.27 -1.27) (end 1.27 49.53) (layer "F.Fab") (width 0.1) (tstamp 57f62407-d130-446f-82c5-0ce211f05129))
  (fp_line (start -1.27 -0.635) (end -0.635 -1.27) (layer "F.Fab") (width 0.1) (tstamp 9f654a41-c11b-41fe-8a52-f5148df7a3be))
  (fp_line (start -1.27 49.53) (end -1.27 -0.635) (layer "F.Fab") (width 0.1) (tstamp a9cb0dec-0405-4a6b-8041-4993d3b3b426))
  (pad "1" thru_hole rect (at 0 0) (size 1.7 1.7) (drill 1) (layers *.Cu *.Mask) (tstamp 8496f61d-9b67-4e40-a39f-bb2eac09c102))
  (pad "2" thru_hole oval (at 0 2.54) (size 1.7 1.7) (drill 1) (layers *.Cu *.Mask) (tstamp 46433c4a-a03c-49b9-82ec-b44787469f1a))
  (pad "3" thru_hole oval (at 0 5.08) (size 1.7 1.7) (drill 1) (layers *.Cu *.Mask) (tstamp 95563f26-f551-4425-924d-b7c07dc5ec07))
  (pad "4" thru_hole oval (at 0 7.62) (size 1.7 1.7) (drill 1) (layers *.Cu *.Mask) (tstamp 1fa84d66-c574-43b3-9d46-865839491582))
  (pad "5" thru_hole oval (at 0 10.16) (size 1.7 1.7) (drill 1) (layers *.Cu *.Mask) (tstamp 8d91c5c5-aabd-471f-8822-40d618525031))
  (pad "6" thru_hole oval (at 0 12.7) (size 1.7 1.7) (drill 1) (layers *.Cu *.Mask) (tstamp ddb3e0e6-2413-4304-a862-6a148085ffd2))
  (pad "7" thru_hole oval (at 0 15.24) (size 1.7 1.7) (drill 1) (layers *.Cu *.Mask) (tstamp a9b4e2a3-1255-404a-99c9-46823644fb24))
  (pad "8" thru_hole oval (at 0 17.78) (size 1.7 1.7) (drill 1) (layers *.Cu *.Mask) (tstamp d082c771-73f3-406d-9f17-0aac44a9642b))
  (pad "9" thru_hole oval (at 0 20.32) (size 1.7 1.7) (drill 1) (layers *.Cu *.Mask) (tstamp f1f76814-404c-4fa4-8272-490ab8baec1a))
  (pad "10" thru_hole oval (at 0 22.86) (size 1.7 1.7) (drill 1) (layers *.Cu *.Mask) (tstamp 78c4f9fd-84fe-40a8-862d-ddba5bb2e7f3))
  (pad "11" thru_hole oval (at 0 25.4) (size 1.7 1.7) (drill 1) (layers *.Cu *.Mask) (tstamp 486ed672-e669-4721-94da-eb15d0d455b3))
  (pad "12" thru_hole oval (at 0 27.94) (size 1.7 1.7) (drill 1) (layers *.Cu *.Mask) (tstamp f67ad9a3-29fd-4e0a-a687-ea93f2d1424c))
  (pad "13" thru_hole oval (at 0 30.48) (size 1.7 1.7) (drill 1) (layers *.Cu *.Mask) (tstamp 3af7c11a-05b3-4503-b6a6-3cad8a34f11e))
  (pad "14" thru_hole oval (at 0 33.02) (size 1.7 1.7) (drill 1) (layers *.Cu *.Mask) (tstamp eea62e2c-38b0-4463-911c-8e821e46b0ed))
  (pad "15" thru_hole oval (at 0 35.56) (size 1.7 1.7) (drill 1) (layers *.Cu *.Mask) (tstamp 0696e1ed-3a65-4e5f-b845-a068baeee4b5))
  (pad "16" thru_hole oval (at 0 38.1) (size 1.7 1.7) (drill 1) (layers *.Cu *.Mask) (tstamp 758f5558-7dc1-47b3-a84b-2be7415df040))
  (pad "17" thru_hole oval (at 0 40.64) (size 1.7 1.7) (drill 1) (layers *.Cu *.Mask) (tstamp 440f4f56-dcbe-4dc3-9d01-85a613c9e58c))
  (pad "18" thru_hole oval (at 0 43.18) (size 1.7 1.7) (drill 1) (layers *.Cu *.Mask) (tstamp 358ab7f2-1475-4245-a812-053ad1912cb3))
  (pad "19" thru_hole oval (at 0 45.72) (size 1.7 1.7) (drill 1) (layers *.Cu *.Mask) (tstamp 5f848d9e-261c-4388-a8d7-cc7ff4b6f894))
  (pad "20" thru_hole oval (at 0 48.26) (size 1.7 1.7) (drill 1) (layers *.Cu *.Mask) (tstamp eaf8e392-a77f-4e12-a362-1aa2435155b0))
  (model "${KICADLIB}/model/connector/PinHeader_1x20_P2.54mm_Vertical.step"
    (offset (xyz 0 0 0))
    (scale (xyz 1 1 1))
    (rotate (xyz 0 0 0))
  )
)
