(module "CAPPR750-1800X1600" (layer F.Cu) (tedit 5EBAD60D)
  (descr "CP, Radial series, Radial, pin pitch=7.50mm, , diameter=18mm, Electrolytic Capacitor")
  (tags "CP Radial series Radial pin pitch 7.50mm  diameter 18mm Electrolytic Capacitor")
  (fp_text reference "REF**" (at 3.75 -10.25) (layer F.SilkS)
    (effects (font (size 1 1) (thickness 0.15)))
  )
  (fp_text value "CAPPR750-1800X1600" (at 3.75 10.25) (layer F.Fab) hide
    (effects (font (size 1 1) (thickness 0.15)))
  )
  (fp_circle (center 3.75 0) (end 12.75 0) (layer F.Fab) (width 0.1))
  (fp_circle (center 3.75 0) (end 12.87 0) (layer F.SilkS) (width 0.12))
  (fp_circle (center 3.75 0) (end 13 0) (layer F.CrtYd) (width 0.05))
  (fp_line (start -3.987271 -3.9475) (end -2.187271 -3.9475) (layer F.Fab) (width 0.1))
  (fp_line (start -3.087271 -4.8475) (end -3.087271 -3.0475) (layer F.Fab) (width 0.1))
  (fp_line (start 3.75 -9.081) (end 3.75 9.081) (layer F.SilkS) (width 0.12))
  (fp_line (start 3.79 -9.08) (end 3.79 9.08) (layer F.SilkS) (width 0.12))
  (fp_line (start 3.83 -9.08) (end 3.83 9.08) (layer F.SilkS) (width 0.12))
  (fp_line (start 3.87 -9.08) (end 3.87 9.08) (layer F.SilkS) (width 0.12))
  (fp_line (start 3.91 -9.079) (end 3.91 9.079) (layer F.SilkS) (width 0.12))
  (fp_line (start 3.95 -9.078) (end 3.95 9.078) (layer F.SilkS) (width 0.12))
  (fp_line (start 3.99 -9.077) (end 3.99 9.077) (layer F.SilkS) (width 0.12))
  (fp_line (start 4.03 -9.076) (end 4.03 9.076) (layer F.SilkS) (width 0.12))
  (fp_line (start 4.07 -9.075) (end 4.07 9.075) (layer F.SilkS) (width 0.12))
  (fp_line (start 4.11 -9.073) (end 4.11 9.073) (layer F.SilkS) (width 0.12))
  (fp_line (start 4.15 -9.072) (end 4.15 9.072) (layer F.SilkS) (width 0.12))
  (fp_line (start 4.19 -9.07) (end 4.19 9.07) (layer F.SilkS) (width 0.12))
  (fp_line (start 4.23 -9.068) (end 4.23 9.068) (layer F.SilkS) (width 0.12))
  (fp_line (start 4.27 -9.066) (end 4.27 9.066) (layer F.SilkS) (width 0.12))
  (fp_line (start 4.31 -9.063) (end 4.31 9.063) (layer F.SilkS) (width 0.12))
  (fp_line (start 4.35 -9.061) (end 4.35 9.061) (layer F.SilkS) (width 0.12))
  (fp_line (start 4.39 -9.058) (end 4.39 9.058) (layer F.SilkS) (width 0.12))
  (fp_line (start 4.43 -9.055) (end 4.43 9.055) (layer F.SilkS) (width 0.12))
  (fp_line (start 4.471 -9.052) (end 4.471 9.052) (layer F.SilkS) (width 0.12))
  (fp_line (start 4.511 -9.049) (end 4.511 9.049) (layer F.SilkS) (width 0.12))
  (fp_line (start 4.551 -9.045) (end 4.551 9.045) (layer F.SilkS) (width 0.12))
  (fp_line (start 4.591 -9.042) (end 4.591 9.042) (layer F.SilkS) (width 0.12))
  (fp_line (start 4.631 -9.038) (end 4.631 9.038) (layer F.SilkS) (width 0.12))
  (fp_line (start 4.671 -9.034) (end 4.671 9.034) (layer F.SilkS) (width 0.12))
  (fp_line (start 4.711 -9.03) (end 4.711 9.03) (layer F.SilkS) (width 0.12))
  (fp_line (start 4.751 -9.026) (end 4.751 9.026) (layer F.SilkS) (width 0.12))
  (fp_line (start 4.791 -9.021) (end 4.791 9.021) (layer F.SilkS) (width 0.12))
  (fp_line (start 4.831 -9.016) (end 4.831 9.016) (layer F.SilkS) (width 0.12))
  (fp_line (start 4.871 -9.011) (end 4.871 9.011) (layer F.SilkS) (width 0.12))
  (fp_line (start 4.911 -9.006) (end 4.911 9.006) (layer F.SilkS) (width 0.12))
  (fp_line (start 4.951 -9.001) (end 4.951 9.001) (layer F.SilkS) (width 0.12))
  (fp_line (start 4.991 -8.996) (end 4.991 8.996) (layer F.SilkS) (width 0.12))
  (fp_line (start 5.031 -8.99) (end 5.031 8.99) (layer F.SilkS) (width 0.12))
  (fp_line (start 5.071 -8.984) (end 5.071 8.984) (layer F.SilkS) (width 0.12))
  (fp_line (start 5.111 -8.979) (end 5.111 8.979) (layer F.SilkS) (width 0.12))
  (fp_line (start 5.151 -8.972) (end 5.151 8.972) (layer F.SilkS) (width 0.12))
  (fp_line (start 5.191 -8.966) (end 5.191 8.966) (layer F.SilkS) (width 0.12))
  (fp_line (start 5.231 -8.96) (end 5.231 8.96) (layer F.SilkS) (width 0.12))
  (fp_line (start 5.271 -8.953) (end 5.271 8.953) (layer F.SilkS) (width 0.12))
  (fp_line (start 5.311 -8.946) (end 5.311 8.946) (layer F.SilkS) (width 0.12))
  (fp_line (start 5.351 -8.939) (end 5.351 8.939) (layer F.SilkS) (width 0.12))
  (fp_line (start 5.391 -8.932) (end 5.391 8.932) (layer F.SilkS) (width 0.12))
  (fp_line (start 5.431 -8.924) (end 5.431 8.924) (layer F.SilkS) (width 0.12))
  (fp_line (start 5.471 -8.917) (end 5.471 8.917) (layer F.SilkS) (width 0.12))
  (fp_line (start 5.511 -8.909) (end 5.511 8.909) (layer F.SilkS) (width 0.12))
  (fp_line (start 5.551 -8.901) (end 5.551 8.901) (layer F.SilkS) (width 0.12))
  (fp_line (start 5.591 -8.893) (end 5.591 8.893) (layer F.SilkS) (width 0.12))
  (fp_line (start 5.631 -8.885) (end 5.631 8.885) (layer F.SilkS) (width 0.12))
  (fp_line (start 5.671 -8.876) (end 5.671 8.876) (layer F.SilkS) (width 0.12))
  (fp_line (start 5.711 -8.867) (end 5.711 8.867) (layer F.SilkS) (width 0.12))
  (fp_line (start 5.751 -8.858) (end 5.751 8.858) (layer F.SilkS) (width 0.12))
  (fp_line (start 5.791 -8.849) (end 5.791 8.849) (layer F.SilkS) (width 0.12))
  (fp_line (start 5.831 -8.84) (end 5.831 8.84) (layer F.SilkS) (width 0.12))
  (fp_line (start 5.871 -8.831) (end 5.871 8.831) (layer F.SilkS) (width 0.12))
  (fp_line (start 5.911 -8.821) (end 5.911 8.821) (layer F.SilkS) (width 0.12))
  (fp_line (start 5.951 -8.811) (end 5.951 8.811) (layer F.SilkS) (width 0.12))
  (fp_line (start 5.991 -8.801) (end 5.991 8.801) (layer F.SilkS) (width 0.12))
  (fp_line (start 6.031 -8.791) (end 6.031 8.791) (layer F.SilkS) (width 0.12))
  (fp_line (start 6.071 -8.78) (end 6.071 -1.44) (layer F.SilkS) (width 0.12))
  (fp_line (start 6.071 1.44) (end 6.071 8.78) (layer F.SilkS) (width 0.12))
  (fp_line (start 6.111 -8.77) (end 6.111 -1.44) (layer F.SilkS) (width 0.12))
  (fp_line (start 6.111 1.44) (end 6.111 8.77) (layer F.SilkS) (width 0.12))
  (fp_line (start 6.151 -8.759) (end 6.151 -1.44) (layer F.SilkS) (width 0.12))
  (fp_line (start 6.151 1.44) (end 6.151 8.759) (layer F.SilkS) (width 0.12))
  (fp_line (start 6.191 -8.748) (end 6.191 -1.44) (layer F.SilkS) (width 0.12))
  (fp_line (start 6.191 1.44) (end 6.191 8.748) (layer F.SilkS) (width 0.12))
  (fp_line (start 6.231 -8.737) (end 6.231 -1.44) (layer F.SilkS) (width 0.12))
  (fp_line (start 6.231 1.44) (end 6.231 8.737) (layer F.SilkS) (width 0.12))
  (fp_line (start 6.271 -8.725) (end 6.271 -1.44) (layer F.SilkS) (width 0.12))
  (fp_line (start 6.271 1.44) (end 6.271 8.725) (layer F.SilkS) (width 0.12))
  (fp_line (start 6.311 -8.714) (end 6.311 -1.44) (layer F.SilkS) (width 0.12))
  (fp_line (start 6.311 1.44) (end 6.311 8.714) (layer F.SilkS) (width 0.12))
  (fp_line (start 6.351 -8.702) (end 6.351 -1.44) (layer F.SilkS) (width 0.12))
  (fp_line (start 6.351 1.44) (end 6.351 8.702) (layer F.SilkS) (width 0.12))
  (fp_line (start 6.391 -8.69) (end 6.391 -1.44) (layer F.SilkS) (width 0.12))
  (fp_line (start 6.391 1.44) (end 6.391 8.69) (layer F.SilkS) (width 0.12))
  (fp_line (start 6.431 -8.678) (end 6.431 -1.44) (layer F.SilkS) (width 0.12))
  (fp_line (start 6.431 1.44) (end 6.431 8.678) (layer F.SilkS) (width 0.12))
  (fp_line (start 6.471 -8.665) (end 6.471 -1.44) (layer F.SilkS) (width 0.12))
  (fp_line (start 6.471 1.44) (end 6.471 8.665) (layer F.SilkS) (width 0.12))
  (fp_line (start 6.511 -8.653) (end 6.511 -1.44) (layer F.SilkS) (width 0.12))
  (fp_line (start 6.511 1.44) (end 6.511 8.653) (layer F.SilkS) (width 0.12))
  (fp_line (start 6.551 -8.64) (end 6.551 -1.44) (layer F.SilkS) (width 0.12))
  (fp_line (start 6.551 1.44) (end 6.551 8.64) (layer F.SilkS) (width 0.12))
  (fp_line (start 6.591 -8.627) (end 6.591 -1.44) (layer F.SilkS) (width 0.12))
  (fp_line (start 6.591 1.44) (end 6.591 8.627) (layer F.SilkS) (width 0.12))
  (fp_line (start 6.631 -8.614) (end 6.631 -1.44) (layer F.SilkS) (width 0.12))
  (fp_line (start 6.631 1.44) (end 6.631 8.614) (layer F.SilkS) (width 0.12))
  (fp_line (start 6.671 -8.6) (end 6.671 -1.44) (layer F.SilkS) (width 0.12))
  (fp_line (start 6.671 1.44) (end 6.671 8.6) (layer F.SilkS) (width 0.12))
  (fp_line (start 6.711 -8.587) (end 6.711 -1.44) (layer F.SilkS) (width 0.12))
  (fp_line (start 6.711 1.44) (end 6.711 8.587) (layer F.SilkS) (width 0.12))
  (fp_line (start 6.751 -8.573) (end 6.751 -1.44) (layer F.SilkS) (width 0.12))
  (fp_line (start 6.751 1.44) (end 6.751 8.573) (layer F.SilkS) (width 0.12))
  (fp_line (start 6.791 -8.559) (end 6.791 -1.44) (layer F.SilkS) (width 0.12))
  (fp_line (start 6.791 1.44) (end 6.791 8.559) (layer F.SilkS) (width 0.12))
  (fp_line (start 6.831 -8.545) (end 6.831 -1.44) (layer F.SilkS) (width 0.12))
  (fp_line (start 6.831 1.44) (end 6.831 8.545) (layer F.SilkS) (width 0.12))
  (fp_line (start 6.871 -8.53) (end 6.871 -1.44) (layer F.SilkS) (width 0.12))
  (fp_line (start 6.871 1.44) (end 6.871 8.53) (layer F.SilkS) (width 0.12))
  (fp_line (start 6.911 -8.516) (end 6.911 -1.44) (layer F.SilkS) (width 0.12))
  (fp_line (start 6.911 1.44) (end 6.911 8.516) (layer F.SilkS) (width 0.12))
  (fp_line (start 6.951 -8.501) (end 6.951 -1.44) (layer F.SilkS) (width 0.12))
  (fp_line (start 6.951 1.44) (end 6.951 8.501) (layer F.SilkS) (width 0.12))
  (fp_line (start 6.991 -8.486) (end 6.991 -1.44) (layer F.SilkS) (width 0.12))
  (fp_line (start 6.991 1.44) (end 6.991 8.486) (layer F.SilkS) (width 0.12))
  (fp_line (start 7.031 -8.47) (end 7.031 -1.44) (layer F.SilkS) (width 0.12))
  (fp_line (start 7.031 1.44) (end 7.031 8.47) (layer F.SilkS) (width 0.12))
  (fp_line (start 7.071 -8.455) (end 7.071 -1.44) (layer F.SilkS) (width 0.12))
  (fp_line (start 7.071 1.44) (end 7.071 8.455) (layer F.SilkS) (width 0.12))
  (fp_line (start 7.111 -8.439) (end 7.111 -1.44) (layer F.SilkS) (width 0.12))
  (fp_line (start 7.111 1.44) (end 7.111 8.439) (layer F.SilkS) (width 0.12))
  (fp_line (start 7.151 -8.423) (end 7.151 -1.44) (layer F.SilkS) (width 0.12))
  (fp_line (start 7.151 1.44) (end 7.151 8.423) (layer F.SilkS) (width 0.12))
  (fp_line (start 7.191 -8.407) (end 7.191 -1.44) (layer F.SilkS) (width 0.12))
  (fp_line (start 7.191 1.44) (end 7.191 8.407) (layer F.SilkS) (width 0.12))
  (fp_line (start 7.231 -8.39) (end 7.231 -1.44) (layer F.SilkS) (width 0.12))
  (fp_line (start 7.231 1.44) (end 7.231 8.39) (layer F.SilkS) (width 0.12))
  (fp_line (start 7.271 -8.374) (end 7.271 -1.44) (layer F.SilkS) (width 0.12))
  (fp_line (start 7.271 1.44) (end 7.271 8.374) (layer F.SilkS) (width 0.12))
  (fp_line (start 7.311 -8.357) (end 7.311 -1.44) (layer F.SilkS) (width 0.12))
  (fp_line (start 7.311 1.44) (end 7.311 8.357) (layer F.SilkS) (width 0.12))
  (fp_line (start 7.351 -8.34) (end 7.351 -1.44) (layer F.SilkS) (width 0.12))
  (fp_line (start 7.351 1.44) (end 7.351 8.34) (layer F.SilkS) (width 0.12))
  (fp_line (start 7.391 -8.323) (end 7.391 -1.44) (layer F.SilkS) (width 0.12))
  (fp_line (start 7.391 1.44) (end 7.391 8.323) (layer F.SilkS) (width 0.12))
  (fp_line (start 7.431 -8.305) (end 7.431 -1.44) (layer F.SilkS) (width 0.12))
  (fp_line (start 7.431 1.44) (end 7.431 8.305) (layer F.SilkS) (width 0.12))
  (fp_line (start 7.471 -8.287) (end 7.471 -1.44) (layer F.SilkS) (width 0.12))
  (fp_line (start 7.471 1.44) (end 7.471 8.287) (layer F.SilkS) (width 0.12))
  (fp_line (start 7.511 -8.269) (end 7.511 -1.44) (layer F.SilkS) (width 0.12))
  (fp_line (start 7.511 1.44) (end 7.511 8.269) (layer F.SilkS) (width 0.12))
  (fp_line (start 7.551 -8.251) (end 7.551 -1.44) (layer F.SilkS) (width 0.12))
  (fp_line (start 7.551 1.44) (end 7.551 8.251) (layer F.SilkS) (width 0.12))
  (fp_line (start 7.591 -8.233) (end 7.591 -1.44) (layer F.SilkS) (width 0.12))
  (fp_line (start 7.591 1.44) (end 7.591 8.233) (layer F.SilkS) (width 0.12))
  (fp_line (start 7.631 -8.214) (end 7.631 -1.44) (layer F.SilkS) (width 0.12))
  (fp_line (start 7.631 1.44) (end 7.631 8.214) (layer F.SilkS) (width 0.12))
  (fp_line (start 7.671 -8.195) (end 7.671 -1.44) (layer F.SilkS) (width 0.12))
  (fp_line (start 7.671 1.44) (end 7.671 8.195) (layer F.SilkS) (width 0.12))
  (fp_line (start 7.711 -8.176) (end 7.711 -1.44) (layer F.SilkS) (width 0.12))
  (fp_line (start 7.711 1.44) (end 7.711 8.176) (layer F.SilkS) (width 0.12))
  (fp_line (start 7.751 -8.156) (end 7.751 -1.44) (layer F.SilkS) (width 0.12))
  (fp_line (start 7.751 1.44) (end 7.751 8.156) (layer F.SilkS) (width 0.12))
  (fp_line (start 7.791 -8.137) (end 7.791 -1.44) (layer F.SilkS) (width 0.12))
  (fp_line (start 7.791 1.44) (end 7.791 8.137) (layer F.SilkS) (width 0.12))
  (fp_line (start 7.831 -8.117) (end 7.831 -1.44) (layer F.SilkS) (width 0.12))
  (fp_line (start 7.831 1.44) (end 7.831 8.117) (layer F.SilkS) (width 0.12))
  (fp_line (start 7.871 -8.097) (end 7.871 -1.44) (layer F.SilkS) (width 0.12))
  (fp_line (start 7.871 1.44) (end 7.871 8.097) (layer F.SilkS) (width 0.12))
  (fp_line (start 7.911 -8.076) (end 7.911 -1.44) (layer F.SilkS) (width 0.12))
  (fp_line (start 7.911 1.44) (end 7.911 8.076) (layer F.SilkS) (width 0.12))
  (fp_line (start 7.951 -8.056) (end 7.951 -1.44) (layer F.SilkS) (width 0.12))
  (fp_line (start 7.951 1.44) (end 7.951 8.056) (layer F.SilkS) (width 0.12))
  (fp_line (start 7.991 -8.035) (end 7.991 -1.44) (layer F.SilkS) (width 0.12))
  (fp_line (start 7.991 1.44) (end 7.991 8.035) (layer F.SilkS) (width 0.12))
  (fp_line (start 8.031 -8.014) (end 8.031 -1.44) (layer F.SilkS) (width 0.12))
  (fp_line (start 8.031 1.44) (end 8.031 8.014) (layer F.SilkS) (width 0.12))
  (fp_line (start 8.071 -7.992) (end 8.071 -1.44) (layer F.SilkS) (width 0.12))
  (fp_line (start 8.071 1.44) (end 8.071 7.992) (layer F.SilkS) (width 0.12))
  (fp_line (start 8.111 -7.971) (end 8.111 -1.44) (layer F.SilkS) (width 0.12))
  (fp_line (start 8.111 1.44) (end 8.111 7.971) (layer F.SilkS) (width 0.12))
  (fp_line (start 8.151 -7.949) (end 8.151 -1.44) (layer F.SilkS) (width 0.12))
  (fp_line (start 8.151 1.44) (end 8.151 7.949) (layer F.SilkS) (width 0.12))
  (fp_line (start 8.191 -7.927) (end 8.191 -1.44) (layer F.SilkS) (width 0.12))
  (fp_line (start 8.191 1.44) (end 8.191 7.927) (layer F.SilkS) (width 0.12))
  (fp_line (start 8.231 -7.904) (end 8.231 -1.44) (layer F.SilkS) (width 0.12))
  (fp_line (start 8.231 1.44) (end 8.231 7.904) (layer F.SilkS) (width 0.12))
  (fp_line (start 8.271 -7.882) (end 8.271 -1.44) (layer F.SilkS) (width 0.12))
  (fp_line (start 8.271 1.44) (end 8.271 7.882) (layer F.SilkS) (width 0.12))
  (fp_line (start 8.311 -7.859) (end 8.311 -1.44) (layer F.SilkS) (width 0.12))
  (fp_line (start 8.311 1.44) (end 8.311 7.859) (layer F.SilkS) (width 0.12))
  (fp_line (start 8.351 -7.835) (end 8.351 -1.44) (layer F.SilkS) (width 0.12))
  (fp_line (start 8.351 1.44) (end 8.351 7.835) (layer F.SilkS) (width 0.12))
  (fp_line (start 8.391 -7.812) (end 8.391 -1.44) (layer F.SilkS) (width 0.12))
  (fp_line (start 8.391 1.44) (end 8.391 7.812) (layer F.SilkS) (width 0.12))
  (fp_line (start 8.431 -7.788) (end 8.431 -1.44) (layer F.SilkS) (width 0.12))
  (fp_line (start 8.431 1.44) (end 8.431 7.788) (layer F.SilkS) (width 0.12))
  (fp_line (start 8.471 -7.764) (end 8.471 -1.44) (layer F.SilkS) (width 0.12))
  (fp_line (start 8.471 1.44) (end 8.471 7.764) (layer F.SilkS) (width 0.12))
  (fp_line (start 8.511 -7.74) (end 8.511 -1.44) (layer F.SilkS) (width 0.12))
  (fp_line (start 8.511 1.44) (end 8.511 7.74) (layer F.SilkS) (width 0.12))
  (fp_line (start 8.551 -7.715) (end 8.551 -1.44) (layer F.SilkS) (width 0.12))
  (fp_line (start 8.551 1.44) (end 8.551 7.715) (layer F.SilkS) (width 0.12))
  (fp_line (start 8.591 -7.69) (end 8.591 -1.44) (layer F.SilkS) (width 0.12))
  (fp_line (start 8.591 1.44) (end 8.591 7.69) (layer F.SilkS) (width 0.12))
  (fp_line (start 8.631 -7.665) (end 8.631 -1.44) (layer F.SilkS) (width 0.12))
  (fp_line (start 8.631 1.44) (end 8.631 7.665) (layer F.SilkS) (width 0.12))
  (fp_line (start 8.671 -7.64) (end 8.671 -1.44) (layer F.SilkS) (width 0.12))
  (fp_line (start 8.671 1.44) (end 8.671 7.64) (layer F.SilkS) (width 0.12))
  (fp_line (start 8.711 -7.614) (end 8.711 -1.44) (layer F.SilkS) (width 0.12))
  (fp_line (start 8.711 1.44) (end 8.711 7.614) (layer F.SilkS) (width 0.12))
  (fp_line (start 8.751 -7.588) (end 8.751 -1.44) (layer F.SilkS) (width 0.12))
  (fp_line (start 8.751 1.44) (end 8.751 7.588) (layer F.SilkS) (width 0.12))
  (fp_line (start 8.791 -7.561) (end 8.791 -1.44) (layer F.SilkS) (width 0.12))
  (fp_line (start 8.791 1.44) (end 8.791 7.561) (layer F.SilkS) (width 0.12))
  (fp_line (start 8.831 -7.535) (end 8.831 -1.44) (layer F.SilkS) (width 0.12))
  (fp_line (start 8.831 1.44) (end 8.831 7.535) (layer F.SilkS) (width 0.12))
  (fp_line (start 8.871 -7.508) (end 8.871 -1.44) (layer F.SilkS) (width 0.12))
  (fp_line (start 8.871 1.44) (end 8.871 7.508) (layer F.SilkS) (width 0.12))
  (fp_line (start 8.911 -7.48) (end 8.911 -1.44) (layer F.SilkS) (width 0.12))
  (fp_line (start 8.911 1.44) (end 8.911 7.48) (layer F.SilkS) (width 0.12))
  (fp_line (start 8.951 -7.453) (end 8.951 7.453) (layer F.SilkS) (width 0.12))
  (fp_line (start 8.991 -7.425) (end 8.991 7.425) (layer F.SilkS) (width 0.12))
  (fp_line (start 9.031 -7.397) (end 9.031 7.397) (layer F.SilkS) (width 0.12))
  (fp_line (start 9.071 -7.368) (end 9.071 7.368) (layer F.SilkS) (width 0.12))
  (fp_line (start 9.111 -7.339) (end 9.111 7.339) (layer F.SilkS) (width 0.12))
  (fp_line (start 9.151 -7.31) (end 9.151 7.31) (layer F.SilkS) (width 0.12))
  (fp_line (start 9.191 -7.28) (end 9.191 7.28) (layer F.SilkS) (width 0.12))
  (fp_line (start 9.231 -7.25) (end 9.231 7.25) (layer F.SilkS) (width 0.12))
  (fp_line (start 9.271 -7.22) (end 9.271 7.22) (layer F.SilkS) (width 0.12))
  (fp_line (start 9.311 -7.19) (end 9.311 7.19) (layer F.SilkS) (width 0.12))
  (fp_line (start 9.351 -7.159) (end 9.351 7.159) (layer F.SilkS) (width 0.12))
  (fp_line (start 9.391 -7.127) (end 9.391 7.127) (layer F.SilkS) (width 0.12))
  (fp_line (start 9.431 -7.096) (end 9.431 7.096) (layer F.SilkS) (width 0.12))
  (fp_line (start 9.471 -7.064) (end 9.471 7.064) (layer F.SilkS) (width 0.12))
  (fp_line (start 9.511 -7.031) (end 9.511 7.031) (layer F.SilkS) (width 0.12))
  (fp_line (start 9.551 -6.999) (end 9.551 6.999) (layer F.SilkS) (width 0.12))
  (fp_line (start 9.591 -6.965) (end 9.591 6.965) (layer F.SilkS) (width 0.12))
  (fp_line (start 9.631 -6.932) (end 9.631 6.932) (layer F.SilkS) (width 0.12))
  (fp_line (start 9.671 -6.898) (end 9.671 6.898) (layer F.SilkS) (width 0.12))
  (fp_line (start 9.711 -6.864) (end 9.711 6.864) (layer F.SilkS) (width 0.12))
  (fp_line (start 9.751 -6.829) (end 9.751 6.829) (layer F.SilkS) (width 0.12))
  (fp_line (start 9.791 -6.794) (end 9.791 6.794) (layer F.SilkS) (width 0.12))
  (fp_line (start 9.831 -6.758) (end 9.831 6.758) (layer F.SilkS) (width 0.12))
  (fp_line (start 9.871 -6.722) (end 9.871 6.722) (layer F.SilkS) (width 0.12))
  (fp_line (start 9.911 -6.686) (end 9.911 6.686) (layer F.SilkS) (width 0.12))
  (fp_line (start 9.951 -6.649) (end 9.951 6.649) (layer F.SilkS) (width 0.12))
  (fp_line (start 9.991 -6.612) (end 9.991 6.612) (layer F.SilkS) (width 0.12))
  (fp_line (start 10.031 -6.574) (end 10.031 6.574) (layer F.SilkS) (width 0.12))
  (fp_line (start 10.071 -6.536) (end 10.071 6.536) (layer F.SilkS) (width 0.12))
  (fp_line (start 10.111 -6.497) (end 10.111 6.497) (layer F.SilkS) (width 0.12))
  (fp_line (start 10.151 -6.458) (end 10.151 6.458) (layer F.SilkS) (width 0.12))
  (fp_line (start 10.191 -6.418) (end 10.191 6.418) (layer F.SilkS) (width 0.12))
  (fp_line (start 10.231 -6.378) (end 10.231 6.378) (layer F.SilkS) (width 0.12))
  (fp_line (start 10.271 -6.337) (end 10.271 6.337) (layer F.SilkS) (width 0.12))
  (fp_line (start 10.311 -6.296) (end 10.311 6.296) (layer F.SilkS) (width 0.12))
  (fp_line (start 10.351 -6.254) (end 10.351 6.254) (layer F.SilkS) (width 0.12))
  (fp_line (start 10.391 -6.212) (end 10.391 6.212) (layer F.SilkS) (width 0.12))
  (fp_line (start 10.431 -6.17) (end 10.431 6.17) (layer F.SilkS) (width 0.12))
  (fp_line (start 10.471 -6.126) (end 10.471 6.126) (layer F.SilkS) (width 0.12))
  (fp_line (start 10.511 -6.082) (end 10.511 6.082) (layer F.SilkS) (width 0.12))
  (fp_line (start 10.551 -6.038) (end 10.551 6.038) (layer F.SilkS) (width 0.12))
  (fp_line (start 10.591 -5.993) (end 10.591 5.993) (layer F.SilkS) (width 0.12))
  (fp_line (start 10.631 -5.947) (end 10.631 5.947) (layer F.SilkS) (width 0.12))
  (fp_line (start 10.671 -5.901) (end 10.671 5.901) (layer F.SilkS) (width 0.12))
  (fp_line (start 10.711 -5.854) (end 10.711 5.854) (layer F.SilkS) (width 0.12))
  (fp_line (start 10.751 -5.806) (end 10.751 5.806) (layer F.SilkS) (width 0.12))
  (fp_line (start 10.791 -5.758) (end 10.791 5.758) (layer F.SilkS) (width 0.12))
  (fp_line (start 10.831 -5.709) (end 10.831 5.709) (layer F.SilkS) (width 0.12))
  (fp_line (start 10.871 -5.66) (end 10.871 5.66) (layer F.SilkS) (width 0.12))
  (fp_line (start 10.911 -5.609) (end 10.911 5.609) (layer F.SilkS) (width 0.12))
  (fp_line (start 10.951 -5.558) (end 10.951 5.558) (layer F.SilkS) (width 0.12))
  (fp_line (start 10.991 -5.506) (end 10.991 5.506) (layer F.SilkS) (width 0.12))
  (fp_line (start 11.031 -5.454) (end 11.031 5.454) (layer F.SilkS) (width 0.12))
  (fp_line (start 11.071 -5.4) (end 11.071 5.4) (layer F.SilkS) (width 0.12))
  (fp_line (start 11.111 -5.346) (end 11.111 5.346) (layer F.SilkS) (width 0.12))
  (fp_line (start 11.151 -5.291) (end 11.151 5.291) (layer F.SilkS) (width 0.12))
  (fp_line (start 11.191 -5.235) (end 11.191 5.235) (layer F.SilkS) (width 0.12))
  (fp_line (start 11.231 -5.178) (end 11.231 5.178) (layer F.SilkS) (width 0.12))
  (fp_line (start 11.271 -5.12) (end 11.271 5.12) (layer F.SilkS) (width 0.12))
  (fp_line (start 11.311 -5.062) (end 11.311 5.062) (layer F.SilkS) (width 0.12))
  (fp_line (start 11.351 -5.002) (end 11.351 5.002) (layer F.SilkS) (width 0.12))
  (fp_line (start 11.391 -4.941) (end 11.391 4.941) (layer F.SilkS) (width 0.12))
  (fp_line (start 11.431 -4.879) (end 11.431 4.879) (layer F.SilkS) (width 0.12))
  (fp_line (start 11.471 -4.816) (end 11.471 4.816) (layer F.SilkS) (width 0.12))
  (fp_line (start 11.511 -4.752) (end 11.511 4.752) (layer F.SilkS) (width 0.12))
  (fp_line (start 11.551 -4.686) (end 11.551 4.686) (layer F.SilkS) (width 0.12))
  (fp_line (start 11.591 -4.62) (end 11.591 4.62) (layer F.SilkS) (width 0.12))
  (fp_line (start 11.631 -4.552) (end 11.631 4.552) (layer F.SilkS) (width 0.12))
  (fp_line (start 11.671 -4.482) (end 11.671 4.482) (layer F.SilkS) (width 0.12))
  (fp_line (start 11.711 -4.412) (end 11.711 4.412) (layer F.SilkS) (width 0.12))
  (fp_line (start 11.751 -4.339) (end 11.751 4.339) (layer F.SilkS) (width 0.12))
  (fp_line (start 11.791 -4.265) (end 11.791 4.265) (layer F.SilkS) (width 0.12))
  (fp_line (start 11.831 -4.19) (end 11.831 4.19) (layer F.SilkS) (width 0.12))
  (fp_line (start 11.871 -4.113) (end 11.871 4.113) (layer F.SilkS) (width 0.12))
  (fp_line (start 11.911 -4.033) (end 11.911 4.033) (layer F.SilkS) (width 0.12))
  (fp_line (start 11.95 -3.952) (end 11.95 3.952) (layer F.SilkS) (width 0.12))
  (fp_line (start 11.99 -3.869) (end 11.99 3.869) (layer F.SilkS) (width 0.12))
  (fp_line (start 12.03 -3.784) (end 12.03 3.784) (layer F.SilkS) (width 0.12))
  (fp_line (start 12.07 -3.696) (end 12.07 3.696) (layer F.SilkS) (width 0.12))
  (fp_line (start 12.11 -3.605) (end 12.11 3.605) (layer F.SilkS) (width 0.12))
  (fp_line (start 12.15 -3.512) (end 12.15 3.512) (layer F.SilkS) (width 0.12))
  (fp_line (start 12.19 -3.416) (end 12.19 3.416) (layer F.SilkS) (width 0.12))
  (fp_line (start 12.23 -3.317) (end 12.23 3.317) (layer F.SilkS) (width 0.12))
  (fp_line (start 12.27 -3.214) (end 12.27 3.214) (layer F.SilkS) (width 0.12))
  (fp_line (start 12.31 -3.107) (end 12.31 3.107) (layer F.SilkS) (width 0.12))
  (fp_line (start 12.35 -2.996) (end 12.35 2.996) (layer F.SilkS) (width 0.12))
  (fp_line (start 12.39 -2.88) (end 12.39 2.88) (layer F.SilkS) (width 0.12))
  (fp_line (start 12.43 -2.759) (end 12.43 2.759) (layer F.SilkS) (width 0.12))
  (fp_line (start 12.47 -2.632) (end 12.47 2.632) (layer F.SilkS) (width 0.12))
  (fp_line (start 12.51 -2.498) (end 12.51 2.498) (layer F.SilkS) (width 0.12))
  (fp_line (start 12.55 -2.355) (end 12.55 2.355) (layer F.SilkS) (width 0.12))
  (fp_line (start 12.59 -2.203) (end 12.59 2.203) (layer F.SilkS) (width 0.12))
  (fp_line (start 12.63 -2.039) (end 12.63 2.039) (layer F.SilkS) (width 0.12))
  (fp_line (start 12.67 -1.86) (end 12.67 1.86) (layer F.SilkS) (width 0.12))
  (fp_line (start 12.71 -1.661) (end 12.71 1.661) (layer F.SilkS) (width 0.12))
  (fp_line (start 12.75 -1.435) (end 12.75 1.435) (layer F.SilkS) (width 0.12))
  (fp_line (start 12.79 -1.166) (end 12.79 1.166) (layer F.SilkS) (width 0.12))
  (fp_line (start 12.83 -0.814) (end 12.83 0.814) (layer F.SilkS) (width 0.12))
  (fp_line (start 12.87 -0.04) (end 12.87 0.04) (layer F.SilkS) (width 0.12))
  (fp_line (start -6.00944 -5.115) (end -4.20944 -5.115) (layer F.SilkS) (width 0.12))
  (fp_line (start -5.10944 -6.015) (end -5.10944 -4.215) (layer F.SilkS) (width 0.12))
  (fp_text user "${REFERENCE}" (at 3.75 0) (layer F.Fab)
    (effects (font (size 1 1) (thickness 0.15)))
  )
  (pad "1" thru_hole rect (at 0 0) (size 2.4 2.4) (drill 1.2) (layers *.Cu *.Mask) (tstamp cbeb2b5a-8bca-42b5-82b8-d7760a1c1179))
  (pad "2" thru_hole circle (at 7.5 0) (size 2.4 2.4) (drill 1.2) (layers *.Cu *.Mask) (tstamp 50ca3310-d2f7-44f4-9394-8613942f03c0))
  (model "${KICADLIB}/model/passive/CAPPR750-1800X1600.stp"
    (offset (xyz 3.75 0 0))
    (scale (xyz 1 1 1))
    (rotate (xyz 0 0 0))
  )
)
