(footprint "OSC_2520_4pad" (version 20221018) (generator pcbnew)
  (layer "F.Cu")
  (attr smd)
  (fp_text reference "REF**" (at 0 -1.8) (layer "F.SilkS")
      (effects (font (size 1 1) (thickness 0.15)))
    (tstamp bf03cf40-14f3-4099-9d4a-e23b1400e69b)
  )
  (fp_text value "OSC_2520_4pad" (at 0 2) (layer "F.Fab") hide
      (effects (font (size 1 1) (thickness 0.15)))
    (tstamp f8705c51-15f7-4bd8-97c8-1ae32184210c)
  )
  (fp_text user "^" (at -0.9 1.85 unlocked) (layer "F.SilkS")
      (effects (font (size 1 1) (thickness 0.15)))
    (tstamp 9e04b76f-0cf8-4efe-be0f-9aaeeb94b249)
  )
  (fp_text user "${REFERENCE}" (at 0 0) (layer "F.Fab")
      (effects (font (size 0.4 0.4) (thickness 0.05)))
    (tstamp fc2d7ea7-43f0-4dda-9d99-47436181ddf5)
  )
  (fp_line (start -1.25 -0.25) (end -1.25 0.25)
    (stroke (width 0.1) (type solid)) (layer "F.SilkS") (tstamp a3e5a64e-da65-454e-94bc-1235d2f70726))
  (fp_line (start 0.4 -1) (end -0.4 -1)
    (stroke (width 0.1) (type solid)) (layer "F.SilkS") (tstamp 461203bc-0a60-4f60-ac59-a47c6a824a95))
  (fp_line (start 0.4 1) (end -0.4 1)
    (stroke (width 0.1) (type solid)) (layer "F.SilkS") (tstamp cb00924b-c666-4c2b-af53-bc2438e7c870))
  (fp_line (start 1.25 -0.25) (end 1.25 0.25)
    (stroke (width 0.1) (type solid)) (layer "F.SilkS") (tstamp e6b37469-b28f-41dc-9808-8c9ea7c18d55))
  (fp_rect (start -1.45 -1.2) (end 1.45 1.2)
    (stroke (width 0.05) (type default)) (fill none) (layer "F.CrtYd") (tstamp 5f272c1a-d4ae-4c4e-97de-c8cfe5be0407))
  (fp_poly
    (pts
      (xy 1.25 -1)
      (xy 1.25 1)
      (xy -1 1)
      (xy -1.25 0.75)
      (xy -1.25 -1)
    )

    (stroke (width 0.1) (type solid)) (fill none) (layer "F.Fab") (tstamp df649c5a-ad5d-42fc-add9-81dd85e1ef17))
  (pad "1" smd roundrect (at -0.925 0.725) (size 0.9 0.8) (layers "F.Cu" "F.Paste" "F.Mask") (roundrect_rratio 0.0625) (tstamp 5c787dfd-402f-4b0e-a566-9d535dbe9486))
  (pad "2" smd roundrect (at 0.925 0.725) (size 0.9 0.8) (layers "F.Cu" "F.Paste" "F.Mask") (roundrect_rratio 0.0625) (tstamp e2d8b6f2-2b4e-4ee3-ad56-1a882cd9523c))
  (pad "3" smd roundrect (at 0.925 -0.725) (size 0.9 0.8) (layers "F.Cu" "F.Paste" "F.Mask") (roundrect_rratio 0.0625) (tstamp e3291309-c9d3-4637-85f0-9e9775ccf033))
  (pad "4" smd roundrect (at -0.925 -0.725) (size 0.9 0.8) (layers "F.Cu" "F.Paste" "F.Mask") (roundrect_rratio 0.0625) (tstamp c2473990-ee48-4521-9bf6-b845d044716a))
  (model "${KICADLIB}/model/clock/OSC2520-4.STEP"
    (offset (xyz 0 0 0.025))
    (scale (xyz 1 1 1))
    (rotate (xyz -90 0 0))
  )
)
