(module megaxone_other:Littelfuse_LVR005NS (layer F.Cu) (tedit 5AFE02D2)
  (fp_text reference REF** (at 0 0) (layer F.SilkS)
    (effects (font (size 1 1) (thickness 0.15)))
  )
  (fp_text value Littelfuse_LVR005NS (at 0 -3.075) (layer F.Fab)
    (effects (font (size 1 1) (thickness 0.15)))
  )
  (fp_line (start -3.45 -2.3) (end -3.45 2.3) (layer F.SilkS) (width 0.15))
  (fp_line (start -3.45 2.3) (end 3.45 2.3) (layer F.SilkS) (width 0.15))
  (fp_line (start 3.45 2.3) (end 3.45 -2.3) (layer F.SilkS) (width 0.15))
  (fp_line (start 3.45 -2.3) (end -3.45 -2.3) (layer F.SilkS) (width 0.15))
  (pad 1 thru_hole circle (at -2.5 0) (size 1.4 1.4) (drill 0.8) (layers *.Cu *.Mask))
  (pad 2 thru_hole circle (at 2.5 0) (size 1.4 1.4) (drill 0.8) (layers *.Cu *.Mask))
  (model ${KICADLIB}/model/other/Littelfuse_LVR005NS.step
    (at (xyz 0 0 0))
    (scale (xyz 1 1 1))
    (rotate (xyz 0 0 0))
  )
)
