(footprint "Molex_7340351XX" (version 20211014) (generator pcbnew)
  (layer "F.Cu")
  (tedit 0)
  (descr "FAKRA Connector")
  (attr through_hole)
  (fp_text reference "REF**" (at -5.1 0 270 unlocked) (layer "F.SilkS")
    (effects (font (size 1 1) (thickness 0.15)))
    (tstamp e13e88a1-9592-49ef-8742-bfec855a9b93)
  )
  (fp_text value "Molex_734036810" (at 0.053997 1.116997 unlocked) (layer "F.Fab") hide
    (effects (font (size 1 1) (thickness 0.15)))
    (tstamp 183c4200-ead5-479f-8f00-843eb8626ba7)
  )
  (fp_text user "^" (at 2 0 90 unlocked) (layer "B.SilkS")
    (effects (font (size 1 1) (thickness 0.15)) (justify mirror))
    (tstamp f1079c9e-c8f8-4b0a-8c07-4ae1e20dbaac)
  )
  (fp_text user "${REFERENCE}" (at 0 0 unlocked) (layer "F.Fab")
    (effects (font (size 1 1) (thickness 0.15)))
    (tstamp 5ceaf3f9-6211-468e-b407-ce2147338bd2)
  )
  (fp_line (start 6.6 -3.675) (end 6.6 3.683) (layer "F.SilkS") (width 0.1) (tstamp 2e4784f3-30c7-480d-8291-7ea6c75778cc))
  (fp_line (start 3.975 -3.675) (end 6.6 -3.675) (layer "F.SilkS") (width 0.1) (tstamp 53dcab14-2332-4b30-92fe-8d1106d46f39))
  (fp_line (start 3.9624 -3.9624) (end -3.9624 -3.9624) (layer "F.SilkS") (width 0.1) (tstamp 55282822-f202-4016-872c-fb00a5b743ee))
  (fp_line (start 3.9624 3.9624) (end 3.9624 -3.9624) (layer "F.SilkS") (width 0.1) (tstamp 9bfb4671-5224-4195-af95-92769a5d6470))
  (fp_line (start -3.9624 3.9624) (end 3.9624 3.9624) (layer "F.SilkS") (width 0.1) (tstamp cfd5cf7c-8bb0-4f37-b619-2ca8465c58af))
  (fp_line (start -3.9624 -3.9624) (end -3.9624 3.9624) (layer "F.SilkS") (width 0.1) (tstamp d3e4f365-5f55-406a-a972-30baeb3d0e0a))
  (fp_line (start 3.975 3.683) (end 6.6 3.683) (layer "F.SilkS") (width 0.1) (tstamp fa67b7fc-ff1c-4cf3-8e3d-bbb568544ff7))
  (fp_line (start 1.997573 5.997572) (end -1.997574 5.997577) (layer "Dwgs.User") (width 0.1) (tstamp 222cb9ce-ce63-45f8-a9c3-013905fa12e5))
  (fp_line (start 5.997568 -1.997571) (end 5.997576 1.997575) (layer "Dwgs.User") (width 0.1) (tstamp c523b688-3746-4499-b1ac-65121cb022b0))
  (fp_line (start -1.997572 -5.997571) (end 1.997571 -5.997574) (layer "Dwgs.User") (width 0.1) (tstamp dd8a7dc9-49e0-408b-8606-888154b35205))
  (fp_line (start -5.997569 1.99757) (end -5.997575 -1.997574) (layer "Dwgs.User") (width 0.1) (tstamp fcfaf614-23f4-409f-9f3e-7b6c5e7fb25b))
  (fp_arc (start -5.997575 -1.997574) (mid -4.826 -4.826) (end -1.997572 -5.997571) (layer "Dwgs.User") (width 0.1) (tstamp 01f4c60c-c8d0-4228-897d-eacf183d6448))
  (fp_arc (start 5.997576 1.997575) (mid 4.826 4.826) (end 1.997573 5.997572) (layer "Dwgs.User") (width 0.1) (tstamp 1755d401-5050-4fca-a82f-ba19e38bcf32))
  (fp_arc (start -1.997574 5.997577) (mid -4.826 4.826) (end -5.997569 1.99757) (layer "Dwgs.User") (width 0.1) (tstamp 2573ef86-f814-45f5-93e3-a9975b14c09d))
  (fp_arc (start 1.997571 -5.997574) (mid 4.826 -4.826) (end 5.997568 -1.997571) (layer "Dwgs.User") (width 0.1) (tstamp e3968197-a029-4db8-b0d4-443c3c539163))
  (fp_line (start -4.191 -4.191) (end 4.191 -4.191) (layer "F.CrtYd") (width 0.05) (tstamp 2a99a3f3-112f-40d7-9557-fea7f62da3c9))
  (fp_line (start 4.191 4.191) (end -4.191 4.191) (layer "F.CrtYd") (width 0.05) (tstamp 5aca491a-87b3-4359-a3fc-b3fb8d8b81cf))
  (fp_line (start -4.191 4.191) (end -4.191 -4.191) (layer "F.CrtYd") (width 0.05) (tstamp af4822c1-6e9b-4f06-8756-46d4a4b4aac0))
  (fp_line (start 4.191 -4.191) (end 4.191 4.191) (layer "F.CrtYd") (width 0.05) (tstamp afc52813-325b-4a17-9bb8-e5aa51a344c3))
  (fp_line (start 17.018 -3.675) (end 17.018 3.675) (layer "F.Fab") (width 0.1) (tstamp 0d3c2c27-b4b2-4b43-885e-c233319fcb63))
  (fp_line (start 3.9624 3.675) (end 3.9624 3.9624) (layer "F.Fab") (width 0.1) (tstamp 18df8139-7b9c-4750-9640-a7aa860a11a9))
  (fp_line (start 3.9624 -3.675) (end 17.018 -3.675) (layer "F.Fab") (width 0.1) (tstamp 23acbf1f-7528-4cf8-b317-bf8701b2ef73))
  (fp_line (start 3.9624 3.9624) (end -3.9624 3.9624) (layer "F.Fab") (width 0.1) (tstamp 4df82da0-6362-4f0b-8760-c4f835598f57))
  (fp_line (start -3.9624 -3.9624) (end 3.9624 -3.9624) (layer "F.Fab") (width 0.1) (tstamp 5ee73d6c-2532-420e-aebf-5b6994607b55))
  (fp_line (start 17.018 3.675) (end 3.975 3.675) (layer "F.Fab") (width 0.1) (tstamp 74a37c27-4d08-46d9-adaf-ff49414a0e66))
  (fp_line (start -3.9624 3.9624) (end -3.9624 -3.9624) (layer "F.Fab") (width 0.1) (tstamp 8c23fcb7-c598-4301-80c6-d407f91ed865))
  (fp_line (start 3.9624 -3.9624) (end 3.9624 -3.675) (layer "F.Fab") (width 0.1) (tstamp b8617366-6b75-4bc2-bc83-7b0132f46363))
  (pad "1" thru_hole circle (at 0 0) (size 2.3 2.3) (drill 1.5) (layers *.Cu *.Mask) (remove_unused_layers) (keep_end_layers)
    (clearance 0.75) (tstamp c8befce0-b3b0-4e2c-8321-98b0843224f0))
  (pad "2" thru_hole circle (at -2.54 2.54) (size 2.6 2.6) (drill 1.9) (layers *.Cu *.Mask) (remove_unused_layers) (keep_end_layers) (tstamp 1cf8581e-de20-4779-a89b-f4a6fde5e3bd))
  (pad "2" thru_hole circle (at 2.54 2.54) (size 2.6 2.6) (drill 1.9) (layers *.Cu *.Mask) (remove_unused_layers) (keep_end_layers) (tstamp 3d7e43a1-8b6d-40c7-a69f-25b0d24016c5))
  (pad "2" thru_hole circle (at -2.54 -2.54) (size 2.6 2.6) (drill 1.9) (layers *.Cu *.Mask) (remove_unused_layers) (keep_end_layers) (tstamp 5efc1c0d-3fb8-4fad-8643-4bcff7a2254e))
  (pad "2" thru_hole circle (at 2.54 -2.54) (size 2.6 2.6) (drill 1.9) (layers *.Cu *.Mask) (remove_unused_layers) (keep_end_layers) (tstamp c4ab5bf2-1c65-4814-905c-faf2ece6f5af))
  (model "${KICADLIB}/model/connector/Molex_734036510_Fakra.step" hide
    (offset (xyz 18.5 0 4.4))
    (scale (xyz 1 1 1))
    (rotate (xyz 0 0 -90))
  )
  (model "${KICADLIB}/model/mechanical/CABLE_FAKRA_734036270.step"
    (offset (xyz 15 0 4.5))
    (scale (xyz 1 1 1))
    (rotate (xyz 0 -90 180))
  )
  (model "${KICADLIB}/model/connector/AmphenolRF_FA1-NZRP-PCB-8_Fakra.stp"
    (offset (xyz 0 0 4.5))
    (scale (xyz 1 1 1))
    (rotate (xyz -90 0 180))
  )
)
