(module "QFN50P300X300-16_MP886x" (layer F.Cu) (tedit 5F2EE900)
  (descr "16-Lead Plastic Quad Flat, No Lead Package (NG) - 3x3x0.9 mm Body [QFN]")
  (tags "QFN 0.5")
  (attr smd)
  (fp_text reference "REF**" (at 0 -2.85) (layer F.SilkS)
    (effects (font (size 1 1) (thickness 0.15)))
    (tstamp ac59ed48-8c27-4c04-810b-c00ecdaf980f)
  )
  (fp_text value "QFN50P300X300-16_MP886x" (at 0 2.85) (layer F.Fab) hide
    (effects (font (size 1 1) (thickness 0.15)))
    (tstamp e4909fa7-7f98-4c58-84e8-28d7303f51ac)
  )
  (fp_text user "^" (at -2.6 -0.8 270 unlocked) (layer F.SilkS)
    (effects (font (size 1 1) (thickness 0.15)))
    (tstamp 1fd6d864-8a0c-421a-b373-44ca7b667e6e)
  )
  (fp_text user "${REFERENCE}" (at 0 0) (layer F.Fab)
    (effects (font (size 0.7 0.7) (thickness 0.105)))
    (tstamp 37d3bbee-c82c-459b-bd06-106f86988b48)
  )
  (fp_line (start -1.5 -1.5) (end -1.5 -1) (layer F.SilkS) (width 0.15) (tstamp 0932f400-d649-4f94-b94f-c03141dbeea5))
  (fp_line (start 1.505 1.505) (end 1.005 1.505) (layer F.SilkS) (width 0.15) (tstamp 11da86f2-9e95-4b8e-a391-956e3dfa4d2b))
  (fp_line (start 1.505 -1.505) (end 1.005 -1.505) (layer F.SilkS) (width 0.15) (tstamp 6ba389b1-5fad-4172-9165-11f979d11c7f))
  (fp_line (start -1.5 -1.5) (end -1 -1.5) (layer F.SilkS) (width 0.15) (tstamp 8da0f4f5-f85c-4763-9fbb-eb25ecf1cac0))
  (fp_line (start -1.505 1.505) (end -1.005 1.505) (layer F.SilkS) (width 0.15) (tstamp 90b0406e-e424-4a06-ad57-947194354d84))
  (fp_line (start 1.505 -1.505) (end 1.505 -1.005) (layer F.SilkS) (width 0.15) (tstamp 9a5af227-6d27-4aef-8a5e-441c0dd5fd63))
  (fp_line (start -1.505 1.505) (end -1.505 1.005) (layer F.SilkS) (width 0.15) (tstamp bb798074-7caa-443b-adc8-799561773aa7))
  (fp_line (start 1.505 1.505) (end 1.505 1.005) (layer F.SilkS) (width 0.15) (tstamp de13c4b8-e5df-4f94-9080-fe614b58f226))
  (fp_line (start 2.1 -2.1) (end 2.1 2.1) (layer F.CrtYd) (width 0.05) (tstamp 20f826ff-3512-4348-9e09-227ca85e9af9))
  (fp_line (start -2.1 -2.1) (end -2.1 2.1) (layer F.CrtYd) (width 0.05) (tstamp 61963dea-2395-4789-99c3-ac96f64f8aec))
  (fp_line (start -2.1 2.1) (end 2.1 2.1) (layer F.CrtYd) (width 0.05) (tstamp 72fca9ec-3113-4582-9878-586ca7279489))
  (fp_line (start -2.1 -2.1) (end 2.1 -2.1) (layer F.CrtYd) (width 0.05) (tstamp ab4991c9-69d2-44c7-9c8f-eef1a5c68e76))
  (fp_line (start -1.5 -1) (end -1 -1.5) (layer F.Fab) (width 0.1) (tstamp 0002b715-7b30-463c-bf69-f797cef2a909))
  (fp_line (start -1 -1.5) (end 1.5 -1.5) (layer F.Fab) (width 0.1) (tstamp 105b877c-f478-4f1a-969b-f92bcbd7112c))
  (fp_line (start -1.5 1.5) (end -1.5 -1) (layer F.Fab) (width 0.1) (tstamp 752c1900-cbe9-4c2e-8e5b-d9516ea09894))
  (fp_line (start 1.5 -1.5) (end 1.5 1.5) (layer F.Fab) (width 0.1) (tstamp 96ce3164-f599-4e23-a10c-8c1c2322d05a))
  (fp_line (start 1.5 1.5) (end -1.5 1.5) (layer F.Fab) (width 0.1) (tstamp e16b72f4-2aec-40df-aef7-7e7bf24d7664))
  (pad "1" smd rect (at -1.45 -0.75) (size 0.8 0.3) (layers "F.Cu" "F.Paste" "F.Mask") (tstamp cdcdfd4e-12f8-47b3-abb1-4626a52e0516))
  (pad "2" smd rect (at -1.475 -0.25) (size 0.75 0.3) (layers "F.Cu" "F.Paste" "F.Mask") (tstamp e236f1e0-1aa1-4b30-ae3a-d3fb22c0797e))
  (pad "3" smd rect (at -1.475 0.25) (size 0.75 0.3) (layers "F.Cu" "F.Paste" "F.Mask") (tstamp 06b96ccb-3f6c-43cc-bcdc-f42e9bac7c73))
  (pad "4" smd rect (at -1.475 0.75) (size 0.75 0.3) (layers "F.Cu" "F.Paste" "F.Mask") (tstamp 8698a513-d6cf-48f0-8fa2-fc0e7e267712))
  (pad "5" smd rect (at -0.75 1.475 90) (size 0.75 0.3) (layers "F.Cu" "F.Paste" "F.Mask") (tstamp c1d7d832-5b92-465e-aa23-efa146a8d6ea))
  (pad "6" smd rect (at -0.25 1.25 90) (size 1.2 0.3) (layers "F.Cu" "F.Paste" "F.Mask") (tstamp 1d4c253a-80cc-42df-8969-fe6c3e6e9304))
  (pad "7" smd rect (at 0.25 1.25 90) (size 1.2 0.3) (layers "F.Cu" "F.Paste" "F.Mask") (tstamp 77a6a6b9-2be7-4de1-a709-10361af24ebe))
  (pad "8" smd rect (at 0.75 1.475 90) (size 0.75 0.3) (layers "F.Cu" "F.Paste" "F.Mask") (tstamp a5331d4e-df7f-46ef-a006-cf550dcbfa6a))
  (pad "9" smd rect (at 1.475 0.75) (size 0.75 0.3) (layers "F.Cu" "F.Paste" "F.Mask") (tstamp 634d14c0-ac5f-4fd0-b6dd-421f5ef4b8ea))
  (pad "10" smd rect (at 1.475 0.25) (size 0.75 0.3) (layers "F.Cu" "F.Paste" "F.Mask") (tstamp c9318f15-ad39-4f71-a1d4-90a2ddabf337))
  (pad "11" smd rect (at 1.475 -0.25) (size 0.75 0.3) (layers "F.Cu" "F.Paste" "F.Mask") (tstamp e273fd9f-2302-472d-894c-8deaef9fa70f))
  (pad "12" smd rect (at 1.475 -0.75) (size 0.75 0.3) (layers "F.Cu" "F.Paste" "F.Mask") (tstamp 12672d7e-23b6-41da-94db-943107293fd9))
  (pad "13" smd rect (at 0.75 -1.475 90) (size 0.75 0.3) (layers "F.Cu" "F.Paste" "F.Mask") (tstamp ce65a8bb-86e4-4eb4-8b27-8a22e51dea1f))
  (pad "14" smd rect (at 0.25 -1.25 90) (size 1.2 0.3) (layers "F.Cu" "F.Paste" "F.Mask") (tstamp eb1cc26e-9b91-4e45-9474-1308b7276ebc))
  (pad "15" smd rect (at -0.25 -1.25 90) (size 1.2 0.3) (layers "F.Cu" "F.Paste" "F.Mask") (tstamp 15de83e3-33fc-453c-839a-49fe8487e516))
  (pad "16" smd rect (at -0.75 -1.475 90) (size 0.75 0.3) (layers "F.Cu" "F.Paste" "F.Mask") (tstamp c8069c36-94b7-4b04-9d25-12dee4e99b4d))
  (model "${KICADLIB}/model/QFN/QFN50P300X300-17.step"
    (offset (xyz 0 0 0))
    (scale (xyz 1 1 1))
    (rotate (xyz 0 0 0))
  )
)
