(footprint "GCT_USB4085-GF-A" (version 20211014) (generator pcbnew)
  (layer "F.Cu")
  (tedit 622FEABB)
  (attr through_hole)
  (fp_text reference "REF**" (at 0 -2.75 unlocked) (layer "F.SilkS")
    (effects (font (size 1 1) (thickness 0.15)))
    (tstamp 23ce6772-b078-452f-832a-098da623ac37)
  )
  (fp_text value "GCT_USB4085-GF-A" (at 0 -2.75 unlocked) (layer "F.Fab") hide
    (effects (font (size 1 1) (thickness 0.15)))
    (tstamp 7a093a76-24dc-48f6-8fc2-2c99e1aacc56)
  )
  (fp_text user "^" (at -3 -2.4 180 unlocked) (layer "B.SilkS")
    (effects (font (size 1 1) (thickness 0.15)) (justify mirror))
    (tstamp 8abe8a90-6cf3-45fb-9e62-bf29b3747c1c)
  )
  (fp_text user "^" (at -3 -2.7 180 unlocked) (layer "F.SilkS")
    (effects (font (size 1 1) (thickness 0.15)))
    (tstamp 51e2bac5-8089-479d-a408-bed666c3a925)
  )
  (fp_text user "${REFERENCE}" (at 0 0 unlocked) (layer "F.Fab")
    (effects (font (size 1 1) (thickness 0.15)))
    (tstamp 7b9adc00-0926-434c-9e3c-9ac06791813b)
  )
  (fp_line (start -4.5 4.7) (end -4.5 4) (layer "F.SilkS") (width 0.1) (tstamp 06edc55f-3716-4b7c-b76b-2d7b98451883))
  (fp_line (start -4.5 -1.8) (end -4.5 -1.925) (layer "F.SilkS") (width 0.1) (tstamp 1882f78a-6c99-4caf-8f27-317e5a4422d5))
  (fp_line (start -4.5 1.9) (end -4.5 1) (layer "F.SilkS") (width 0.1) (tstamp 2c49f044-e916-4166-8c9a-24245eb58bfc))
  (fp_line (start -4.5 -1.925) (end 4.45 -1.925) (layer "F.SilkS") (width 0.1) (tstamp 3a5642cb-e1e0-4b77-90ae-756160d5f95a))
  (fp_line (start 4.45 -1.925) (end 4.45 -1.8) (layer "F.SilkS") (width 0.1) (tstamp 6b9a9e60-db83-4cba-a2db-097cdfde11eb))
  (fp_line (start 4.45 4.7) (end -4.5 4.7) (layer "F.SilkS") (width 0.1) (tstamp acd48dcb-c7be-429d-b8ae-e836a3d5cafa))
  (fp_line (start 4.45 1) (end 4.45 1.9) (layer "F.SilkS") (width 0.1) (tstamp f6d86bd8-2e54-4a36-a715-e1c9dfb3c87f))
  (fp_line (start 4.45 4) (end 4.45 4.7) (layer "F.SilkS") (width 0.1) (tstamp fc98b68b-db61-4bbf-9457-0b69663548b4))
  (fp_line (start -4.5 4.7) (end 4.475 4.7) (layer "Eco1.User") (width 0.1) (tstamp 38eaeb5f-50bc-4341-8f03-e309fa479cc2))
  (fp_rect (start -5 -2.2) (end 5 7.6) (layer "F.CrtYd") (width 0.05) (fill none) (tstamp 9d79217f-fb76-4ed7-bee5-22b72e562f6c))
  (fp_line (start 4.443782 -1.913824) (end -3.8 -1.9) (layer "F.Fab") (width 0.1) (tstamp 132d2003-8e7b-4203-b125-be7ecc11d555))
  (fp_line (start -4.5 -1.2) (end -3.8 -1.9) (layer "F.Fab") (width 0.1) (tstamp 1b98f940-1801-46db-86de-2d9217dbd0e7))
  (fp_line (start 4.443782 7.261176) (end 4.443782 -1.913824) (layer "F.Fab") (width 0.1) (tstamp 2ea9d90d-5d83-4e22-8f34-4461841e1e01))
  (fp_line (start -4.506218 7.261176) (end 4.443782 7.261176) (layer "F.Fab") (width 0.1) (tstamp dda65070-75a7-4277-ad85-a4974b4a7268))
  (fp_line (start -4.5 -1.2) (end -4.506218 7.261176) (layer "F.Fab") (width 0.1) (tstamp e8afbdc1-d2b1-4b07-b992-8914e38896d3))
  (pad "1" thru_hole oval (at -4.325 -0.425) (size 1.1 2.6) (drill oval 0.6 2.1) (layers *.Cu *.Mask) (remove_unused_layers) (keep_end_layers) (tstamp 0388bfa2-3931-4209-ad0e-d7b799a4f5e6))
  (pad "1" thru_hole oval (at -4.325 2.95) (size 1.1 1.9) (drill oval 0.6 1.4) (layers *.Cu *.Mask) (tstamp 2ee166ec-6369-4b73-ad52-44083a243568))
  (pad "1" thru_hole oval (at 4.325 -0.4) (size 1.1 2.6) (drill oval 0.6 2.1) (layers *.Cu *.Mask) (remove_unused_layers) (keep_end_layers) (tstamp 452cf66f-721d-457d-a68b-e41f3e9618f7))
  (pad "1" thru_hole oval (at 4.325 2.95) (size 1.1 1.9) (drill oval 0.6 1.4) (layers *.Cu *.Mask) (tstamp cebba21d-7cd4-407c-8876-58e20f970fee))
  (pad "A1" thru_hole circle (at -2.975 -1.35) (size 0.65 0.65) (drill 0.4) (layers *.Cu *.Mask) (remove_unused_layers) (keep_end_layers) (tstamp 591ed248-a39a-479f-b9c1-d6d5a0ec7d7b))
  (pad "A4" thru_hole circle (at -2.125 -1.35) (size 0.65 0.65) (drill 0.4) (layers *.Cu *.Mask) (remove_unused_layers) (keep_end_layers) (tstamp e5e45b63-90ec-427d-b62f-dd546e2eb1f5))
  (pad "A5" thru_hole circle (at -1.275 -1.35) (size 0.65 0.65) (drill 0.4) (layers *.Cu *.Mask) (remove_unused_layers) (keep_end_layers) (tstamp 3be594c3-612b-4fda-8013-5dcd5ac9dd28))
  (pad "A6" thru_hole circle (at -0.425 -1.35) (size 0.65 0.65) (drill 0.4) (layers *.Cu *.Mask) (remove_unused_layers) (keep_end_layers) (tstamp 41ee2625-6781-4722-a0a6-d77029a8fbd8))
  (pad "A7" thru_hole circle (at 0.425 -1.35) (size 0.65 0.65) (drill 0.4) (layers *.Cu *.Mask) (remove_unused_layers) (keep_end_layers) (tstamp 4c6487c8-8dac-42f5-b07f-9e476641a66d))
  (pad "A8" thru_hole circle (at 1.275 -1.35) (size 0.65 0.65) (drill 0.4) (layers *.Cu *.Mask) (remove_unused_layers) (keep_end_layers) (tstamp 4f3be4a3-6019-48d3-a738-a21a1c8594d5))
  (pad "A9" thru_hole circle (at 2.125 -1.35) (size 0.65 0.65) (drill 0.4) (layers *.Cu *.Mask) (remove_unused_layers) (keep_end_layers) (tstamp bb41fd6f-ba03-4683-8f73-cb5318bb08d9))
  (pad "A12" thru_hole circle (at 2.975 -1.35) (size 0.65 0.65) (drill 0.4) (layers *.Cu *.Mask) (remove_unused_layers) (keep_end_layers) (tstamp 27bd41a8-6c67-4768-9a1b-b9be1229f2e7))
  (pad "B1" thru_hole circle (at 2.975 0) (size 0.65 0.65) (drill 0.4) (layers *.Cu *.Mask) (tstamp 5f44d47f-4afa-44b5-aa2b-97852151ba3f))
  (pad "B4" thru_hole circle (at 2.125 0) (size 0.65 0.65) (drill 0.4) (layers *.Cu *.Mask) (remove_unused_layers) (keep_end_layers) (tstamp 77720d2f-5a5d-4132-bd48-207c37a5dd45))
  (pad "B5" thru_hole circle (at 1.275 0) (size 0.65 0.65) (drill 0.4) (layers *.Cu *.Mask) (remove_unused_layers) (keep_end_layers) (tstamp bba604a8-bccd-4d8d-951a-259aa861e43a))
  (pad "B6" thru_hole circle (at 0.425 0) (size 0.65 0.65) (drill 0.4) (layers *.Cu *.Mask) (remove_unused_layers) (keep_end_layers) (tstamp d775847d-e42c-46c2-922f-c50773648c10))
  (pad "B7" thru_hole circle (at -0.425 0) (size 0.65 0.65) (drill 0.4) (layers *.Cu *.Mask) (remove_unused_layers) (keep_end_layers) (tstamp 6b7fe578-daca-4511-ab26-fc489653fd61))
  (pad "B8" thru_hole circle (at -1.275 0) (size 0.65 0.65) (drill 0.4) (layers *.Cu *.Mask) (remove_unused_layers) (keep_end_layers) (tstamp 4e54798e-89dc-4ba5-bae1-b7a9d675bb05))
  (pad "B9" thru_hole circle (at -2.125 0) (size 0.65 0.65) (drill 0.4) (layers *.Cu *.Mask) (remove_unused_layers) (keep_end_layers) (tstamp 335f1f7e-a45b-47d0-812c-a069ba21d62a))
  (pad "B12" thru_hole circle (at -2.975 0) (size 0.65 0.65) (drill 0.4) (layers *.Cu *.Mask) (remove_unused_layers) (keep_end_layers) (tstamp ecd08242-4f5b-4495-916f-67b8b8e5deb0))
  (model "${KICADLIB}/model/connector/GFC_USB4085-GF-A.STEP"
    (offset (xyz 0 -2.65 0))
    (scale (xyz 1 1 1))
    (rotate (xyz -90 0 0))
  )
  (model "${KICADLIB}/model/mechanical/Cable_USBCPlug.step" hide
    (offset (xyz 0 -9.15 1.85))
    (scale (xyz 1 1 1))
    (rotate (xyz 90 0 0))
  )
)
