(module "Molex_5019516010" (layer F.Cu) (tedit 5F37FFAD)
  (fp_text reference "REF**" (at 0 -2.85 unlocked) (layer F.SilkS)
    (effects (font (size 1 1) (thickness 0.15)))
    (tstamp 1d5997aa-0597-4cde-94da-b53196dd3d32)
  )
  (fp_text value "Molex_5019516010" (at 0 -2.85 unlocked) (layer F.Fab) hide
    (effects (font (size 1 1) (thickness 0.15)))
    (tstamp da144897-bee2-4207-a861-d7b6a9798643)
  )
  (fp_text user "^" (at -15.75 2.75 unlocked) (layer F.SilkS)
    (effects (font (size 1 1) (thickness 0.15)))
    (tstamp 65f7350d-ecdb-4b7e-8c24-b152206a2327)
  )
  (fp_text user "${REF}" (at 0 0 unlocked) (layer F.Fab)
    (effects (font (size 1 1) (thickness 0.15)))
    (tstamp 26ad38aa-3ce0-40fd-9474-11e059771f47)
  )
  (fp_line (start -2.9 -1.835341) (end -2.6 -1.835341) (layer F.SilkS) (width 0.12) (tstamp 038d9626-bd8d-4c33-a44a-089e0bbbd4d9))
  (fp_line (start -3.4 1.85) (end -3.1 1.85) (layer F.SilkS) (width 0.12) (tstamp 03cab22e-da28-4023-80c3-db4c1b7fd312))
  (fp_line (start -13.9 -1.835341) (end -13.6 -1.835341) (layer F.SilkS) (width 0.12) (tstamp 07d3e998-059e-4ca6-8627-b5b8e308eaaa))
  (fp_line (start 8.1 -1.835341) (end 8.4 -1.835341) (layer F.SilkS) (width 0.12) (tstamp 08b34bd6-9940-406e-8ca5-cf4bae5360bf))
  (fp_line (start -11.4 1.85) (end -11.1 1.85) (layer F.SilkS) (width 0.12) (tstamp 0ecc73ec-b123-4ee2-bc00-c630fde66042))
  (fp_line (start 7.6 1.85) (end 7.9 1.85) (layer F.SilkS) (width 0.12) (tstamp 172e5189-9a98-4c98-a5da-921aac29b01d))
  (fp_line (start 12.1 -1.835341) (end 12.4 -1.835341) (layer F.SilkS) (width 0.12) (tstamp 17c4fd2f-1436-401a-8fae-499190ff871c))
  (fp_line (start -15.3 -1.85) (end -14.6 -1.85) (layer F.SilkS) (width 0.12) (tstamp 19b62ea7-eb70-4db1-a194-35c12dfab3e6))
  (fp_line (start 8.6 1.85) (end 8.9 1.85) (layer F.SilkS) (width 0.12) (tstamp 1e8aa7f7-1f99-481d-b9b7-b96bf22cf986))
  (fp_line (start 3.6 1.85) (end 3.9 1.85) (layer F.SilkS) (width 0.12) (tstamp 2063c966-406a-4c65-bb9b-286368cfb7f0))
  (fp_line (start 13.6 1.85) (end 13.9 1.85) (layer F.SilkS) (width 0.12) (tstamp 2475b965-7f82-4b1a-acdd-6a78498eac97))
  (fp_line (start -16.4 1.85) (end -16.2 1.85) (layer F.SilkS) (width 0.12) (tstamp 24e83af7-2563-43d0-8b75-474b42a8869e))
  (fp_line (start -12.4 1.85) (end -12.1 1.85) (layer F.SilkS) (width 0.12) (tstamp 2f719f81-eb35-46ea-b790-f9b7919d7c5c))
  (fp_line (start 6.1 -1.835341) (end 6.4 -1.835341) (layer F.SilkS) (width 0.12) (tstamp 315d3fe6-4930-4db0-9fa7-66e60112cfca))
  (fp_line (start 7.1 -1.835341) (end 7.4 -1.835341) (layer F.SilkS) (width 0.12) (tstamp 35015933-9bb6-4bcc-bdd0-2627c77343b1))
  (fp_line (start -15.3 1.85) (end -15.1 1.85) (layer F.SilkS) (width 0.12) (tstamp 3f646fc4-5fa2-4f82-8910-39d8fadf6a17))
  (fp_line (start 4.6 1.85) (end 4.9 1.85) (layer F.SilkS) (width 0.12) (tstamp 45cfb375-46e1-412d-9fd0-f54696c379ea))
  (fp_line (start -3.9 -1.835341) (end -3.6 -1.835341) (layer F.SilkS) (width 0.12) (tstamp 4637188e-a0d4-4efe-81ba-d8c9ffadfbf1))
  (fp_line (start 0.1 -1.835341) (end 0.4 -1.835341) (layer F.SilkS) (width 0.12) (tstamp 4689f0cf-5956-4749-84fe-016c5558539e))
  (fp_line (start 5.6 1.85) (end 5.9 1.85) (layer F.SilkS) (width 0.12) (tstamp 4bbcef10-d438-4f51-9755-db5c9d5abd3a))
  (fp_line (start 16.4 1.85) (end 16.2 1.85) (layer F.SilkS) (width 0.12) (tstamp 4d43c9be-89c3-47aa-a60a-ae6a6b81291e))
  (fp_line (start 4.1 -1.835341) (end 4.4 -1.835341) (layer F.SilkS) (width 0.12) (tstamp 4ef37ae4-e63e-4d95-9e5a-7a184ab815b6))
  (fp_line (start -7.4 1.85) (end -7.1 1.85) (layer F.SilkS) (width 0.12) (tstamp 52f28bdb-36c3-4642-ab6b-b496ef630045))
  (fp_line (start 11.1 -1.835341) (end 11.4 -1.835341) (layer F.SilkS) (width 0.12) (tstamp 5748d94c-8602-46d1-8af5-415926399f5e))
  (fp_line (start -8.4 1.85) (end -8.1 1.85) (layer F.SilkS) (width 0.12) (tstamp 5a879c5c-aed7-4b24-958f-2a8fa16df723))
  (fp_line (start -12.9 -1.835341) (end -12.6 -1.835341) (layer F.SilkS) (width 0.12) (tstamp 67556d47-08c6-4afa-9408-6a529ae24b8b))
  (fp_line (start -10.4 1.85) (end -10.1 1.85) (layer F.SilkS) (width 0.12) (tstamp 687f3e10-ea89-4819-938e-c56cd2f6a5f4))
  (fp_line (start -0.9 -1.835341) (end -0.6 -1.835341) (layer F.SilkS) (width 0.12) (tstamp 6d15131a-98b4-4bed-b498-d395961cde24))
  (fp_line (start -16.4 -1.85) (end -16.25 -1.85) (layer F.SilkS) (width 0.12) (tstamp 70dd890a-6422-4280-aab5-20e1f6576506))
  (fp_line (start 9.1 -1.835341) (end 9.4 -1.835341) (layer F.SilkS) (width 0.12) (tstamp 76254258-8b72-473f-af77-166a04f84941))
  (fp_line (start 5.1 -1.835341) (end 5.4 -1.835341) (layer F.SilkS) (width 0.12) (tstamp 7a530ce3-9a63-4597-ab10-2e5ecd26604d))
  (fp_line (start 10.6 1.85) (end 10.9 1.85) (layer F.SilkS) (width 0.12) (tstamp 7cde5df4-d73d-421c-abd1-6a4d48b07d9a))
  (fp_line (start -0.4 1.85) (end -0.1 1.85) (layer F.SilkS) (width 0.12) (tstamp 7d02f05d-2427-4400-9788-819ec39a633b))
  (fp_line (start -16.4 -1.85) (end -16.4 1.85) (layer F.SilkS) (width 0.12) (tstamp 808639be-060a-464f-a959-380e1d69d6f1))
  (fp_line (start 12.6 1.85) (end 12.9 1.85) (layer F.SilkS) (width 0.12) (tstamp 82d321cd-c95f-4a6c-aa79-0136765d3ac9))
  (fp_line (start -8.9 -1.835341) (end -8.6 -1.835341) (layer F.SilkS) (width 0.12) (tstamp 85df7fe8-712f-4348-8c21-c2caf4451933))
  (fp_line (start -5.9 -1.835341) (end -5.6 -1.835341) (layer F.SilkS) (width 0.12) (tstamp 8b1bf782-a628-404a-8363-fd0028d15be7))
  (fp_line (start -5.4 1.85) (end -5.1 1.85) (layer F.SilkS) (width 0.12) (tstamp 8c125e85-0a62-4522-9796-54ad491570aa))
  (fp_line (start -2.4 1.85) (end -2.1 1.85) (layer F.SilkS) (width 0.12) (tstamp 99fed646-120f-4abc-b604-f76a82f1865d))
  (fp_line (start -4.9 -1.835341) (end -4.6 -1.835341) (layer F.SilkS) (width 0.12) (tstamp a6a94185-b0da-4b26-83fb-028dcce6588c))
  (fp_line (start 1.6 1.85) (end 1.9 1.85) (layer F.SilkS) (width 0.12) (tstamp a8bdfe1a-d0ee-478d-98f9-d2be96187ee6))
  (fp_line (start 14.1 -1.835341) (end 14.4 -1.835341) (layer F.SilkS) (width 0.12) (tstamp ac132da1-be09-4de5-bf1a-5292f4c2242f))
  (fp_line (start -1.9 -1.835341) (end -1.6 -1.835341) (layer F.SilkS) (width 0.12) (tstamp acac81bf-693a-4062-b93c-36e7c7c5f062))
  (fp_line (start 2.6 1.85) (end 2.9 1.85) (layer F.SilkS) (width 0.12) (tstamp b3564f08-96c5-4acb-9819-ae00d6821ea6))
  (fp_line (start -14.4 1.85) (end -14.1 1.85) (layer F.SilkS) (width 0.12) (tstamp ba37582a-38c6-431c-a3cf-31f82c6c6c60))
  (fp_line (start 11.6 1.85) (end 11.9 1.85) (layer F.SilkS) (width 0.12) (tstamp ba51bdbd-1e53-458a-975a-b890a5dfd676))
  (fp_line (start 13.1 -1.835341) (end 13.4 -1.835341) (layer F.SilkS) (width 0.12) (tstamp bff8b8f5-6c30-411c-95e6-a99777c2d0fc))
  (fp_line (start -6.9 -1.835341) (end -6.6 -1.835341) (layer F.SilkS) (width 0.12) (tstamp bffadf5a-e60c-45a5-8407-bf1138aa8775))
  (fp_line (start 1.1 -1.835341) (end 1.4 -1.835341) (layer F.SilkS) (width 0.12) (tstamp c226ac46-5661-41f6-8f36-d5ab3a76b613))
  (fp_line (start 15.3 1.85) (end 14.6 1.85) (layer F.SilkS) (width 0.12) (tstamp c27ce123-2d73-4d38-8686-f8e0cd69563f))
  (fp_line (start 15.3 -1.85) (end 15.1 -1.85) (layer F.SilkS) (width 0.12) (tstamp c297cc54-3d7c-4922-a13c-cd86ff82655f))
  (fp_line (start 16.4 -1.85) (end 16.2 -1.85) (layer F.SilkS) (width 0.12) (tstamp c2eed3ce-9904-484d-8a0f-d6e5b74fe95e))
  (fp_line (start -1.4 1.85) (end -1.1 1.85) (layer F.SilkS) (width 0.12) (tstamp ce92a45c-7df0-40cc-a9a9-1d487370c583))
  (fp_line (start -9.9 -1.835341) (end -9.6 -1.835341) (layer F.SilkS) (width 0.12) (tstamp d457d586-89e3-4064-a5f3-bafe95b3acec))
  (fp_line (start 2.1 -1.835341) (end 2.4 -1.835341) (layer F.SilkS) (width 0.12) (tstamp d4b387b4-d3e9-4190-b73e-50508e7c2d63))
  (fp_line (start 0.6 1.85) (end 0.9 1.85) (layer F.SilkS) (width 0.12) (tstamp d517a17b-e97f-4f1b-988d-6250cb84ec32))
  (fp_line (start -7.9 -1.835341) (end -7.6 -1.835341) (layer F.SilkS) (width 0.12) (tstamp d94ac3ae-dc84-4c84-a68a-905129104f02))
  (fp_line (start -9.4 1.85) (end -9.1 1.85) (layer F.SilkS) (width 0.12) (tstamp db0eddaf-6093-4350-aad4-dae94a965cf5))
  (fp_line (start -11.9 -1.835341) (end -11.6 -1.835341) (layer F.SilkS) (width 0.12) (tstamp db6583b6-cbcf-4483-83bb-a1ce54dfffaf))
  (fp_line (start 16.4 1.85) (end 16.4 -1.85) (layer F.SilkS) (width 0.12) (tstamp dc988152-f26d-401f-9e1a-8374c6c9064e))
  (fp_line (start 9.6 1.85) (end 9.9 1.85) (layer F.SilkS) (width 0.12) (tstamp ddc3d655-90ab-441e-a686-9a2753976422))
  (fp_line (start 10.1 -1.835341) (end 10.4 -1.835341) (layer F.SilkS) (width 0.12) (tstamp e086a010-4fac-4ed4-bc29-96654b76ff16))
  (fp_line (start 6.6 1.85) (end 6.9 1.85) (layer F.SilkS) (width 0.12) (tstamp e7163c67-1b99-4fcc-b7f9-c4916fef6ca9))
  (fp_line (start 3.1 -1.835341) (end 3.4 -1.835341) (layer F.SilkS) (width 0.12) (tstamp eed8962e-a9ee-4af4-8cd8-84fc7a233159))
  (fp_line (start -6.4 1.85) (end -6.1 1.85) (layer F.SilkS) (width 0.12) (tstamp f4cbabc0-43e6-49c5-a956-f3e3ddb3477b))
  (fp_line (start -13.4 1.85) (end -13.1 1.85) (layer F.SilkS) (width 0.12) (tstamp f5a62c6b-72c7-49ff-9238-0c2b9f1258b1))
  (fp_line (start -10.9 -1.835341) (end -10.6 -1.835341) (layer F.SilkS) (width 0.12) (tstamp f64b50b7-b20f-4e4c-8078-534c37dd10c4))
  (fp_line (start -4.4 1.85) (end -4.1 1.85) (layer F.SilkS) (width 0.12) (tstamp ff55a6c3-3e9d-4ad7-a5d7-e2b9fff91c1f))
  (fp_rect (start -16.6 -2.2) (end 16.6 2.2) (layer F.CrtYd) (width 0.05) (tstamp e269b048-faf6-48ed-a320-38792499b906))
  (fp_line (start -15.5 1.85) (end -16.4 0.95) (layer F.Fab) (width 0.1) (tstamp 04ce20b9-e5fb-41c4-8a76-2bbe0fcf6f5f))
  (fp_line (start 16.4 -1.85) (end 16.4 1.85) (layer F.Fab) (width 0.1) (tstamp 0bc54726-5fc7-467e-a116-133fd3d5706f))
  (fp_line (start 16.4 1.85) (end -15.5 1.85) (layer F.Fab) (width 0.1) (tstamp 298808b1-783f-43da-a2f3-19ff1d7e1a30))
  (fp_line (start -16.4 0.95) (end -16.4 -1.85) (layer F.Fab) (width 0.1) (tstamp 5f6de7d9-776c-49b6-9150-b8a2b90ed47b))
  (fp_line (start -16.4 -1.85) (end 16.4 -1.85) (layer F.Fab) (width 0.1) (tstamp 6a2f936a-9ae3-434c-8a2e-9e2409697f9c))
  (pad "" smd rect (at -15.75 -1.35) (size 0.8 1.4) (layers "F.Cu" "F.Paste" "F.Mask") (tstamp 158d87e6-7bb6-4005-8f91-2f5bd10ec146))
  (pad "" smd rect (at -15.75 1.35) (size 0.8 1.4) (layers "F.Cu" "F.Paste" "F.Mask") (tstamp 4ed70ec6-bb32-4e95-891a-3f2cbcd79555))
  (pad "" smd rect (at 15.75 1.35) (size 0.8 1.4) (layers "F.Cu" "F.Paste" "F.Mask") (tstamp 83600e50-1601-48be-a5ff-f1c18bec99e6))
  (pad "" smd rect (at 15.75 -1.39) (size 0.8 1.4) (layers "F.Cu" "F.Paste" "F.Mask") (tstamp acff3b78-298e-4ebd-945e-a2bc006d2a7a))
  (pad "1" smd rect (at -14.75 1.45) (size 0.6 1.2) (layers "F.Cu" "F.Paste" "F.Mask") (tstamp cf2276b0-2089-453b-88e6-afe785895712))
  (pad "2" smd rect (at -14.25 -1.45) (size 0.6 1.2) (layers "F.Cu" "F.Paste" "F.Mask") (tstamp 2d3d4afa-81cb-4d40-807a-1dcc11114ba9))
  (pad "3" smd rect (at -13.75 1.45) (size 0.6 1.2) (layers "F.Cu" "F.Paste" "F.Mask") (tstamp e8f7168f-0c2d-465f-91ee-1e9db240796a))
  (pad "4" smd rect (at -13.25 -1.45) (size 0.6 1.2) (layers "F.Cu" "F.Paste" "F.Mask") (tstamp c10cab03-0b9d-4a02-b9b9-2797e2311479))
  (pad "5" smd rect (at -12.75 1.45) (size 0.6 1.2) (layers "F.Cu" "F.Paste" "F.Mask") (tstamp c5f670d3-89cd-491b-a818-9a1582e08054))
  (pad "6" smd rect (at -12.25 -1.45) (size 0.6 1.2) (layers "F.Cu" "F.Paste" "F.Mask") (tstamp fbdd5206-8128-4e6f-8f01-4ea3fe911a37))
  (pad "7" smd rect (at -11.75 1.45) (size 0.6 1.2) (layers "F.Cu" "F.Paste" "F.Mask") (tstamp 2d612b36-5aa9-4645-9750-4bfe3c8b2e18))
  (pad "8" smd rect (at -11.25 -1.45) (size 0.6 1.2) (layers "F.Cu" "F.Paste" "F.Mask") (tstamp 355ae50a-6006-4677-9f2d-4b9d8727fc85))
  (pad "9" smd rect (at -10.75 1.45) (size 0.6 1.2) (layers "F.Cu" "F.Paste" "F.Mask") (tstamp 08eca28f-4d6f-4678-a811-68d600f9ce24))
  (pad "10" smd rect (at -10.25 -1.45) (size 0.6 1.2) (layers "F.Cu" "F.Paste" "F.Mask") (tstamp b48bace3-9cae-41b6-9c60-732824d1ed7f))
  (pad "11" smd rect (at -9.75 1.45) (size 0.6 1.2) (layers "F.Cu" "F.Paste" "F.Mask") (tstamp 2c4acf4a-2f79-4bf7-980b-e9505ae95516))
  (pad "12" smd rect (at -9.25 -1.45) (size 0.6 1.2) (layers "F.Cu" "F.Paste" "F.Mask") (tstamp e4345e68-d4cb-48ec-a23a-631edd086361))
  (pad "13" smd rect (at -8.75 1.45) (size 0.6 1.2) (layers "F.Cu" "F.Paste" "F.Mask") (tstamp bfb321f5-c9e4-49c1-8559-01a86263cc1b))
  (pad "14" smd rect (at -8.25 -1.45) (size 0.6 1.2) (layers "F.Cu" "F.Paste" "F.Mask") (tstamp 0abdfbd4-559e-47fb-b1fa-a7c22b0ba26d))
  (pad "15" smd rect (at -7.75 1.45) (size 0.6 1.2) (layers "F.Cu" "F.Paste" "F.Mask") (tstamp 9fd64d96-4e37-4b48-bd8c-0ec2f6fba724))
  (pad "16" smd rect (at -7.25 -1.45) (size 0.6 1.2) (layers "F.Cu" "F.Paste" "F.Mask") (tstamp f339873f-5ff2-43d3-99d6-de4584a32502))
  (pad "17" smd rect (at -6.75 1.45) (size 0.6 1.2) (layers "F.Cu" "F.Paste" "F.Mask") (tstamp 6bcf138c-cf08-4b8b-818d-0ded32033399))
  (pad "18" smd rect (at -6.25 -1.45) (size 0.6 1.2) (layers "F.Cu" "F.Paste" "F.Mask") (tstamp 918d7e39-a2cf-47c8-85f0-36e33b369e53))
  (pad "19" smd rect (at -5.75 1.45) (size 0.6 1.2) (layers "F.Cu" "F.Paste" "F.Mask") (tstamp f46c22d2-575b-4f98-a453-fcc235205aab))
  (pad "20" smd rect (at -5.25 -1.45) (size 0.6 1.2) (layers "F.Cu" "F.Paste" "F.Mask") (tstamp a5d38439-ff2e-4a0c-ad6a-f6db19e12483))
  (pad "21" smd rect (at -4.75 1.45) (size 0.6 1.2) (layers "F.Cu" "F.Paste" "F.Mask") (tstamp 6f9fba27-e064-49cf-9f0e-13e46fb1b90b))
  (pad "22" smd rect (at -4.25 -1.45) (size 0.6 1.2) (layers "F.Cu" "F.Paste" "F.Mask") (tstamp 6b25095a-f2a4-435d-824f-09392ac35e5d))
  (pad "23" smd rect (at -3.75 1.45) (size 0.6 1.2) (layers "F.Cu" "F.Paste" "F.Mask") (tstamp 8e69fa08-1af5-4dde-91a0-ea27616d71f8))
  (pad "24" smd rect (at -3.25 -1.45) (size 0.6 1.2) (layers "F.Cu" "F.Paste" "F.Mask") (tstamp b332b1cf-e415-4df0-b371-0c15677c4cfa))
  (pad "25" smd rect (at -2.75 1.45) (size 0.6 1.2) (layers "F.Cu" "F.Paste" "F.Mask") (tstamp b8a16f56-622e-4e0e-9b2b-346191ce7b3b))
  (pad "26" smd rect (at -2.25 -1.45) (size 0.6 1.2) (layers "F.Cu" "F.Paste" "F.Mask") (tstamp 5198cd9a-92d1-4f1f-91a1-ceac3ab8f4b0))
  (pad "27" smd rect (at -1.75 1.45) (size 0.6 1.2) (layers "F.Cu" "F.Paste" "F.Mask") (tstamp c4621803-a0f3-490a-9c8b-aa2cc9ae5143))
  (pad "28" smd rect (at -1.25 -1.45) (size 0.6 1.2) (layers "F.Cu" "F.Paste" "F.Mask") (tstamp 6f311b3d-e47d-4c69-9d96-78ac81b191ae))
  (pad "29" smd rect (at -0.75 1.45) (size 0.6 1.2) (layers "F.Cu" "F.Paste" "F.Mask") (tstamp 830afe9c-f0e3-402d-b862-6993e4f851cb))
  (pad "30" smd rect (at -0.25 -1.45) (size 0.6 1.2) (layers "F.Cu" "F.Paste" "F.Mask") (tstamp 18620be0-2590-4a3e-b0d8-3e62d3647d18))
  (pad "31" smd rect (at 0.25 1.45) (size 0.6 1.2) (layers "F.Cu" "F.Paste" "F.Mask") (tstamp 2536ae78-18e3-4229-9da6-eb190374eaaf))
  (pad "32" smd rect (at 0.75 -1.45) (size 0.6 1.2) (layers "F.Cu" "F.Paste" "F.Mask") (tstamp c747b023-70e4-4915-82e8-d41089ae8663))
  (pad "33" smd rect (at 1.25 1.45) (size 0.6 1.2) (layers "F.Cu" "F.Paste" "F.Mask") (tstamp 0468302c-4056-469d-bde4-f3ab60e90e0a))
  (pad "34" smd rect (at 1.75 -1.45) (size 0.6 1.2) (layers "F.Cu" "F.Paste" "F.Mask") (tstamp 140e846a-f4f0-4817-af2f-a1b5b4037cf9))
  (pad "35" smd rect (at 2.25 1.45) (size 0.6 1.2) (layers "F.Cu" "F.Paste" "F.Mask") (tstamp d85fac1e-7132-4c7c-b97c-e08c4bcb2492))
  (pad "36" smd rect (at 2.75 -1.45) (size 0.6 1.2) (layers "F.Cu" "F.Paste" "F.Mask") (tstamp 6847cfb7-c86d-4c23-a047-8febd6c730e4))
  (pad "37" smd rect (at 3.25 1.45) (size 0.6 1.2) (layers "F.Cu" "F.Paste" "F.Mask") (tstamp 4e7584d3-dda6-4610-b897-53a5a9f64615))
  (pad "38" smd rect (at 3.75 -1.45) (size 0.6 1.2) (layers "F.Cu" "F.Paste" "F.Mask") (tstamp 81e61671-8217-448a-a693-62f1558d8117))
  (pad "39" smd rect (at 4.25 1.45) (size 0.6 1.2) (layers "F.Cu" "F.Paste" "F.Mask") (tstamp ad887697-d039-442f-8f32-515f65bae719))
  (pad "40" smd rect (at 4.75 -1.45) (size 0.6 1.2) (layers "F.Cu" "F.Paste" "F.Mask") (tstamp 8334fb32-9993-4187-a405-f2f0befee076))
  (pad "41" smd rect (at 5.25 1.45) (size 0.6 1.2) (layers "F.Cu" "F.Paste" "F.Mask") (tstamp 3204bdda-d41c-4ce1-b43c-738d455aa6f5))
  (pad "42" smd rect (at 5.75 -1.45) (size 0.6 1.2) (layers "F.Cu" "F.Paste" "F.Mask") (tstamp ec1783bf-39f1-4998-9a37-8b8bc0fbd654))
  (pad "43" smd rect (at 6.25 1.45) (size 0.6 1.2) (layers "F.Cu" "F.Paste" "F.Mask") (tstamp ac06c819-1a01-4017-b80b-79363f127f49))
  (pad "44" smd rect (at 6.75 -1.45) (size 0.6 1.2) (layers "F.Cu" "F.Paste" "F.Mask") (tstamp 280d7cfd-5b88-450f-b575-dc0a55e794dd))
  (pad "45" smd rect (at 7.25 1.45) (size 0.6 1.2) (layers "F.Cu" "F.Paste" "F.Mask") (tstamp f3cddb80-6ff0-4f57-bd6e-9e6d306730b7))
  (pad "46" smd rect (at 7.75 -1.45) (size 0.6 1.2) (layers "F.Cu" "F.Paste" "F.Mask") (tstamp 1b01703e-3ea6-4d1f-8c88-a0dc0e18464c))
  (pad "47" smd rect (at 8.25 1.45) (size 0.6 1.2) (layers "F.Cu" "F.Paste" "F.Mask") (tstamp 71080a76-8465-4be1-a887-63f2e225db96))
  (pad "48" smd rect (at 8.75 -1.45) (size 0.6 1.2) (layers "F.Cu" "F.Paste" "F.Mask") (tstamp a41a5d9b-50a2-4bf9-b0d7-2b26f09ef775))
  (pad "49" smd rect (at 9.25 1.45) (size 0.6 1.2) (layers "F.Cu" "F.Paste" "F.Mask") (tstamp dbd125a0-4fa7-462d-a2a6-c83fff43e40c))
  (pad "50" smd rect (at 9.75 -1.45) (size 0.6 1.2) (layers "F.Cu" "F.Paste" "F.Mask") (tstamp baabbe62-205b-4ad8-b8ac-b53681a648f1))
  (pad "51" smd rect (at 10.25 1.45) (size 0.6 1.2) (layers "F.Cu" "F.Paste" "F.Mask") (tstamp b4710e65-9581-416d-a7d2-6fc861b821f5))
  (pad "52" smd rect (at 10.75 -1.45) (size 0.6 1.2) (layers "F.Cu" "F.Paste" "F.Mask") (tstamp b397fb23-5805-4588-a2b6-3ab407e0e74a))
  (pad "53" smd rect (at 11.25 1.45) (size 0.6 1.2) (layers "F.Cu" "F.Paste" "F.Mask") (tstamp 084d8fcf-ab09-4f4f-ab5c-ed3bce490d21))
  (pad "54" smd rect (at 11.75 -1.45) (size 0.6 1.2) (layers "F.Cu" "F.Paste" "F.Mask") (tstamp 0964f3f5-0890-4977-9f4b-ce9e0747fc18))
  (pad "55" smd rect (at 12.25 1.45) (size 0.6 1.2) (layers "F.Cu" "F.Paste" "F.Mask") (tstamp b69a4bea-bd43-42ad-8499-523aa1805802))
  (pad "56" smd rect (at 12.75 -1.45) (size 0.6 1.2) (layers "F.Cu" "F.Paste" "F.Mask") (tstamp 59b21e80-a335-4bdd-bd70-3b7f9450ea1c))
  (pad "57" smd rect (at 13.25 1.45) (size 0.6 1.2) (layers "F.Cu" "F.Paste" "F.Mask") (tstamp 0949210d-7e7a-47de-9b1a-e5ea05e4be08))
  (pad "58" smd rect (at 13.75 -1.45) (size 0.6 1.2) (layers "F.Cu" "F.Paste" "F.Mask") (tstamp 8a87cea0-49f8-4ea9-8396-254a0a835dd7))
  (pad "59" smd rect (at 14.25 1.45) (size 0.6 1.2) (layers "F.Cu" "F.Paste" "F.Mask") (tstamp 2d380fc1-3880-4f03-9a9b-6d17d412b52b))
  (pad "60" smd rect (at 14.75 -1.45) (size 0.6 1.2) (layers "F.Cu" "F.Paste" "F.Mask") (tstamp f5d5fa93-f669-4ca9-b446-530add94033b))
  (model "${KICADLIB}/model/connector/Molex_5019516010.stp"
    (offset (xyz 0 0 0.525))
    (scale (xyz 1 1 1))
    (rotate (xyz -90 0 0))
  )
)
