(module "ST_VL53L1x" (layer F.Cu) (tedit 5EC5E601)
  (attr smd)
  (fp_text reference "REF**" (at 0 -3.1 unlocked) (layer F.SilkS)
    (effects (font (size 1 1) (thickness 0.15)))
  )
  (fp_text value "ST_VL53L1x" (at 0 3.3 unlocked) (layer F.Fab) hide
    (effects (font (size 1 1) (thickness 0.15)))
  )
  (fp_line (start 1.25 2.45) (end -1.25 2.45) (layer F.SilkS) (width 0.12))
  (fp_line (start -1.25 -2.45) (end -1.25 2.45) (layer F.SilkS) (width 0.12))
  (fp_line (start 1.25 2.45) (end 1.25 -2.45) (layer F.SilkS) (width 0.12))
  (fp_line (start -1.25 -2.45) (end 1.25 -2.45) (layer F.SilkS) (width 0.12))
  (fp_line (start -1.35 -2.55) (end 1.35 -2.55) (layer F.CrtYd) (width 0.05))
  (fp_line (start -1.35 2.55) (end -1.35 -2.55) (layer F.CrtYd) (width 0.05))
  (fp_line (start 1.35 2.55) (end -1.35 2.55) (layer F.CrtYd) (width 0.05))
  (fp_line (start 1.35 -2.55) (end 1.35 2.55) (layer F.CrtYd) (width 0.05))
  (fp_text user "^" (at 2.1 -1.6 90 unlocked) (layer F.SilkS)
    (effects (font (size 1 1) (thickness 0.15)))
  )
  (fp_text user "${REFERENCE}" (at 0 0 270 unlocked) (layer F.Fab)
    (effects (font (size 1 1) (thickness 0.15)))
  )
  (fp_line (start 1.25 -2.45) (end 1.25 2.45) (layer F.Fab) (width 0.1))
  (fp_line (start 1.25 2.45) (end -1.25 2.45) (layer F.Fab) (width 0.1))
  (fp_line (start -1.25 2.45) (end -1.25 -2.45) (layer F.Fab) (width 0.1))
  (fp_line (start -1.25 -2.45) (end 1.25 -2.45) (layer F.Fab) (width 0.1))
  (pad "1" smd rect (at 0.8 -1.6) (size 0.5 0.5) (layers "F.Cu" "F.Paste" "F.Mask") (tstamp c970a84a-598a-45b6-9803-2062e8876129))
  (pad "2" smd rect (at 0.8 -0.8) (size 0.5 0.5) (layers "F.Cu" "F.Paste" "F.Mask") (tstamp f3c591fb-6565-4694-b12b-130b70f05e68))
  (pad "3" smd rect (at 0.8 0) (size 0.5 0.5) (layers "F.Cu" "F.Paste" "F.Mask") (tstamp ff28bf15-0777-493b-9edc-d3baed4d610b))
  (pad "4" smd rect (at 0.8 0.8) (size 0.5 0.5) (layers "F.Cu" "F.Paste" "F.Mask") (tstamp f939f382-f8ea-4efa-b72c-85d0d5412c8c))
  (pad "5" smd rect (at 0.8 1.6) (size 0.5 0.5) (layers "F.Cu" "F.Paste" "F.Mask") (tstamp 6a70447a-fdef-468b-877c-7073ac61e56f))
  (pad "6" smd rect (at 0 1.6) (size 0.5 0.5) (layers "F.Cu" "F.Paste" "F.Mask") (tstamp 13c5aa0a-31c4-4b13-a4a4-157dd1091fba))
  (pad "7" smd rect (at -0.8 1.6) (size 0.5 0.5) (layers "F.Cu" "F.Paste" "F.Mask") (tstamp 80877d40-6b2e-4020-88b3-645603ba67e4))
  (pad "8" smd rect (at -0.8 0.8) (size 0.5 0.5) (layers "F.Cu" "F.Paste" "F.Mask") (tstamp 537518cd-2a39-4832-a402-31aecbb7bd2e))
  (pad "9" smd rect (at -0.8 0) (size 0.5 0.5) (layers "F.Cu" "F.Paste" "F.Mask") (tstamp 4a9353a6-6455-4f19-9e08-86dd3e8eb71c))
  (pad "10" smd rect (at -0.8 -0.8) (size 0.5 0.5) (layers "F.Cu" "F.Paste" "F.Mask") (tstamp 23e7c860-3837-40e3-ba29-60194585866f))
  (pad "11" smd rect (at -0.8 -1.6) (size 0.5 0.5) (layers "F.Cu" "F.Paste" "F.Mask") (tstamp 4ab78249-3d5b-479e-a95b-20aee319e89c))
  (pad "12" smd rect (at 0 -1.6) (size 0.5 0.5) (layers "F.Cu" "F.Paste" "F.Mask") (tstamp 8df1122e-e9ad-4f4e-a64d-7b65207177fe))
  (pad "1" smd rect (at 0.68 -1.89) (size 0.25 0.08) (layers "F.Cu" "F.Paste" "F.Mask") (tstamp a11eb1ef-e106-4309-abb6-fca46a89a5ac))
  (model "${KICADLIB}/model/other/VL53L1x.step"
    (offset (xyz 0 0 0.05))
    (scale (xyz 1 1 1))
    (rotate (xyz 0 0 0))
  )
)
