(module "SOT-353_SC-70-5" (layer F.Cu) (tedit 5EBAFE7D)
  (descr "SOT-353, SC-70-5")
  (tags "SOT-353 SC-70-5")
  (attr smd)
  (fp_text reference "REF**" (at 0 -2) (layer F.SilkS)
    (effects (font (size 1 1) (thickness 0.15)))
  )
  (fp_text value "SOT-353_SC-70-5" (at 0 2 180) (layer F.Fab) hide
    (effects (font (size 1 1) (thickness 0.15)))
  )
  (fp_text user "${REFERENCE}" (at 0 0 90) (layer F.Fab)
    (effects (font (size 0.5 0.5) (thickness 0.075)))
  )
  (fp_line (start -1.4 1.2) (end -1.4 -1.2) (layer F.CrtYd) (width 0.05))
  (fp_line (start -0.7 -1.1) (end 0.7 -1.1) (layer F.SilkS) (width 0.1))
  (fp_line (start -0.7 1.1) (end 0.7 1.1) (layer F.SilkS) (width 0.1))
  (fp_line (start 1.4 -1.2) (end 1.4 1.2) (layer F.CrtYd) (width 0.05))
  (fp_line (start 1.4 1.2) (end -1.4 1.2) (layer F.CrtYd) (width 0.05))
  (fp_line (start -1.4 -1.2) (end 1.4 -1.2) (layer F.CrtYd) (width 0.05))
  (fp_text user "^" (at -1.1 -1.6 180 unlocked) (layer F.SilkS)
    (effects (font (size 1 1) (thickness 0.15)))
  )
  (fp_line (start -0.7 1.1) (end 0.7 1.1) (layer F.Fab) (width 0.1))
  (fp_line (start 0.7 1.1) (end 0.7 -1.1) (layer F.Fab) (width 0.1))
  (fp_line (start 0.7 -1.1) (end -0.35 -1.1) (layer F.Fab) (width 0.1))
  (fp_line (start -0.35 -1.1) (end -0.7 -0.75) (layer F.Fab) (width 0.1))
  (fp_line (start -0.7 -0.75) (end -0.7 1.1) (layer F.Fab) (width 0.1))
  (pad "1" smd rect (at -0.95 -0.65) (size 0.65 0.4) (layers "F.Cu" "F.Paste" "F.Mask") (tstamp d947c37e-fb88-4170-86f8-aecac8458834))
  (pad "3" smd rect (at -0.95 0.65) (size 0.65 0.4) (layers "F.Cu" "F.Paste" "F.Mask") (tstamp cf2873d6-e5ca-4dfa-994a-386ac1575a37))
  (pad "2" smd rect (at -0.95 0) (size 0.65 0.4) (layers "F.Cu" "F.Paste" "F.Mask") (tstamp b451757e-9bf9-49e1-873e-328c207cde99))
  (pad "4" smd rect (at 0.95 0.65) (size 0.65 0.4) (layers "F.Cu" "F.Paste" "F.Mask") (tstamp 52c8eb85-0a11-4a6f-8aba-5d325e0b523d))
  (pad "5" smd rect (at 0.95 -0.65) (size 0.65 0.4) (layers "F.Cu" "F.Paste" "F.Mask") (tstamp 0a0c74b8-a927-4090-9705-7580c87e610d))
  (model "${KICADLIB}/model/SOT/SOT-353_SC-70-5.step"
    (at (xyz 0 0 0))
    (scale (xyz 1 1 1))
    (rotate (xyz 0 0 0))
  )
)
