(footprint "WROOM32" (version 20211014) (generator pcbnew)
  (layer "F.Cu")
  (tedit 5E55AEC3)
  (attr smd)
  (fp_text reference "REF**" (at 0 14) (layer "F.SilkS")
    (effects (font (size 1 1) (thickness 0.15)))
    (tstamp b5885433-5fed-4220-a94f-f93d4d350c4d)
  )
  (fp_text value "${REFERENCE}" (at 0 0) (layer "F.Fab")
    (effects (font (size 1 1) (thickness 0.15)))
    (tstamp 5d338fa1-0478-4452-89c5-7bc17a095baa)
  )
  (fp_text user "^" (at -10 -5.25 270 unlocked) (layer "F.SilkS")
    (effects (font (size 1 1) (thickness 0.15)))
    (tstamp d28254e8-f87d-43f3-9a50-063945e04479)
  )
  (fp_line (start 9 12.75) (end 6.25 12.75) (layer "F.SilkS") (width 0.15) (tstamp 67417970-7b0d-4b51-9e78-f865e5a4fe49))
  (fp_line (start 9 -12.75) (end 9 -5.8) (layer "F.SilkS") (width 0.15) (tstamp 777c421e-f32c-4775-a24b-8c419a78b9fd))
  (fp_line (start 9 12.75) (end 9 11.8) (layer "F.SilkS") (width 0.15) (tstamp 8421ae49-ad32-4620-97ca-78b7871cec68))
  (fp_line (start 9 -12.75) (end -9 -12.75) (layer "F.SilkS") (width 0.15) (tstamp 86d53ece-9cff-4005-9bd9-75a4dc076e72))
  (fp_line (start -9 12.75) (end -9 11.8) (layer "F.SilkS") (width 0.15) (tstamp 904da71d-67de-48e5-9d45-6707790c6337))
  (fp_line (start -9 -12.75) (end -9 -5.8) (layer "F.SilkS") (width 0.15) (tstamp 959441b3-7bd0-4a38-94e0-e81c928ca776))
  (fp_line (start -9 12.75) (end -6.3 12.75) (layer "F.SilkS") (width 0.15) (tstamp ccc1826b-3392-4218-966a-f3298d6f04e4))
  (fp_rect (start -9.5 -13.25) (end 9.5 13.25) (layer "F.CrtYd") (width 0.05) (fill none) (tstamp 7fb57afe-e10e-4293-80e4-b4c4c7feb0a2))
  (fp_line (start 9 -12.75) (end 9 12.75) (layer "F.Fab") (width 0.1) (tstamp 571abe16-0a3a-46b3-9df8-d64ad1d7f8ec))
  (fp_line (start -9 12.75) (end -9 -11) (layer "F.Fab") (width 0.1) (tstamp 82d0a488-d79f-4353-9c6f-26dfa51ae92b))
  (fp_line (start -7.25 -12.75) (end 9 -12.75) (layer "F.Fab") (width 0.1) (tstamp 9e7a0644-6189-436e-979f-5a22b4afc34a))
  (fp_line (start -9 -11) (end -7.25 -12.75) (layer "F.Fab") (width 0.1) (tstamp aa9cd001-7dbb-42b1-bbb9-0d4f8cc5c006))
  (fp_line (start 9 12.75) (end -9 12.75) (layer "F.Fab") (width 0.1) (tstamp c3e9ab6c-5a7b-4eb7-b55b-40305c8fe84a))
  (pad "1" smd rect (at -8.8 -5.26) (size 1 0.95) (layers "F.Cu" "F.Paste" "F.Mask") (tstamp adbe76e8-4953-433f-a554-718e43891548))
  (pad "2" smd rect (at -8.8 -3.99) (size 1 0.95) (layers "F.Cu" "F.Paste" "F.Mask") (tstamp 02c0f19c-a03c-4d26-875b-36ad4d3ef8dc))
  (pad "3" smd rect (at -8.8 -2.72) (size 1 0.95) (layers "F.Cu" "F.Paste" "F.Mask") (tstamp 40de8210-32bc-488a-8fff-58e83181bf70))
  (pad "4" smd rect (at -8.8 -1.45) (size 1 0.95) (layers "F.Cu" "F.Paste" "F.Mask") (tstamp 1925dedf-2572-42d6-a538-abf175361f0e))
  (pad "5" smd rect (at -8.8 -0.18) (size 1 0.95) (layers "F.Cu" "F.Paste" "F.Mask") (tstamp e4f38d99-c76a-4ee1-ba75-26ee0521a64f))
  (pad "6" smd rect (at -8.8 1.09) (size 1 0.95) (layers "F.Cu" "F.Paste" "F.Mask") (tstamp e65b011b-7001-4b5e-8905-247987d656b2))
  (pad "7" smd rect (at -8.8 2.36) (size 1 0.95) (layers "F.Cu" "F.Paste" "F.Mask") (tstamp cd5b83fa-3d85-47c7-8498-f66c9291202a))
  (pad "8" smd rect (at -8.8 3.63) (size 1 0.95) (layers "F.Cu" "F.Paste" "F.Mask") (tstamp a80cd2ab-26c9-4f33-86ff-3a0cb96518ec))
  (pad "9" smd rect (at -8.8 4.9) (size 1 0.95) (layers "F.Cu" "F.Paste" "F.Mask") (tstamp 8c368453-4637-4b53-b1c5-6d72c3e87ae6))
  (pad "10" smd rect (at -8.8 6.17) (size 1 0.95) (layers "F.Cu" "F.Paste" "F.Mask") (tstamp b2694d63-f0ab-4d5c-b92a-eee53659e34d))
  (pad "11" smd rect (at -8.8 7.44) (size 1 0.95) (layers "F.Cu" "F.Paste" "F.Mask") (tstamp 5676647e-78dd-4ee9-b366-2ebe302e81c0))
  (pad "12" smd rect (at -8.8 8.71) (size 1 0.95) (layers "F.Cu" "F.Paste" "F.Mask") (tstamp 974c2133-1b11-465d-b1c3-071709692bcb))
  (pad "13" smd rect (at -8.8 9.98) (size 1 0.95) (layers "F.Cu" "F.Paste" "F.Mask") (tstamp 6bcd2b97-f520-42e7-a3f8-2297757a1dab))
  (pad "14" smd rect (at -8.8 11.25) (size 1 0.95) (layers "F.Cu" "F.Paste" "F.Mask") (tstamp 23046ba6-be5a-4934-8afb-6ca158a63da0))
  (pad "15" smd rect (at -5.73 12.48 90) (size 1 0.95) (layers "F.Cu" "F.Paste" "F.Mask") (tstamp 3ce656b7-3b45-439a-91c3-6c40dd055ee7))
  (pad "16" smd rect (at -4.46 12.48 90) (size 1 0.95) (layers "F.Cu" "F.Paste" "F.Mask") (tstamp 6ff618f6-70fa-4812-ad22-2ff6869d7add))
  (pad "17" smd rect (at -3.19 12.48 90) (size 1 0.95) (layers "F.Cu" "F.Paste" "F.Mask") (tstamp 29cbf67f-8327-4c9d-9c9a-b31280d8b2c0))
  (pad "18" smd rect (at -1.92 12.48 90) (size 1 0.95) (layers "F.Cu" "F.Paste" "F.Mask") (tstamp 14c24602-e983-43a0-87ef-a4c9c57480d1))
  (pad "19" smd rect (at -0.65 12.48 90) (size 1 0.95) (layers "F.Cu" "F.Paste" "F.Mask") (tstamp 942764a8-cb10-404d-9c06-0c5716575d6b))
  (pad "20" smd rect (at 0.62 12.48 90) (size 1 0.95) (layers "F.Cu" "F.Paste" "F.Mask") (tstamp 45477a87-6619-4cfd-b281-80f30d5f4cf9))
  (pad "21" smd rect (at 1.89 12.48 90) (size 1 0.95) (layers "F.Cu" "F.Paste" "F.Mask") (tstamp f8a40622-893f-4158-b671-e4efeb6b9409))
  (pad "22" smd rect (at 3.16 12.48 90) (size 1 0.95) (layers "F.Cu" "F.Paste" "F.Mask") (tstamp 39aa848e-fdd7-4b81-8a47-a3ddda67c83a))
  (pad "23" smd rect (at 4.43 12.48 90) (size 1 0.95) (layers "F.Cu" "F.Paste" "F.Mask") (tstamp 5df7b21d-0c64-4250-b3ab-4b31b33a7d0a))
  (pad "24" smd rect (at 5.7 12.48 90) (size 1 0.95) (layers "F.Cu" "F.Paste" "F.Mask") (tstamp ab19e175-62d6-4e32-b428-60ed076e291e))
  (pad "25" smd rect (at 8.7 11.25) (size 1 0.95) (layers "F.Cu" "F.Paste" "F.Mask") (tstamp 7251f071-4f9a-476a-bf44-80a91d76478e))
  (pad "26" smd rect (at 8.7 9.98) (size 1 0.95) (layers "F.Cu" "F.Paste" "F.Mask") (tstamp 017be1bf-582f-4962-9cbc-c0829f1a01e7))
  (pad "27" smd rect (at 8.7 8.71) (size 1 0.95) (layers "F.Cu" "F.Paste" "F.Mask") (tstamp 70552b7f-f1d5-482c-b21a-a8b636e6f024))
  (pad "28" smd rect (at 8.7 7.44) (size 1 0.95) (layers "F.Cu" "F.Paste" "F.Mask") (tstamp 36a1ac86-a5c0-4748-b34f-2bd7ebcd8764))
  (pad "29" smd rect (at 8.7 6.17) (size 1 0.95) (layers "F.Cu" "F.Paste" "F.Mask") (tstamp 4890bc00-72c7-4922-8895-9da8245bb7ba))
  (pad "30" smd rect (at 8.7 4.9) (size 1 0.95) (layers "F.Cu" "F.Paste" "F.Mask") (tstamp 9079ce63-0e34-4cf8-b2c6-fa9ab4933ec5))
  (pad "31" smd rect (at 8.7 3.63) (size 1 0.95) (layers "F.Cu" "F.Paste" "F.Mask") (tstamp 4344c1b2-b8e2-4e6a-882d-9eac8e71080a))
  (pad "32" smd rect (at 8.7 2.36) (size 1 0.95) (layers "F.Cu" "F.Paste" "F.Mask") (tstamp 16810ab5-3564-4f30-a4ab-1a510cc607b4))
  (pad "33" smd rect (at 8.7 1.09) (size 1 0.95) (layers "F.Cu" "F.Paste" "F.Mask") (tstamp cb29cb96-4910-4ab8-bca7-3a321729764c))
  (pad "34" smd rect (at 8.7 -0.18) (size 1 0.95) (layers "F.Cu" "F.Paste" "F.Mask") (tstamp 8cffe1a7-90dc-4ed8-a2b3-27442a268dea))
  (pad "35" smd rect (at 8.7 -1.45) (size 1 0.95) (layers "F.Cu" "F.Paste" "F.Mask") (tstamp a309d002-1553-48b2-934e-92a9408e42db))
  (pad "36" smd rect (at 8.7 -2.72) (size 1 0.95) (layers "F.Cu" "F.Paste" "F.Mask") (tstamp 70f93f93-b149-4676-913b-be4e0de2cfcb))
  (pad "37" smd rect (at 8.7 -3.99) (size 1 0.95) (layers "F.Cu" "F.Paste" "F.Mask") (tstamp 18552cad-eebb-47a8-87e0-a90f89dda8cc))
  (pad "38" smd rect (at 8.7 -5.26) (size 1 0.95) (layers "F.Cu" "F.Paste" "F.Mask") (tstamp 48c8949f-a246-4bf4-8735-b4819cbf266f))
  (pad "39" smd rect (at 0.7 2.15 90) (size 4 4) (layers "F.Cu" "F.Paste" "F.Mask") (tstamp b5740a01-c73f-4e76-9985-cd013fa770bc))
  (model "${KICADLIB}/model/SoM/esp-wroom-32.stp"
    (offset (xyz -9 -12.75 0))
    (scale (xyz 1 1 1))
    (rotate (xyz -90 0 0))
  )
)
