(module "JAE_DX07B024JJ1R1500" (layer F.Cu) (tedit 5ED18212)
  (attr smd)
  (fp_text reference "REF**" (at 0 -1.9 unlocked) (layer F.SilkS)
    (effects (font (size 1 1) (thickness 0.15)))
  )
  (fp_text value "JAE_DX07B024JJ1R1500" (at 0 -1.9 unlocked) (layer F.SilkS) hide
    (effects (font (size 1 1) (thickness 0.15)))
  )
  (fp_text user "^" (at -2.4 -2 180 unlocked) (layer F.SilkS)
    (effects (font (size 1 1) (thickness 0.15)))
  )
  (fp_text user "${REFERENCE}" (at 0 3.7 unlocked) (layer F.Fab)
    (effects (font (size 1 1) (thickness 0.15)))
  )
  (fp_line (start -2.7 -0.8) (end -4.3 -0.8) (layer F.SilkS) (width 0.1))
  (fp_line (start -4.3 -0.8) (end -4.3 7.4) (layer F.SilkS) (width 0.1))
  (fp_line (start 3.5 -0.8) (end 4.8 -0.8) (layer F.SilkS) (width 0.1))
  (fp_line (start 4.8 -0.8) (end 4.8 7.4) (layer F.SilkS) (width 0.1))
  (fp_line (start 4.8 7.4) (end -4.3 7.4) (layer F.SilkS) (width 0.1))
  (fp_line (start 4.8 -0.8) (end 4.8 7.4) (layer F.Fab) (width 0.1))
  (fp_line (start 4.8 7.4) (end -4.3 7.4) (layer F.Fab) (width 0.1))
  (fp_line (start -4.3 7.4) (end -4.3 0) (layer F.Fab) (width 0.1))
  (fp_line (start -4.3 0) (end -3.5 -0.8) (layer F.Fab) (width 0.1))
  (fp_line (start -3.5 -0.8) (end 4.8 -0.8) (layer F.Fab) (width 0.1))
  (fp_line (start -4.3 7.4) (end -4.3 2.6) (layer Eco1.User) (width 0.1))
  (fp_line (start 4.8 7.4) (end 4.8 2.6) (layer Eco1.User) (width 0.1))
  (fp_line (start -4.3 1.6) (end 4.8 1.6) (layer Eco1.User) (width 0.1))
  (fp_arc (start 4.798893 2.100715) (end 4.798893 2.600715) (angle -180) (layer Eco1.User) (width 0.1))
  (fp_arc (start -4.298893 2.099285) (end -4.298893 1.599285) (angle -180) (layer Eco1.User) (width 0.1))
  (pad "A1" smd rect (at -2.375 -0.7) (size 0.27 0.9) (layers "F.Cu" "F.Paste" "F.Mask") (tstamp 2b13e8d3-4c3d-4707-8084-dc422b22a4ee))
  (pad "A2" smd rect (at -1.875 -0.7) (size 0.27 0.9) (layers "F.Cu" "F.Paste" "F.Mask") (tstamp 9914c66c-4e86-4835-8747-850986b6f644))
  (pad "A3" smd rect (at -1.375 -0.7) (size 0.27 0.9) (layers "F.Cu" "F.Paste" "F.Mask") (tstamp 20d3e3b4-8760-46f6-adf5-5984e0552b48))
  (pad "A4" smd rect (at -0.875 -0.7) (size 0.27 0.9) (layers "F.Cu" "F.Paste" "F.Mask") (tstamp 3c721993-276f-4d7f-a2e8-91ed8e8d8cea))
  (pad "A5" smd rect (at -0.375 -0.7) (size 0.27 0.9) (layers "F.Cu" "F.Paste" "F.Mask") (tstamp 30520183-6ac3-4e46-8e18-e343fb5975d1))
  (pad "A6" smd rect (at 0.125 -0.7) (size 0.27 0.9) (layers "F.Cu" "F.Paste" "F.Mask") (tstamp 6c00dc4f-33fe-4178-b89d-ee27c9112e0b))
  (pad "A7" smd rect (at 0.625 -0.7) (size 0.27 0.9) (layers "F.Cu" "F.Paste" "F.Mask") (tstamp 6c2114c7-a830-41d7-b825-1f8b57a8c538))
  (pad "A8" smd rect (at 1.125 -0.7) (size 0.27 0.9) (layers "F.Cu" "F.Paste" "F.Mask") (tstamp 9747c7cf-c56b-49a5-ad9f-bdef68f3770d))
  (pad "A9" smd rect (at 1.625 -0.7) (size 0.27 0.9) (layers "F.Cu" "F.Paste" "F.Mask") (tstamp cb486cde-edd9-4060-b732-6b9cc0229e0f))
  (pad "A10" smd rect (at 2.125 -0.7) (size 0.27 0.9) (layers "F.Cu" "F.Paste" "F.Mask") (tstamp 64af41cc-36af-4f0c-944a-d9ae9aa40163))
  (pad "A11" smd rect (at 2.625 -0.7) (size 0.27 0.9) (layers "F.Cu" "F.Paste" "F.Mask") (tstamp eb3a0191-0641-45a4-9f66-55a4de756d78))
  (pad "A12" smd rect (at 3.125 -0.7) (size 0.27 0.9) (layers "F.Cu" "F.Paste" "F.Mask") (tstamp d042db66-6b26-4acd-a6b0-8e9414c0649d))
  (pad "B11" smd rect (at -2.125 0.85 180) (size 0.27 0.7) (layers "F.Cu" "F.Paste" "F.Mask") (tstamp eb3a0191-0641-45a4-9f66-55a4de756d78))
  (pad "B10" smd rect (at -1.625 0.85 180) (size 0.27 0.7) (layers "F.Cu" "F.Paste" "F.Mask") (tstamp 64af41cc-36af-4f0c-944a-d9ae9aa40163))
  (pad "B9" smd rect (at -1.125 0.85 180) (size 0.27 0.7) (layers "F.Cu" "F.Paste" "F.Mask") (tstamp cb486cde-edd9-4060-b732-6b9cc0229e0f))
  (pad "B12" smd rect (at -2.625 0.85 180) (size 0.27 0.7) (layers "F.Cu" "F.Paste" "F.Mask") (tstamp d042db66-6b26-4acd-a6b0-8e9414c0649d))
  (pad "B5" smd rect (at 0.875 0.85 180) (size 0.27 0.7) (layers "F.Cu" "F.Paste" "F.Mask") (tstamp 30520183-6ac3-4e46-8e18-e343fb5975d1))
  (pad "B4" smd rect (at 1.375 0.85 180) (size 0.27 0.7) (layers "F.Cu" "F.Paste" "F.Mask") (tstamp 3c721993-276f-4d7f-a2e8-91ed8e8d8cea))
  (pad "B8" smd rect (at -0.625 0.85 180) (size 0.27 0.7) (layers "F.Cu" "F.Paste" "F.Mask") (tstamp 9747c7cf-c56b-49a5-ad9f-bdef68f3770d))
  (pad "B7" smd rect (at -0.125 0.85 180) (size 0.27 0.7) (layers "F.Cu" "F.Paste" "F.Mask") (tstamp 6c2114c7-a830-41d7-b825-1f8b57a8c538))
  (pad "B6" smd rect (at 0.375 0.85 180) (size 0.27 0.7) (layers "F.Cu" "F.Paste" "F.Mask") (tstamp 6c00dc4f-33fe-4178-b89d-ee27c9112e0b))
  (pad "B1" smd rect (at 2.875 0.85 180) (size 0.27 0.7) (layers "F.Cu" "F.Paste" "F.Mask") (tstamp 2b13e8d3-4c3d-4707-8084-dc422b22a4ee))
  (pad "B3" smd rect (at 1.875 0.85 180) (size 0.27 0.7) (layers "F.Cu" "F.Paste" "F.Mask") (tstamp 20d3e3b4-8760-46f6-adf5-5984e0552b48))
  (pad "B2" smd rect (at 2.375 0.85 180) (size 0.27 0.7) (layers "F.Cu" "F.Paste" "F.Mask") (tstamp 9914c66c-4e86-4835-8747-850986b6f644))
  (pad "" thru_hole oval (at -5.63 5.3 180) (size 1.3 2.1) (drill oval 0.7 1.5) (layers *.Cu *.Mask) (tstamp cb6cf833-f65f-4072-b7b9-b4c2fd5534ea))
  (pad "" thru_hole oval (at 6.08 5.3 180) (size 1.3 2.1) (drill oval 0.7 1.5) (layers *.Cu *.Mask) (tstamp b2c049ab-6a58-47f0-a73c-1a06aad57dab))
  (pad "" thru_hole oval (at -4.09 0) (size 1.2 2.3) (drill oval 0.6 1.9) (layers *.Cu *.Mask) (tstamp 4fe3c0c1-2ce2-4bba-ba41-26f7d5ac97b8))
  (pad "" thru_hole oval (at 4.55 -0.02) (size 1.2 2.3) (drill oval 0.6 1.9) (layers *.Cu *.Mask) (tstamp 66cc42aa-cf15-4c4f-a5d6-bcbceb7934e9))
  (pad "" thru_hole oval (at -3.76 0.61 180) (size 1.65 1.1) (drill oval 1.2 0.7 (offset 0.1 0)) (layers *.Cu *.Mask) (tstamp b0cc1ca5-c7ee-4b11-9082-de5183a8571f))
  (pad "" thru_hole oval (at 4.22 0.59) (size 1.65 1.1) (drill oval 1.2 0.7 (offset 0.1 0)) (layers *.Cu *.Mask) (tstamp b0cc1ca5-c7ee-4b11-9082-de5183a8571f))
  (model "${KICADLIB}/model/connector/JAE_K3D-DX07B024JJ1.STEP"
    (offset (xyz 0.25 -2.65 0.45))
    (scale (xyz 1 1 1))
    (rotate (xyz -90 0 0))
  )
)
