(footprint "QFN50P200X150-10" (version 20210623) (generator pcbnew) (layer "F.Cu")
  (tedit 60F8453D)
  (attr smd)
  (fp_text reference "REF**" (at -0.02 -1.62 unlocked) (layer "F.SilkS")
    (effects (font (size 1 1) (thickness 0.15)))
    (tstamp 00000000-0000-0000-0000-000000000000)
  )
  (fp_text value "QFN50P200X150-10" (at -0.01 -1.66 unlocked) (layer "F.Fab") hide
    (effects (font (size 1 1) (thickness 0.15)))
    (tstamp 00000000-0000-0000-0000-000000000000)
  )
  (fp_text user "^" (at -0.75 1.66 unlocked) (layer "F.SilkS")
    (effects (font (size 1 1) (thickness 0.15)))
    (tstamp 00000000-0000-0000-0000-000000000000)
  )
  (fp_text user "${REFERENCE}" (at 0 0 unlocked) (layer "F.Fab")
    (effects (font (size 0.4 0.4) (thickness 0.05)))
    (tstamp 00000000-0000-0000-0000-000000000000)
  )
  (fp_line (start 1 0.74) (end 1 0.24) (layer "F.SilkS") (width 0.12) (tstamp 00000000-0000-0000-0000-000000000000))
  (fp_line (start -1 -0.75) (end -1 -0.25) (layer "F.SilkS") (width 0.12) (tstamp 00000000-0000-0000-0000-000000000000))
  (fp_line (start 1 -0.76) (end 1 -0.24) (layer "F.SilkS") (width 0.12) (tstamp 00000000-0000-0000-0000-000000000000))
  (fp_line (start -1 0.75) (end -1 0.23) (layer "F.SilkS") (width 0.12) (tstamp 00000000-0000-0000-0000-000000000000))
  (fp_line (start -1.3 -1.1) (end 1.3 -1.1) (layer "F.CrtYd") (width 0.05) (tstamp 00000000-0000-0000-0000-000000000000))
  (fp_line (start -1.3 1.1) (end -1.3 -1.1) (layer "F.CrtYd") (width 0.05) (tstamp 00000000-0000-0000-0000-000000000000))
  (fp_line (start 1.3 -1.1) (end 1.3 1.1) (layer "F.CrtYd") (width 0.05) (tstamp 00000000-0000-0000-0000-000000000000))
  (fp_line (start 1.3 1.1) (end -1.3 1.1) (layer "F.CrtYd") (width 0.05) (tstamp 00000000-0000-0000-0000-000000000000))
  (fp_line (start -1 -0.75) (end 1 -0.75) (layer "F.Fab") (width 0.1) (tstamp 00000000-0000-0000-0000-000000000000))
  (fp_line (start 1 0.75) (end -0.55 0.75) (layer "F.Fab") (width 0.1) (tstamp 00000000-0000-0000-0000-000000000000))
  (fp_line (start -1 0.3) (end -1 -0.75) (layer "F.Fab") (width 0.1) (tstamp 00000000-0000-0000-0000-000000000000))
  (fp_line (start 1 -0.75) (end 1 0.75) (layer "F.Fab") (width 0.1) (tstamp 00000000-0000-0000-0000-000000000000))
  (fp_line (start -0.55 0.75) (end -1 0.3) (layer "F.Fab") (width 0.1) (tstamp 00000000-0000-0000-0000-000000000000))
  (pad "1" smd rect (at -0.75 0.64) (size 0.25 0.58) (layers "F.Cu" "F.Paste" "F.Mask") (tstamp 6a3cde4c-3985-4d7e-9cfa-0cbfcf73c04c))
  (pad "2" smd rect (at -0.25 0.64) (size 0.25 0.58) (layers "F.Cu" "F.Paste" "F.Mask") (tstamp 286bfbf3-41a2-4125-9c7a-ed76f83129c8))
  (pad "3" smd rect (at 0.25 0.64) (size 0.25 0.58) (layers "F.Cu" "F.Paste" "F.Mask") (tstamp abfc9a42-ce0d-402e-8391-01df25e31fd3))
  (pad "4" smd rect (at 0.75 0.64) (size 0.25 0.58) (layers "F.Cu" "F.Paste" "F.Mask") (tstamp 6db41272-5041-4d0a-9c56-18b8144e07cc))
  (pad "5" smd rect (at 0.86 0) (size 0.63 0.25) (layers "F.Cu" "F.Paste" "F.Mask") (tstamp 0c7d96d5-4f15-4a70-8d09-5626ef08641f))
  (pad "6" smd rect (at 0.75 -0.64) (size 0.25 0.58) (layers "F.Cu" "F.Paste" "F.Mask") (tstamp 717626c7-046e-488d-8299-5f347088942b))
  (pad "7" smd rect (at 0.25 -0.64) (size 0.25 0.58) (layers "F.Cu" "F.Paste" "F.Mask") (tstamp 8cc244c1-16e3-4e03-b4e4-6b2b01f44f00))
  (pad "8" smd rect (at -0.25 -0.64) (size 0.25 0.58) (layers "F.Cu" "F.Paste" "F.Mask") (tstamp 1f449b60-d264-4fbc-b1d8-4052d3a8376b))
  (pad "9" smd rect (at -0.75 -0.64) (size 0.25 0.58) (layers "F.Cu" "F.Paste" "F.Mask") (tstamp 458a3391-0509-4084-a8cc-75dd70f28b38))
  (pad "10" smd rect (at -0.86 -0.01) (size 0.63 0.25) (layers "F.Cu" "F.Paste" "F.Mask") (tstamp 9beeb2ea-9e5b-4071-acf9-3a9f045da38b))
  (model "${KICADLIB}/model/QFN/QFN50P200X150-10.step"
    (offset (xyz 0 0 0))
    (scale (xyz 1 1 1))
    (rotate (xyz 0 0 -90))
  )
)
