(footprint "MOUNTHOLE_M3_SOCKETHEAD" (version 20211014) (generator pcbnew)
  (layer "F.Cu")
  (tedit 60EC7014)
  (fp_text reference "REF**" (at 0 3.75) (layer "F.SilkS")
    (effects (font (size 1 1) (thickness 0.15)))
    (tstamp a74b2fff-269f-4871-84ab-d8716b9cf24a)
  )
  (fp_text value "MOUNTHOLE_M3_SOCKETHEAD" (at 0 -1.3) (layer "F.Fab")
    (effects (font (size 1 1) (thickness 0.15)))
    (tstamp bf1b42be-1c7a-41cb-b565-6812f35e4a59)
  )
  (fp_text user "${REFERENCE}" (at 0 1.25 unlocked) (layer "F.Fab")
    (effects (font (size 1 1) (thickness 0.15)))
    (tstamp 914c1a7b-f3ae-4e5b-99fe-913e06ba15e9)
  )
  (fp_circle (center 0 0) (end 5.5 0) (layer "Dwgs.User") (width 0.1) (fill none) (tstamp 3083d5b9-de26-4c5a-9fee-a5afcc35c056))
  (fp_circle (center 0 0) (end 0 -3.1) (layer "F.CrtYd") (width 0.05) (fill none) (tstamp a4bd2d0b-e409-4437-8482-42c47c83f1d8))
  (fp_circle (center 0 0) (end 0 -3) (layer "F.Fab") (width 0.1) (fill none) (tstamp d16dcd87-33dc-46c4-a855-ba83eca8f115))
  (pad "" np_thru_hole circle (at 0 0) (size 6 6) (drill 3.3) (layers F&B.Cu *.Mask) (tstamp a3fc3f5f-6427-4c08-af14-a1edd02ec94a))
  (model "${KICADLIB}/model/mechanical/SCREW_M3-TORX-SOCKETHEAD_5MM_90128A187.STEP"
    (offset (xyz 0 0 -5.1))
    (scale (xyz 1 1 1))
    (rotate (xyz 180 0 0))
  )
)
