(module "JST_SM04B-SRSS-TB" (layer F.Cu) (tedit 5F061158)
  (attr smd)
  (fp_text reference "REF**" (at 0 -4 unlocked) (layer F.SilkS)
    (effects (font (size 1 1) (thickness 0.15)))
  )
  (fp_text value "JST_SM04B-SRSS-TB" (at 0 -4 unlocked) (layer F.Fab) hide
    (effects (font (size 1 1) (thickness 0.15)))
  )
  (fp_text user "^" (at 1.5 -3.95 180 unlocked) (layer F.SilkS)
    (effects (font (size 1 1) (thickness 0.15)))
  )
  (fp_line (start -1.9 -2.1) (end -3 -2.1) (layer F.SilkS) (width 0.1))
  (fp_line (start -3 -2.1) (end -3 0.5) (layer F.SilkS) (width 0.1))
  (fp_line (start 2.85 0.5) (end 2.85 -2.1) (layer F.SilkS) (width 0.1))
  (fp_line (start 2.85 -2.1) (end 1.9 -2.1) (layer F.SilkS) (width 0.1))
  (fp_line (start 1.9 2.2) (end -2 2.2) (layer F.SilkS) (width 0.1))
  (fp_line (start -3.5 2.55) (end 3.5 2.55) (layer F.CrtYd) (width 0.05))
  (fp_line (start 3.5 2.55) (end 3.5 -3.6) (layer F.CrtYd) (width 0.05))
  (fp_line (start 3.5 -3.6) (end -3.5 -3.6) (layer F.CrtYd) (width 0.05))
  (fp_line (start -3.5 -3.6) (end -3.5 2.55) (layer F.CrtYd) (width 0.05))
  (fp_text user "${REFERENCE}" (at 0 0 unlocked) (layer F.Fab)
    (effects (font (size 1 1) (thickness 0.15)))
  )
  (fp_line (start -3 -2.1) (end -3 2.2) (layer F.Fab) (width 0.1))
  (fp_line (start -3 2.2) (end 2.85 2.2) (layer F.Fab) (width 0.1))
  (fp_line (start 2.85 2.2) (end 2.85 -1.7) (layer F.Fab) (width 0.1))
  (fp_line (start 2.85 -1.7) (end 2.45 -2.1) (layer F.Fab) (width 0.1))
  (fp_line (start 2.45 -2.1) (end -3 -2.1) (layer F.Fab) (width 0.1))
  (pad "" smd rect (at 2.6 1.5) (size 1.2 1.8) (layers "F.Cu" "F.Paste" "F.Mask") (tstamp 14739ebe-ff9b-412c-9a79-4ebc67e1ee34))
  (pad "" smd rect (at -2.75 1.5) (size 1.2 1.8) (layers "F.Cu" "F.Paste" "F.Mask") (tstamp 6cb05f49-c3b5-42c7-a403-d6e8ec1fdae7))
  (pad "1" smd rect (at 1.5 -2.45) (size 0.6 1.55) (layers "F.Cu" "F.Paste" "F.Mask") (tstamp 9352d58c-431b-41cf-9096-a3cd914b80f1))
  (pad "2" smd rect (at 0.5 -2.45) (size 0.6 1.55) (layers "F.Cu" "F.Paste" "F.Mask") (tstamp 3c5e88bb-cfb4-4017-9dc6-2e6e7a8ef1ae))
  (pad "3" smd rect (at -0.5 -2.45) (size 0.6 1.55) (layers "F.Cu" "F.Paste" "F.Mask") (tstamp a2b0500c-0a31-4390-b35e-5c253a106f84))
  (pad "4" smd rect (at -1.5 -2.45) (size 0.6 1.55) (layers "F.Cu" "F.Paste" "F.Mask") (tstamp fa58e803-47d1-4649-bacd-127a89027964))
  (model "${KICADLIB}/model/connector/JST_SM04B-SRSS-TB.STEP"
    (offset (xyz 0 1.75 -0.3))
    (scale (xyz 1 1 1))
    (rotate (xyz -90 0 0))
  )
)
