(footprint "Knowles_SPU0410LR5H-QB" (version 20221018) (generator pcbnew)
  (layer "F.Cu")
  (attr smd)
  (fp_text reference "REF**" (at 0.01 -3.4) (layer "F.SilkS")
      (effects (font (size 1 1) (thickness 0.15)))
    (tstamp a5684d91-13d4-446e-b3e2-328cc2a8b64e)
  )
  (fp_text value "Knowles_SPU0410LR5H-QB" (at 0 -3.42) (layer "F.Fab") hide
      (effects (font (size 1 1) (thickness 0.15)))
    (tstamp 5a1cf982-cd23-4770-b646-6a680c6a7f4c)
  )
  (fp_text user "^" (at -2.3 -2.1 -90 unlocked) (layer "F.SilkS")
      (effects (font (size 1 1) (thickness 0.15)))
    (tstamp 7e93ac0c-be2d-4aff-a2c1-5b0fc239f2c1)
  )
  (fp_poly
    (pts
      (xy -0.3 0.1)
      (xy -0.5 0.3)
      (xy -0.6 0.2)
      (xy -0.6 -0.2)
      (xy -0.5 -0.3)
      (xy -0.3 -0.1)
    )

    (stroke (width 0.15) (type solid)) (fill solid) (layer "F.Paste") (tstamp 91f81f73-87e2-4f2d-af89-285b8d4d8c73))
  (fp_poly
    (pts
      (xy -0.1 -0.3)
      (xy -0.3 -0.5)
      (xy -0.2 -0.6)
      (xy 0.2 -0.6)
      (xy 0.3 -0.5)
      (xy 0.1 -0.3)
    )

    (stroke (width 0.15) (type solid)) (fill solid) (layer "F.Paste") (tstamp 3764e6c7-2841-4887-9c7e-6f5c6a4bf029))
  (fp_poly
    (pts
      (xy 0.1 0.3)
      (xy 0.3 0.5)
      (xy 0.2 0.6)
      (xy -0.2 0.6)
      (xy -0.3 0.5)
      (xy -0.1 0.3)
    )

    (stroke (width 0.15) (type solid)) (fill solid) (layer "F.Paste") (tstamp 939a8b95-7667-4936-a560-f0606a980fba))
  (fp_poly
    (pts
      (xy 0.3 -0.1)
      (xy 0.5 -0.3)
      (xy 0.6 -0.2)
      (xy 0.6 0.2)
      (xy 0.5 0.3)
      (xy 0.3 0.1)
    )

    (stroke (width 0.15) (type solid)) (fill solid) (layer "F.Paste") (tstamp 4218f1f6-1542-4420-877e-1ab60138490a))
  (fp_line (start -1.5 -2.64) (end -1.5 1.12)
    (stroke (width 0.15) (type solid)) (layer "F.SilkS") (tstamp 0d46c0a9-68d6-4584-ab43-76f7c6fb05ba))
  (fp_line (start -1.5 1.12) (end 1.5 1.12)
    (stroke (width 0.15) (type solid)) (layer "F.SilkS") (tstamp 3bad1e20-dd5a-4067-96a5-9f1e8735f0c8))
  (fp_line (start 1.5 -2.64) (end -1.5 -2.64)
    (stroke (width 0.15) (type solid)) (layer "F.SilkS") (tstamp be3a7f51-3aff-4971-8cdc-d8d1ec548dfa))
  (fp_line (start 1.5 1.12) (end 1.5 -2.64)
    (stroke (width 0.15) (type solid)) (layer "F.SilkS") (tstamp 1e2d80d3-1871-407d-a081-e9229c99eb06))
  (fp_rect (start -1.7 -2.8) (end 1.7 1.3)
    (stroke (width 0.05) (type default)) (fill none) (layer "F.CrtYd") (tstamp d7c58be6-5a6c-4b21-a15e-4f3fccf921c0))
  (fp_line (start -1.5 -2.15) (end -1 -2.65)
    (stroke (width 0.1) (type default)) (layer "F.Fab") (tstamp 957ffec3-29b0-4d71-8f16-419960192996))
  (fp_line (start -1.5 1.1) (end -1.5 -2.15)
    (stroke (width 0.1) (type default)) (layer "F.Fab") (tstamp 5ac55a0a-b12d-46b4-a053-2eae59757123))
  (fp_line (start -1 -2.65) (end 1.5 -2.65)
    (stroke (width 0.1) (type default)) (layer "F.Fab") (tstamp 8675b475-df16-4cfd-ae3b-72478336ff75))
  (fp_line (start 1.5 -2.65) (end 1.5 1.1)
    (stroke (width 0.1) (type default)) (layer "F.Fab") (tstamp 4364ecc7-a749-41f7-974f-8d26db68306f))
  (fp_line (start 1.5 1.1) (end -1.5 1.1)
    (stroke (width 0.1) (type default)) (layer "F.Fab") (tstamp f281fdfd-8523-42fa-86b3-bf4997b04b39))
  (pad "1" smd circle (at -0.97 -2.1) (size 0.723 0.723) (layers "F.Cu" "F.Paste" "F.Mask") (tstamp fe9ab88e-80b3-42b9-b7f4-802287a6f788))
  (pad "2" smd circle (at -1.02 0.63) (size 0.562 0.562) (layers "F.Cu" "F.Paste" "F.Mask") (tstamp d961ec7d-5ce5-490f-aa04-03745f210e19))
  (pad "3" smd circle (at 1.02 0.63) (size 0.562 0.562) (layers "F.Cu" "F.Paste" "F.Mask") (tstamp 55996ece-a99a-4b85-a607-47a2decdc377))
  (pad "4" smd circle (at 0.97 -2.1) (size 0.723 0.723) (layers "F.Cu" "F.Paste" "F.Mask") (tstamp 19cf1e58-6a9a-43aa-b5aa-ca6ed1a59e34))
  (pad "5" smd circle (at 0 -2.1) (size 0.612 0.612) (layers "F.Cu" "F.Paste" "F.Mask") (tstamp bf32ddf2-9333-4318-be92-ae496b4608ee))
  (pad "6" thru_hole circle (at 0 0) (size 1.224 1.224) (drill 0.61) (layers "*.Cu" "*.Mask") (tstamp f2aade73-3d8f-4835-a36c-4b7ee8d7d030))
  (model "${KICADLIB}/model/other/Knowles_SPU0410LR5H-QB.step"
    (offset (xyz 0 0.75 0))
    (scale (xyz 1 1 1))
    (rotate (xyz 0 0 180))
  )
)
