(footprint "PinHeader_1x02_P2.54mm_Vertical" (version 20211014) (generator pcbnew)
  (layer "F.Cu")
  (tedit 6116C4B0)
  (descr "Through hole straight pin header, 1x02, 2.54mm pitch, single row")
  (tags "Through hole pin header THT 1x02 2.54mm single row")
  (attr through_hole)
  (fp_text reference "REF**" (at 0 -2.33) (layer "F.SilkS")
    (effects (font (size 1 1) (thickness 0.15)))
    (tstamp 60528f7a-b431-4dd2-a0b7-0cc8c4f80389)
  )
  (fp_text value "PinHeader_1x02_P2.54mm_Vertical" (at 0 4.87) (layer "F.Fab") hide
    (effects (font (size 1 1) (thickness 0.15)))
    (tstamp 88646578-25be-41c8-a790-323d07fe18fa)
  )
  (fp_text user "^" (at -2.2 0 -90 unlocked) (layer "B.SilkS")
    (effects (font (size 1 1) (thickness 0.15)) (justify mirror))
    (tstamp 6a6469d4-88c9-4932-b178-71c1a909b825)
  )
  (fp_text user "^" (at -2.2 0 270 unlocked) (layer "F.SilkS")
    (effects (font (size 1 1) (thickness 0.15)))
    (tstamp c4b9d6ed-4131-4b5b-80d5-593b537330b8)
  )
  (fp_text user "${REFERENCE}" (at 0 1.27 90) (layer "F.Fab")
    (effects (font (size 1 1) (thickness 0.15)))
    (tstamp 1ca83451-4e42-4936-8a70-ddbc96e79528)
  )
  (fp_line (start 1.33 1.27) (end 1.33 3.87) (layer "F.SilkS") (width 0.12) (tstamp 1e00988a-adca-4722-aa4b-6d5311546bb5))
  (fp_line (start -1.33 -1.33) (end 0 -1.33) (layer "F.SilkS") (width 0.12) (tstamp 234e45ca-1ff7-4e30-8285-54fe60c7abfc))
  (fp_line (start -1.33 1.27) (end -1.33 3.87) (layer "F.SilkS") (width 0.12) (tstamp 6f083405-4a63-4349-af28-39538b7e9fcd))
  (fp_line (start -1.33 1.27) (end 1.33 1.27) (layer "F.SilkS") (width 0.12) (tstamp cbacd255-dfce-45dc-a40b-9851fe8687fd))
  (fp_line (start -1.33 3.87) (end 1.33 3.87) (layer "F.SilkS") (width 0.12) (tstamp de96d0eb-52b0-480a-8586-f787a8b12b94))
  (fp_line (start -1.33 0) (end -1.33 -1.33) (layer "F.SilkS") (width 0.12) (tstamp e8df8ca2-d008-4750-9923-4ab7917a29d1))
  (fp_line (start -1.8 -1.8) (end -1.8 4.35) (layer "F.CrtYd") (width 0.05) (tstamp 1951d916-452c-4704-bd44-50829f23603f))
  (fp_line (start -1.8 4.35) (end 1.8 4.35) (layer "F.CrtYd") (width 0.05) (tstamp 3ae5ab5e-a021-4b8b-ac91-5e4bcbc4fd2d))
  (fp_line (start 1.8 -1.8) (end -1.8 -1.8) (layer "F.CrtYd") (width 0.05) (tstamp 680a0231-72de-4599-a7f3-a699cfa03f22))
  (fp_line (start 1.8 4.35) (end 1.8 -1.8) (layer "F.CrtYd") (width 0.05) (tstamp f99e67f1-cddc-4d77-92bc-54c76641b2db))
  (fp_line (start -0.635 -1.27) (end 1.27 -1.27) (layer "F.Fab") (width 0.1) (tstamp 189c52e1-a646-49ee-8ebe-090c7281ff2d))
  (fp_line (start 1.27 -1.27) (end 1.27 3.81) (layer "F.Fab") (width 0.1) (tstamp 1aa0d4e6-f0b4-497d-a9f3-0d80fd49b3ee))
  (fp_line (start 1.27 3.81) (end -1.27 3.81) (layer "F.Fab") (width 0.1) (tstamp 32d47bf6-9fdf-46a8-9095-218dfed42c00))
  (fp_line (start -1.27 -0.635) (end -0.635 -1.27) (layer "F.Fab") (width 0.1) (tstamp 3d31b462-c16f-46f9-aab8-50b08bc31318))
  (fp_line (start -1.27 3.81) (end -1.27 -0.635) (layer "F.Fab") (width 0.1) (tstamp e9749cce-c950-48bc-ac25-27f158fa1323))
  (pad "1" thru_hole rect (at 0 0) (size 1.7 1.7) (drill 1) (layers *.Cu *.Mask) (remove_unused_layers) (keep_end_layers) (tstamp b53d30e8-2ff6-477c-8e6c-ea1d9ef079e0))
  (pad "2" thru_hole oval (at 0 2.54) (size 1.7 1.7) (drill 1) (layers *.Cu *.Mask) (remove_unused_layers) (keep_end_layers) (tstamp ab4cc2ae-a47e-47aa-a130-a57bc3a0b95f))
  (model "${KICADLIB}/model/connector/PinHeader_1x02_P2.54mm_Vertical.step"
    (offset (xyz 0 0 0))
    (scale (xyz 1 1 1))
    (rotate (xyz 0 0 0))
  )
)
