(footprint "Crystal_2012_2pad" (version 20221018) (generator pcbnew)
  (layer "F.Cu")
  (attr smd)
  (fp_text reference "REF**" (at 0.02 -1.35 unlocked) (layer "F.SilkS")
      (effects (font (size 1 1) (thickness 0.15)))
    (tstamp fdc22f54-f207-4d54-9a00-42e8a5d9f160)
  )
  (fp_text value "Crystal_2012_2pad" (at 0 1.3 unlocked) (layer "F.Fab") hide
      (effects (font (size 1 1) (thickness 0.15)))
    (tstamp 6adcfa05-53b5-4bb8-9abf-c48fda86da17)
  )
  (fp_text user "^" (at -0.75 1.35 unlocked) (layer "F.SilkS")
      (effects (font (size 1 1) (thickness 0.15)))
    (tstamp 1b8be7ef-0cc9-466d-9bc3-753f1b07fb0f)
  )
  (fp_text user "${REFERENCE}" (at 0 0 unlocked) (layer "F.Fab")
      (effects (font (size 0.4 0.4) (thickness 0.05)))
    (tstamp 5b969365-655a-4305-9b5d-dc1d402f348b)
  )
  (fp_poly
    (pts
      (xy -0.5 -0.15)
      (xy -1 -0.15)
      (xy -1 -0.6)
      (xy -0.5 -0.6)
    )

    (stroke (width 0.01) (type solid)) (fill solid) (layer "F.Paste") (tstamp 155ba73a-498d-4722-8e4f-9112808289ab))
  (fp_poly
    (pts
      (xy -0.5 0.6)
      (xy -1 0.6)
      (xy -1 0.15)
      (xy -0.5 0.15)
    )

    (stroke (width 0.01) (type solid)) (fill solid) (layer "F.Paste") (tstamp 53e3c0ca-b315-4470-8ae8-c3302f84e81a))
  (fp_poly
    (pts
      (xy 1 -0.15)
      (xy 0.5 -0.15)
      (xy 0.5 -0.6)
      (xy 1 -0.6)
    )

    (stroke (width 0.01) (type solid)) (fill solid) (layer "F.Paste") (tstamp 17e8295e-0a16-49bc-adb2-f9418998c9eb))
  (fp_poly
    (pts
      (xy 1 0.6)
      (xy 0.5 0.6)
      (xy 0.5 0.15)
      (xy 1 0.15)
    )

    (stroke (width 0.01) (type solid)) (fill solid) (layer "F.Paste") (tstamp 6c810d38-a0a5-4926-8b1e-d93597e5c2ae))
  (fp_line (start -0.2 -0.6) (end 0.2 -0.6)
    (stroke (width 0.1) (type solid)) (layer "F.SilkS") (tstamp e79fddeb-ce2b-42b8-b28b-068853af933e))
  (fp_line (start -0.2 0.6) (end 0.2 0.6)
    (stroke (width 0.1) (type solid)) (layer "F.SilkS") (tstamp 5f1d100c-6680-4645-81b7-3795103c43c8))
  (fp_rect (start -1.2 -0.75) (end 1.2 0.75)
    (stroke (width 0.05) (type default)) (fill none) (layer "F.CrtYd") (tstamp 06627c18-3f09-4f4d-8d90-b76b4794cfdd))
  (fp_poly
    (pts
      (xy -1 -0.6)
      (xy -1 0.15)
      (xy -0.55 0.6)
      (xy 1 0.6)
      (xy 1 -0.6)
    )

    (stroke (width 0.1) (type solid)) (fill none) (layer "F.Fab") (tstamp aef5b35c-8e67-4d96-8847-f8b0068fe054))
  (pad "1" smd roundrect (at -0.7 0) (size 0.8 1.3) (layers "F.Cu" "F.Mask") (roundrect_rratio 0.0625) (tstamp 00bd729d-1b06-4ee3-8e29-946fc76ebecf))
  (pad "2" smd roundrect (at 0.7 0) (size 0.8 1.3) (layers "F.Cu" "F.Mask") (roundrect_rratio 0.0625) (tstamp 106b81ea-01cf-4735-ac05-098bafd7e74b))
  (model "${KICADLIB}/model/clock/Crystal2012-2.step"
    (offset (xyz 0 0 0.01))
    (scale (xyz 1 1 1))
    (rotate (xyz 0 0 0))
  )
)
