(footprint "WL1835MODGB" (version 20211014) (generator pcbnew)
  (layer "F.Cu")
  (tedit 61A0E7BA)
  (attr smd)
  (fp_text reference "REF**" (at 0 -15 unlocked) (layer "F.SilkS")
    (effects (font (size 1 1) (thickness 0.15)))
    (tstamp 6df08910-50b5-4f00-9566-52f9d2fd59b2)
  )
  (fp_text value "WL1835MODGB" (at 0 1 unlocked) (layer "F.Fab") hide
    (effects (font (size 1 1) (thickness 0.15)))
    (tstamp 6733fb9b-51de-4688-b26f-256fabfa1be5)
  )
  (fp_text user "^" (at -7.5 -6 -90 unlocked) (layer "F.SilkS")
    (effects (font (size 1 1) (thickness 0.15)))
    (tstamp 857efbf2-8be3-42ff-b6dd-0cccdad6602c)
  )
  (fp_text user "${REFERENCE}" (at 0 0 unlocked) (layer "F.Fab")
    (effects (font (size 1 1) (thickness 0.15)))
    (tstamp b47bec3b-8a7f-4e83-8d44-9a87874e5e8b)
  )
  (fp_rect (start -6.7 -6.7) (end 6.7 6.7) (layer "F.SilkS") (width 0.1) (fill none) (tstamp 18465579-c7cb-4493-b3bc-dd4392610c6b))
  (fp_rect (start -7 -7) (end 7 7) (layer "F.CrtYd") (width 0.05) (fill none) (tstamp f5ed558f-80ed-4443-bc97-1b09457375e3))
  (fp_line (start -6 -6.7) (end 6.7 -6.7) (layer "F.Fab") (width 0.1) (tstamp 07ac44f0-0996-4b5d-aadb-79336ead9e8a))
  (fp_line (start 6.7 6.7) (end -6.7 6.7) (layer "F.Fab") (width 0.1) (tstamp 0fa93b70-51d9-4047-ada9-e9021ea47d28))
  (fp_line (start -6 -6.7) (end -6.7 -6) (layer "F.Fab") (width 0.1) (tstamp 435a69d9-5f29-4ef8-a076-0b513b0750e5))
  (fp_line (start 6.7 -6.7) (end 6.7 6.7) (layer "F.Fab") (width 0.1) (tstamp 8a3ba31e-10c2-456b-88ba-d95ebe212817))
  (fp_line (start -6.7 6.7) (end -6.7 -6) (layer "F.Fab") (width 0.1) (tstamp 8e362cb7-8fb9-4a05-a7f8-149ff5df9b82))
  (pad "1" smd rect (at -5.975 -6.025) (size 0.75 0.75) (layers "F.Cu" "F.Paste" "F.Mask") (tstamp e4a0a170-24d1-4d2e-a23d-026d2cf2324d))
  (pad "2" smd rect (at -5.975 -4.9) (size 0.75 0.4) (layers "F.Cu" "F.Paste" "F.Mask") (tstamp 9b866222-0657-414a-9974-0a63aa0bcb13))
  (pad "3" smd rect (at -5.975 -4.2) (size 0.75 0.4) (layers "F.Cu" "F.Paste" "F.Mask") (tstamp d0dc59da-56ef-4bc1-b6f2-7a49a8348bf3))
  (pad "4" smd rect (at -5.975 -3.5) (size 0.75 0.4) (layers "F.Cu" "F.Paste" "F.Mask") (tstamp d5faeac0-7eae-4351-8d03-bf4f312be19b))
  (pad "5" smd rect (at -5.975 -2.8) (size 0.75 0.4) (layers "F.Cu" "F.Paste" "F.Mask") (tstamp 653b67a6-2ddd-4371-9545-baa96ab66e7d))
  (pad "6" smd rect (at -5.975 -2.1) (size 0.75 0.4) (layers "F.Cu" "F.Paste" "F.Mask") (tstamp 87c9addb-c321-44b9-b911-9b8a526f3af5))
  (pad "7" smd rect (at -5.975 -1.4) (size 0.75 0.4) (layers "F.Cu" "F.Paste" "F.Mask") (tstamp c7c9acfa-7d9a-4ae6-b203-3913479e780d))
  (pad "8" smd rect (at -5.975 -0.7) (size 0.75 0.4) (layers "F.Cu" "F.Paste" "F.Mask") (tstamp 54985f98-ee8d-46ca-a0ae-0b2cfa1a9c80))
  (pad "9" smd rect (at -5.975 0) (size 0.75 0.4) (layers "F.Cu" "F.Paste" "F.Mask") (tstamp 9c35a354-e6e5-4d62-bede-9025e11709b1))
  (pad "10" smd rect (at -5.975 0.7) (size 0.75 0.4) (layers "F.Cu" "F.Paste" "F.Mask") (tstamp 1ac68372-2f97-4902-804c-0385009f0446))
  (pad "11" smd rect (at -5.975 1.4) (size 0.75 0.4) (layers "F.Cu" "F.Paste" "F.Mask") (tstamp 0be6f062-a230-40af-b848-09f9f502a3d7))
  (pad "12" smd rect (at -5.975 2.1) (size 0.75 0.4) (layers "F.Cu" "F.Paste" "F.Mask") (tstamp a5aab76c-b39f-4700-9b66-b3a43ae226e7))
  (pad "13" smd rect (at -5.975 2.8) (size 0.75 0.4) (layers "F.Cu" "F.Paste" "F.Mask") (tstamp 34c2595e-7281-4fdf-b6dd-5bbb55760c91))
  (pad "14" smd rect (at -5.975 3.5) (size 0.75 0.4) (layers "F.Cu" "F.Paste" "F.Mask") (tstamp 28f1ac0b-3fbd-4c35-a756-c2d40312f1d8))
  (pad "15" smd rect (at -5.975 4.2) (size 0.75 0.4) (layers "F.Cu" "F.Paste" "F.Mask") (tstamp 90250165-6b84-4be9-9935-a2b63cc92e32))
  (pad "16" smd rect (at -5.975 4.9) (size 0.75 0.4) (layers "F.Cu" "F.Paste" "F.Mask") (tstamp 08d8cba5-aff4-4247-87d7-cb2d73d47e7e))
  (pad "17" smd rect (at -5.975 6.025) (size 0.75 0.75) (layers "F.Cu" "F.Paste" "F.Mask") (tstamp 093ecf9a-b03a-4701-af3b-3aae44ff4b70))
  (pad "18" smd rect (at -4.9 6.025 90) (size 0.75 0.4) (layers "F.Cu" "F.Paste" "F.Mask") (tstamp 718c7fb3-e250-4d5b-a3ef-bdd7f94d386c))
  (pad "19" smd rect (at -4.2 6.025 90) (size 0.75 0.4) (layers "F.Cu" "F.Paste" "F.Mask") (tstamp 543cff19-c29d-443c-b06f-e6c600979cae))
  (pad "20" smd rect (at -3.5 6.025 90) (size 0.75 0.4) (layers "F.Cu" "F.Paste" "F.Mask") (tstamp 4b94b689-7be1-46b2-97e5-76aca73784bc))
  (pad "21" smd rect (at -2.8 6.025 90) (size 0.75 0.4) (layers "F.Cu" "F.Paste" "F.Mask") (tstamp caee4c8f-c9e1-4620-abcf-86dfc2b7778f))
  (pad "22" smd rect (at -2.1 6.025 90) (size 0.75 0.4) (layers "F.Cu" "F.Paste" "F.Mask") (tstamp 56d91906-6948-4b85-86b6-cd0a49442aff))
  (pad "23" smd rect (at -1.4 6.025 90) (size 0.75 0.4) (layers "F.Cu" "F.Paste" "F.Mask") (tstamp cf336936-14cc-4a50-ae1e-bfe89a6f976f))
  (pad "24" smd rect (at -0.7 6.025 90) (size 0.75 0.4) (layers "F.Cu" "F.Paste" "F.Mask") (tstamp 87130f03-bf16-40be-aae5-6ce1610d3211))
  (pad "25" smd rect (at 0 6.025 90) (size 0.75 0.4) (layers "F.Cu" "F.Paste" "F.Mask") (tstamp 812b2f55-69fe-4838-b62f-b80904578f5f))
  (pad "26" smd rect (at 0.7 6.025 90) (size 0.75 0.4) (layers "F.Cu" "F.Paste" "F.Mask") (tstamp 6209d868-52ff-4dea-87bf-6efe5d8fb516))
  (pad "27" smd rect (at 1.4 6.025 90) (size 0.75 0.4) (layers "F.Cu" "F.Paste" "F.Mask") (tstamp 217197ad-8f8d-4e12-a547-21eaacb50d2b))
  (pad "28" smd rect (at 2.1 6.025 90) (size 0.75 0.4) (layers "F.Cu" "F.Paste" "F.Mask") (tstamp fbfb88ba-f7f9-4321-8588-c237e3cf3b43))
  (pad "29" smd rect (at 2.8 6.025 90) (size 0.75 0.4) (layers "F.Cu" "F.Paste" "F.Mask") (tstamp 13145598-b53a-416e-ae77-32752b94f0e2))
  (pad "30" smd rect (at 3.5 6.025 90) (size 0.75 0.4) (layers "F.Cu" "F.Paste" "F.Mask") (tstamp 2ea50d49-0d93-4647-b1d6-386c7faa22bb))
  (pad "31" smd rect (at 4.2 6.025 90) (size 0.75 0.4) (layers "F.Cu" "F.Paste" "F.Mask") (tstamp 4762b10c-62d8-4092-b775-1e96306ad0a6))
  (pad "32" smd rect (at 4.9 6.025 90) (size 0.75 0.4) (layers "F.Cu" "F.Paste" "F.Mask") (tstamp 4999d485-acc7-46d9-af9c-160297839124))
  (pad "33" smd rect (at 5.975 6.025) (size 0.75 0.75) (layers "F.Cu" "F.Paste" "F.Mask") (tstamp cc6fd926-282f-4755-af9a-251d9701314e))
  (pad "34" smd rect (at 5.975 4.9) (size 0.75 0.4) (layers "F.Cu" "F.Paste" "F.Mask") (tstamp b08e967c-03b6-49eb-a939-33c2bdaac9b8))
  (pad "35" smd rect (at 5.975 4.2) (size 0.75 0.4) (layers "F.Cu" "F.Paste" "F.Mask") (tstamp ed700960-0d83-46e8-a9dc-7bdba54da40b))
  (pad "36" smd rect (at 5.975 3.5) (size 0.75 0.4) (layers "F.Cu" "F.Paste" "F.Mask") (tstamp 12af9b69-117d-4c41-9fdd-002985afa72a))
  (pad "37" smd rect (at 5.975 2.8) (size 0.75 0.4) (layers "F.Cu" "F.Paste" "F.Mask") (tstamp db088c1e-1887-4e7d-8a26-fca65b8084bc))
  (pad "38" smd rect (at 5.975 2.1) (size 0.75 0.4) (layers "F.Cu" "F.Paste" "F.Mask") (tstamp 87c7f121-b7b9-436a-a233-5c58e58d32dc))
  (pad "39" smd rect (at 5.975 1.4) (size 0.75 0.4) (layers "F.Cu" "F.Paste" "F.Mask") (tstamp e51557b8-45f4-4ebb-a271-ad54fd54d9c4))
  (pad "40" smd rect (at 5.975 0.7) (size 0.75 0.4) (layers "F.Cu" "F.Paste" "F.Mask") (tstamp b81f3592-c9ec-453b-8b74-54cfb41c5ad9))
  (pad "41" smd rect (at 5.975 0) (size 0.75 0.4) (layers "F.Cu" "F.Paste" "F.Mask") (tstamp f2c50d06-8792-4790-baff-b702c0df2d46))
  (pad "42" smd rect (at 5.975 -0.7) (size 0.75 0.4) (layers "F.Cu" "F.Paste" "F.Mask") (tstamp 0fe274bf-93fa-4dd7-a3a3-00ba33f93e43))
  (pad "43" smd rect (at 5.975 -1.4) (size 0.75 0.4) (layers "F.Cu" "F.Paste" "F.Mask") (tstamp 995c54cd-2e37-482a-9676-3715b10c3caa))
  (pad "44" smd rect (at 5.975 -2.1) (size 0.75 0.4) (layers "F.Cu" "F.Paste" "F.Mask") (tstamp d483865f-bd07-449a-b612-6b637e115e34))
  (pad "45" smd rect (at 5.975 -2.8) (size 0.75 0.4) (layers "F.Cu" "F.Paste" "F.Mask") (tstamp ded4a44c-dc52-4191-84a1-7ae688981532))
  (pad "46" smd rect (at 5.975 -3.5) (size 0.75 0.4) (layers "F.Cu" "F.Paste" "F.Mask") (tstamp f0256169-3233-4fe8-be2c-d584d04214af))
  (pad "47" smd rect (at 5.975 -4.2) (size 0.75 0.4) (layers "F.Cu" "F.Paste" "F.Mask") (tstamp 7eed66c3-e2ae-49cb-aeb2-66d84008ae7b))
  (pad "48" smd rect (at 5.975 -4.9) (size 0.75 0.4) (layers "F.Cu" "F.Paste" "F.Mask") (tstamp b1f9495b-c0a5-41af-83c8-5ed10376a5bc))
  (pad "49" smd rect (at 5.975 -6.025) (size 0.75 0.75) (layers "F.Cu" "F.Paste" "F.Mask") (tstamp 69c3edc6-83ca-4d25-91b9-9e680413aba9))
  (pad "50" smd rect (at 4.9 -6.025 90) (size 0.75 0.4) (layers "F.Cu" "F.Paste" "F.Mask") (tstamp a3f66cfd-ab63-429a-b684-063ae42cfb29))
  (pad "51" smd rect (at 4.2 -6.025 90) (size 0.75 0.4) (layers "F.Cu" "F.Paste" "F.Mask") (tstamp 01c5bf21-4f81-47ee-96cd-3bd531e303c4))
  (pad "52" smd rect (at 3.5 -6.025 90) (size 0.75 0.4) (layers "F.Cu" "F.Paste" "F.Mask") (tstamp 6a3cdcfd-c8d0-49e6-82dd-d9e24779c13d))
  (pad "53" smd rect (at 2.8 -6.025 90) (size 0.75 0.4) (layers "F.Cu" "F.Paste" "F.Mask") (tstamp 371aa808-c93d-4227-8b33-c9714b01dbc6))
  (pad "54" smd rect (at 2.1 -6.025 90) (size 0.75 0.4) (layers "F.Cu" "F.Paste" "F.Mask") (tstamp d87067dc-48bb-4a75-b69f-3099df3b6495))
  (pad "55" smd rect (at 1.4 -6.025 90) (size 0.75 0.4) (layers "F.Cu" "F.Paste" "F.Mask") (tstamp 751e605f-31fc-4ff0-9629-0a46fe6bf14e))
  (pad "56" smd rect (at 0.7 -6.025 90) (size 0.75 0.4) (layers "F.Cu" "F.Paste" "F.Mask") (tstamp 57907a2f-54bd-42cb-8325-d7ac6af550e9))
  (pad "57" smd rect (at 0 -6.025 90) (size 0.75 0.4) (layers "F.Cu" "F.Paste" "F.Mask") (tstamp c718416f-20f6-4412-8ff4-4665ec54760f))
  (pad "58" smd rect (at -0.7 -6.025 90) (size 0.75 0.4) (layers "F.Cu" "F.Paste" "F.Mask") (tstamp b24d6798-e5a5-4e92-aa1a-b1b027c37163))
  (pad "59" smd rect (at -1.4 -6.025 90) (size 0.75 0.4) (layers "F.Cu" "F.Paste" "F.Mask") (tstamp 3c71f830-7bd4-4929-93a4-b99459581c1a))
  (pad "60" smd rect (at -2.1 -6.025 90) (size 0.75 0.4) (layers "F.Cu" "F.Paste" "F.Mask") (tstamp 7c20f7ae-e602-4394-80ae-592d21013c82))
  (pad "61" smd rect (at -2.8 -6.025 90) (size 0.75 0.4) (layers "F.Cu" "F.Paste" "F.Mask") (tstamp 529e8817-4224-47af-b3e5-86fc9a41cfe3))
  (pad "62" smd rect (at -3.5 -6.025 90) (size 0.75 0.4) (layers "F.Cu" "F.Paste" "F.Mask") (tstamp 56b3fb31-938b-4e99-ace3-601bd810d8ec))
  (pad "63" smd rect (at -4.2 -6.025 90) (size 0.75 0.4) (layers "F.Cu" "F.Paste" "F.Mask") (tstamp a353e72b-2b74-4bc3-97c2-98d0e29055d1))
  (pad "64" smd rect (at -4.9 -6.025 90) (size 0.75 0.4) (layers "F.Cu" "F.Paste" "F.Mask") (tstamp 7b17d2ff-c768-4444-a201-ea2a2dc670ce))
  (pad "G1" smd rect (at -3.85 -3.85) (size 1 1) (layers "F.Cu" "F.Paste" "F.Mask") (tstamp ae287842-87a9-44f1-9c88-bba953cdce3a))
  (pad "G2" smd rect (at -3.85 -2.45) (size 1 1) (layers "F.Cu" "F.Paste" "F.Mask") (tstamp 5cb397bb-179c-47ff-b221-c4e8ed16aa3d))
  (pad "G3" smd rect (at -3.85 -1.05) (size 1 1) (layers "F.Cu" "F.Paste" "F.Mask") (tstamp 12b639da-bec0-45fc-9ce3-a6d05d970414))
  (pad "G4" smd rect (at -3.85 1.05) (size 1 1) (layers "F.Cu" "F.Paste" "F.Mask") (tstamp 5bdc02db-97d3-4a24-a0b6-b77e3b46d534))
  (pad "G5" smd rect (at -3.85 2.45) (size 1 1) (layers "F.Cu" "F.Paste" "F.Mask") (tstamp e966f5d7-6d77-4a5c-a5ee-9fc4ed1ed9af))
  (pad "G6" smd rect (at -3.85 3.85) (size 1 1) (layers "F.Cu" "F.Paste" "F.Mask") (tstamp e6263a0e-d365-4593-83ec-afae174e8aab))
  (pad "G7" smd rect (at -2.45 -3.85) (size 1 1) (layers "F.Cu" "F.Paste" "F.Mask") (tstamp 239f3eca-8107-47e2-a7a5-c8ef973b8dbe))
  (pad "G8" smd rect (at -2.45 -2.45) (size 1 1) (layers "F.Cu" "F.Paste" "F.Mask") (tstamp 9302a741-7c92-4915-a203-7d6497d74844))
  (pad "G9" smd rect (at -2.45 -1.05) (size 1 1) (layers "F.Cu" "F.Paste" "F.Mask") (tstamp cd5a8240-4609-4282-80d8-d6b343a4c322))
  (pad "G10" smd rect (at -2.45 1.05) (size 1 1) (layers "F.Cu" "F.Paste" "F.Mask") (tstamp b196a136-e2f9-4b34-b03f-23d1972089f7))
  (pad "G11" smd rect (at -2.45 2.45) (size 1 1) (layers "F.Cu" "F.Paste" "F.Mask") (tstamp 53648576-eaeb-492f-8361-bba38857daa4))
  (pad "G12" smd rect (at -2.45 3.85) (size 1 1) (layers "F.Cu" "F.Paste" "F.Mask") (tstamp ad6a9127-940b-4f7f-b8de-ee59b1cf2479))
  (pad "G13" smd rect (at -1.05 -3.85) (size 1 1) (layers "F.Cu" "F.Paste" "F.Mask") (tstamp df949cd4-9447-44ec-915b-d5cca274891a))
  (pad "G14" smd rect (at -1.05 -2.45) (size 1 1) (layers "F.Cu" "F.Paste" "F.Mask") (tstamp 23e9f264-3e75-4874-9b0e-b87ba39a0da1))
  (pad "G15" smd rect (at -1.05 -1.05) (size 1 1) (layers "F.Cu" "F.Paste" "F.Mask") (tstamp d511b42e-c813-47e9-8b9a-4ce6a768f345))
  (pad "G16" smd rect (at -1.05 1.05) (size 1 1) (layers "F.Cu" "F.Paste" "F.Mask") (tstamp 85e860a4-6f8d-416d-a76f-550602575be2))
  (pad "G17" smd rect (at -1.05 2.45) (size 1 1) (layers "F.Cu" "F.Paste" "F.Mask") (tstamp f8b13bf3-0f0f-47eb-ae31-fa268a19bf89))
  (pad "G18" smd rect (at -1.05 3.85) (size 1 1) (layers "F.Cu" "F.Paste" "F.Mask") (tstamp 120b845b-db10-493b-b695-f6b69c56ceba))
  (pad "G19" smd rect (at 1.05 -3.85) (size 1 1) (layers "F.Cu" "F.Paste" "F.Mask") (tstamp e10a6a42-4617-41f9-b2cf-d937de19551b))
  (pad "G20" smd rect (at 1.05 -2.45) (size 1 1) (layers "F.Cu" "F.Paste" "F.Mask") (tstamp a6f8fdc9-c2ae-4656-a86d-b3ae6dde8e6a))
  (pad "G21" smd rect (at 1.05 -1.05) (size 1 1) (layers "F.Cu" "F.Paste" "F.Mask") (tstamp b808f268-0f71-43ea-9a51-e919e18c2803))
  (pad "G22" smd rect (at 1.05 1.05) (size 1 1) (layers "F.Cu" "F.Paste" "F.Mask") (tstamp 4f598a29-d468-4ebe-8114-4fc766f1c1f9))
  (pad "G23" smd rect (at 1.05 2.45) (size 1 1) (layers "F.Cu" "F.Paste" "F.Mask") (tstamp 4e4e5c36-d77a-445d-a6e9-80f492288c32))
  (pad "G24" smd rect (at 1.05 3.85) (size 1 1) (layers "F.Cu" "F.Paste" "F.Mask") (tstamp c864a783-9405-4349-b429-a245b8027e73))
  (pad "G25" smd rect (at 2.45 -3.85) (size 1 1) (layers "F.Cu" "F.Paste" "F.Mask") (tstamp 9c8575d9-b58c-4970-86b4-906d86a81c12))
  (pad "G26" smd rect (at 2.45 -2.45) (size 1 1) (layers "F.Cu" "F.Paste" "F.Mask") (tstamp 984ec690-de25-4586-9df6-4b76620a942f))
  (pad "G27" smd rect (at 2.45 -1.05) (size 1 1) (layers "F.Cu" "F.Paste" "F.Mask") (tstamp 6e4628a5-74d3-479a-87c5-ea4d27f07771))
  (pad "G28" smd rect (at 2.45 1.05) (size 1 1) (layers "F.Cu" "F.Paste" "F.Mask") (tstamp fd723450-4d4e-4ac2-a48a-dca9bf30d39a))
  (pad "G29" smd rect (at 2.45 2.45) (size 1 1) (layers "F.Cu" "F.Paste" "F.Mask") (tstamp 0c2b8e82-7e1c-4f04-9020-c12269e3e350))
  (pad "G30" smd rect (at 2.45 3.85) (size 1 1) (layers "F.Cu" "F.Paste" "F.Mask") (tstamp d76495cb-524a-4e3b-8d5c-97fa8989098c))
  (pad "G31" smd rect (at 3.85 -3.85) (size 1 1) (layers "F.Cu" "F.Paste" "F.Mask") (tstamp 17c4db87-15e2-41ed-bc1e-676e34c88e8e))
  (pad "G32" smd rect (at 3.85 -2.45) (size 1 1) (layers "F.Cu" "F.Paste" "F.Mask") (tstamp cd5fe03f-6d8d-4e44-aae0-4eafce02a09d))
  (pad "G33" smd rect (at 3.85 -1.05) (size 1 1) (layers "F.Cu" "F.Paste" "F.Mask") (tstamp 68ecd1fc-8cfd-42d0-a774-fe1317e3e324))
  (pad "G34" smd rect (at 3.85 1.05) (size 1 1) (layers "F.Cu" "F.Paste" "F.Mask") (tstamp 98346266-8af5-4c86-a34e-fe7ea77820cf))
  (pad "G35" smd rect (at 3.85 2.45) (size 1 1) (layers "F.Cu" "F.Paste" "F.Mask") (tstamp afbb6f43-17cd-4230-8c18-0daabd868f45))
  (pad "G36" smd rect (at 3.85 3.85) (size 1 1) (layers "F.Cu" "F.Paste" "F.Mask") (tstamp 061ab06b-b561-48b7-9a94-d75bdc9043b1))
  (model "${KICADLIB}/model/SoM/WL1835MODGB.stp"
    (offset (xyz 0 0 0))
    (scale (xyz 1 1 1))
    (rotate (xyz 0 0 0))
  )
)
