(module "CAPPR500-1250X2000" (layer F.Cu) (tedit 5EBAD5C8)
  (descr "CP, Radial series, Radial, pin pitch=5.00mm, , diameter=12.5mm, Electrolytic Capacitor")
  (tags "CP Radial series Radial pin pitch 5.00mm  diameter 12.5mm Electrolytic Capacitor")
  (fp_text reference "REF**" (at 2.5 -7.5) (layer F.SilkS)
    (effects (font (size 1 1) (thickness 0.15)))
  )
  (fp_text value "CAPPR500-1250X2000" (at 2.5 7.5) (layer F.Fab) hide
    (effects (font (size 1 1) (thickness 0.15)))
  )
  (fp_text user "${REFERENCE}" (at 2.5 0) (layer F.Fab)
    (effects (font (size 1 1) (thickness 0.15)))
  )
  (fp_line (start -3.692082 -4.2) (end -3.692082 -2.95) (layer F.SilkS) (width 0.12))
  (fp_line (start -4.317082 -3.575) (end -3.067082 -3.575) (layer F.SilkS) (width 0.12))
  (fp_line (start 8.861 -0.317) (end 8.861 0.317) (layer F.SilkS) (width 0.12))
  (fp_line (start 8.821 -0.757) (end 8.821 0.757) (layer F.SilkS) (width 0.12))
  (fp_line (start 8.781 -1.028) (end 8.781 1.028) (layer F.SilkS) (width 0.12))
  (fp_line (start 8.741 -1.241) (end 8.741 1.241) (layer F.SilkS) (width 0.12))
  (fp_line (start 8.701 -1.422) (end 8.701 1.422) (layer F.SilkS) (width 0.12))
  (fp_line (start 8.661 -1.583) (end 8.661 1.583) (layer F.SilkS) (width 0.12))
  (fp_line (start 8.621 -1.728) (end 8.621 1.728) (layer F.SilkS) (width 0.12))
  (fp_line (start 8.581 -1.861) (end 8.581 1.861) (layer F.SilkS) (width 0.12))
  (fp_line (start 8.541 -1.984) (end 8.541 1.984) (layer F.SilkS) (width 0.12))
  (fp_line (start 8.501 -2.1) (end 8.501 2.1) (layer F.SilkS) (width 0.12))
  (fp_line (start 8.461 -2.209) (end 8.461 2.209) (layer F.SilkS) (width 0.12))
  (fp_line (start 8.421 -2.312) (end 8.421 2.312) (layer F.SilkS) (width 0.12))
  (fp_line (start 8.381 -2.41) (end 8.381 2.41) (layer F.SilkS) (width 0.12))
  (fp_line (start 8.341 -2.504) (end 8.341 2.504) (layer F.SilkS) (width 0.12))
  (fp_line (start 8.301 -2.594) (end 8.301 2.594) (layer F.SilkS) (width 0.12))
  (fp_line (start 8.261 -2.681) (end 8.261 2.681) (layer F.SilkS) (width 0.12))
  (fp_line (start 8.221 -2.764) (end 8.221 2.764) (layer F.SilkS) (width 0.12))
  (fp_line (start 8.181 -2.844) (end 8.181 2.844) (layer F.SilkS) (width 0.12))
  (fp_line (start 8.141 -2.921) (end 8.141 2.921) (layer F.SilkS) (width 0.12))
  (fp_line (start 8.101 -2.996) (end 8.101 2.996) (layer F.SilkS) (width 0.12))
  (fp_line (start 8.061 -3.069) (end 8.061 3.069) (layer F.SilkS) (width 0.12))
  (fp_line (start 8.021 -3.14) (end 8.021 3.14) (layer F.SilkS) (width 0.12))
  (fp_line (start 7.981 -3.208) (end 7.981 3.208) (layer F.SilkS) (width 0.12))
  (fp_line (start 7.941 -3.275) (end 7.941 3.275) (layer F.SilkS) (width 0.12))
  (fp_line (start 7.901 -3.339) (end 7.901 3.339) (layer F.SilkS) (width 0.12))
  (fp_line (start 7.861 -3.402) (end 7.861 3.402) (layer F.SilkS) (width 0.12))
  (fp_line (start 7.821 -3.464) (end 7.821 3.464) (layer F.SilkS) (width 0.12))
  (fp_line (start 7.781 -3.524) (end 7.781 3.524) (layer F.SilkS) (width 0.12))
  (fp_line (start 7.741 -3.583) (end 7.741 3.583) (layer F.SilkS) (width 0.12))
  (fp_line (start 7.701 -3.64) (end 7.701 3.64) (layer F.SilkS) (width 0.12))
  (fp_line (start 7.661 -3.696) (end 7.661 3.696) (layer F.SilkS) (width 0.12))
  (fp_line (start 7.621 -3.75) (end 7.621 3.75) (layer F.SilkS) (width 0.12))
  (fp_line (start 7.581 -3.804) (end 7.581 3.804) (layer F.SilkS) (width 0.12))
  (fp_line (start 7.541 -3.856) (end 7.541 3.856) (layer F.SilkS) (width 0.12))
  (fp_line (start 7.501 -3.907) (end 7.501 3.907) (layer F.SilkS) (width 0.12))
  (fp_line (start 7.461 -3.957) (end 7.461 3.957) (layer F.SilkS) (width 0.12))
  (fp_line (start 7.421 -4.007) (end 7.421 4.007) (layer F.SilkS) (width 0.12))
  (fp_line (start 7.381 -4.055) (end 7.381 4.055) (layer F.SilkS) (width 0.12))
  (fp_line (start 7.341 -4.102) (end 7.341 4.102) (layer F.SilkS) (width 0.12))
  (fp_line (start 7.301 -4.148) (end 7.301 4.148) (layer F.SilkS) (width 0.12))
  (fp_line (start 7.261 -4.194) (end 7.261 4.194) (layer F.SilkS) (width 0.12))
  (fp_line (start 7.221 -4.238) (end 7.221 4.238) (layer F.SilkS) (width 0.12))
  (fp_line (start 7.181 -4.282) (end 7.181 4.282) (layer F.SilkS) (width 0.12))
  (fp_line (start 7.141 -4.325) (end 7.141 4.325) (layer F.SilkS) (width 0.12))
  (fp_line (start 7.101 -4.367) (end 7.101 4.367) (layer F.SilkS) (width 0.12))
  (fp_line (start 7.061 -4.408) (end 7.061 4.408) (layer F.SilkS) (width 0.12))
  (fp_line (start 7.021 -4.449) (end 7.021 4.449) (layer F.SilkS) (width 0.12))
  (fp_line (start 6.981 -4.489) (end 6.981 4.489) (layer F.SilkS) (width 0.12))
  (fp_line (start 6.941 -4.528) (end 6.941 4.528) (layer F.SilkS) (width 0.12))
  (fp_line (start 6.901 -4.567) (end 6.901 4.567) (layer F.SilkS) (width 0.12))
  (fp_line (start 6.861 -4.605) (end 6.861 4.605) (layer F.SilkS) (width 0.12))
  (fp_line (start 6.821 -4.642) (end 6.821 4.642) (layer F.SilkS) (width 0.12))
  (fp_line (start 6.781 -4.678) (end 6.781 4.678) (layer F.SilkS) (width 0.12))
  (fp_line (start 6.741 -4.714) (end 6.741 4.714) (layer F.SilkS) (width 0.12))
  (fp_line (start 6.701 -4.75) (end 6.701 4.75) (layer F.SilkS) (width 0.12))
  (fp_line (start 6.661 -4.785) (end 6.661 4.785) (layer F.SilkS) (width 0.12))
  (fp_line (start 6.621 -4.819) (end 6.621 4.819) (layer F.SilkS) (width 0.12))
  (fp_line (start 6.581 -4.852) (end 6.581 4.852) (layer F.SilkS) (width 0.12))
  (fp_line (start 6.541 -4.885) (end 6.541 4.885) (layer F.SilkS) (width 0.12))
  (fp_line (start 6.501 -4.918) (end 6.501 4.918) (layer F.SilkS) (width 0.12))
  (fp_line (start 6.461 -4.95) (end 6.461 4.95) (layer F.SilkS) (width 0.12))
  (fp_line (start 6.421 1.44) (end 6.421 4.982) (layer F.SilkS) (width 0.12))
  (fp_line (start 6.421 -4.982) (end 6.421 -1.44) (layer F.SilkS) (width 0.12))
  (fp_line (start 6.381 1.44) (end 6.381 5.012) (layer F.SilkS) (width 0.12))
  (fp_line (start 6.381 -5.012) (end 6.381 -1.44) (layer F.SilkS) (width 0.12))
  (fp_line (start 6.341 1.44) (end 6.341 5.043) (layer F.SilkS) (width 0.12))
  (fp_line (start 6.341 -5.043) (end 6.341 -1.44) (layer F.SilkS) (width 0.12))
  (fp_line (start 6.301 1.44) (end 6.301 5.073) (layer F.SilkS) (width 0.12))
  (fp_line (start 6.301 -5.073) (end 6.301 -1.44) (layer F.SilkS) (width 0.12))
  (fp_line (start 6.261 1.44) (end 6.261 5.102) (layer F.SilkS) (width 0.12))
  (fp_line (start 6.261 -5.102) (end 6.261 -1.44) (layer F.SilkS) (width 0.12))
  (fp_line (start 6.221 1.44) (end 6.221 5.131) (layer F.SilkS) (width 0.12))
  (fp_line (start 6.221 -5.131) (end 6.221 -1.44) (layer F.SilkS) (width 0.12))
  (fp_line (start 6.181 1.44) (end 6.181 5.16) (layer F.SilkS) (width 0.12))
  (fp_line (start 6.181 -5.16) (end 6.181 -1.44) (layer F.SilkS) (width 0.12))
  (fp_line (start 6.141 1.44) (end 6.141 5.188) (layer F.SilkS) (width 0.12))
  (fp_line (start 6.141 -5.188) (end 6.141 -1.44) (layer F.SilkS) (width 0.12))
  (fp_line (start 6.101 1.44) (end 6.101 5.216) (layer F.SilkS) (width 0.12))
  (fp_line (start 6.101 -5.216) (end 6.101 -1.44) (layer F.SilkS) (width 0.12))
  (fp_line (start 6.061 1.44) (end 6.061 5.243) (layer F.SilkS) (width 0.12))
  (fp_line (start 6.061 -5.243) (end 6.061 -1.44) (layer F.SilkS) (width 0.12))
  (fp_line (start 6.021 1.44) (end 6.021 5.27) (layer F.SilkS) (width 0.12))
  (fp_line (start 6.021 -5.27) (end 6.021 -1.44) (layer F.SilkS) (width 0.12))
  (fp_line (start 5.981 1.44) (end 5.981 5.296) (layer F.SilkS) (width 0.12))
  (fp_line (start 5.981 -5.296) (end 5.981 -1.44) (layer F.SilkS) (width 0.12))
  (fp_line (start 5.941 1.44) (end 5.941 5.322) (layer F.SilkS) (width 0.12))
  (fp_line (start 5.941 -5.322) (end 5.941 -1.44) (layer F.SilkS) (width 0.12))
  (fp_line (start 5.901 1.44) (end 5.901 5.347) (layer F.SilkS) (width 0.12))
  (fp_line (start 5.901 -5.347) (end 5.901 -1.44) (layer F.SilkS) (width 0.12))
  (fp_line (start 5.861 1.44) (end 5.861 5.372) (layer F.SilkS) (width 0.12))
  (fp_line (start 5.861 -5.372) (end 5.861 -1.44) (layer F.SilkS) (width 0.12))
  (fp_line (start 5.821 1.44) (end 5.821 5.397) (layer F.SilkS) (width 0.12))
  (fp_line (start 5.821 -5.397) (end 5.821 -1.44) (layer F.SilkS) (width 0.12))
  (fp_line (start 5.781 1.44) (end 5.781 5.421) (layer F.SilkS) (width 0.12))
  (fp_line (start 5.781 -5.421) (end 5.781 -1.44) (layer F.SilkS) (width 0.12))
  (fp_line (start 5.741 1.44) (end 5.741 5.445) (layer F.SilkS) (width 0.12))
  (fp_line (start 5.741 -5.445) (end 5.741 -1.44) (layer F.SilkS) (width 0.12))
  (fp_line (start 5.701 1.44) (end 5.701 5.468) (layer F.SilkS) (width 0.12))
  (fp_line (start 5.701 -5.468) (end 5.701 -1.44) (layer F.SilkS) (width 0.12))
  (fp_line (start 5.661 1.44) (end 5.661 5.491) (layer F.SilkS) (width 0.12))
  (fp_line (start 5.661 -5.491) (end 5.661 -1.44) (layer F.SilkS) (width 0.12))
  (fp_line (start 5.621 1.44) (end 5.621 5.514) (layer F.SilkS) (width 0.12))
  (fp_line (start 5.621 -5.514) (end 5.621 -1.44) (layer F.SilkS) (width 0.12))
  (fp_line (start 5.581 1.44) (end 5.581 5.536) (layer F.SilkS) (width 0.12))
  (fp_line (start 5.581 -5.536) (end 5.581 -1.44) (layer F.SilkS) (width 0.12))
  (fp_line (start 5.541 1.44) (end 5.541 5.558) (layer F.SilkS) (width 0.12))
  (fp_line (start 5.541 -5.558) (end 5.541 -1.44) (layer F.SilkS) (width 0.12))
  (fp_line (start 5.501 1.44) (end 5.501 5.58) (layer F.SilkS) (width 0.12))
  (fp_line (start 5.501 -5.58) (end 5.501 -1.44) (layer F.SilkS) (width 0.12))
  (fp_line (start 5.461 1.44) (end 5.461 5.601) (layer F.SilkS) (width 0.12))
  (fp_line (start 5.461 -5.601) (end 5.461 -1.44) (layer F.SilkS) (width 0.12))
  (fp_line (start 5.421 1.44) (end 5.421 5.622) (layer F.SilkS) (width 0.12))
  (fp_line (start 5.421 -5.622) (end 5.421 -1.44) (layer F.SilkS) (width 0.12))
  (fp_line (start 5.381 1.44) (end 5.381 5.642) (layer F.SilkS) (width 0.12))
  (fp_line (start 5.381 -5.642) (end 5.381 -1.44) (layer F.SilkS) (width 0.12))
  (fp_line (start 5.341 1.44) (end 5.341 5.662) (layer F.SilkS) (width 0.12))
  (fp_line (start 5.341 -5.662) (end 5.341 -1.44) (layer F.SilkS) (width 0.12))
  (fp_line (start 5.301 1.44) (end 5.301 5.682) (layer F.SilkS) (width 0.12))
  (fp_line (start 5.301 -5.682) (end 5.301 -1.44) (layer F.SilkS) (width 0.12))
  (fp_line (start 5.261 1.44) (end 5.261 5.702) (layer F.SilkS) (width 0.12))
  (fp_line (start 5.261 -5.702) (end 5.261 -1.44) (layer F.SilkS) (width 0.12))
  (fp_line (start 5.221 1.44) (end 5.221 5.721) (layer F.SilkS) (width 0.12))
  (fp_line (start 5.221 -5.721) (end 5.221 -1.44) (layer F.SilkS) (width 0.12))
  (fp_line (start 5.181 1.44) (end 5.181 5.739) (layer F.SilkS) (width 0.12))
  (fp_line (start 5.181 -5.739) (end 5.181 -1.44) (layer F.SilkS) (width 0.12))
  (fp_line (start 5.141 1.44) (end 5.141 5.758) (layer F.SilkS) (width 0.12))
  (fp_line (start 5.141 -5.758) (end 5.141 -1.44) (layer F.SilkS) (width 0.12))
  (fp_line (start 5.101 1.44) (end 5.101 5.776) (layer F.SilkS) (width 0.12))
  (fp_line (start 5.101 -5.776) (end 5.101 -1.44) (layer F.SilkS) (width 0.12))
  (fp_line (start 5.061 1.44) (end 5.061 5.793) (layer F.SilkS) (width 0.12))
  (fp_line (start 5.061 -5.793) (end 5.061 -1.44) (layer F.SilkS) (width 0.12))
  (fp_line (start 5.021 1.44) (end 5.021 5.811) (layer F.SilkS) (width 0.12))
  (fp_line (start 5.021 -5.811) (end 5.021 -1.44) (layer F.SilkS) (width 0.12))
  (fp_line (start 4.981 1.44) (end 4.981 5.828) (layer F.SilkS) (width 0.12))
  (fp_line (start 4.981 -5.828) (end 4.981 -1.44) (layer F.SilkS) (width 0.12))
  (fp_line (start 4.941 1.44) (end 4.941 5.845) (layer F.SilkS) (width 0.12))
  (fp_line (start 4.941 -5.845) (end 4.941 -1.44) (layer F.SilkS) (width 0.12))
  (fp_line (start 4.901 1.44) (end 4.901 5.861) (layer F.SilkS) (width 0.12))
  (fp_line (start 4.901 -5.861) (end 4.901 -1.44) (layer F.SilkS) (width 0.12))
  (fp_line (start 4.861 1.44) (end 4.861 5.877) (layer F.SilkS) (width 0.12))
  (fp_line (start 4.861 -5.877) (end 4.861 -1.44) (layer F.SilkS) (width 0.12))
  (fp_line (start 4.821 1.44) (end 4.821 5.893) (layer F.SilkS) (width 0.12))
  (fp_line (start 4.821 -5.893) (end 4.821 -1.44) (layer F.SilkS) (width 0.12))
  (fp_line (start 4.781 1.44) (end 4.781 5.908) (layer F.SilkS) (width 0.12))
  (fp_line (start 4.781 -5.908) (end 4.781 -1.44) (layer F.SilkS) (width 0.12))
  (fp_line (start 4.741 1.44) (end 4.741 5.924) (layer F.SilkS) (width 0.12))
  (fp_line (start 4.741 -5.924) (end 4.741 -1.44) (layer F.SilkS) (width 0.12))
  (fp_line (start 4.701 1.44) (end 4.701 5.939) (layer F.SilkS) (width 0.12))
  (fp_line (start 4.701 -5.939) (end 4.701 -1.44) (layer F.SilkS) (width 0.12))
  (fp_line (start 4.661 1.44) (end 4.661 5.953) (layer F.SilkS) (width 0.12))
  (fp_line (start 4.661 -5.953) (end 4.661 -1.44) (layer F.SilkS) (width 0.12))
  (fp_line (start 4.621 1.44) (end 4.621 5.967) (layer F.SilkS) (width 0.12))
  (fp_line (start 4.621 -5.967) (end 4.621 -1.44) (layer F.SilkS) (width 0.12))
  (fp_line (start 4.581 1.44) (end 4.581 5.981) (layer F.SilkS) (width 0.12))
  (fp_line (start 4.581 -5.981) (end 4.581 -1.44) (layer F.SilkS) (width 0.12))
  (fp_line (start 4.541 1.44) (end 4.541 5.995) (layer F.SilkS) (width 0.12))
  (fp_line (start 4.541 -5.995) (end 4.541 -1.44) (layer F.SilkS) (width 0.12))
  (fp_line (start 4.501 1.44) (end 4.501 6.008) (layer F.SilkS) (width 0.12))
  (fp_line (start 4.501 -6.008) (end 4.501 -1.44) (layer F.SilkS) (width 0.12))
  (fp_line (start 4.461 1.44) (end 4.461 6.021) (layer F.SilkS) (width 0.12))
  (fp_line (start 4.461 -6.021) (end 4.461 -1.44) (layer F.SilkS) (width 0.12))
  (fp_line (start 4.421 1.44) (end 4.421 6.034) (layer F.SilkS) (width 0.12))
  (fp_line (start 4.421 -6.034) (end 4.421 -1.44) (layer F.SilkS) (width 0.12))
  (fp_line (start 4.381 1.44) (end 4.381 6.047) (layer F.SilkS) (width 0.12))
  (fp_line (start 4.381 -6.047) (end 4.381 -1.44) (layer F.SilkS) (width 0.12))
  (fp_line (start 4.341 1.44) (end 4.341 6.059) (layer F.SilkS) (width 0.12))
  (fp_line (start 4.341 -6.059) (end 4.341 -1.44) (layer F.SilkS) (width 0.12))
  (fp_line (start 4.301 1.44) (end 4.301 6.071) (layer F.SilkS) (width 0.12))
  (fp_line (start 4.301 -6.071) (end 4.301 -1.44) (layer F.SilkS) (width 0.12))
  (fp_line (start 4.261 1.44) (end 4.261 6.083) (layer F.SilkS) (width 0.12))
  (fp_line (start 4.261 -6.083) (end 4.261 -1.44) (layer F.SilkS) (width 0.12))
  (fp_line (start 4.221 1.44) (end 4.221 6.094) (layer F.SilkS) (width 0.12))
  (fp_line (start 4.221 -6.094) (end 4.221 -1.44) (layer F.SilkS) (width 0.12))
  (fp_line (start 4.181 1.44) (end 4.181 6.105) (layer F.SilkS) (width 0.12))
  (fp_line (start 4.181 -6.105) (end 4.181 -1.44) (layer F.SilkS) (width 0.12))
  (fp_line (start 4.141 1.44) (end 4.141 6.116) (layer F.SilkS) (width 0.12))
  (fp_line (start 4.141 -6.116) (end 4.141 -1.44) (layer F.SilkS) (width 0.12))
  (fp_line (start 4.101 1.44) (end 4.101 6.126) (layer F.SilkS) (width 0.12))
  (fp_line (start 4.101 -6.126) (end 4.101 -1.44) (layer F.SilkS) (width 0.12))
  (fp_line (start 4.061 1.44) (end 4.061 6.137) (layer F.SilkS) (width 0.12))
  (fp_line (start 4.061 -6.137) (end 4.061 -1.44) (layer F.SilkS) (width 0.12))
  (fp_line (start 4.021 1.44) (end 4.021 6.146) (layer F.SilkS) (width 0.12))
  (fp_line (start 4.021 -6.146) (end 4.021 -1.44) (layer F.SilkS) (width 0.12))
  (fp_line (start 3.981 1.44) (end 3.981 6.156) (layer F.SilkS) (width 0.12))
  (fp_line (start 3.981 -6.156) (end 3.981 -1.44) (layer F.SilkS) (width 0.12))
  (fp_line (start 3.941 1.44) (end 3.941 6.166) (layer F.SilkS) (width 0.12))
  (fp_line (start 3.941 -6.166) (end 3.941 -1.44) (layer F.SilkS) (width 0.12))
  (fp_line (start 3.901 1.44) (end 3.901 6.175) (layer F.SilkS) (width 0.12))
  (fp_line (start 3.901 -6.175) (end 3.901 -1.44) (layer F.SilkS) (width 0.12))
  (fp_line (start 3.861 1.44) (end 3.861 6.184) (layer F.SilkS) (width 0.12))
  (fp_line (start 3.861 -6.184) (end 3.861 -1.44) (layer F.SilkS) (width 0.12))
  (fp_line (start 3.821 1.44) (end 3.821 6.192) (layer F.SilkS) (width 0.12))
  (fp_line (start 3.821 -6.192) (end 3.821 -1.44) (layer F.SilkS) (width 0.12))
  (fp_line (start 3.781 1.44) (end 3.781 6.201) (layer F.SilkS) (width 0.12))
  (fp_line (start 3.781 -6.201) (end 3.781 -1.44) (layer F.SilkS) (width 0.12))
  (fp_line (start 3.741 1.44) (end 3.741 6.209) (layer F.SilkS) (width 0.12))
  (fp_line (start 3.741 -6.209) (end 3.741 -1.44) (layer F.SilkS) (width 0.12))
  (fp_line (start 3.701 1.44) (end 3.701 6.216) (layer F.SilkS) (width 0.12))
  (fp_line (start 3.701 -6.216) (end 3.701 -1.44) (layer F.SilkS) (width 0.12))
  (fp_line (start 3.661 1.44) (end 3.661 6.224) (layer F.SilkS) (width 0.12))
  (fp_line (start 3.661 -6.224) (end 3.661 -1.44) (layer F.SilkS) (width 0.12))
  (fp_line (start 3.621 1.44) (end 3.621 6.231) (layer F.SilkS) (width 0.12))
  (fp_line (start 3.621 -6.231) (end 3.621 -1.44) (layer F.SilkS) (width 0.12))
  (fp_line (start 3.581 1.44) (end 3.581 6.238) (layer F.SilkS) (width 0.12))
  (fp_line (start 3.581 -6.238) (end 3.581 -1.44) (layer F.SilkS) (width 0.12))
  (fp_line (start 3.541 -6.245) (end 3.541 6.245) (layer F.SilkS) (width 0.12))
  (fp_line (start 3.501 -6.252) (end 3.501 6.252) (layer F.SilkS) (width 0.12))
  (fp_line (start 3.461 -6.258) (end 3.461 6.258) (layer F.SilkS) (width 0.12))
  (fp_line (start 3.421 -6.264) (end 3.421 6.264) (layer F.SilkS) (width 0.12))
  (fp_line (start 3.381 -6.269) (end 3.381 6.269) (layer F.SilkS) (width 0.12))
  (fp_line (start 3.341 -6.275) (end 3.341 6.275) (layer F.SilkS) (width 0.12))
  (fp_line (start 3.301 -6.28) (end 3.301 6.28) (layer F.SilkS) (width 0.12))
  (fp_line (start 3.261 -6.285) (end 3.261 6.285) (layer F.SilkS) (width 0.12))
  (fp_line (start 3.221 -6.29) (end 3.221 6.29) (layer F.SilkS) (width 0.12))
  (fp_line (start 3.18 -6.294) (end 3.18 6.294) (layer F.SilkS) (width 0.12))
  (fp_line (start 3.14 -6.298) (end 3.14 6.298) (layer F.SilkS) (width 0.12))
  (fp_line (start 3.1 -6.302) (end 3.1 6.302) (layer F.SilkS) (width 0.12))
  (fp_line (start 3.06 -6.306) (end 3.06 6.306) (layer F.SilkS) (width 0.12))
  (fp_line (start 3.02 -6.309) (end 3.02 6.309) (layer F.SilkS) (width 0.12))
  (fp_line (start 2.98 -6.312) (end 2.98 6.312) (layer F.SilkS) (width 0.12))
  (fp_line (start 2.94 -6.315) (end 2.94 6.315) (layer F.SilkS) (width 0.12))
  (fp_line (start 2.9 -6.318) (end 2.9 6.318) (layer F.SilkS) (width 0.12))
  (fp_line (start 2.86 -6.32) (end 2.86 6.32) (layer F.SilkS) (width 0.12))
  (fp_line (start 2.82 -6.322) (end 2.82 6.322) (layer F.SilkS) (width 0.12))
  (fp_line (start 2.78 -6.324) (end 2.78 6.324) (layer F.SilkS) (width 0.12))
  (fp_line (start 2.74 -6.326) (end 2.74 6.326) (layer F.SilkS) (width 0.12))
  (fp_line (start 2.7 -6.327) (end 2.7 6.327) (layer F.SilkS) (width 0.12))
  (fp_line (start 2.66 -6.328) (end 2.66 6.328) (layer F.SilkS) (width 0.12))
  (fp_line (start 2.62 -6.329) (end 2.62 6.329) (layer F.SilkS) (width 0.12))
  (fp_line (start 2.58 -6.33) (end 2.58 6.33) (layer F.SilkS) (width 0.12))
  (fp_line (start 2.54 -6.33) (end 2.54 6.33) (layer F.SilkS) (width 0.12))
  (fp_line (start 2.5 -6.33) (end 2.5 6.33) (layer F.SilkS) (width 0.12))
  (fp_line (start -2.241489 -3.3625) (end -2.241489 -2.1125) (layer F.Fab) (width 0.1))
  (fp_line (start -2.866489 -2.7375) (end -1.616489 -2.7375) (layer F.Fab) (width 0.1))
  (fp_circle (center 2.5 0) (end 9 0) (layer F.CrtYd) (width 0.05))
  (fp_circle (center 2.5 0) (end 8.87 0) (layer F.SilkS) (width 0.12))
  (fp_circle (center 2.5 0) (end 8.75 0) (layer F.Fab) (width 0.1))
  (pad "1" thru_hole rect (at 0 0) (size 2.4 2.4) (drill 1.2) (layers *.Cu *.Mask) (tstamp 29795b87-c9d2-440a-bbeb-bfac8e4f6f4a))
  (pad "2" thru_hole circle (at 5 0) (size 2.4 2.4) (drill 1.2) (layers *.Cu *.Mask) (tstamp f4a9b270-efda-474b-af66-01dc5d0d5f2b))
  (model "${KICADLIB}/model/passive/CAPPR500-1250X2000.step"
    (at (xyz 0 0 0))
    (scale (xyz 1 1 1))
    (rotate (xyz 0 0 0))
  )
)
