(footprint "Molex_0039301040" (version 20211014) (generator pcbnew)
  (layer "F.Cu")
  (tedit 5B5753A4)
  (attr through_hole)
  (fp_text reference "REF**" (at 0 2.8) (layer "F.SilkS")
    (effects (font (size 1 1) (thickness 0.15)))
    (tstamp d33a85f3-2ca5-4fe7-b532-22bbcf6b7da2)
  )
  (fp_text value "Molex_0039301040" (at 0 -2.2) (layer "F.Fab")
    (effects (font (size 1 1) (thickness 0.15)))
    (tstamp c046b61f-69e8-4fb1-8424-5be94dae6f5e)
  )
  (fp_text user "^" (at 2.1 3.3 180 unlocked) (layer "B.SilkS")
    (effects (font (size 1 1) (thickness 0.15)) (justify mirror))
    (tstamp 7fa33fb5-b013-4ef9-bb4f-484d2e45d13c)
  )
  (fp_text user "^" (at 2.1 3.3 180 unlocked) (layer "F.SilkS")
    (effects (font (size 1 1) (thickness 0.15)))
    (tstamp 1f7f90ea-94db-410a-a261-27a53a38031c)
  )
  (fp_text user "${REFERENCE}" (at 0 7.6 unlocked) (layer "F.Fab")
    (effects (font (size 1 1) (thickness 0.15)))
    (tstamp 72d631a0-15fd-495e-909e-7c5df4c6bd51)
  )
  (fp_line (start 4.8 6.7) (end 3.1 6.7) (layer "F.SilkS") (width 0.1) (tstamp 13db57c7-f4de-45e0-bd45-797675cccb8c))
  (fp_line (start 4.8 19.5) (end 4.8 6.7) (layer "F.SilkS") (width 0.1) (tstamp 306e4556-d9ed-48c3-ae25-4a9d301442ba))
  (fp_line (start -4.8 19.5) (end 4.8 19.5) (layer "F.SilkS") (width 0.1) (tstamp 513c2e85-7a73-4e1b-b204-3d287ad5bc29))
  (fp_line (start -4.8 6.7) (end -4.8 19.5) (layer "F.SilkS") (width 0.1) (tstamp 7e841316-4024-4b96-bb5c-2c03c83adc7d))
  (fp_line (start 1.05 6.7) (end -1.05 6.7) (layer "F.SilkS") (width 0.1) (tstamp c56a38f5-b67d-4847-b27b-87afd083e52c))
  (fp_line (start -4.8 6.7) (end -3.15 6.7) (layer "F.SilkS") (width 0.1) (tstamp e3e192ac-a51a-4e45-b186-ac85d540d459))
  (fp_rect (start -5.25 -1.75) (end 5.25 19.75) (layer "F.CrtYd") (width 0.05) (fill none) (tstamp 91dc7a8c-3f84-4149-93be-1e81b350bf8e))
  (fp_rect (start 2.65 6.7) (end 1.55 -0.45) (layer "F.Fab") (width 0.1) (fill none) (tstamp 107dafa2-e11b-4139-a21d-9b33a1db6bf9))
  (fp_rect (start -1.55 6.7) (end -2.65 -0.45) (layer "F.Fab") (width 0.1) (fill none) (tstamp 9be9aa24-fcde-41fd-a75f-ec7c38b2f1bc))
  (fp_poly (pts
      (xy 4.8 7.7)
      (xy 4.8 19.5)
      (xy -4.8 19.5)
      (xy -4.8 6.7)
      (xy 3.8 6.7)
    ) (layer "F.Fab") (width 0.1) (fill none) (tstamp d4cf79d9-5360-4d9c-8d0a-3d10cece1ede))
  (pad "" thru_hole circle (at 0 12.8) (size 3 3) (drill 3) (layers *.Cu *.Mask) (tstamp cbd5b5ed-10b7-4bcc-85fa-93fd89307403))
  (pad "1" thru_hole circle (at 2.1 5.5) (size 2.8 2.8) (drill 1.8) (layers *.Cu *.Mask) (remove_unused_layers) (keep_end_layers) (tstamp fdb43a79-9663-4b3f-814c-2b4568d7f6e6))
  (pad "2" thru_hole circle (at 2.1 0) (size 2.8 2.8) (drill 1.8) (layers *.Cu *.Mask) (remove_unused_layers) (keep_end_layers) (tstamp d7760bfa-42e5-421f-8a06-96f7e0534e63))
  (pad "3" thru_hole circle (at -2.1 5.5) (size 2.8 2.8) (drill 1.8) (layers *.Cu *.Mask) (remove_unused_layers) (keep_end_layers) (tstamp f1dc13fd-1c4f-427b-80df-0bbcb0ed50f7))
  (pad "4" thru_hole circle (at -2.1 0) (size 2.8 2.8) (drill 1.8) (layers *.Cu *.Mask) (remove_unused_layers) (keep_end_layers) (tstamp daa2f5c8-90c0-42e2-9d9d-c2731c85e6aa))
  (model "${KICADLIB}/model/connector/Molex_039301040.stp"
    (offset (xyz 0 -19.5 0))
    (scale (xyz 1 1 1))
    (rotate (xyz -90 0 0))
  )
)
