(footprint "CalTest_CT3151SP" (version 20211014) (generator pcbnew)
  (layer "F.Cu")
  (tedit 621E47D0)
  (attr through_hole)
  (fp_text reference "REF**" (at 0 5.55) (layer "F.SilkS")
    (effects (font (size 1 1) (thickness 0.15)))
    (tstamp 0510cef5-9962-4977-8ea8-35e9694aa39c)
  )
  (fp_text value "CalTest_CT3151SP" (at 0 4.4) (layer "F.Fab") hide
    (effects (font (size 1 1) (thickness 0.15)))
    (tstamp 7e93555d-9772-4985-9a59-a1984a288e75)
  )
  (fp_text user "${REFERENCE}" (at 0 0) (layer "F.Fab")
    (effects (font (size 1 1) (thickness 0.15)))
    (tstamp b4d1fcae-94b6-4a83-a55d-92ffd35eb875)
  )
  (fp_line (start -2.8 1) (end -2.8 -1) (layer "F.SilkS") (width 0.12) (tstamp 07cee9f8-fb45-4a95-bf19-42449b60ec7f))
  (fp_line (start 2.8 1) (end 2.8 -1) (layer "F.SilkS") (width 0.12) (tstamp 13641336-7c89-4399-b634-0c70a3a0a4a9))
  (fp_line (start -1 -3.05) (end 1 -3.05) (layer "F.SilkS") (width 0.12) (tstamp 4b4f5da8-3429-4a0d-9c96-239510d10631))
  (fp_line (start -1 3.2) (end 1 3.2) (layer "F.SilkS") (width 0.12) (tstamp 8fdb38ba-f577-4cb2-a6f0-884c3b7e8f92))
  (fp_poly (pts
      (xy -5 -1.3)
      (xy -7 -13.9)
      (xy -7 -21.5)
      (xy 7 -21.5)
      (xy 7 -13.9)
      (xy 5 -1.3)
      (xy 5 4.3)
      (xy -5 4.3)
    ) (layer "F.CrtYd") (width 0.05) (fill none) (tstamp 386babe7-db15-43d6-945b-e760b8edd1d1))
  (fp_line (start 2.8 3.2) (end 2.8 -3.05) (layer "F.Fab") (width 0.1) (tstamp 00a44908-2c6e-4f3e-aa87-bce614e79f89))
  (fp_line (start 6.75 -21.3) (end 6.75 -13.9) (layer "F.Fab") (width 0.1) (tstamp 0ad46188-7add-45cc-8f86-202997e868d0))
  (fp_line (start -6.75 -13.9) (end -6.75 -21.3) (layer "F.Fab") (width 0.1) (tstamp 1d0c11e0-d854-455f-a21d-eb54956e4aad))
  (fp_line (start -5.75 -24.575) (end -5.75 -21.3) (layer "F.Fab") (width 0.1) (tstamp 8294d8e0-4efe-4d19-b7ec-fb29a0831960))
  (fp_line (start -5.75 -24.575) (end 5.75 -24.575) (layer "F.Fab") (width 0.1) (tstamp 87a9496f-4369-49eb-be98-fe3f7e0b9f44))
  (fp_line (start -2.8 -3.05) (end -5.05 -3.05) (layer "F.Fab") (width 0.1) (tstamp 8c35d187-d2af-4c4c-a5db-5041491ae221))
  (fp_line (start -5.05 -3.05) (end -6.75 -13.9) (layer "F.Fab") (width 0.1) (tstamp 951d36b1-5d08-49fc-890a-8b436d623520))
  (fp_line (start 6.75 -13.9) (end 5.05 -3.05) (layer "F.Fab") (width 0.1) (tstamp a2975483-496f-4a92-b71e-d959fd75d8ad))
  (fp_line (start -6.75 -21.3) (end 6.75 -21.3) (layer "F.Fab") (width 0.1) (tstamp b934e5ba-28ba-4251-bc7c-8d38080cce50))
  (fp_line (start -2.8 3.2) (end 2.8 3.2) (layer "F.Fab") (width 0.1) (tstamp c2634fdb-a410-4942-97f6-2a2170ce79c8))
  (fp_line (start -2.8 -3.05) (end -2.8 3.2) (layer "F.Fab") (width 0.1) (tstamp c2c707cb-aa2f-4390-b872-82b3e9c1f430))
  (fp_line (start 5.75 -24.575) (end 5.75 -21.3) (layer "F.Fab") (width 0.1) (tstamp caf8b910-d469-46e1-a97d-18ade03563d9))
  (fp_line (start 5.05 -3.05) (end 2.8 -3.05) (layer "F.Fab") (width 0.1) (tstamp de0fb2b0-7d3a-4c87-986a-6c679dc53955))
  (pad "1" thru_hole circle (at -2.54 -2.54) (size 2.6 2.6) (drill 1.6) (layers *.Cu *.Mask) (remove_unused_layers) (keep_end_layers) (tstamp 562f6c0a-b067-4aa0-b5e1-f2069e4e9a0c))
  (pad "1" thru_hole circle (at 2.54 2.54) (size 2.6 2.6) (drill 1.6) (layers *.Cu *.Mask) (remove_unused_layers) (keep_end_layers) (tstamp 5f86ba51-6db8-44ca-890c-c6dd70575e3b))
  (pad "1" thru_hole circle (at 2.54 -2.54) (size 2.6 2.6) (drill 1.6) (layers *.Cu *.Mask) (remove_unused_layers) (keep_end_layers) (tstamp 989e7f22-9fea-4a8c-bf8e-3ee536a08662))
  (pad "1" thru_hole circle (at -2.54 2.54) (size 2.6 2.6) (drill 1.6) (layers *.Cu *.Mask) (remove_unused_layers) (keep_end_layers) (tstamp f4176d9f-3ddb-47c5-b8ef-dea0c24e3192))
  (model "${KICADLIB}/model/connector/CalTest_CT3151SP-Black.step"
    (offset (xyz -0 24.6 7.65))
    (scale (xyz 1 1 1))
    (rotate (xyz -90 0 0))
  )
  (model "${KICADLIB}/model/connector/CalTest_CT3151SP-Blue.step" hide
    (offset (xyz 0 24.6 7.65))
    (scale (xyz 1 1 1))
    (rotate (xyz -90 0 0))
  )
  (model "${KICADLIB}/model/connector/CalTest_CT3151SP-Green.step" hide
    (offset (xyz 0 24.6 7.65))
    (scale (xyz 1 1 1))
    (rotate (xyz -90 0 0))
  )
  (model "${KICADLIB}/model/connector/CalTest_CT3151SP-Red.step" hide
    (offset (xyz 0 24.6 7.65))
    (scale (xyz 1 1 1))
    (rotate (xyz -90 0 0))
  )
  (model "${KICADLIB}/model/connector/CalTest_CT3151SP-White.step" hide
    (offset (xyz 0 24.6 7.65))
    (scale (xyz 1 1 1))
    (rotate (xyz -90 0 0))
  )
  (model "${KICADLIB}/model/connector/CalTest_CT3151SP-Yellow.step" hide
    (offset (xyz 0 24.6 7.65))
    (scale (xyz 1 1 1))
    (rotate (xyz -90 0 0))
  )
)
