(footprint "QFN50P350X350-15" (version 20221018) (generator pcbnew)
  (layer "F.Cu")
  (attr smd)
  (fp_text reference "REF**" (at 0 2.85 unlocked) (layer "F.SilkS")
      (effects (font (size 1 1) (thickness 0.15)))
    (tstamp eb82367a-ce58-4900-83b7-77ded8411df4)
  )
  (fp_text value "QFN50P350X350-15" (at 0 1 unlocked) (layer "F.Fab") hide
      (effects (font (size 1 1) (thickness 0.15)))
    (tstamp c6f1ba79-16fe-4257-8d13-268ff26e0c3e)
  )
  (fp_text user "^" (at -0.75 -2.85 180 unlocked) (layer "F.SilkS")
      (effects (font (size 1 1) (thickness 0.15)))
    (tstamp 92e6ba75-1f85-4fbe-970f-80ed80d638f6)
  )
  (fp_text user "${REFERENCE}" (at 0 0.05) (layer "F.Fab")
      (effects (font (size 0.65 0.65) (thickness 0.125)))
    (tstamp e1f852fe-318a-46b4-9fe4-f483fc34cde6)
  )
  (fp_line (start -1.75 -1.75) (end -1 -1.75)
    (stroke (width 0.1) (type solid)) (layer "F.SilkS") (tstamp 96a4075a-498f-40ad-b720-e6fe1d44c9e5))
  (fp_line (start -1.75 -1.25) (end -1.75 -1.75)
    (stroke (width 0.1) (type solid)) (layer "F.SilkS") (tstamp 799a8fba-eceb-4c99-bd7d-e3e8c7ca4c2a))
  (fp_line (start -1.75 1.75) (end -1.75 1.25)
    (stroke (width 0.1) (type solid)) (layer "F.SilkS") (tstamp d2a525cb-562c-4941-a49a-12cc4a6631e3))
  (fp_line (start -1 1.75) (end -1.75 1.75)
    (stroke (width 0.1) (type solid)) (layer "F.SilkS") (tstamp 2bb62af5-5d85-4c54-b213-08af92153b77))
  (fp_line (start -0.5 -1.75) (end 0.5 -1.75)
    (stroke (width 0.1) (type solid)) (layer "F.SilkS") (tstamp 616fdf14-1fad-4baa-9365-4ba9990e68b2))
  (fp_line (start 0.5 1.75) (end -0.5 1.75)
    (stroke (width 0.1) (type solid)) (layer "F.SilkS") (tstamp 7c876dd5-9d9e-4fce-b02b-0340c3f9d0c7))
  (fp_line (start 1 -1.75) (end 1.75 -1.75)
    (stroke (width 0.1) (type solid)) (layer "F.SilkS") (tstamp 97786a8e-5159-40a2-a165-4721b97be319))
  (fp_line (start 1.75 -1.75) (end 1.75 -1.25)
    (stroke (width 0.1) (type solid)) (layer "F.SilkS") (tstamp 7c703db2-f8ce-40ec-9b54-02eb65397287))
  (fp_line (start 1.75 1.25) (end 1.75 1.75)
    (stroke (width 0.1) (type solid)) (layer "F.SilkS") (tstamp dda3941e-a0f6-4708-8709-55fb24436fb9))
  (fp_line (start 1.75 1.75) (end 1 1.75)
    (stroke (width 0.1) (type solid)) (layer "F.SilkS") (tstamp cbe0ae39-2eac-4212-83ae-5eae835cddec))
  (fp_rect (start -2.2 -2.2) (end 2.2 2.2)
    (stroke (width 0.05) (type solid)) (fill none) (layer "F.CrtYd") (tstamp 3e3a1df2-c8de-43f0-8fc9-01283ccc8e00))
  (fp_line (start -1.75 1.75) (end -1.75 -1.25)
    (stroke (width 0.1) (type solid)) (layer "F.Fab") (tstamp 99798c03-f11a-4b20-9e2e-64ab5f97092a))
  (fp_line (start -1.25 -1.75) (end -1.75 -1.25)
    (stroke (width 0.1) (type solid)) (layer "F.Fab") (tstamp 7346ffeb-f784-46d3-9f48-2360f5a5c057))
  (fp_line (start -1.25 -1.75) (end 1.75 -1.75)
    (stroke (width 0.1) (type solid)) (layer "F.Fab") (tstamp e3f2efed-ccff-47b0-bcb3-85222f41a245))
  (fp_line (start 1.75 -1.75) (end 1.75 1.75)
    (stroke (width 0.1) (type solid)) (layer "F.Fab") (tstamp af2b133c-84bf-4a6f-8020-b02c952ed4ec))
  (fp_line (start 1.75 1.75) (end -1.75 1.75)
    (stroke (width 0.1) (type solid)) (layer "F.Fab") (tstamp 47b17d3a-604f-4e6c-9975-e5fb22fba835))
  (pad "" smd roundrect (at -0.6 -0.6) (size 0.9 0.9) (layers "F.Paste") (roundrect_rratio 0.05555555556) (tstamp d775eb65-1e65-40c0-aed3-c7f42338c12c))
  (pad "" smd roundrect (at -0.6 0.6) (size 0.9 0.9) (layers "F.Paste") (roundrect_rratio 0.05555555556) (tstamp c02d5bb6-61b6-4fa7-8d1f-118d8407c719))
  (pad "" smd roundrect (at 0.6 -0.6) (size 0.9 0.9) (layers "F.Paste") (roundrect_rratio 0.05555555556) (tstamp bf1a4fe4-0ba1-4b05-9a7c-14abb98cb5a6))
  (pad "" smd roundrect (at 0.6 0.6) (size 0.9 0.9) (layers "F.Paste") (roundrect_rratio 0.05555555556) (tstamp 5a89aaa6-cfef-459a-a11d-c9de241c1fe6))
  (pad "1" smd roundrect (at -0.75 -1.75) (size 0.3 0.7) (layers "F.Cu" "F.Paste" "F.Mask") (roundrect_rratio 0.1666666667) (tstamp 56744aed-596e-4312-aae9-00d3a697d61e))
  (pad "2" smd roundrect (at -1.75 -1 270) (size 0.3 0.7) (layers "F.Cu" "F.Paste" "F.Mask") (roundrect_rratio 0.1666666667) (tstamp 231bee40-b689-4fee-b884-d2cc0754c8de))
  (pad "3" smd roundrect (at -1.75 -0.5 270) (size 0.3 0.7) (layers "F.Cu" "F.Paste" "F.Mask") (roundrect_rratio 0.1666666667) (tstamp 249c97bd-4507-46c0-8a1e-fb6351f9a306))
  (pad "4" smd roundrect (at -1.75 0 270) (size 0.3 0.7) (layers "F.Cu" "F.Paste" "F.Mask") (roundrect_rratio 0.1666666667) (tstamp 32217230-94ba-45e2-820d-43cef4cd3e9f))
  (pad "5" smd roundrect (at -1.75 0.5 270) (size 0.3 0.7) (layers "F.Cu" "F.Paste" "F.Mask") (roundrect_rratio 0.1666666667) (tstamp ed752c52-3745-4fe1-a82f-3b61ba8b4817))
  (pad "6" smd roundrect (at -1.75 1 270) (size 0.3 0.7) (layers "F.Cu" "F.Paste" "F.Mask") (roundrect_rratio 0.1666666667) (tstamp 5d5f1a6e-127f-40f5-a2c3-a79a67da789f))
  (pad "7" smd roundrect (at -0.75 1.75) (size 0.3 0.7) (layers "F.Cu" "F.Paste" "F.Mask") (roundrect_rratio 0.1666666667) (tstamp 5ff3bcbd-6f8b-4146-a417-a383692396d7))
  (pad "8" smd roundrect (at 0.75 1.75) (size 0.3 0.7) (layers "F.Cu" "F.Paste" "F.Mask") (roundrect_rratio 0.1666666667) (tstamp a99efd21-7ade-4f1a-a5ce-9407f3ea01d8))
  (pad "9" smd roundrect (at 1.75 1 270) (size 0.3 0.7) (layers "F.Cu" "F.Paste" "F.Mask") (roundrect_rratio 0.1666666667) (tstamp 02ee76a8-c25a-4293-84c4-01c9b6c2af41))
  (pad "10" smd roundrect (at 1.75 0.5 270) (size 0.3 0.7) (layers "F.Cu" "F.Paste" "F.Mask") (roundrect_rratio 0.1666666667) (tstamp 3fb6d290-fee7-4c30-b840-b2643ff0cb40))
  (pad "11" smd roundrect (at 1.75 0 270) (size 0.3 0.7) (layers "F.Cu" "F.Paste" "F.Mask") (roundrect_rratio 0.1666666667) (tstamp 19fe5101-9e48-4a8b-a409-b26256e74431))
  (pad "12" smd roundrect (at 1.75 -0.5 270) (size 0.3 0.7) (layers "F.Cu" "F.Paste" "F.Mask") (roundrect_rratio 0.1666666667) (tstamp f79187a5-9bd2-4095-8f9e-f034f8a5dcd2))
  (pad "13" smd roundrect (at 1.75 -1 270) (size 0.3 0.7) (layers "F.Cu" "F.Paste" "F.Mask") (roundrect_rratio 0.1666666667) (tstamp 0413467f-3501-4c48-8395-06f3d8988677))
  (pad "14" smd roundrect (at 0.75 -1.75) (size 0.3 0.7) (layers "F.Cu" "F.Paste" "F.Mask") (roundrect_rratio 0.1666666667) (tstamp 9289aa76-fefb-4bbc-a90f-3e99d9315cea))
  (pad "15" smd roundrect (at 0 0) (size 2.2 2.2) (layers "F.Cu" "F.Mask") (roundrect_rratio 0.02272727273) (tstamp d61169f1-2438-4c00-8f99-5ca4d8f6e718))
  (model "${KICADLIB}/model/QFN/QFN50P350X350-15.step"
    (offset (xyz 0 0 0))
    (scale (xyz 1 1 1))
    (rotate (xyz 0 0 0))
  )
)
