(footprint "TQFP50P700X700-48" (version 20221018) (generator pcbnew)
  (layer "F.Cu")
  (tags "TQFP QFP")
  (attr smd)
  (fp_text reference "REF**" (at 0 -5.85) (layer "F.SilkS")
      (effects (font (size 1 1) (thickness 0.15)))
    (tstamp 7fcfb9fc-1778-444f-9d63-332f54224c75)
  )
  (fp_text value "TQFP50P700X700-48" (at 0 5.85) (layer "F.Fab") hide
      (effects (font (size 1 1) (thickness 0.15)))
    (tstamp baa06158-f980-4c9a-a4b4-6f67acd573b4)
  )
  (fp_text user "^" (at -5.7 -2.8 270 unlocked) (layer "F.SilkS")
      (effects (font (size 1 1) (thickness 0.15)))
    (tstamp dc82ca73-d062-426c-9002-f1e1f9acca27)
  )
  (fp_text user "${REFERENCE}" (at 0 0) (layer "F.Fab")
      (effects (font (size 1 1) (thickness 0.15)))
    (tstamp b111411b-1351-4698-a7f3-42acaa29d0dc)
  )
  (fp_line (start -3.5 -3.5) (end -3.5 -3)
    (stroke (width 0.1) (type solid)) (layer "F.SilkS") (tstamp e92c0059-815c-45d5-9e60-53c9f5dfd039))
  (fp_line (start -3.5 3) (end -3.5 3.5)
    (stroke (width 0.1) (type solid)) (layer "F.SilkS") (tstamp 8f74e210-6744-4e75-a9f5-8820889f3446))
  (fp_line (start -3.5 3.5) (end -3 3.5)
    (stroke (width 0.1) (type solid)) (layer "F.SilkS") (tstamp f863e387-14fb-4c4a-a2cb-345c80ad3bb9))
  (fp_line (start -3 -3.5) (end -3.5 -3.5)
    (stroke (width 0.1) (type solid)) (layer "F.SilkS") (tstamp 6606d0e8-ac80-422e-aa4d-41d982eaa8cd))
  (fp_line (start 3 3.5) (end 3.5 3.5)
    (stroke (width 0.1) (type solid)) (layer "F.SilkS") (tstamp 9f238e4c-0cbe-4d30-a10b-094d873a74e6))
  (fp_line (start 3.5 -3.5) (end 3 -3.5)
    (stroke (width 0.1) (type solid)) (layer "F.SilkS") (tstamp 45a770a2-bf21-4e60-bb5c-c06353e11342))
  (fp_line (start 3.5 -3) (end 3.5 -3.5)
    (stroke (width 0.1) (type solid)) (layer "F.SilkS") (tstamp 31ccf409-234d-449a-8490-916dd89ac270))
  (fp_line (start 3.5 3.5) (end 3.5 3)
    (stroke (width 0.1) (type solid)) (layer "F.SilkS") (tstamp 7b4d7adb-b6ab-4064-a7b8-eea6a9f06815))
  (fp_line (start -5.15 -3.15) (end -5.15 0)
    (stroke (width 0.05) (type solid)) (layer "F.CrtYd") (tstamp 8374a235-3159-4199-94ee-e3ced7f3b934))
  (fp_line (start -5.15 3.15) (end -5.15 0)
    (stroke (width 0.05) (type solid)) (layer "F.CrtYd") (tstamp 22df3e3f-586c-42fc-84de-b6ddc118c3be))
  (fp_line (start -3.75 -3.75) (end -3.75 -3.15)
    (stroke (width 0.05) (type solid)) (layer "F.CrtYd") (tstamp 104a4365-5936-4ec1-b4a0-b6f44e2ebb87))
  (fp_line (start -3.75 -3.15) (end -5.15 -3.15)
    (stroke (width 0.05) (type solid)) (layer "F.CrtYd") (tstamp 7dd74610-db7a-455b-a971-edf41bbbcc9d))
  (fp_line (start -3.75 3.15) (end -5.15 3.15)
    (stroke (width 0.05) (type solid)) (layer "F.CrtYd") (tstamp b136c52d-b936-4974-99af-62c500620938))
  (fp_line (start -3.75 3.75) (end -3.75 3.15)
    (stroke (width 0.05) (type solid)) (layer "F.CrtYd") (tstamp 633b6983-543a-43a4-bdee-a7239045504e))
  (fp_line (start -3.15 -5.15) (end -3.15 -3.75)
    (stroke (width 0.05) (type solid)) (layer "F.CrtYd") (tstamp 65ba570c-bbe4-43f1-9510-e1c028c90b8c))
  (fp_line (start -3.15 -3.75) (end -3.75 -3.75)
    (stroke (width 0.05) (type solid)) (layer "F.CrtYd") (tstamp b4706eb6-7b0b-46e9-bb08-2961c2f2b455))
  (fp_line (start -3.15 3.75) (end -3.75 3.75)
    (stroke (width 0.05) (type solid)) (layer "F.CrtYd") (tstamp 8d4f8c97-f4ba-4d27-b678-fba8363b5d27))
  (fp_line (start -3.15 5.15) (end -3.15 3.75)
    (stroke (width 0.05) (type solid)) (layer "F.CrtYd") (tstamp 60958cd1-ac37-477a-8039-aea80885be90))
  (fp_line (start 0 -5.15) (end -3.15 -5.15)
    (stroke (width 0.05) (type solid)) (layer "F.CrtYd") (tstamp 66ed011d-8fac-496c-a936-1f6d717c7d9d))
  (fp_line (start 0 -5.15) (end 3.15 -5.15)
    (stroke (width 0.05) (type solid)) (layer "F.CrtYd") (tstamp 377699e8-bc49-454e-9834-b73720220ede))
  (fp_line (start 0 5.15) (end -3.15 5.15)
    (stroke (width 0.05) (type solid)) (layer "F.CrtYd") (tstamp d5ec650c-22b0-4c18-891a-d47c8f2516e3))
  (fp_line (start 0 5.15) (end 3.15 5.15)
    (stroke (width 0.05) (type solid)) (layer "F.CrtYd") (tstamp a7b7cdc0-7ba8-4c89-8281-b56439457b53))
  (fp_line (start 3.15 -5.15) (end 3.15 -3.75)
    (stroke (width 0.05) (type solid)) (layer "F.CrtYd") (tstamp d172a764-e59e-421f-99b0-579f5a7fcd87))
  (fp_line (start 3.15 -3.75) (end 3.75 -3.75)
    (stroke (width 0.05) (type solid)) (layer "F.CrtYd") (tstamp 0d480a20-764b-4c17-a13b-c849eaaac1cc))
  (fp_line (start 3.15 3.75) (end 3.75 3.75)
    (stroke (width 0.05) (type solid)) (layer "F.CrtYd") (tstamp 641372e3-3601-437d-8145-5b9bb4d09a92))
  (fp_line (start 3.15 5.15) (end 3.15 3.75)
    (stroke (width 0.05) (type solid)) (layer "F.CrtYd") (tstamp c2780cab-807e-42a4-bf47-af8629f7fc86))
  (fp_line (start 3.75 -3.75) (end 3.75 -3.15)
    (stroke (width 0.05) (type solid)) (layer "F.CrtYd") (tstamp d80e0327-ee48-4aeb-a3a4-be3f7b8bf065))
  (fp_line (start 3.75 -3.15) (end 5.15 -3.15)
    (stroke (width 0.05) (type solid)) (layer "F.CrtYd") (tstamp 3baa7c58-e4eb-4fb3-9510-e0aa5051cd4f))
  (fp_line (start 3.75 3.15) (end 5.15 3.15)
    (stroke (width 0.05) (type solid)) (layer "F.CrtYd") (tstamp 090ad87c-9644-47ab-b241-2b3ab2422777))
  (fp_line (start 3.75 3.75) (end 3.75 3.15)
    (stroke (width 0.05) (type solid)) (layer "F.CrtYd") (tstamp 2d3e910a-2dbf-4441-975d-7d4ad3fd9c3b))
  (fp_line (start 5.15 -3.15) (end 5.15 0)
    (stroke (width 0.05) (type solid)) (layer "F.CrtYd") (tstamp f469584a-2a9f-4839-a5c0-f166aa097bb3))
  (fp_line (start 5.15 3.15) (end 5.15 0)
    (stroke (width 0.05) (type solid)) (layer "F.CrtYd") (tstamp 84192c79-dc19-48ec-8603-2631b7c0676b))
  (fp_line (start -3.5 -2.5) (end -2.5 -3.5)
    (stroke (width 0.1) (type solid)) (layer "F.Fab") (tstamp 966447da-1e47-4fff-8c02-fc085f7f1031))
  (fp_line (start -3.5 3.5) (end -3.5 -2.5)
    (stroke (width 0.1) (type solid)) (layer "F.Fab") (tstamp b3cb2b1e-299a-4e71-8788-5e23e29cd7c8))
  (fp_line (start -2.5 -3.5) (end 3.5 -3.5)
    (stroke (width 0.1) (type solid)) (layer "F.Fab") (tstamp fd118155-3be0-49bd-9ff2-79dfdbabe7be))
  (fp_line (start 3.5 -3.5) (end 3.5 3.5)
    (stroke (width 0.1) (type solid)) (layer "F.Fab") (tstamp 60da0a26-182a-4b16-9ba1-bc6bda1962df))
  (fp_line (start 3.5 3.5) (end -3.5 3.5)
    (stroke (width 0.1) (type solid)) (layer "F.Fab") (tstamp 58f77057-f6dd-4a44-b918-6131f0155cca))
  (pad "1" smd roundrect (at -4.1625 -2.75) (size 1.475 0.3) (layers "F.Cu" "F.Paste" "F.Mask") (roundrect_rratio 0.1666666667) (tstamp 8b3f77c2-53bf-408d-a31e-74f97f15cbdf))
  (pad "2" smd roundrect (at -4.1625 -2.25) (size 1.475 0.3) (layers "F.Cu" "F.Paste" "F.Mask") (roundrect_rratio 0.1666666667) (tstamp c1c709a7-29fa-4745-84d7-fbe37201539e))
  (pad "3" smd roundrect (at -4.1625 -1.75) (size 1.475 0.3) (layers "F.Cu" "F.Paste" "F.Mask") (roundrect_rratio 0.1666666667) (tstamp 3469f232-493a-4f80-a295-7a39a8cb70f9))
  (pad "4" smd roundrect (at -4.1625 -1.25) (size 1.475 0.3) (layers "F.Cu" "F.Paste" "F.Mask") (roundrect_rratio 0.1666666667) (tstamp e0bd82ad-f990-4d00-8c45-25e28ea922f5))
  (pad "5" smd roundrect (at -4.1625 -0.75) (size 1.475 0.3) (layers "F.Cu" "F.Paste" "F.Mask") (roundrect_rratio 0.1666666667) (tstamp bc221e15-5344-4628-9cba-94eec5c0f53a))
  (pad "6" smd roundrect (at -4.1625 -0.25) (size 1.475 0.3) (layers "F.Cu" "F.Paste" "F.Mask") (roundrect_rratio 0.1666666667) (tstamp b8c23eb7-76da-4bcc-9c89-3f961da07175))
  (pad "7" smd roundrect (at -4.1625 0.25) (size 1.475 0.3) (layers "F.Cu" "F.Paste" "F.Mask") (roundrect_rratio 0.1666666667) (tstamp 98905354-5798-4a3c-9270-efe1570b48f0))
  (pad "8" smd roundrect (at -4.1625 0.75) (size 1.475 0.3) (layers "F.Cu" "F.Paste" "F.Mask") (roundrect_rratio 0.1666666667) (tstamp ed25af04-8eca-4010-9151-e0ae1bdc22a5))
  (pad "9" smd roundrect (at -4.1625 1.25) (size 1.475 0.3) (layers "F.Cu" "F.Paste" "F.Mask") (roundrect_rratio 0.1666666667) (tstamp d2038007-55fd-469b-a5b4-a31184fed1fa))
  (pad "10" smd roundrect (at -4.1625 1.75) (size 1.475 0.3) (layers "F.Cu" "F.Paste" "F.Mask") (roundrect_rratio 0.1666666667) (tstamp e34b85b0-f892-4c94-a46b-e48ee48d758e))
  (pad "11" smd roundrect (at -4.1625 2.25) (size 1.475 0.3) (layers "F.Cu" "F.Paste" "F.Mask") (roundrect_rratio 0.1666666667) (tstamp 231785e5-416d-43b7-82f5-78bc94a1d4fc))
  (pad "12" smd roundrect (at -4.1625 2.75) (size 1.475 0.3) (layers "F.Cu" "F.Paste" "F.Mask") (roundrect_rratio 0.1666666667) (tstamp fe6225f4-d077-4cba-abf6-f4ad716a3199))
  (pad "13" smd roundrect (at -2.75 4.1625) (size 0.3 1.475) (layers "F.Cu" "F.Paste" "F.Mask") (roundrect_rratio 0.1666666667) (tstamp 380e3614-d781-4912-8187-11a003fa993e))
  (pad "14" smd roundrect (at -2.25 4.1625) (size 0.3 1.475) (layers "F.Cu" "F.Paste" "F.Mask") (roundrect_rratio 0.1666666667) (tstamp 6d5196cd-29e5-4372-b710-57f47846d8aa))
  (pad "15" smd roundrect (at -1.75 4.1625) (size 0.3 1.475) (layers "F.Cu" "F.Paste" "F.Mask") (roundrect_rratio 0.1666666667) (tstamp 16fe2a63-2bc7-44c8-af7c-fd52df3f8f7c))
  (pad "16" smd roundrect (at -1.25 4.1625) (size 0.3 1.475) (layers "F.Cu" "F.Paste" "F.Mask") (roundrect_rratio 0.1666666667) (tstamp a0f64866-c977-4199-9e1c-b311e565c80b))
  (pad "17" smd roundrect (at -0.75 4.1625) (size 0.3 1.475) (layers "F.Cu" "F.Paste" "F.Mask") (roundrect_rratio 0.1666666667) (tstamp 558f1e63-2292-4f4c-9a64-cf318647df92))
  (pad "18" smd roundrect (at -0.25 4.1625) (size 0.3 1.475) (layers "F.Cu" "F.Paste" "F.Mask") (roundrect_rratio 0.1666666667) (tstamp a7e4e41b-d2bd-4faf-9ffd-543314c6ab77))
  (pad "19" smd roundrect (at 0.25 4.1625) (size 0.3 1.475) (layers "F.Cu" "F.Paste" "F.Mask") (roundrect_rratio 0.1666666667) (tstamp ff4848db-d89d-40d0-ac3a-878bd776f9d8))
  (pad "20" smd roundrect (at 0.75 4.1625) (size 0.3 1.475) (layers "F.Cu" "F.Paste" "F.Mask") (roundrect_rratio 0.1666666667) (tstamp 828ccd68-21b1-4a19-bcbe-327068470fb0))
  (pad "21" smd roundrect (at 1.25 4.1625) (size 0.3 1.475) (layers "F.Cu" "F.Paste" "F.Mask") (roundrect_rratio 0.1666666667) (tstamp 1dec63cc-a213-4651-81e8-4e0995498e21))
  (pad "22" smd roundrect (at 1.75 4.1625) (size 0.3 1.475) (layers "F.Cu" "F.Paste" "F.Mask") (roundrect_rratio 0.1666666667) (tstamp fa9a2aed-7ee8-4043-adee-12043ca55440))
  (pad "23" smd roundrect (at 2.25 4.1625) (size 0.3 1.475) (layers "F.Cu" "F.Paste" "F.Mask") (roundrect_rratio 0.1666666667) (tstamp 1528e433-ade0-4927-b6da-7a6947071016))
  (pad "24" smd roundrect (at 2.75 4.1625) (size 0.3 1.475) (layers "F.Cu" "F.Paste" "F.Mask") (roundrect_rratio 0.1666666667) (tstamp 79060678-9e1a-47ac-99aa-411b8effa925))
  (pad "25" smd roundrect (at 4.1625 2.75) (size 1.475 0.3) (layers "F.Cu" "F.Paste" "F.Mask") (roundrect_rratio 0.1666666667) (tstamp da807954-3d10-4886-ad92-fba37ac2eb64))
  (pad "26" smd roundrect (at 4.1625 2.25) (size 1.475 0.3) (layers "F.Cu" "F.Paste" "F.Mask") (roundrect_rratio 0.1666666667) (tstamp 3fe423ff-b33c-4bbf-ae89-352e8bdcd5b0))
  (pad "27" smd roundrect (at 4.1625 1.75) (size 1.475 0.3) (layers "F.Cu" "F.Paste" "F.Mask") (roundrect_rratio 0.1666666667) (tstamp 3417e47f-8f35-4f50-be8b-50cecec130d9))
  (pad "28" smd roundrect (at 4.1625 1.25) (size 1.475 0.3) (layers "F.Cu" "F.Paste" "F.Mask") (roundrect_rratio 0.1666666667) (tstamp 501fec8b-4383-40db-805f-7925aed4552b))
  (pad "29" smd roundrect (at 4.1625 0.75) (size 1.475 0.3) (layers "F.Cu" "F.Paste" "F.Mask") (roundrect_rratio 0.1666666667) (tstamp 4cdb897a-eac0-4d5c-a641-a5102f7daceb))
  (pad "30" smd roundrect (at 4.1625 0.25) (size 1.475 0.3) (layers "F.Cu" "F.Paste" "F.Mask") (roundrect_rratio 0.1666666667) (tstamp 3093b332-77cc-4352-8461-2bf49fe27a67))
  (pad "31" smd roundrect (at 4.1625 -0.25) (size 1.475 0.3) (layers "F.Cu" "F.Paste" "F.Mask") (roundrect_rratio 0.1666666667) (tstamp 6616b138-277d-495f-b66f-162741ae204a))
  (pad "32" smd roundrect (at 4.1625 -0.75) (size 1.475 0.3) (layers "F.Cu" "F.Paste" "F.Mask") (roundrect_rratio 0.1666666667) (tstamp e140f746-868e-478e-94f9-16ee189dd0e6))
  (pad "33" smd roundrect (at 4.1625 -1.25) (size 1.475 0.3) (layers "F.Cu" "F.Paste" "F.Mask") (roundrect_rratio 0.1666666667) (tstamp 64d89785-c12c-4fd1-b3c1-f31c87c130dc))
  (pad "34" smd roundrect (at 4.1625 -1.75) (size 1.475 0.3) (layers "F.Cu" "F.Paste" "F.Mask") (roundrect_rratio 0.1666666667) (tstamp 9450d495-9a8c-4a98-904c-6b89f6a9848d))
  (pad "35" smd roundrect (at 4.1625 -2.25) (size 1.475 0.3) (layers "F.Cu" "F.Paste" "F.Mask") (roundrect_rratio 0.1666666667) (tstamp f3c5641b-de18-42f6-a5e5-a4fd1621d561))
  (pad "36" smd roundrect (at 4.1625 -2.75) (size 1.475 0.3) (layers "F.Cu" "F.Paste" "F.Mask") (roundrect_rratio 0.1666666667) (tstamp 0f904cf9-a29e-4eaa-9b42-11ac16b7f503))
  (pad "37" smd roundrect (at 2.75 -4.1625) (size 0.3 1.475) (layers "F.Cu" "F.Paste" "F.Mask") (roundrect_rratio 0.1666666667) (tstamp ec99d87c-16c8-4544-a810-052459b9b61c))
  (pad "38" smd roundrect (at 2.25 -4.1625) (size 0.3 1.475) (layers "F.Cu" "F.Paste" "F.Mask") (roundrect_rratio 0.1666666667) (tstamp 648a8532-77f6-44dd-8a44-e45b3a0fc5b1))
  (pad "39" smd roundrect (at 1.75 -4.1625) (size 0.3 1.475) (layers "F.Cu" "F.Paste" "F.Mask") (roundrect_rratio 0.1666666667) (tstamp 96a771ba-a770-47e8-a8d8-f58d32ee432b))
  (pad "40" smd roundrect (at 1.25 -4.1625) (size 0.3 1.475) (layers "F.Cu" "F.Paste" "F.Mask") (roundrect_rratio 0.1666666667) (tstamp d2d5c682-6a63-452d-9ad1-ba9c5b28d5ae))
  (pad "41" smd roundrect (at 0.75 -4.1625) (size 0.3 1.475) (layers "F.Cu" "F.Paste" "F.Mask") (roundrect_rratio 0.1666666667) (tstamp 46b0bf91-63a1-4033-9f11-2121b862e7b0))
  (pad "42" smd roundrect (at 0.25 -4.1625) (size 0.3 1.475) (layers "F.Cu" "F.Paste" "F.Mask") (roundrect_rratio 0.1666666667) (tstamp 72bfaf68-7492-4380-b66d-c8660395010f))
  (pad "43" smd roundrect (at -0.25 -4.1625) (size 0.3 1.475) (layers "F.Cu" "F.Paste" "F.Mask") (roundrect_rratio 0.1666666667) (tstamp 32d0b45f-2388-4bdf-87a0-ab7231babcba))
  (pad "44" smd roundrect (at -0.75 -4.1625) (size 0.3 1.475) (layers "F.Cu" "F.Paste" "F.Mask") (roundrect_rratio 0.1666666667) (tstamp dfcf9eca-56a8-4f3a-864a-89127749adfc))
  (pad "45" smd roundrect (at -1.25 -4.1625) (size 0.3 1.475) (layers "F.Cu" "F.Paste" "F.Mask") (roundrect_rratio 0.1666666667) (tstamp 3f04f214-0407-4171-b6cb-fad9a448a58d))
  (pad "46" smd roundrect (at -1.75 -4.1625) (size 0.3 1.475) (layers "F.Cu" "F.Paste" "F.Mask") (roundrect_rratio 0.1666666667) (tstamp 5a95a259-94f6-4cc4-be79-3dea108e92ec))
  (pad "47" smd roundrect (at -2.25 -4.1625) (size 0.3 1.475) (layers "F.Cu" "F.Paste" "F.Mask") (roundrect_rratio 0.1666666667) (tstamp 31eea55c-5c5d-4c86-ba95-7177760cf804))
  (pad "48" smd roundrect (at -2.75 -4.1625) (size 0.3 1.475) (layers "F.Cu" "F.Paste" "F.Mask") (roundrect_rratio 0.1666666667) (tstamp 0162f4c0-c7bd-4a35-9424-43c2d16d0ddd))
  (model "${KICADLIB}/model/QFP/TQFP50P700X700-48.step"
    (offset (xyz 0 0 0))
    (scale (xyz 1 1 1))
    (rotate (xyz 0 0 0))
  )
)
