(footprint "PinHeader_2x04_P2.54mm_Horizontal_SMD" (version 20221018) (generator pcbnew)
  (layer "F.Cu")
  (attr smd)
  (fp_text reference "REF**" (at 0 -6.731 unlocked) (layer "F.SilkS")
      (effects (font (size 1 1) (thickness 0.1)))
    (tstamp dd97b479-9e60-4c06-9b69-6cd41fde8b4e)
  )
  (fp_text value "PinHeader_2x04_P2.54mm_Horizontal_SMD" (at 0 1.762 unlocked) (layer "F.Fab") hide
      (effects (font (size 1 1) (thickness 0.15)))
    (tstamp e86c67a9-dd73-42b2-a32f-0b1ffbdf5c59)
  )
  (fp_text user "^" (at -5.207 -0.508 -90 unlocked) (layer "F.SilkS")
      (effects (font (size 1 1) (thickness 0.15)))
    (tstamp 55bd5dd7-be9e-4e0b-9efb-3e60eb681e4d)
  )
  (fp_text user "${REFERENCE}" (at 0 3.962 unlocked) (layer "F.Fab")
      (effects (font (size 1 1) (thickness 0.15)))
    (tstamp c904f3bf-f0ea-478d-9ddd-d3459a8a1591)
  )
  (fp_line (start -5.08 2.762) (end 5.08 2.762)
    (stroke (width 0.1) (type default)) (layer "F.SilkS") (tstamp 33a84ae5-a038-4b7a-82be-c401b504c3dd))
  (fp_line (start -5.08 5.262) (end -5.08 2.762)
    (stroke (width 0.1) (type default)) (layer "F.SilkS") (tstamp 3d842d6b-8db0-4cfa-8766-a8f4321fa0bc))
  (fp_line (start 5.08 2.762) (end 5.08 5.262)
    (stroke (width 0.1) (type default)) (layer "F.SilkS") (tstamp a25f3e94-7b44-4545-b3d6-958a7044aa0f))
  (fp_line (start 5.08 5.262) (end -5.08 5.262)
    (stroke (width 0.1) (type default)) (layer "F.SilkS") (tstamp 1181deb9-16d1-415c-8717-986a9106095f))
  (fp_rect (start -5.387 -5.891) (end 5.387 11.381)
    (stroke (width 0.05) (type default)) (fill none) (layer "F.CrtYd") (tstamp 31544bfd-a9c5-4af4-8ecb-6b323cd4b472))
  (fp_line (start -4.16 -5.08) (end -4.16 -1.27)
    (stroke (width 0.1) (type solid)) (layer "F.Fab") (tstamp b5ad7f29-515b-4df1-b5e3-007a12ff0d5b))
  (fp_line (start -4.16 -0.918) (end -4.16 2.762)
    (stroke (width 0.1) (type solid)) (layer "F.Fab") (tstamp f1284030-99c1-430f-9d03-41d4890f1eef))
  (fp_line (start -4.15 5.262) (end -4.15 11.102)
    (stroke (width 0.1) (type solid)) (layer "F.Fab") (tstamp f9499fdc-9e82-4722-b172-378beca5a2dc))
  (fp_line (start -4.15 11.102) (end -3.45 11.102)
    (stroke (width 0.1) (type solid)) (layer "F.Fab") (tstamp e1607d8b-e06c-4540-8c27-737f469b5872))
  (fp_line (start -3.46 -5.08) (end -4.16 -5.08)
    (stroke (width 0.1) (type solid)) (layer "F.Fab") (tstamp 8fea0b67-9a46-4a3e-9cdb-dd53c80ef494))
  (fp_line (start -3.46 -1.273) (end -3.46 -5.08)
    (stroke (width 0.1) (type solid)) (layer "F.Fab") (tstamp ba52a272-a370-4f8c-91f8-abdad8c09971))
  (fp_line (start -3.46 -0.918) (end -4.16 -0.918)
    (stroke (width 0.1) (type solid)) (layer "F.Fab") (tstamp 1b6806c4-62b6-413c-8157-79a70894efee))
  (fp_line (start -3.46 2.762) (end -3.46 -0.918)
    (stroke (width 0.1) (type solid)) (layer "F.Fab") (tstamp 1044201c-7356-478e-b9cc-cc60ebc00a4c))
  (fp_line (start -3.45 11.102) (end -3.45 5.262)
    (stroke (width 0.1) (type solid)) (layer "F.Fab") (tstamp 8343b5c1-d2fa-4807-8a63-e9b43612e907))
  (fp_line (start -1.62 -5.08) (end -1.62 -1.27)
    (stroke (width 0.1) (type solid)) (layer "F.Fab") (tstamp c820ad72-36d3-4aef-8dae-e00fb1f42c6f))
  (fp_line (start -1.62 -0.918) (end -1.62 2.762)
    (stroke (width 0.1) (type solid)) (layer "F.Fab") (tstamp aefa1dea-d3f9-4715-bd6d-e11ec0936eaf))
  (fp_line (start -1.6 5.262) (end -1.6 11.102)
    (stroke (width 0.1) (type solid)) (layer "F.Fab") (tstamp a5982b9a-7ddf-46ef-bafd-af1ca390d4fe))
  (fp_line (start -1.6 11.102) (end -0.9 11.102)
    (stroke (width 0.1) (type solid)) (layer "F.Fab") (tstamp fa0ac7ee-8767-4943-bc71-735ee8f7de0b))
  (fp_line (start -0.92 -5.08) (end -1.62 -5.08)
    (stroke (width 0.1) (type solid)) (layer "F.Fab") (tstamp 5f9e2a46-3357-4cc4-ab0d-e41c57afebd0))
  (fp_line (start -0.92 -1.273) (end -0.92 -5.08)
    (stroke (width 0.1) (type solid)) (layer "F.Fab") (tstamp 177784ca-2f61-4687-993d-1a162096bfba))
  (fp_line (start -0.92 -0.918) (end -1.62 -0.918)
    (stroke (width 0.1) (type solid)) (layer "F.Fab") (tstamp f78f2cc4-0214-4385-ad8f-823a408660a3))
  (fp_line (start -0.92 2.762) (end -0.92 -0.918)
    (stroke (width 0.1) (type solid)) (layer "F.Fab") (tstamp 4b3a795a-4ce5-4b75-bada-d7898c8a099e))
  (fp_line (start -0.9 11.102) (end -0.9 5.262)
    (stroke (width 0.1) (type solid)) (layer "F.Fab") (tstamp db1ae278-8262-45c9-a3f7-48e4865b110f))
  (fp_line (start 0.9 5.262) (end 0.9 11.102)
    (stroke (width 0.1) (type solid)) (layer "F.Fab") (tstamp eee699d5-23c7-450d-ac33-978793a0f339))
  (fp_line (start 0.9 11.102) (end 1.6 11.102)
    (stroke (width 0.1) (type solid)) (layer "F.Fab") (tstamp f70b37a2-502b-449d-bc03-e8abd8ee51b6))
  (fp_line (start 0.92 -5.08) (end 0.92 -1.27)
    (stroke (width 0.1) (type solid)) (layer "F.Fab") (tstamp 608ebd29-60ec-425a-ae47-90edca56f058))
  (fp_line (start 0.92 -0.918) (end 0.92 2.762)
    (stroke (width 0.1) (type solid)) (layer "F.Fab") (tstamp 1d81d13c-69af-48b7-a62d-8c6653fbcfe7))
  (fp_line (start 1.6 11.102) (end 1.6 5.262)
    (stroke (width 0.1) (type solid)) (layer "F.Fab") (tstamp 7635dbd0-049c-40a8-871c-c525d22b12d7))
  (fp_line (start 1.62 -5.08) (end 0.92 -5.08)
    (stroke (width 0.1) (type solid)) (layer "F.Fab") (tstamp f8f96c29-ddbb-43c3-a923-3c8d1f316533))
  (fp_line (start 1.62 -1.273) (end 1.62 -5.08)
    (stroke (width 0.1) (type solid)) (layer "F.Fab") (tstamp 1c12c874-8d74-4c87-8e92-61822c0c3f1c))
  (fp_line (start 1.62 -0.918) (end 0.92 -0.918)
    (stroke (width 0.1) (type solid)) (layer "F.Fab") (tstamp 60bc09e5-0791-4764-b7aa-ed87d61c0732))
  (fp_line (start 1.62 2.762) (end 1.62 -0.918)
    (stroke (width 0.1) (type solid)) (layer "F.Fab") (tstamp 8c60a356-5a43-4fca-b668-26040f6f23d6))
  (fp_line (start 3.45 5.262) (end 3.45 11.102)
    (stroke (width 0.1) (type solid)) (layer "F.Fab") (tstamp 5210f90d-5c9f-46ee-9ec9-9d6cb4da181a))
  (fp_line (start 3.45 11.102) (end 4.15 11.102)
    (stroke (width 0.1) (type solid)) (layer "F.Fab") (tstamp 9debcd94-13bc-4e23-860b-98c3f4bcd66f))
  (fp_line (start 3.46 -5.08) (end 3.46 -1.27)
    (stroke (width 0.1) (type solid)) (layer "F.Fab") (tstamp 43bf49ea-1a87-4842-9565-869978f82f60))
  (fp_line (start 3.46 -0.918) (end 3.46 2.762)
    (stroke (width 0.1) (type solid)) (layer "F.Fab") (tstamp 08665a3d-0191-4a58-85f0-f4fbf4f7db9b))
  (fp_line (start 4.15 11.102) (end 4.15 5.262)
    (stroke (width 0.1) (type solid)) (layer "F.Fab") (tstamp 74c98286-fef5-4232-89a6-f0ca13ff020f))
  (fp_line (start 4.16 -5.08) (end 3.46 -5.08)
    (stroke (width 0.1) (type solid)) (layer "F.Fab") (tstamp 1d577ff0-b2df-4227-b8ce-4237348fbe4b))
  (fp_line (start 4.16 -1.273) (end 4.16 -5.08)
    (stroke (width 0.1) (type solid)) (layer "F.Fab") (tstamp 52fb5d74-1472-40ef-ac0e-8a33001e3eaf))
  (fp_line (start 4.16 -0.918) (end 3.46 -0.918)
    (stroke (width 0.1) (type solid)) (layer "F.Fab") (tstamp 4a10c281-6b78-4cb3-aa18-ab6ed6863e8d))
  (fp_line (start 4.16 2.762) (end 4.16 -0.918)
    (stroke (width 0.1) (type solid)) (layer "F.Fab") (tstamp 2be29272-5e1e-428c-ba35-fde9cf434631))
  (fp_poly
    (pts
      (xy 5.06 2.762)
      (xy 5.06 5.262)
      (xy -5.06 5.262)
      (xy -5.06 3.262)
      (xy -4.572 2.762)
    )

    (stroke (width 0.1) (type solid)) (fill none) (layer "F.Fab") (tstamp 08730307-53cd-45cb-be39-ea72d29c02eb))
  (pad "1" smd roundrect (at -3.81 0) (size 1.02 3.17) (layers "F.Cu" "F.Paste" "F.Mask") (roundrect_rratio 0.04901960784) (tstamp 0b4ee137-bbca-4b20-b219-e8c1399805ed))
  (pad "2" smd roundrect (at -3.81 -4.191) (size 1.02 3.17) (layers "F.Cu" "F.Paste" "F.Mask") (roundrect_rratio 0.04901960784) (tstamp 33862c56-5843-4654-8bfb-44a152bada2e))
  (pad "3" smd roundrect (at -1.27 0) (size 1.02 3.17) (layers "F.Cu" "F.Paste" "F.Mask") (roundrect_rratio 0.04901960784) (tstamp 674228a5-ca91-4662-9ccd-55ab8eb65084))
  (pad "4" smd roundrect (at -1.27 -4.191) (size 1.02 3.17) (layers "F.Cu" "F.Paste" "F.Mask") (roundrect_rratio 0.04901960784) (tstamp a04286ca-8f00-4832-9fe3-3ac5327e066f))
  (pad "5" smd roundrect (at 1.27 0) (size 1.02 3.17) (layers "F.Cu" "F.Paste" "F.Mask") (roundrect_rratio 0.04901960784) (tstamp 1d7bba6d-e736-48e2-9104-b51d8d1eb2e9))
  (pad "6" smd roundrect (at 1.27 -4.191) (size 1.02 3.17) (layers "F.Cu" "F.Paste" "F.Mask") (roundrect_rratio 0.04901960784) (tstamp 5b698172-9d19-4f22-b059-6d10728f0713))
  (pad "7" smd roundrect (at 3.81 0) (size 1.02 3.17) (layers "F.Cu" "F.Paste" "F.Mask") (roundrect_rratio 0.04901960784) (tstamp dbc4b2c5-3aa7-4dc5-a195-7cb57ad7561f))
  (pad "8" smd roundrect (at 3.81 -4.191) (size 1.02 3.17) (layers "F.Cu" "F.Paste" "F.Mask") (roundrect_rratio 0.04901960784) (tstamp 21e5733a-e2a5-4cf8-af7f-72a400845a08))
  (model "${KICADLIB}/model/connector/Samtec_TSM-104-01-T-DH.stp"
    (offset (xyz 0 -4.012 1.5))
    (scale (xyz 1 1 1))
    (rotate (xyz -90 0 0))
  )
)
