(footprint "Hirose_FX10A-140P14-SV1(71)" (version 20201116) (generator pcbnew) (layer "F.Cu")
  (tedit 5FBDDEE9)
  (fp_text reference "REF**" (at -25.5 0 90 unlocked) (layer "F.SilkS")
    (effects (font (size 1 1) (thickness 0.15)))
    (tstamp fb69fac3-d45c-4475-b1ef-7b05e1d3f21e)
  )
  (fp_text value "Hirose_FX10A-140P14-SV1(71)" (at 0 1 unlocked) (layer "F.Fab") hide
    (effects (font (size 1 1) (thickness 0.15)))
    (tstamp 87c915e5-5025-49f8-aebb-49c75fe4dfca)
  )
  (fp_text user "^" (at -18 3.95 unlocked) (layer "F.SilkS")
    (effects (font (size 1 1) (thickness 0.15)))
    (tstamp 1f487f1b-71be-401a-bd2a-2ad5954f19d4)
  )
  (fp_text user "${REFERENCE}" (at 0 0 unlocked) (layer "F.Fab")
    (effects (font (size 1 1) (thickness 0.15)))
    (tstamp ae41fafd-0e32-4a8c-95ca-7f2da90841e1)
  )
  (fp_line (start 24.6 -3) (end 22 -3) (layer "F.SilkS") (width 0.1) (tstamp 14bbe8ff-661b-4294-89c3-e99d133633a5))
  (fp_line (start -24.6 -3) (end -24.6 -1.6) (layer "F.SilkS") (width 0.1) (tstamp 1f5426b2-1050-4493-b926-eaaf40e9f1af))
  (fp_line (start -24.6 2.2) (end -23.8 3) (layer "F.SilkS") (width 0.1) (tstamp 2c160504-a5a6-4898-aead-8fdc7196787c))
  (fp_line (start -24.6 2.2) (end -24.6 1.6) (layer "F.SilkS") (width 0.1) (tstamp 888a3c1d-40d7-41b8-9d4b-91b279815933))
  (fp_line (start -23.8 3) (end -21.9 3) (layer "F.SilkS") (width 0.1) (tstamp 9eb0f0b4-fcf1-467b-b327-d3658a5bf74e))
  (fp_line (start 24.6 3) (end 22 3) (layer "F.SilkS") (width 0.1) (tstamp c3730a04-47bb-423c-9f54-9a26bef35ea9))
  (fp_line (start 24.6 -3) (end 24.6 -1.6) (layer "F.SilkS") (width 0.1) (tstamp cbd590e0-6e65-4b25-aa53-1cdc4ebc53a4))
  (fp_line (start -24.6 -3) (end -21.9 -3) (layer "F.SilkS") (width 0.1) (tstamp d5292cb3-4555-46b8-b405-57f0a462f7ca))
  (fp_line (start 24.6 3) (end 24.6 1.6) (layer "F.SilkS") (width 0.1) (tstamp fc324148-4c31-4ac1-bbec-d49d9640d8a6))
  (fp_rect (start -24.8 -4) (end 24.8 4) (layer "F.CrtYd") (width 0.05) (fill none) (tstamp 17cac953-3c15-48b5-8109-00511e385382))
  (pad "" thru_hole circle (at -22.2 0) (size 1.1 1.1) (drill 1.1) (layers *.Mask) (tstamp 72df1c74-dd6f-460e-b130-58def9f546d9))
  (pad "" thru_hole circle (at 22.2 0) (size 1.1 1.1) (drill 1.1) (layers *.Mask) (tstamp 83f60500-5d00-464d-b35b-a7277bb08d83))
  (pad "1" smd rect (at -18 2.4) (size 0.7 1.5) (layers "F.Cu" "F.Paste" "F.Mask") (tstamp a6652473-0b56-4979-aae7-075739e3c9f1))
  (pad "2" smd rect (at -17.25 2.6) (size 0.3 1.1) (layers "F.Cu" "F.Paste" "F.Mask") (tstamp feeb9c30-4484-45ca-85dc-c9974e6b5a14))
  (pad "3" smd rect (at -16.75 2.6) (size 0.3 1.1) (layers "F.Cu" "F.Paste" "F.Mask") (tstamp ad4eb79d-0bb3-4611-9087-995da6bdefe1))
  (pad "4" smd rect (at -16.25 2.6) (size 0.3 1.1) (layers "F.Cu" "F.Paste" "F.Mask") (tstamp a3f5a537-e335-41a7-82d4-364ff7f772d6))
  (pad "5" smd rect (at -15.75 2.6) (size 0.3 1.1) (layers "F.Cu" "F.Paste" "F.Mask") (tstamp 6aed681d-b0e2-4104-bbe8-8237a559d611))
  (pad "6" smd rect (at -15.25 2.6) (size 0.3 1.1) (layers "F.Cu" "F.Paste" "F.Mask") (tstamp 31415bd9-c412-45bc-a2d9-f4e6eb93eaed))
  (pad "7" smd rect (at -14.75 2.6) (size 0.3 1.1) (layers "F.Cu" "F.Paste" "F.Mask") (tstamp 6e330685-2cfa-40fe-86df-90e2e7204428))
  (pad "8" smd rect (at -14.25 2.6) (size 0.3 1.1) (layers "F.Cu" "F.Paste" "F.Mask") (tstamp ce109bf4-1a35-443c-8cb5-9c0e746d0d3d))
  (pad "9" smd rect (at -13.75 2.6) (size 0.3 1.1) (layers "F.Cu" "F.Paste" "F.Mask") (tstamp 3466619a-93e1-4483-bc24-91da33c4ec73))
  (pad "10" smd rect (at -13.25 2.6) (size 0.3 1.1) (layers "F.Cu" "F.Paste" "F.Mask") (tstamp 1d293d9c-7b72-4c89-b527-3061d43bf1c0))
  (pad "11" smd rect (at -12.75 2.6) (size 0.3 1.1) (layers "F.Cu" "F.Paste" "F.Mask") (tstamp f9ae4637-dc82-465a-bad3-8c7e6199dabd))
  (pad "12" smd rect (at -12 2.4) (size 0.7 1.5) (layers "F.Cu" "F.Paste" "F.Mask") (tstamp 249abe0f-a03f-4fee-9028-aa5f0c6d242f))
  (pad "13" smd rect (at -11.25 2.6) (size 0.3 1.1) (layers "F.Cu" "F.Paste" "F.Mask") (tstamp 89256bb0-6c37-40d5-bf96-2af1d8ce40da))
  (pad "14" smd rect (at -10.75 2.6) (size 0.3 1.1) (layers "F.Cu" "F.Paste" "F.Mask") (tstamp 9a4ed1db-4055-4367-80ab-53b8e4f81000))
  (pad "15" smd rect (at -10.25 2.6) (size 0.3 1.1) (layers "F.Cu" "F.Paste" "F.Mask") (tstamp 83c151c4-2f9c-471d-b978-aff4b30c0138))
  (pad "16" smd rect (at -9.75 2.6) (size 0.3 1.1) (layers "F.Cu" "F.Paste" "F.Mask") (tstamp 19094c70-0739-4661-ac28-5b4243c74483))
  (pad "17" smd rect (at -9.25 2.6) (size 0.3 1.1) (layers "F.Cu" "F.Paste" "F.Mask") (tstamp a378f9ff-2b4b-4f98-8059-9814a21c2d0f))
  (pad "18" smd rect (at -8.75 2.6) (size 0.3 1.1) (layers "F.Cu" "F.Paste" "F.Mask") (tstamp 47c8a6c8-f559-4659-bc59-7fd3e4707ff8))
  (pad "19" smd rect (at -8.25 2.6) (size 0.3 1.1) (layers "F.Cu" "F.Paste" "F.Mask") (tstamp ff14d01a-2116-4f1c-b858-4387c10f30e6))
  (pad "20" smd rect (at -7.75 2.6) (size 0.3 1.1) (layers "F.Cu" "F.Paste" "F.Mask") (tstamp d3e93ae1-b4f5-4078-bc9c-ea9826279443))
  (pad "21" smd rect (at -7.25 2.6) (size 0.3 1.1) (layers "F.Cu" "F.Paste" "F.Mask") (tstamp bcf88025-14b4-42a9-8502-422e8d6c4077))
  (pad "22" smd rect (at -6.75 2.6) (size 0.3 1.1) (layers "F.Cu" "F.Paste" "F.Mask") (tstamp dfc91ebf-cc88-4ab5-b8a6-9a017381619b))
  (pad "23" smd rect (at -6 2.4) (size 0.7 1.5) (layers "F.Cu" "F.Paste" "F.Mask") (tstamp d2e99542-5bb3-414f-96b7-54c951489b5b))
  (pad "24" smd rect (at -5.25 2.6) (size 0.3 1.1) (layers "F.Cu" "F.Paste" "F.Mask") (tstamp 4d781575-42c0-47d6-9c97-b59bbb924433))
  (pad "25" smd rect (at -4.75 2.6) (size 0.3 1.1) (layers "F.Cu" "F.Paste" "F.Mask") (tstamp 5db4ba2e-34d3-4015-ada8-3bf422f8a4a8))
  (pad "26" smd rect (at -4.25 2.6) (size 0.3 1.1) (layers "F.Cu" "F.Paste" "F.Mask") (tstamp 3054037d-51ab-4b4d-9e5a-6c26b574f54d))
  (pad "27" smd rect (at -3.75 2.6) (size 0.3 1.1) (layers "F.Cu" "F.Paste" "F.Mask") (tstamp 4dd2063c-76f6-46ba-a4ee-f0621e4e91ff))
  (pad "28" smd rect (at -3.25 2.6) (size 0.3 1.1) (layers "F.Cu" "F.Paste" "F.Mask") (tstamp 1eda1266-a658-40d1-bd04-3c0f2f20d151))
  (pad "29" smd rect (at -2.75 2.6) (size 0.3 1.1) (layers "F.Cu" "F.Paste" "F.Mask") (tstamp 137a87bd-d3d8-47b1-9796-c9cf8b171fe9))
  (pad "30" smd rect (at -2.25 2.6) (size 0.3 1.1) (layers "F.Cu" "F.Paste" "F.Mask") (tstamp 514cc039-4c4e-4f9e-9e20-907e565682e5))
  (pad "31" smd rect (at -1.75 2.6) (size 0.3 1.1) (layers "F.Cu" "F.Paste" "F.Mask") (tstamp 6cb4d23c-e2f8-46e2-90d0-a99162c9e2c7))
  (pad "32" smd rect (at -1.25 2.6) (size 0.3 1.1) (layers "F.Cu" "F.Paste" "F.Mask") (tstamp 36ccf75b-ba6a-41bc-849e-f3bec4ec3e0e))
  (pad "33" smd rect (at -0.75 2.6) (size 0.3 1.1) (layers "F.Cu" "F.Paste" "F.Mask") (tstamp 6717e4d1-fc1a-423d-8fb6-a733e533d90e))
  (pad "34" smd rect (at 0 2.4) (size 0.7 1.5) (layers "F.Cu" "F.Paste" "F.Mask") (tstamp 92a94c51-c724-4016-87f4-7dde3793b97e))
  (pad "35" smd rect (at 0.75 2.6) (size 0.3 1.1) (layers "F.Cu" "F.Paste" "F.Mask") (tstamp 9337e46f-4cd7-48af-baf3-d3176d122a96))
  (pad "36" smd rect (at 1.25 2.6) (size 0.3 1.1) (layers "F.Cu" "F.Paste" "F.Mask") (tstamp afe26e38-bdcb-42e5-9da4-c974dc9fef82))
  (pad "37" smd rect (at 1.75 2.6) (size 0.3 1.1) (layers "F.Cu" "F.Paste" "F.Mask") (tstamp 31b315bb-8836-4b94-9196-e20047bb7e0d))
  (pad "38" smd rect (at 2.25 2.6) (size 0.3 1.1) (layers "F.Cu" "F.Paste" "F.Mask") (tstamp 8ae15210-8d16-455b-85ce-4ddc7a1bf76b))
  (pad "39" smd rect (at 2.75 2.6) (size 0.3 1.1) (layers "F.Cu" "F.Paste" "F.Mask") (tstamp baed714f-8ed7-4155-a617-3dd988c2b5d6))
  (pad "40" smd rect (at 3.25 2.6) (size 0.3 1.1) (layers "F.Cu" "F.Paste" "F.Mask") (tstamp 1b1ce038-5bc8-4c91-aea6-ac3fcd702d5d))
  (pad "41" smd rect (at 3.75 2.6) (size 0.3 1.1) (layers "F.Cu" "F.Paste" "F.Mask") (tstamp 7340ce05-85d6-4c2a-b8e5-97de31ae23e3))
  (pad "42" smd rect (at 4.25 2.6) (size 0.3 1.1) (layers "F.Cu" "F.Paste" "F.Mask") (tstamp a280a401-2081-4c1c-8e80-5297f5993064))
  (pad "43" smd rect (at 4.75 2.6) (size 0.3 1.1) (layers "F.Cu" "F.Paste" "F.Mask") (tstamp 0c6dbff8-ca47-4f60-affb-456b98bd739e))
  (pad "44" smd rect (at 5.25 2.6) (size 0.3 1.1) (layers "F.Cu" "F.Paste" "F.Mask") (tstamp 6d0128d6-064d-4453-837b-6271186d7db3))
  (pad "45" smd rect (at 6 2.4) (size 0.7 1.5) (layers "F.Cu" "F.Paste" "F.Mask") (tstamp 6a616cef-43e4-40dd-86fa-5886523c457e))
  (pad "46" smd rect (at 6.75 2.6) (size 0.3 1.1) (layers "F.Cu" "F.Paste" "F.Mask") (tstamp 03e19ebf-1bbc-406f-875f-88a135437d9f))
  (pad "47" smd rect (at 7.25 2.6) (size 0.3 1.1) (layers "F.Cu" "F.Paste" "F.Mask") (tstamp d0968717-7c11-46d0-8e20-e526f30200cb))
  (pad "48" smd rect (at 7.75 2.6) (size 0.3 1.1) (layers "F.Cu" "F.Paste" "F.Mask") (tstamp 4a5ff219-d729-4367-956e-92ed751f7a4f))
  (pad "49" smd rect (at 8.25 2.6) (size 0.3 1.1) (layers "F.Cu" "F.Paste" "F.Mask") (tstamp 74e792ff-1353-4680-a55f-9513154f0232))
  (pad "50" smd rect (at 8.75 2.6) (size 0.3 1.1) (layers "F.Cu" "F.Paste" "F.Mask") (tstamp 91130579-7ca1-46a8-8c6a-33b1ad07cb88))
  (pad "51" smd rect (at 9.25 2.6) (size 0.3 1.1) (layers "F.Cu" "F.Paste" "F.Mask") (tstamp 5354654d-1711-4a3e-964b-2861f8e6618a))
  (pad "52" smd rect (at 9.75 2.6) (size 0.3 1.1) (layers "F.Cu" "F.Paste" "F.Mask") (tstamp 47fdc326-a30f-4b05-9abd-bac53bbcf90a))
  (pad "53" smd rect (at 10.25 2.6) (size 0.3 1.1) (layers "F.Cu" "F.Paste" "F.Mask") (tstamp 9885e64d-0862-4f77-84fa-2df344cf666f))
  (pad "54" smd rect (at 10.75 2.6) (size 0.3 1.1) (layers "F.Cu" "F.Paste" "F.Mask") (tstamp 0bdbad37-cf1a-481a-b0ac-8c620859d162))
  (pad "55" smd rect (at 11.25 2.6) (size 0.3 1.1) (layers "F.Cu" "F.Paste" "F.Mask") (tstamp a2940fcb-0a6b-493d-a077-cebd3e500651))
  (pad "56" smd rect (at 12 2.4) (size 0.7 1.5) (layers "F.Cu" "F.Paste" "F.Mask") (tstamp f2a062be-a29f-4c8a-89ee-7a27f6329601))
  (pad "57" smd rect (at 12.75 2.6) (size 0.3 1.1) (layers "F.Cu" "F.Paste" "F.Mask") (tstamp c163c3f8-f6d9-4c0d-b6ae-70ad52123db8))
  (pad "58" smd rect (at 13.25 2.6) (size 0.3 1.1) (layers "F.Cu" "F.Paste" "F.Mask") (tstamp 72561d65-0162-4693-bedc-021108e66e75))
  (pad "59" smd rect (at 13.75 2.6) (size 0.3 1.1) (layers "F.Cu" "F.Paste" "F.Mask") (tstamp 8eb65998-e069-424d-a26f-108837e4f142))
  (pad "60" smd rect (at 14.25 2.6) (size 0.3 1.1) (layers "F.Cu" "F.Paste" "F.Mask") (tstamp c7fbe589-bdbe-433f-9d0f-6f58eebb0e03))
  (pad "61" smd rect (at 14.75 2.6) (size 0.3 1.1) (layers "F.Cu" "F.Paste" "F.Mask") (tstamp 407f53f2-b04a-4f14-85b5-143d31151528))
  (pad "62" smd rect (at 15.25 2.6) (size 0.3 1.1) (layers "F.Cu" "F.Paste" "F.Mask") (tstamp 67bf30aa-16b3-41b3-9528-f1d300e0c893))
  (pad "63" smd rect (at 15.75 2.6) (size 0.3 1.1) (layers "F.Cu" "F.Paste" "F.Mask") (tstamp 5188af6b-527c-428c-862f-33f4e656c260))
  (pad "64" smd rect (at 16.25 2.6) (size 0.3 1.1) (layers "F.Cu" "F.Paste" "F.Mask") (tstamp 8e1f414a-b899-4853-b836-b85e3d8144c3))
  (pad "65" smd rect (at 16.75 2.6) (size 0.3 1.1) (layers "F.Cu" "F.Paste" "F.Mask") (tstamp 530c7398-0186-42aa-a636-70a85a819b84))
  (pad "66" smd rect (at 17.25 2.6) (size 0.3 1.1) (layers "F.Cu" "F.Paste" "F.Mask") (tstamp bb6c6b7b-0ac7-43c9-b26d-261e667262bb))
  (pad "67" smd rect (at 18 2.4) (size 0.7 1.5) (layers "F.Cu" "F.Paste" "F.Mask") (tstamp 1de6b26d-03f9-40aa-9943-a93c34350762))
  (pad "68" smd rect (at 18.75 2.6) (size 0.3 1.1) (layers "F.Cu" "F.Paste" "F.Mask") (tstamp f40b259e-e60e-4c28-8548-50bfc6f86fb8))
  (pad "69" smd rect (at 19.25 2.6) (size 0.3 1.1) (layers "F.Cu" "F.Paste" "F.Mask") (tstamp 64e41767-b4cb-4393-8d32-17c200ea8f38))
  (pad "70" smd rect (at 19.75 2.6) (size 0.3 1.1) (layers "F.Cu" "F.Paste" "F.Mask") (tstamp 4178f9c9-4443-4192-80a1-2461edfcfdba))
  (pad "71" smd rect (at 20.25 2.6) (size 0.3 1.1) (layers "F.Cu" "F.Paste" "F.Mask") (tstamp 396e19d5-52de-435a-958c-7ea53c14d393))
  (pad "72" smd rect (at 20.75 2.6) (size 0.3 1.1) (layers "F.Cu" "F.Paste" "F.Mask") (tstamp 9395e878-295d-4556-bfdb-0bee66ae2964))
  (pad "73" smd rect (at 23.95 0) (size 1.6 3.1) (layers "F.Cu" "F.Paste" "F.Mask") (tstamp e1987ae9-906f-4d7c-bc12-8cd505f37ef3))
  (pad "74" smd rect (at 20.75 -2.6) (size 0.3 1.1) (layers "F.Cu" "F.Paste" "F.Mask") (tstamp c5bf6071-eb13-4213-9490-dd037bc530e8))
  (pad "75" smd rect (at 20.25 -2.6) (size 0.3 1.1) (layers "F.Cu" "F.Paste" "F.Mask") (tstamp f5df0ece-53cd-443e-982a-47088e08a122))
  (pad "76" smd rect (at 19.75 -2.6) (size 0.3 1.1) (layers "F.Cu" "F.Paste" "F.Mask") (tstamp 4f6f8f0b-aae8-46c8-adc5-dbaa737498ec))
  (pad "77" smd rect (at 19.25 -2.6) (size 0.3 1.1) (layers "F.Cu" "F.Paste" "F.Mask") (tstamp ca01cc7f-30e3-45ec-a383-afe7e32c093a))
  (pad "78" smd rect (at 18.75 -2.6) (size 0.3 1.1) (layers "F.Cu" "F.Paste" "F.Mask") (tstamp bc5ec03c-6f16-4743-894a-603f7d868597))
  (pad "79" smd rect (at 18 -2.4) (size 0.7 1.5) (layers "F.Cu" "F.Paste" "F.Mask") (tstamp 586f1ba9-bcac-4cc3-9467-216aaf3717e0))
  (pad "80" smd rect (at 17.25 -2.6) (size 0.3 1.1) (layers "F.Cu" "F.Paste" "F.Mask") (tstamp 3195b5e5-adc3-43aa-9919-d1d523a2ec12))
  (pad "81" smd rect (at 16.75 -2.6) (size 0.3 1.1) (layers "F.Cu" "F.Paste" "F.Mask") (tstamp 01e89eac-3343-49f6-b3cf-e2da2b7e95bb))
  (pad "82" smd rect (at 16.25 -2.6) (size 0.3 1.1) (layers "F.Cu" "F.Paste" "F.Mask") (tstamp 92f582b3-12e7-42c7-a639-ce978a98725b))
  (pad "83" smd rect (at 15.75 -2.6) (size 0.3 1.1) (layers "F.Cu" "F.Paste" "F.Mask") (tstamp 7f07113b-d06f-4d86-8756-501b28eb10b3))
  (pad "84" smd rect (at 15.25 -2.6) (size 0.3 1.1) (layers "F.Cu" "F.Paste" "F.Mask") (tstamp 2cb1e3c8-5792-4736-b48e-e731184480c7))
  (pad "85" smd rect (at 14.75 -2.6) (size 0.3 1.1) (layers "F.Cu" "F.Paste" "F.Mask") (tstamp 90a844ed-aa75-4e5a-becf-44cf2118bcde))
  (pad "86" smd rect (at 14.25 -2.6) (size 0.3 1.1) (layers "F.Cu" "F.Paste" "F.Mask") (tstamp dd35a3ca-eb9c-4819-95f3-6a070da7c2f5))
  (pad "87" smd rect (at 13.75 -2.6) (size 0.3 1.1) (layers "F.Cu" "F.Paste" "F.Mask") (tstamp 452d0915-9457-4ae4-8449-3eb79536898a))
  (pad "88" smd rect (at 13.25 -2.6) (size 0.3 1.1) (layers "F.Cu" "F.Paste" "F.Mask") (tstamp f17025e5-4a09-42f7-ba30-db8e56f9d352))
  (pad "89" smd rect (at 12.75 -2.6) (size 0.3 1.1) (layers "F.Cu" "F.Paste" "F.Mask") (tstamp e4a1dead-4735-4824-86eb-b8f62722b653))
  (pad "90" smd rect (at 12 -2.4) (size 0.7 1.5) (layers "F.Cu" "F.Paste" "F.Mask") (tstamp 59411c30-e5e5-44b5-8316-793cb491c931))
  (pad "91" smd rect (at 11.25 -2.6) (size 0.3 1.1) (layers "F.Cu" "F.Paste" "F.Mask") (tstamp 1c17d47d-ab62-41d1-bfb6-351f983c8877))
  (pad "92" smd rect (at 10.75 -2.6) (size 0.3 1.1) (layers "F.Cu" "F.Paste" "F.Mask") (tstamp 7866ea91-8dee-4355-9e15-99c21b7db7c9))
  (pad "93" smd rect (at 10.25 -2.6) (size 0.3 1.1) (layers "F.Cu" "F.Paste" "F.Mask") (tstamp 0c341157-0806-4042-a8eb-3d10a65aa71a))
  (pad "94" smd rect (at 9.75 -2.6) (size 0.3 1.1) (layers "F.Cu" "F.Paste" "F.Mask") (tstamp f2ea9337-22fe-4b78-9240-c1d31bbdf0fd))
  (pad "95" smd rect (at 9.25 -2.6) (size 0.3 1.1) (layers "F.Cu" "F.Paste" "F.Mask") (tstamp 366e1fed-bfd9-43a0-9519-bc0949725ced))
  (pad "96" smd rect (at 8.75 -2.6) (size 0.3 1.1) (layers "F.Cu" "F.Paste" "F.Mask") (tstamp 5f890442-84d8-4fdd-8236-02d30468be1c))
  (pad "97" smd rect (at 8.25 -2.6) (size 0.3 1.1) (layers "F.Cu" "F.Paste" "F.Mask") (tstamp eae05734-f0b4-46c1-8d31-91167f64b9a7))
  (pad "98" smd rect (at 7.75 -2.6) (size 0.3 1.1) (layers "F.Cu" "F.Paste" "F.Mask") (tstamp 53ec647f-3953-4653-bf36-b3d1afbab57f))
  (pad "99" smd rect (at 7.25 -2.6) (size 0.3 1.1) (layers "F.Cu" "F.Paste" "F.Mask") (tstamp 11005ab2-0461-4d83-81cd-8527246aea18))
  (pad "100" smd rect (at 6.75 -2.6) (size 0.3 1.1) (layers "F.Cu" "F.Paste" "F.Mask") (tstamp 7efa6b0e-306d-49d5-809f-d642671d4f3d))
  (pad "101" smd rect (at 6 -2.4) (size 0.7 1.5) (layers "F.Cu" "F.Paste" "F.Mask") (tstamp cc0fb4b4-2713-4242-9f5b-8068507393cf))
  (pad "102" smd rect (at 5.25 -2.6) (size 0.3 1.1) (layers "F.Cu" "F.Paste" "F.Mask") (tstamp a94b02dc-5fdd-4533-a42d-83a9bb9441ae))
  (pad "103" smd rect (at 4.75 -2.6) (size 0.3 1.1) (layers "F.Cu" "F.Paste" "F.Mask") (tstamp 8600b236-b69b-4ccf-9bbb-c992d49b05d7))
  (pad "104" smd rect (at 4.25 -2.6) (size 0.3 1.1) (layers "F.Cu" "F.Paste" "F.Mask") (tstamp 7fc71aa8-9aad-4ff2-bfaa-bc5615d9966b))
  (pad "105" smd rect (at 3.75 -2.6) (size 0.3 1.1) (layers "F.Cu" "F.Paste" "F.Mask") (tstamp 55fa7217-40e1-4559-a0d5-569a1004485e))
  (pad "106" smd rect (at 3.25 -2.6) (size 0.3 1.1) (layers "F.Cu" "F.Paste" "F.Mask") (tstamp 63104c68-4b99-4805-9ff0-2c29d3677226))
  (pad "107" smd rect (at 2.75 -2.6) (size 0.3 1.1) (layers "F.Cu" "F.Paste" "F.Mask") (tstamp de509dc0-a010-40d0-b931-db4294f4b5da))
  (pad "108" smd rect (at 2.25 -2.6) (size 0.3 1.1) (layers "F.Cu" "F.Paste" "F.Mask") (tstamp efb0e949-5ac4-42ec-8116-d17514fdfd61))
  (pad "109" smd rect (at 1.75 -2.6) (size 0.3 1.1) (layers "F.Cu" "F.Paste" "F.Mask") (tstamp 379b2e80-7560-4dcf-8a57-3023273e1ddb))
  (pad "110" smd rect (at 1.25 -2.6) (size 0.3 1.1) (layers "F.Cu" "F.Paste" "F.Mask") (tstamp 4fb6df32-62c4-4193-9dce-d07a090a7f6e))
  (pad "111" smd rect (at 0.75 -2.6) (size 0.3 1.1) (layers "F.Cu" "F.Paste" "F.Mask") (tstamp c1742c5c-784e-41f1-8a4d-e2d4070a883f))
  (pad "112" smd rect (at 0 -2.4) (size 0.7 1.5) (layers "F.Cu" "F.Paste" "F.Mask") (tstamp 1af1fcf1-f65d-47b9-854e-7a48562be020))
  (pad "113" smd rect (at -0.75 -2.6) (size 0.3 1.1) (layers "F.Cu" "F.Paste" "F.Mask") (tstamp 25eb58f8-258d-49d0-9323-0f307953f950))
  (pad "114" smd rect (at -1.25 -2.6) (size 0.3 1.1) (layers "F.Cu" "F.Paste" "F.Mask") (tstamp 048a04e4-8e4a-4de6-8ce4-c094f09f33db))
  (pad "115" smd rect (at -1.75 -2.6) (size 0.3 1.1) (layers "F.Cu" "F.Paste" "F.Mask") (tstamp 3f6819e3-8e22-42ef-ade8-615cc878f949))
  (pad "116" smd rect (at -2.25 -2.6) (size 0.3 1.1) (layers "F.Cu" "F.Paste" "F.Mask") (tstamp 82db0750-2c79-4751-ae6b-ba77c8a07168))
  (pad "117" smd rect (at -2.75 -2.6) (size 0.3 1.1) (layers "F.Cu" "F.Paste" "F.Mask") (tstamp 61abea4c-46ce-46e5-aa3a-698c3acf6bcc))
  (pad "118" smd rect (at -3.25 -2.6) (size 0.3 1.1) (layers "F.Cu" "F.Paste" "F.Mask") (tstamp 58236f66-094f-48c7-8a7f-30933a7c66b3))
  (pad "119" smd rect (at -3.75 -2.6) (size 0.3 1.1) (layers "F.Cu" "F.Paste" "F.Mask") (tstamp ee5a9633-f334-49b5-8969-ac19e1af4a97))
  (pad "120" smd rect (at -4.25 -2.6) (size 0.3 1.1) (layers "F.Cu" "F.Paste" "F.Mask") (tstamp 3d5c0d1e-b335-483c-8312-3b6ae50e94e2))
  (pad "121" smd rect (at -4.75 -2.6) (size 0.3 1.1) (layers "F.Cu" "F.Paste" "F.Mask") (tstamp 48123b9c-ccce-41ec-8136-0ae52c6c2398))
  (pad "122" smd rect (at -5.25 -2.6) (size 0.3 1.1) (layers "F.Cu" "F.Paste" "F.Mask") (tstamp fbfdca8b-52b9-4c4f-8b9d-b865202bdc48))
  (pad "123" smd rect (at -6 -2.4) (size 0.7 1.5) (layers "F.Cu" "F.Paste" "F.Mask") (tstamp 8ae731e4-1cd0-45ab-9214-c4ae54db2835))
  (pad "124" smd rect (at -6.75 -2.6) (size 0.3 1.1) (layers "F.Cu" "F.Paste" "F.Mask") (tstamp 46a17837-36c1-44f8-9fbf-f81b2961bf3c))
  (pad "125" smd rect (at -7.25 -2.6) (size 0.3 1.1) (layers "F.Cu" "F.Paste" "F.Mask") (tstamp fafe8c5e-ad58-4e41-9d1a-14478423328e))
  (pad "126" smd rect (at -7.75 -2.6) (size 0.3 1.1) (layers "F.Cu" "F.Paste" "F.Mask") (tstamp bda399d7-a4f7-4fd6-9e9b-3fd2ac560e61))
  (pad "127" smd rect (at -8.25 -2.6) (size 0.3 1.1) (layers "F.Cu" "F.Paste" "F.Mask") (tstamp 7294b43c-e397-4cd1-bc9c-cf051fec6f99))
  (pad "128" smd rect (at -8.75 -2.6) (size 0.3 1.1) (layers "F.Cu" "F.Paste" "F.Mask") (tstamp 70c3f426-f04f-4781-a468-652e5b2719d0))
  (pad "129" smd rect (at -9.25 -2.6) (size 0.3 1.1) (layers "F.Cu" "F.Paste" "F.Mask") (tstamp e0ef3609-943f-4137-a0d0-1a8488739ac5))
  (pad "130" smd rect (at -9.75 -2.6) (size 0.3 1.1) (layers "F.Cu" "F.Paste" "F.Mask") (tstamp ff70c60d-2fe0-42e7-a4d2-d7495c1d9f31))
  (pad "131" smd rect (at -10.25 -2.6) (size 0.3 1.1) (layers "F.Cu" "F.Paste" "F.Mask") (tstamp 763c1d29-9f3c-4313-9877-5217145c51c6))
  (pad "132" smd rect (at -10.75 -2.6) (size 0.3 1.1) (layers "F.Cu" "F.Paste" "F.Mask") (tstamp 83b7bd75-760e-4309-827a-3f9ba839f3df))
  (pad "133" smd rect (at -11.25 -2.6) (size 0.3 1.1) (layers "F.Cu" "F.Paste" "F.Mask") (tstamp f3d4bc2e-bd5b-4474-9314-ef407f752753))
  (pad "134" smd rect (at -12 -2.4) (size 0.7 1.5) (layers "F.Cu" "F.Paste" "F.Mask") (tstamp 394e577a-2ba5-423c-93d8-f06c58fd686b))
  (pad "135" smd rect (at -12.75 -2.6) (size 0.3 1.1) (layers "F.Cu" "F.Paste" "F.Mask") (tstamp 906e3efd-f3db-456e-8071-7a6df705a0bf))
  (pad "136" smd rect (at -13.25 -2.6) (size 0.3 1.1) (layers "F.Cu" "F.Paste" "F.Mask") (tstamp 51f26e39-20fb-43e8-b9bf-32aebe6b8014))
  (pad "137" smd rect (at -13.75 -2.6) (size 0.3 1.1) (layers "F.Cu" "F.Paste" "F.Mask") (tstamp b5f99198-976d-401b-8fb4-fba38fb45ed1))
  (pad "138" smd rect (at -14.25 -2.6) (size 0.3 1.1) (layers "F.Cu" "F.Paste" "F.Mask") (tstamp 362340b6-2cd9-422f-b99b-8f9bb033dc45))
  (pad "139" smd rect (at -14.75 -2.6) (size 0.3 1.1) (layers "F.Cu" "F.Paste" "F.Mask") (tstamp e026923b-932e-4afb-82fb-83115ec79ef5))
  (pad "140" smd rect (at -15.25 -2.6) (size 0.3 1.1) (layers "F.Cu" "F.Paste" "F.Mask") (tstamp 258803f1-98c1-45f0-b659-ddee9be4362a))
  (pad "141" smd rect (at -15.75 -2.6) (size 0.3 1.1) (layers "F.Cu" "F.Paste" "F.Mask") (tstamp 36869231-e03e-4074-ae4a-16524ff2a478))
  (pad "142" smd rect (at -16.25 -2.6) (size 0.3 1.1) (layers "F.Cu" "F.Paste" "F.Mask") (tstamp d9ca04b4-9502-4eef-9d18-ef8969848e32))
  (pad "143" smd rect (at -16.75 -2.6) (size 0.3 1.1) (layers "F.Cu" "F.Paste" "F.Mask") (tstamp 94fcfc50-ac0a-4eb9-a369-dba28e5ec725))
  (pad "144" smd rect (at -17.25 -2.6) (size 0.3 1.1) (layers "F.Cu" "F.Paste" "F.Mask") (tstamp 81792853-ea5e-4414-b418-73a9ebe1d9b8))
  (pad "145" smd rect (at -18 -2.4) (size 0.7 1.5) (layers "F.Cu" "F.Paste" "F.Mask") (tstamp ac613db0-103c-4860-ba14-f41e4f404a62))
  (pad "146" smd rect (at -18.75 -2.6) (size 0.3 1.1) (layers "F.Cu" "F.Paste" "F.Mask") (tstamp 0aeca86a-f54a-4395-a679-65be2fdbb8c3))
  (pad "147" smd rect (at -19.25 -2.6) (size 0.3 1.1) (layers "F.Cu" "F.Paste" "F.Mask") (tstamp 25fe0a71-8ef0-4201-b1ff-df117e972ca7))
  (pad "148" smd rect (at -19.75 -2.6) (size 0.3 1.1) (layers "F.Cu" "F.Paste" "F.Mask") (tstamp 03190a65-2d9c-480b-8835-d69edaaad020))
  (pad "149" smd rect (at -20.25 -2.6) (size 0.3 1.1) (layers "F.Cu" "F.Paste" "F.Mask") (tstamp 480ff1f5-5367-400c-ab81-ed5201177125))
  (pad "150" smd rect (at -20.75 -2.6) (size 0.3 1.1) (layers "F.Cu" "F.Paste" "F.Mask") (tstamp c564522e-46ed-4aa5-8988-3f22b2547de8))
  (pad "151" smd rect (at -23.9 0) (size 1.6 3.1) (layers "F.Cu" "F.Paste" "F.Mask") (tstamp cac6a260-5232-4cd6-8204-bea83bc63dc9))
  (pad "152" smd rect (at -20.75 2.6) (size 0.3 1.1) (layers "F.Cu" "F.Paste" "F.Mask") (tstamp a13caab1-e710-476b-a925-e9be0d8932da))
  (pad "153" smd rect (at -20.25 2.6) (size 0.3 1.1) (layers "F.Cu" "F.Paste" "F.Mask") (tstamp 82730183-c38d-4568-b129-cd36616286d8))
  (pad "154" smd rect (at -19.75 2.6) (size 0.3 1.1) (layers "F.Cu" "F.Paste" "F.Mask") (tstamp bc58c9f6-2226-4b2a-bbfd-84a9cf9947b6))
  (pad "155" smd rect (at -19.25 2.6) (size 0.3 1.1) (layers "F.Cu" "F.Paste" "F.Mask") (tstamp 2fa10db7-8a43-4ecd-b2a6-54d86b884882))
  (pad "156" smd rect (at -18.75 2.6) (size 0.3 1.1) (layers "F.Cu" "F.Paste" "F.Mask") (tstamp b75f3722-5bb1-4fa6-a079-9ca2013868bc))
  (model "${KICADLIB}/model/connector/Hirose_FX10A-140P14-SV1.step"
    (offset (xyz -9.25 -1.35 1))
    (scale (xyz 1 1 1))
    (rotate (xyz 0 0 90))
  )
)
