(footprint "Hirose_FX10A-140S14-SV(71)" (version 20201116) (generator pcbnew) (layer "F.Cu")
  (tedit 5FBDDF08)
  (fp_text reference "REF**" (at -25.5 0 90 unlocked) (layer "F.SilkS")
    (effects (font (size 1 1) (thickness 0.15)))
    (tstamp c5b3a80d-be4e-4eb0-93c8-38d8699a3123)
  )
  (fp_text value "Hirose_FX10A-140S14-SV(71)" (at 0 1 unlocked) (layer "F.Fab") hide
    (effects (font (size 1 1) (thickness 0.15)))
    (tstamp 4ae69698-fea0-4d10-bc6f-35f8fde7fcd4)
  )
  (fp_text user "^" (at -18 -4.6 180 unlocked) (layer "F.SilkS")
    (effects (font (size 1 1) (thickness 0.15)))
    (tstamp b6d9d7fe-4869-434f-b2e1-20dbf3ea6aa4)
  )
  (fp_text user "${REFERENCE}" (at 0 0 unlocked) (layer "F.Fab")
    (effects (font (size 1 1) (thickness 0.15)))
    (tstamp 67081196-a7f4-4cde-b67e-c12951c4676e)
  )
  (fp_line (start -23.8 -3.7) (end -21.8 -3.7) (layer "F.SilkS") (width 0.1) (tstamp 16e3fc9e-2981-431b-87ef-25667d2aef52))
  (fp_line (start 24.6 3.7) (end 24.6 1.6) (layer "F.SilkS") (width 0.1) (tstamp 25e86c06-cd2f-4f68-ac95-dbd37bf91695))
  (fp_line (start -24.6 -2.9) (end -24.6 -1.6) (layer "F.SilkS") (width 0.1) (tstamp 3ab72456-f0c9-42d2-9216-d117cf7a0873))
  (fp_line (start 24.6 -3.7) (end 24.6 -1.6) (layer "F.SilkS") (width 0.1) (tstamp 4b2cf491-3b90-4ac5-b03d-f230b9837227))
  (fp_line (start 24.6 3.7) (end 21.8 3.7) (layer "F.SilkS") (width 0.1) (tstamp 52661322-dedc-49a2-9ab6-2abb0757cf8b))
  (fp_line (start 24.6 -3.7) (end 21.8 -3.7) (layer "F.SilkS") (width 0.1) (tstamp 64941d11-ff40-4315-a675-c8d89397c62c))
  (fp_line (start -24.6 -2.9) (end -23.8 -3.7) (layer "F.SilkS") (width 0.1) (tstamp a670d3d9-aa85-420f-a055-c49363f7eaa8))
  (fp_line (start -24.6 3.7) (end -24.6 1.6) (layer "F.SilkS") (width 0.1) (tstamp c937f717-9979-4fba-9c06-ab05c57fa5ef))
  (fp_line (start -24.6 3.7) (end -21.8 3.7) (layer "F.SilkS") (width 0.1) (tstamp fb2f5324-70f7-4b58-b3f1-45cffb24cb77))
  (fp_rect (start -24.8 -4) (end 24.8 4) (layer "F.CrtYd") (width 0.05) (fill none) (tstamp eec4e6c4-4c4f-4e1b-87b3-d92459be49c6))
  (fp_line (start 21.8 3.7) (end 24.6 3.7) (layer "F.Fab") (width 0.1) (tstamp 092258a3-a0c3-496a-8667-4f42da952760))
  (fp_line (start 21.8 2.2) (end 21.8 3.7) (layer "F.Fab") (width 0.1) (tstamp 39cb8624-94fc-4738-9a27-0bb6638dab65))
  (fp_line (start -24.6 -2.9) (end -24.6 3.7) (layer "F.Fab") (width 0.1) (tstamp 3f7dbef8-0920-4309-a4c9-70bcb7d0e9ab))
  (fp_line (start -23.8 -3.7) (end -24.6 -2.9) (layer "F.Fab") (width 0.1) (tstamp 5336e8cb-64b2-4457-94e1-8d5248c7f125))
  (fp_line (start 24.6 3.7) (end 24.6 -3.7) (layer "F.Fab") (width 0.1) (tstamp 5eed6cba-81bb-4bb4-8fcd-6cf9bc80dcef))
  (fp_line (start 21.8 -3.7) (end 21.8 -2.2) (layer "F.Fab") (width 0.1) (tstamp 7a6c5463-ca8c-4f7e-8c9b-3e558c687361))
  (fp_line (start -24.6 3.7) (end -21.8 3.7) (layer "F.Fab") (width 0.1) (tstamp 7cf68d21-29b3-4caa-ac77-42208d88da55))
  (fp_line (start 21.8 -2.2) (end -21.8 -2.2) (layer "F.Fab") (width 0.1) (tstamp b1af1bf3-00a1-4ac8-bae8-fa1ced6ecda0))
  (fp_line (start -21.8 -2.2) (end -21.8 -3.7) (layer "F.Fab") (width 0.1) (tstamp be235b4b-1a4a-4eab-b8dd-3300de549b61))
  (fp_line (start -21.8 -3.7) (end -23.8 -3.7) (layer "F.Fab") (width 0.1) (tstamp d1d7af35-e383-426f-bde4-3b1508a6e96f))
  (fp_line (start -21.8 2.2) (end 21.8 2.2) (layer "F.Fab") (width 0.1) (tstamp ee5483fa-5ab6-4245-a87d-63f33415e086))
  (fp_line (start 24.6 -3.7) (end 21.8 -3.7) (layer "F.Fab") (width 0.1) (tstamp f682daf1-1590-499d-9628-c247d11153d9))
  (fp_line (start -21.8 3.7) (end -21.8 2.2) (layer "F.Fab") (width 0.1) (tstamp f99ea296-d82f-4a08-a4e2-8dc7099a5ec0))
  (pad "" thru_hole circle (at -22.2 0) (size 1.1 1.1) (drill 1.1) (layers *.Mask) (tstamp 00dea55a-f9fe-43f6-8936-bbf67b9c1843))
  (pad "" thru_hole circle (at 22.2 0) (size 1.1 1.1) (drill 1.1) (layers *.Mask) (tstamp 3666020d-2037-4e91-a523-3340d3070e3d))
  (pad "1" smd rect (at -18 -3.05) (size 0.7 1.6) (layers "F.Cu" "F.Paste" "F.Mask") (tstamp 2f1372f9-4498-491e-9b94-91b8b4fbc7cd))
  (pad "2" smd rect (at -17.25 -3.05) (size 0.3 1.6) (layers "F.Cu" "F.Paste" "F.Mask") (tstamp df9c71d6-b517-437b-b2a0-978d799e8a77))
  (pad "3" smd rect (at -16.75 -3.05) (size 0.3 1.6) (layers "F.Cu" "F.Paste" "F.Mask") (tstamp da3d0bfc-ddfb-45a0-a469-9f16e01c7f4c))
  (pad "4" smd rect (at -16.25 -3.05) (size 0.3 1.6) (layers "F.Cu" "F.Paste" "F.Mask") (tstamp 679c9724-e501-4441-8964-db5dcfdc718a))
  (pad "5" smd rect (at -15.75 -3.05) (size 0.3 1.6) (layers "F.Cu" "F.Paste" "F.Mask") (tstamp 92bda146-b50d-4675-8896-28cfa0a5b559))
  (pad "6" smd rect (at -15.25 -3.05) (size 0.3 1.6) (layers "F.Cu" "F.Paste" "F.Mask") (tstamp 19d39f68-ca1d-4da3-90f4-4fca5de3af6c))
  (pad "7" smd rect (at -14.75 -3.05) (size 0.3 1.6) (layers "F.Cu" "F.Paste" "F.Mask") (tstamp 3675b6ec-4093-4a95-816d-5d7b0c81e23d))
  (pad "8" smd rect (at -14.25 -3.05) (size 0.3 1.6) (layers "F.Cu" "F.Paste" "F.Mask") (tstamp 0345d5a0-4da7-4b8c-b300-e1a97028fa60))
  (pad "9" smd rect (at -13.75 -3.05) (size 0.3 1.6) (layers "F.Cu" "F.Paste" "F.Mask") (tstamp a040a9d8-e1c9-49ce-9f2c-d09e2dcfc1a3))
  (pad "10" smd rect (at -13.25 -3.05) (size 0.3 1.6) (layers "F.Cu" "F.Paste" "F.Mask") (tstamp 57e84619-5c14-4d6d-b23d-b2c832ee4e42))
  (pad "11" smd rect (at -12.75 -3.05) (size 0.3 1.6) (layers "F.Cu" "F.Paste" "F.Mask") (tstamp af22b615-565f-45e2-a666-87eab0db9b3e))
  (pad "12" smd rect (at -12 -3.05) (size 0.7 1.6) (layers "F.Cu" "F.Paste" "F.Mask") (tstamp 7068d28d-b3a1-4295-b1d0-8a3321cbc908))
  (pad "13" smd rect (at -11.25 -3.05) (size 0.3 1.6) (layers "F.Cu" "F.Paste" "F.Mask") (tstamp 1e0becaf-c68f-4a31-85b7-5bd2b6ac0fe9))
  (pad "14" smd rect (at -10.75 -3.05) (size 0.3 1.6) (layers "F.Cu" "F.Paste" "F.Mask") (tstamp bc72630a-5942-46ce-b12f-85478ad49aab))
  (pad "15" smd rect (at -10.25 -3.05) (size 0.3 1.6) (layers "F.Cu" "F.Paste" "F.Mask") (tstamp 059d5fb7-b608-485c-89fd-2d656abaec4d))
  (pad "16" smd rect (at -9.75 -3.05) (size 0.3 1.6) (layers "F.Cu" "F.Paste" "F.Mask") (tstamp 8bc2d84e-1e92-446e-b0b0-ded7035d0a4f))
  (pad "17" smd rect (at -9.25 -3.05) (size 0.3 1.6) (layers "F.Cu" "F.Paste" "F.Mask") (tstamp 031652ff-22e6-49c9-914e-16d4d9524a94))
  (pad "18" smd rect (at -8.75 -3.05) (size 0.3 1.6) (layers "F.Cu" "F.Paste" "F.Mask") (tstamp 85eed206-b4e4-49ed-88e2-8bbc5308201c))
  (pad "19" smd rect (at -8.25 -3.05) (size 0.3 1.6) (layers "F.Cu" "F.Paste" "F.Mask") (tstamp b9f271dd-1f6a-455f-a447-e92e289de4a5))
  (pad "20" smd rect (at -7.75 -3.05) (size 0.3 1.6) (layers "F.Cu" "F.Paste" "F.Mask") (tstamp f2a80ec3-bba5-49e1-b67a-b33fe4e4f4d4))
  (pad "21" smd rect (at -7.25 -3.05) (size 0.3 1.6) (layers "F.Cu" "F.Paste" "F.Mask") (tstamp 74577743-d149-48ad-9148-b87bf05e6397))
  (pad "22" smd rect (at -6.75 -3.05) (size 0.3 1.6) (layers "F.Cu" "F.Paste" "F.Mask") (tstamp 65c2a611-2c6f-4102-891e-5f152bf6268c))
  (pad "23" smd rect (at -6 -3.05) (size 0.7 1.6) (layers "F.Cu" "F.Paste" "F.Mask") (tstamp fb8c2c94-512b-4882-86ae-93e036a4212b))
  (pad "24" smd rect (at -5.25 -3.05) (size 0.3 1.6) (layers "F.Cu" "F.Paste" "F.Mask") (tstamp 0dfda702-7c08-446e-b197-ce42fca4b8ca))
  (pad "25" smd rect (at -4.75 -3.05) (size 0.3 1.6) (layers "F.Cu" "F.Paste" "F.Mask") (tstamp e23ec895-111c-4856-afff-14ec59cb58ff))
  (pad "26" smd rect (at -4.25 -3.05) (size 0.3 1.6) (layers "F.Cu" "F.Paste" "F.Mask") (tstamp a6e19fe6-4c57-47e5-9ee1-7238d396ef0e))
  (pad "27" smd rect (at -3.75 -3.05) (size 0.3 1.6) (layers "F.Cu" "F.Paste" "F.Mask") (tstamp a367879e-4bfb-4965-a46f-587d47ae9df5))
  (pad "28" smd rect (at -3.25 -3.05) (size 0.3 1.6) (layers "F.Cu" "F.Paste" "F.Mask") (tstamp 18d0128e-6f20-465d-9713-85a876291e13))
  (pad "29" smd rect (at -2.75 -3.05) (size 0.3 1.6) (layers "F.Cu" "F.Paste" "F.Mask") (tstamp c5459ccc-2a21-4a15-8aba-741dc8bc61a2))
  (pad "30" smd rect (at -2.25 -3.05) (size 0.3 1.6) (layers "F.Cu" "F.Paste" "F.Mask") (tstamp 6c91f86d-fc56-48da-b668-8fe1d6303c35))
  (pad "31" smd rect (at -1.75 -3.05) (size 0.3 1.6) (layers "F.Cu" "F.Paste" "F.Mask") (tstamp d853f23b-9bc1-482c-9809-60c7873d7b58))
  (pad "32" smd rect (at -1.25 -3.05) (size 0.3 1.6) (layers "F.Cu" "F.Paste" "F.Mask") (tstamp 9f6b8130-bfe0-49eb-8ea5-8f87e8576f52))
  (pad "33" smd rect (at -0.75 -3.05) (size 0.3 1.6) (layers "F.Cu" "F.Paste" "F.Mask") (tstamp d2d8cc1d-8605-4cdf-8b85-c42f3b7340a5))
  (pad "34" smd rect (at 0 -3.05) (size 0.7 1.6) (layers "F.Cu" "F.Paste" "F.Mask") (tstamp 30c4d98b-b0a2-42df-8a3e-b8febcb85fe4))
  (pad "35" smd rect (at 0.75 -3.05) (size 0.3 1.6) (layers "F.Cu" "F.Paste" "F.Mask") (tstamp 26e1b23e-28f7-43af-957b-568767bda7b4))
  (pad "36" smd rect (at 1.25 -3.05) (size 0.3 1.6) (layers "F.Cu" "F.Paste" "F.Mask") (tstamp 30df124a-2817-40f2-9a5a-aa91bb73a365))
  (pad "37" smd rect (at 1.75 -3.05) (size 0.3 1.6) (layers "F.Cu" "F.Paste" "F.Mask") (tstamp 79411a47-5bc0-499c-b217-027f8821baba))
  (pad "38" smd rect (at 2.25 -3.05) (size 0.3 1.6) (layers "F.Cu" "F.Paste" "F.Mask") (tstamp 297103db-6bbc-4a3a-b07d-a3254db415c5))
  (pad "39" smd rect (at 2.75 -3.05) (size 0.3 1.6) (layers "F.Cu" "F.Paste" "F.Mask") (tstamp c8ab7010-50c4-4238-b23d-233488600dac))
  (pad "40" smd rect (at 3.25 -3.05) (size 0.3 1.6) (layers "F.Cu" "F.Paste" "F.Mask") (tstamp 7771cad3-8805-44b2-a684-f309c9c06c8f))
  (pad "41" smd rect (at 3.75 -3.05) (size 0.3 1.6) (layers "F.Cu" "F.Paste" "F.Mask") (tstamp 84b4889d-559f-4a2b-b2dc-5e57f5812ed6))
  (pad "42" smd rect (at 4.25 -3.05) (size 0.3 1.6) (layers "F.Cu" "F.Paste" "F.Mask") (tstamp 28c4c394-50c9-4a45-bb5a-fbfe2290a862))
  (pad "43" smd rect (at 4.75 -3.05) (size 0.3 1.6) (layers "F.Cu" "F.Paste" "F.Mask") (tstamp d9b4123d-0910-43d7-a8a9-2026d3620ca2))
  (pad "44" smd rect (at 5.25 -3.05) (size 0.3 1.6) (layers "F.Cu" "F.Paste" "F.Mask") (tstamp fbf05826-e8d6-4666-9cbc-e0b28674b708))
  (pad "45" smd rect (at 6 -3.05) (size 0.7 1.6) (layers "F.Cu" "F.Paste" "F.Mask") (tstamp 1b100aad-8ca8-4cba-a1a2-42958ec097e6))
  (pad "46" smd rect (at 6.75 -3.05) (size 0.3 1.6) (layers "F.Cu" "F.Paste" "F.Mask") (tstamp 07a1f2a6-0239-4e1a-b256-7f234f884353))
  (pad "47" smd rect (at 7.25 -3.05) (size 0.3 1.6) (layers "F.Cu" "F.Paste" "F.Mask") (tstamp 22342953-3947-477c-9196-302a5ea6d527))
  (pad "48" smd rect (at 7.75 -3.05) (size 0.3 1.6) (layers "F.Cu" "F.Paste" "F.Mask") (tstamp e585a40b-ab17-4c93-bbdf-9d9ab5bdabae))
  (pad "49" smd rect (at 8.25 -3.05) (size 0.3 1.6) (layers "F.Cu" "F.Paste" "F.Mask") (tstamp 9f7056ee-aaed-4d42-9d4d-810a9811c6b8))
  (pad "50" smd rect (at 8.75 -3.05) (size 0.3 1.6) (layers "F.Cu" "F.Paste" "F.Mask") (tstamp 83196ff9-1827-4dd8-936a-d29c71475904))
  (pad "51" smd rect (at 9.25 -3.05) (size 0.3 1.6) (layers "F.Cu" "F.Paste" "F.Mask") (tstamp fb1a6936-3a15-4247-88b0-6347539bcf56))
  (pad "52" smd rect (at 9.75 -3.05) (size 0.3 1.6) (layers "F.Cu" "F.Paste" "F.Mask") (tstamp 76e90103-8467-4935-8522-1ad60d9261b1))
  (pad "53" smd rect (at 10.25 -3.05) (size 0.3 1.6) (layers "F.Cu" "F.Paste" "F.Mask") (tstamp c6ddc4d6-2bab-44d7-9552-852f7d5312e6))
  (pad "54" smd rect (at 10.75 -3.05) (size 0.3 1.6) (layers "F.Cu" "F.Paste" "F.Mask") (tstamp b63636c1-c06b-471a-a40b-4e53fd8b7405))
  (pad "55" smd rect (at 11.25 -3.05) (size 0.3 1.6) (layers "F.Cu" "F.Paste" "F.Mask") (tstamp 9d916d37-b3a0-4780-a4f8-c09f0a59644e))
  (pad "56" smd rect (at 12 -3.05) (size 0.7 1.6) (layers "F.Cu" "F.Paste" "F.Mask") (tstamp d86c433c-aa45-4886-81d6-c883962841ff))
  (pad "57" smd rect (at 12.75 -3.05) (size 0.3 1.6) (layers "F.Cu" "F.Paste" "F.Mask") (tstamp 2a2cc4ac-c27f-4aa4-8413-8f2f290a7030))
  (pad "58" smd rect (at 13.25 -3.05) (size 0.3 1.6) (layers "F.Cu" "F.Paste" "F.Mask") (tstamp 39ac4845-9813-4ef3-bf08-e45946ffe240))
  (pad "59" smd rect (at 13.75 -3.05) (size 0.3 1.6) (layers "F.Cu" "F.Paste" "F.Mask") (tstamp 06649dec-96de-4cbd-b96e-391c691a528c))
  (pad "60" smd rect (at 14.25 -3.05) (size 0.3 1.6) (layers "F.Cu" "F.Paste" "F.Mask") (tstamp eb8afca2-05c0-4737-ba0d-c913f23f3d6f))
  (pad "61" smd rect (at 14.75 -3.05) (size 0.3 1.6) (layers "F.Cu" "F.Paste" "F.Mask") (tstamp 4e68083f-2f1e-4fd4-9bdc-c32d561f4063))
  (pad "62" smd rect (at 15.25 -3.05) (size 0.3 1.6) (layers "F.Cu" "F.Paste" "F.Mask") (tstamp ed2f3847-80c0-4b62-bd48-e5eb0f6ca75c))
  (pad "63" smd rect (at 15.75 -3.05) (size 0.3 1.6) (layers "F.Cu" "F.Paste" "F.Mask") (tstamp 09f75544-dcdc-415a-bb7f-be7f49c1b3e4))
  (pad "64" smd rect (at 16.25 -3.05) (size 0.3 1.6) (layers "F.Cu" "F.Paste" "F.Mask") (tstamp 78064f07-00d7-40c6-8ae3-e9d0c5e66413))
  (pad "65" smd rect (at 16.75 -3.05) (size 0.3 1.6) (layers "F.Cu" "F.Paste" "F.Mask") (tstamp 7f5d42e1-f227-46f0-900c-64bbe38e51cf))
  (pad "66" smd rect (at 17.25 -3.05) (size 0.3 1.6) (layers "F.Cu" "F.Paste" "F.Mask") (tstamp c5261e67-f241-4870-ad38-eb97724a355b))
  (pad "67" smd rect (at 18 -3.05) (size 0.7 1.6) (layers "F.Cu" "F.Paste" "F.Mask") (tstamp a8ed8fdf-6ed1-47b0-9d85-392b21f7eaa1))
  (pad "68" smd rect (at 18.75 -3.05) (size 0.3 1.6) (layers "F.Cu" "F.Paste" "F.Mask") (tstamp 563069cc-db3e-4fa6-9e3c-8cd5c0361d2e))
  (pad "69" smd rect (at 19.25 -3.05) (size 0.3 1.6) (layers "F.Cu" "F.Paste" "F.Mask") (tstamp 1df900a9-fe59-47f1-870a-9393c7a0daec))
  (pad "70" smd rect (at 19.75 -3.05) (size 0.3 1.6) (layers "F.Cu" "F.Paste" "F.Mask") (tstamp 3c0d9a62-d31d-45f7-96ae-51f5b0da3925))
  (pad "71" smd rect (at 20.25 -3.05) (size 0.3 1.6) (layers "F.Cu" "F.Paste" "F.Mask") (tstamp 183fc1ec-7c1b-4da9-a515-d1b79b314a02))
  (pad "72" smd rect (at 20.75 -3.05) (size 0.3 1.6) (layers "F.Cu" "F.Paste" "F.Mask") (tstamp 0fb4276f-df81-4dfc-8485-a9ea79ea0ac2))
  (pad "73" smd rect (at 23.95 0) (size 1.6 3.1) (layers "F.Cu" "F.Paste" "F.Mask") (tstamp f31f3adc-bc0f-4b73-abc4-eabbfbb4cd19))
  (pad "74" smd rect (at 20.75 3.05) (size 0.3 1.6) (layers "F.Cu" "F.Paste" "F.Mask") (tstamp b0d0fe19-92f4-40f2-bfc2-a788fd3d760e))
  (pad "75" smd rect (at 20.25 3.05) (size 0.3 1.6) (layers "F.Cu" "F.Paste" "F.Mask") (tstamp e166c213-0802-499f-bf0f-d8c570f74c47))
  (pad "76" smd rect (at 19.75 3.05) (size 0.3 1.6) (layers "F.Cu" "F.Paste" "F.Mask") (tstamp 16b3f5b2-e735-4ba2-b108-131f3f3a4a61))
  (pad "77" smd rect (at 19.25 3.05) (size 0.3 1.6) (layers "F.Cu" "F.Paste" "F.Mask") (tstamp a2cff960-8593-43b9-b85e-d3925214d35d))
  (pad "78" smd rect (at 18.75 3.05) (size 0.3 1.6) (layers "F.Cu" "F.Paste" "F.Mask") (tstamp 5cc19c7a-e0fa-4fe9-97f0-b39551642e99))
  (pad "79" smd rect (at 18 3.05) (size 0.7 1.6) (layers "F.Cu" "F.Paste" "F.Mask") (tstamp afbc90e1-502c-416f-9a65-201978c793d3))
  (pad "80" smd rect (at 17.25 3.05) (size 0.3 1.6) (layers "F.Cu" "F.Paste" "F.Mask") (tstamp f1b7fb4b-5514-4e92-a9a8-d9d9fce5d6e6))
  (pad "81" smd rect (at 16.75 3.05) (size 0.3 1.6) (layers "F.Cu" "F.Paste" "F.Mask") (tstamp b8b91ee1-0f6a-401e-bd7a-e72987e67004))
  (pad "82" smd rect (at 16.25 3.05) (size 0.3 1.6) (layers "F.Cu" "F.Paste" "F.Mask") (tstamp 9e8d479e-76ec-4251-8796-1e8b2a35b7eb))
  (pad "83" smd rect (at 15.75 3.05) (size 0.3 1.6) (layers "F.Cu" "F.Paste" "F.Mask") (tstamp 1b86a42d-5bea-4ef2-855b-63b665be670b))
  (pad "84" smd rect (at 15.25 3.05) (size 0.3 1.6) (layers "F.Cu" "F.Paste" "F.Mask") (tstamp 918f60f9-3265-4464-9489-40b6ecd389d9))
  (pad "85" smd rect (at 14.75 3.05) (size 0.3 1.6) (layers "F.Cu" "F.Paste" "F.Mask") (tstamp e59754b4-57bc-460a-bdf4-c63cf0984d05))
  (pad "86" smd rect (at 14.25 3.05) (size 0.3 1.6) (layers "F.Cu" "F.Paste" "F.Mask") (tstamp 4302cff0-225a-4dcd-9748-5ebe44caa68c))
  (pad "87" smd rect (at 13.75 3.05) (size 0.3 1.6) (layers "F.Cu" "F.Paste" "F.Mask") (tstamp 32aa5e6a-dbb3-4893-945c-a9f9357f67f6))
  (pad "88" smd rect (at 13.25 3.05) (size 0.3 1.6) (layers "F.Cu" "F.Paste" "F.Mask") (tstamp 6d7fde18-a9b7-432b-9126-9e26884cd135))
  (pad "89" smd rect (at 12.75 3.05) (size 0.3 1.6) (layers "F.Cu" "F.Paste" "F.Mask") (tstamp fbd97b14-6efc-4d74-af49-8abacb5d10dc))
  (pad "90" smd rect (at 12 3.05) (size 0.7 1.6) (layers "F.Cu" "F.Paste" "F.Mask") (tstamp 83718c1f-2de6-48bf-b961-1aa720ec2d53))
  (pad "91" smd rect (at 11.25 3.05) (size 0.3 1.6) (layers "F.Cu" "F.Paste" "F.Mask") (tstamp a568fff3-84be-4a9f-830c-24552d54596a))
  (pad "92" smd rect (at 10.75 3.05) (size 0.3 1.6) (layers "F.Cu" "F.Paste" "F.Mask") (tstamp 67f8fa1a-b653-4d36-9749-e386db03ab6e))
  (pad "93" smd rect (at 10.25 3.05) (size 0.3 1.6) (layers "F.Cu" "F.Paste" "F.Mask") (tstamp 0e272d2f-bae1-4c34-b467-7a53a32cd916))
  (pad "94" smd rect (at 9.75 3.05) (size 0.3 1.6) (layers "F.Cu" "F.Paste" "F.Mask") (tstamp 1e9c42f9-fec9-4287-806f-7aa538d872e2))
  (pad "95" smd rect (at 9.25 3.05) (size 0.3 1.6) (layers "F.Cu" "F.Paste" "F.Mask") (tstamp 68a8a469-adad-4c0b-bc47-b8a2f3a60858))
  (pad "96" smd rect (at 8.75 3.05) (size 0.3 1.6) (layers "F.Cu" "F.Paste" "F.Mask") (tstamp 4a1d2b88-9b91-407d-af82-221254145461))
  (pad "97" smd rect (at 8.25 3.05) (size 0.3 1.6) (layers "F.Cu" "F.Paste" "F.Mask") (tstamp cdd55fcb-6ee6-4128-a177-619ae9d5e197))
  (pad "98" smd rect (at 7.75 3.05) (size 0.3 1.6) (layers "F.Cu" "F.Paste" "F.Mask") (tstamp a4ef55ff-d844-4ad1-baa6-9fc950367541))
  (pad "99" smd rect (at 7.25 3.05) (size 0.3 1.6) (layers "F.Cu" "F.Paste" "F.Mask") (tstamp 950f4a07-0272-49d4-98f6-fa30f0d65c96))
  (pad "100" smd rect (at 6.75 3.05) (size 0.3 1.6) (layers "F.Cu" "F.Paste" "F.Mask") (tstamp 9c660bf3-95ac-493d-a470-95d075945ada))
  (pad "101" smd rect (at 6 3.05) (size 0.7 1.6) (layers "F.Cu" "F.Paste" "F.Mask") (tstamp 733aacb5-e9cf-4ead-b93d-55defb1b4142))
  (pad "102" smd rect (at 5.25 3.05) (size 0.3 1.6) (layers "F.Cu" "F.Paste" "F.Mask") (tstamp 4cc3d940-ab8e-42af-944d-b46ee5d6d5d0))
  (pad "103" smd rect (at 4.75 3.05) (size 0.3 1.6) (layers "F.Cu" "F.Paste" "F.Mask") (tstamp 59528af2-8c64-4329-a6ac-0136842a748b))
  (pad "104" smd rect (at 4.25 3.05) (size 0.3 1.6) (layers "F.Cu" "F.Paste" "F.Mask") (tstamp 216af17a-716d-4b28-82df-0246a7162475))
  (pad "105" smd rect (at 3.75 3.05) (size 0.3 1.6) (layers "F.Cu" "F.Paste" "F.Mask") (tstamp 28dad2b8-d1b5-4dfd-ab38-da099c3988e9))
  (pad "106" smd rect (at 3.25 3.05) (size 0.3 1.6) (layers "F.Cu" "F.Paste" "F.Mask") (tstamp b099fdd1-9bb4-48e6-ba00-fa99b6f0f6b0))
  (pad "107" smd rect (at 2.75 3.05) (size 0.3 1.6) (layers "F.Cu" "F.Paste" "F.Mask") (tstamp 50a3521b-6f06-42b5-8658-1f64d90d93b1))
  (pad "108" smd rect (at 2.25 3.05) (size 0.3 1.6) (layers "F.Cu" "F.Paste" "F.Mask") (tstamp 9298a67a-9903-4de0-85c0-caa56befd6cd))
  (pad "109" smd rect (at 1.75 3.05) (size 0.3 1.6) (layers "F.Cu" "F.Paste" "F.Mask") (tstamp 9fb29972-7027-40da-9f93-7f1efb6f59a9))
  (pad "110" smd rect (at 1.25 3.05) (size 0.3 1.6) (layers "F.Cu" "F.Paste" "F.Mask") (tstamp 29e220e0-4025-4202-99be-55c562ec766c))
  (pad "111" smd rect (at 0.75 3.05) (size 0.3 1.6) (layers "F.Cu" "F.Paste" "F.Mask") (tstamp 4d5059e5-59d6-4461-bf23-e8b4b6af691d))
  (pad "112" smd rect (at 0 3.05) (size 0.7 1.6) (layers "F.Cu" "F.Paste" "F.Mask") (tstamp 3af63cc4-57aa-463e-b8f7-5086c4ccb3cd))
  (pad "113" smd rect (at -0.75 3.05) (size 0.3 1.6) (layers "F.Cu" "F.Paste" "F.Mask") (tstamp 6c8d4935-a12a-4834-8c63-17075bbdc5b5))
  (pad "114" smd rect (at -1.25 3.05) (size 0.3 1.6) (layers "F.Cu" "F.Paste" "F.Mask") (tstamp 0b6cee65-d41f-47b2-9ed0-9ac4b4fea134))
  (pad "115" smd rect (at -1.75 3.05) (size 0.3 1.6) (layers "F.Cu" "F.Paste" "F.Mask") (tstamp 9ea4cd8d-6aa8-4f09-a5d5-b7e508730642))
  (pad "116" smd rect (at -2.25 3.05) (size 0.3 1.6) (layers "F.Cu" "F.Paste" "F.Mask") (tstamp ccd928ec-fe5d-43f9-a9b0-226ccb1a0fca))
  (pad "117" smd rect (at -2.75 3.05) (size 0.3 1.6) (layers "F.Cu" "F.Paste" "F.Mask") (tstamp 979101b3-caee-4f3e-979d-2b565793e749))
  (pad "118" smd rect (at -3.25 3.05) (size 0.3 1.6) (layers "F.Cu" "F.Paste" "F.Mask") (tstamp 34598383-5751-476a-b533-b3c9c7396676))
  (pad "119" smd rect (at -3.75 3.05) (size 0.3 1.6) (layers "F.Cu" "F.Paste" "F.Mask") (tstamp 4db2e33d-13cc-4f2b-86b7-0508d2a62a53))
  (pad "120" smd rect (at -4.25 3.05) (size 0.3 1.6) (layers "F.Cu" "F.Paste" "F.Mask") (tstamp f9b1c0e8-aa32-4a76-b19c-33680b564bbb))
  (pad "121" smd rect (at -4.75 3.05) (size 0.3 1.6) (layers "F.Cu" "F.Paste" "F.Mask") (tstamp c07c9279-6799-4387-b1db-9ff345c53f02))
  (pad "122" smd rect (at -5.25 3.05) (size 0.3 1.6) (layers "F.Cu" "F.Paste" "F.Mask") (tstamp 09972a4b-3bd9-4bce-b3d4-ffb71e119fd5))
  (pad "123" smd rect (at -6 3.05) (size 0.7 1.6) (layers "F.Cu" "F.Paste" "F.Mask") (tstamp b7f26fa4-a233-4601-a327-7c137bce5a78))
  (pad "124" smd rect (at -6.75 3.05) (size 0.3 1.6) (layers "F.Cu" "F.Paste" "F.Mask") (tstamp d4b1d012-d32e-43b3-b452-3f4d4480a1ca))
  (pad "125" smd rect (at -7.25 3.05) (size 0.3 1.6) (layers "F.Cu" "F.Paste" "F.Mask") (tstamp aa3bc3d9-6ffe-41fa-8f7a-a2b2ac7ddae5))
  (pad "126" smd rect (at -7.75 3.05) (size 0.3 1.6) (layers "F.Cu" "F.Paste" "F.Mask") (tstamp c9c8c099-7120-4de8-9134-7bab164d0f72))
  (pad "127" smd rect (at -8.25 3.05) (size 0.3 1.6) (layers "F.Cu" "F.Paste" "F.Mask") (tstamp a8645ceb-999b-4c32-8e13-fb426518e8cf))
  (pad "128" smd rect (at -8.75 3.05) (size 0.3 1.6) (layers "F.Cu" "F.Paste" "F.Mask") (tstamp 39266e92-1491-46d0-a0fc-8165a348b15f))
  (pad "129" smd rect (at -9.25 3.05) (size 0.3 1.6) (layers "F.Cu" "F.Paste" "F.Mask") (tstamp c93e6f1e-b984-4fcc-b2cd-9c354c729819))
  (pad "130" smd rect (at -9.75 3.05) (size 0.3 1.6) (layers "F.Cu" "F.Paste" "F.Mask") (tstamp a476cee3-5cfb-4a41-8405-e4cd5b91120b))
  (pad "131" smd rect (at -10.25 3.05) (size 0.3 1.6) (layers "F.Cu" "F.Paste" "F.Mask") (tstamp 6d28cfdc-d5e2-4f27-91f0-a0799b0a5849))
  (pad "132" smd rect (at -10.75 3.05) (size 0.3 1.6) (layers "F.Cu" "F.Paste" "F.Mask") (tstamp 9747fcd7-5e2d-4a9f-8736-ce09e0ad9ccc))
  (pad "133" smd rect (at -11.25 3.05) (size 0.3 1.6) (layers "F.Cu" "F.Paste" "F.Mask") (tstamp 544fa1a8-0ad0-499e-86cf-2d63689bb65d))
  (pad "134" smd rect (at -12 3.05) (size 0.7 1.6) (layers "F.Cu" "F.Paste" "F.Mask") (tstamp 34b6e906-237b-4e5a-a7af-29d53c5c4811))
  (pad "135" smd rect (at -12.75 3.05) (size 0.3 1.6) (layers "F.Cu" "F.Paste" "F.Mask") (tstamp 7fbf3d89-7089-48f6-b99f-cf5ab3727b68))
  (pad "136" smd rect (at -13.25 3.05) (size 0.3 1.6) (layers "F.Cu" "F.Paste" "F.Mask") (tstamp f80bd480-88d0-453b-83bf-43882329f8de))
  (pad "137" smd rect (at -13.75 3.05) (size 0.3 1.6) (layers "F.Cu" "F.Paste" "F.Mask") (tstamp 6dcfafe1-cc79-4a80-ae17-319100970f6e))
  (pad "138" smd rect (at -14.25 3.05) (size 0.3 1.6) (layers "F.Cu" "F.Paste" "F.Mask") (tstamp 5a96b008-3ae5-4975-84cd-ca2945db227b))
  (pad "139" smd rect (at -14.75 3.05) (size 0.3 1.6) (layers "F.Cu" "F.Paste" "F.Mask") (tstamp e90a7437-0405-444f-a7d0-1c372001a7a0))
  (pad "140" smd rect (at -15.25 3.05) (size 0.3 1.6) (layers "F.Cu" "F.Paste" "F.Mask") (tstamp fe706417-62bc-4612-8bf0-7e2ba8ddeaf9))
  (pad "141" smd rect (at -15.75 3.05) (size 0.3 1.6) (layers "F.Cu" "F.Paste" "F.Mask") (tstamp c8318438-fb62-4658-9dd4-51ce7fd4dc2c))
  (pad "142" smd rect (at -16.25 3.05) (size 0.3 1.6) (layers "F.Cu" "F.Paste" "F.Mask") (tstamp 9c339668-e480-48f2-bfa8-0465778f958b))
  (pad "143" smd rect (at -16.75 3.05) (size 0.3 1.6) (layers "F.Cu" "F.Paste" "F.Mask") (tstamp b15d4280-2f1f-4e53-a6c0-52e12d13edf2))
  (pad "144" smd rect (at -17.25 3.05) (size 0.3 1.6) (layers "F.Cu" "F.Paste" "F.Mask") (tstamp 433786a0-a38c-45a8-a4a2-5e91170a3a6f))
  (pad "145" smd rect (at -18 3.05) (size 0.7 1.6) (layers "F.Cu" "F.Paste" "F.Mask") (tstamp 36d798b2-267b-415b-af46-9755d8ed4ea9))
  (pad "146" smd rect (at -18.75 3.05) (size 0.3 1.6) (layers "F.Cu" "F.Paste" "F.Mask") (tstamp f90fa4bd-7517-4d0f-a247-d245dc8bb860))
  (pad "147" smd rect (at -19.25 3.05) (size 0.3 1.6) (layers "F.Cu" "F.Paste" "F.Mask") (tstamp f2100569-4362-4871-92f0-0841780840f9))
  (pad "148" smd rect (at -19.75 3.05) (size 0.3 1.6) (layers "F.Cu" "F.Paste" "F.Mask") (tstamp 6fc9aaf8-acb5-4795-a777-ea2631402374))
  (pad "149" smd rect (at -20.25 3.05) (size 0.3 1.6) (layers "F.Cu" "F.Paste" "F.Mask") (tstamp 0f02a74c-fbd8-4e01-89df-611c00428489))
  (pad "150" smd rect (at -20.75 3.05) (size 0.3 1.6) (layers "F.Cu" "F.Paste" "F.Mask") (tstamp 6717f62a-acf6-4437-b8b9-933acd657244))
  (pad "151" smd rect (at -23.9 0) (size 1.6 3.1) (layers "F.Cu" "F.Paste" "F.Mask") (tstamp b047d618-45f4-41e0-afc6-cd8be8d6f748))
  (pad "152" smd rect (at -20.75 -3.05) (size 0.3 1.6) (layers "F.Cu" "F.Paste" "F.Mask") (tstamp ffa90732-91d7-4442-b1a5-db9224bfae57))
  (pad "153" smd rect (at -20.25 -3.05) (size 0.3 1.6) (layers "F.Cu" "F.Paste" "F.Mask") (tstamp 561b6975-53f8-4993-a9c6-3f3b4412cba1))
  (pad "154" smd rect (at -19.75 -3.05) (size 0.3 1.6) (layers "F.Cu" "F.Paste" "F.Mask") (tstamp d29f2ed1-0c40-4abb-8a17-d9828d2001c1))
  (pad "155" smd rect (at -19.25 -3.05) (size 0.3 1.6) (layers "F.Cu" "F.Paste" "F.Mask") (tstamp 287a8131-7a0b-4cdc-a775-5e3558266358))
  (pad "156" smd rect (at -18.75 -3.05) (size 0.3 1.6) (layers "F.Cu" "F.Paste" "F.Mask") (tstamp 123b1c51-330e-4904-87ed-7d691323bc32))
  (model "${KICADLIB}/model/connector/Hirose_FX10A-140S14-SV.step"
    (offset (xyz 16 -2.25 0.9))
    (scale (xyz 1 1 1))
    (rotate (xyz -90 0 90))
  )
)
