(footprint "PinSocket_1x08_P2.54mm_Vertical" (version 20221018) (generator pcbnew)
  (layer "F.Cu")
  (descr "Through hole straight socket strip, 1x08, 2.54mm pitch, single row (from Kicad 4.0.7), script generated")
  (tags "Through hole socket strip THT 1x08 2.54mm single row")
  (attr through_hole)
  (fp_text reference "REF**" (at 0 -2.77) (layer "F.SilkS")
      (effects (font (size 1 1) (thickness 0.15)))
    (tstamp 37c7ae8e-9f38-4819-bcd7-d7134560c2e1)
  )
  (fp_text value "PinSocket_1x08_P2.54mm_Vertical" (at 0 20.55) (layer "F.Fab") hide
      (effects (font (size 1 1) (thickness 0.15)))
    (tstamp 93011dc3-6458-4b49-ba19-07254aa7898c)
  )
  (fp_text user "^" (at -2.17 0 270 unlocked) (layer "F.SilkS")
      (effects (font (size 1 1) (thickness 0.15)))
    (tstamp c5e6e052-7f6f-4d98-9930-ad557e0b547b)
  )
  (fp_text user "${REFERENCE}" (at 0 8.89 90) (layer "F.Fab")
      (effects (font (size 1 1) (thickness 0.15)))
    (tstamp 0123cd6f-119b-44a7-9e79-81c37d9ab61f)
  )
  (fp_line (start -1.33 1.27) (end -1.33 19.11)
    (stroke (width 0.12) (type solid)) (layer "F.SilkS") (tstamp 7fd619ef-364a-43b1-84c9-0ac9ca61a25f))
  (fp_line (start -1.33 1.27) (end 1.33 1.27)
    (stroke (width 0.12) (type solid)) (layer "F.SilkS") (tstamp d2ccf8c6-1505-4b25-83f0-ade3ad231b3d))
  (fp_line (start -1.33 19.11) (end 1.33 19.11)
    (stroke (width 0.12) (type solid)) (layer "F.SilkS") (tstamp 729d2c56-aac2-4488-b1c2-5c2b38a29adb))
  (fp_line (start 0 -1.33) (end 1.33 -1.33)
    (stroke (width 0.12) (type solid)) (layer "F.SilkS") (tstamp 973ed135-7beb-47f2-b1e2-16e44f2e8fd7))
  (fp_line (start 1.33 -1.33) (end 1.33 0)
    (stroke (width 0.12) (type solid)) (layer "F.SilkS") (tstamp a083553a-97cc-4f41-b442-48d8d9ce2d80))
  (fp_line (start 1.33 1.27) (end 1.33 19.11)
    (stroke (width 0.12) (type solid)) (layer "F.SilkS") (tstamp f22214f8-61b6-4950-93de-59f17e90298d))
  (fp_line (start -1.8 -1.8) (end 1.75 -1.8)
    (stroke (width 0.05) (type solid)) (layer "F.CrtYd") (tstamp e5eb76f1-64a1-4cfe-a9f7-aaaffc5f1d3d))
  (fp_line (start -1.8 19.55) (end -1.8 -1.8)
    (stroke (width 0.05) (type solid)) (layer "F.CrtYd") (tstamp 4d208535-bb2b-41d6-9236-762b111c6846))
  (fp_line (start 1.75 -1.8) (end 1.75 19.55)
    (stroke (width 0.05) (type solid)) (layer "F.CrtYd") (tstamp 51d0b102-8b9d-4a35-99df-4f1752864838))
  (fp_line (start 1.75 19.55) (end -1.8 19.55)
    (stroke (width 0.05) (type solid)) (layer "F.CrtYd") (tstamp 5ada71c6-af1c-40c9-835d-c9c6a402b3fe))
  (fp_line (start -1.27 -1.27) (end 0.635 -1.27)
    (stroke (width 0.1) (type solid)) (layer "F.Fab") (tstamp 29b2a550-9286-4e13-b286-5d4e1de04847))
  (fp_line (start -1.27 19.05) (end -1.27 -1.27)
    (stroke (width 0.1) (type solid)) (layer "F.Fab") (tstamp 324991a1-e9c5-4967-82da-6e5c0d929bbb))
  (fp_line (start 0.635 -1.27) (end 1.27 -0.635)
    (stroke (width 0.1) (type solid)) (layer "F.Fab") (tstamp f421cdc6-e4e5-4057-96dd-a5ca63309a7f))
  (fp_line (start 1.27 -0.635) (end 1.27 19.05)
    (stroke (width 0.1) (type solid)) (layer "F.Fab") (tstamp d32794fe-de4d-49ed-bf1c-cda5cac0c268))
  (fp_line (start 1.27 19.05) (end -1.27 19.05)
    (stroke (width 0.1) (type solid)) (layer "F.Fab") (tstamp 44f0acdf-aeca-4053-8e69-81fc457fba7a))
  (pad "1" thru_hole rect (at 0 0) (size 1.7 1.7) (drill 1) (layers "*.Cu" "*.Mask") (remove_unused_layers) (keep_end_layers) (tstamp 554f401e-f89d-4c43-92b5-791bf41e40d1))
  (pad "2" thru_hole oval (at 0 2.54) (size 1.7 1.7) (drill 1) (layers "*.Cu" "*.Mask") (remove_unused_layers) (keep_end_layers) (tstamp 12583614-e374-402a-ab8c-5f46813891c8))
  (pad "3" thru_hole oval (at 0 5.08) (size 1.7 1.7) (drill 1) (layers "*.Cu" "*.Mask") (remove_unused_layers) (keep_end_layers) (tstamp c29b89f6-0780-435b-8b84-834c7aa2b766))
  (pad "4" thru_hole oval (at 0 7.62) (size 1.7 1.7) (drill 1) (layers "*.Cu" "*.Mask") (remove_unused_layers) (keep_end_layers) (tstamp 414bbfe8-cf51-486d-a1a7-3bbc14b86740))
  (pad "5" thru_hole oval (at 0 10.16) (size 1.7 1.7) (drill 1) (layers "*.Cu" "*.Mask") (remove_unused_layers) (keep_end_layers) (tstamp dcfac264-21ba-475a-9018-1659391081c4))
  (pad "6" thru_hole oval (at 0 12.7) (size 1.7 1.7) (drill 1) (layers "*.Cu" "*.Mask") (remove_unused_layers) (keep_end_layers) (tstamp a3dad053-b34b-4ddc-8675-abb727a71436))
  (pad "7" thru_hole oval (at 0 15.24) (size 1.7 1.7) (drill 1) (layers "*.Cu" "*.Mask") (remove_unused_layers) (keep_end_layers) (tstamp 1f80c9ad-6fdc-4abb-81b2-f5fd174cd150))
  (pad "8" thru_hole oval (at 0 17.78) (size 1.7 1.7) (drill 1) (layers "*.Cu" "*.Mask") (remove_unused_layers) (keep_end_layers) (tstamp fe96c162-b040-4dd2-b279-b7a338e85f49))
  (model "${KICADLIB}/model/connector/PinSocket_1x08_P2.54mm_Vertical.step"
    (offset (xyz 0 0 0))
    (scale (xyz 1 1 1))
    (rotate (xyz 0 0 0))
  )
)
