(footprint "Pot_SMD_5.0x4.8_3pin" (version 20221018) (generator pcbnew)
  (layer "F.Cu")
  (attr smd)
  (fp_text reference "REF**" (at 0 -3.7) (layer "F.SilkS")
      (effects (font (size 1 1) (thickness 0.15)))
    (tstamp cb779eb3-9f8f-4326-b99c-9400a21af868)
  )
  (fp_text value "Pot_SMD_5.0x4.8_3pin" (at 0 3) (layer "F.Fab") hide
      (effects (font (size 1 1) (thickness 0.15)))
    (tstamp bce62ce7-e7d1-4e55-a29b-a0129585bbca)
  )
  (fp_text user "^" (at -1.25 3.75 unlocked) (layer "F.SilkS")
      (effects (font (size 1 1) (thickness 0.15)))
    (tstamp 8a5580db-96dc-4dba-8352-f09f4923e503)
  )
  (fp_text user "${REFERENCE}" (at 0 0.05 unlocked) (layer "F.Fab")
      (effects (font (size 0.6 0.6) (thickness 0.15)))
    (tstamp eabd0307-2266-46ac-ab71-64305b54702f)
  )
  (fp_line (start -2.4 -2.3) (end -2.4 2.3)
    (stroke (width 0.1) (type solid)) (layer "F.SilkS") (tstamp 543684e2-9a6e-4714-8214-e1b71405b17e))
  (fp_line (start -2.4 -2.3) (end -1.1 -2.3)
    (stroke (width 0.1) (type solid)) (layer "F.SilkS") (tstamp ea3e54cf-c3fb-4f10-983b-704613f22997))
  (fp_line (start -2.4 2.3) (end -2.05 2.3)
    (stroke (width 0.1) (type solid)) (layer "F.SilkS") (tstamp 9be09746-bfcd-4096-bbff-0609544c1de9))
  (fp_line (start -0.5 2.3) (end 0.5 2.3)
    (stroke (width 0.1) (type solid)) (layer "F.SilkS") (tstamp 04dea630-b83f-4da3-baed-0a10d0dfadf5))
  (fp_line (start 2.4 -2.3) (end 1.1 -2.3)
    (stroke (width 0.1) (type solid)) (layer "F.SilkS") (tstamp 8ec647ce-b741-4a3e-8284-ac6f6518aaa2))
  (fp_line (start 2.4 2.3) (end 2 2.3)
    (stroke (width 0.1) (type solid)) (layer "F.SilkS") (tstamp 8a9d764a-0c6d-4894-9415-ec588b499f80))
  (fp_line (start 2.4 2.3) (end 2.4 -2.3)
    (stroke (width 0.1) (type solid)) (layer "F.SilkS") (tstamp d9d02a59-eae3-4b91-b509-bd863f198cfd))
  (fp_rect (start -2.6 -2.5) (end 2.6 2.5)
    (stroke (width 0.05) (type solid)) (fill none) (layer "F.CrtYd") (tstamp 5d3eb723-025b-429f-ba41-e90d55962211))
  (fp_line (start -2.4 -2.3) (end 2.4 -2.3)
    (stroke (width 0.1) (type solid)) (layer "F.Fab") (tstamp e192e762-45c0-4e59-94ea-5817edc4927a))
  (fp_line (start -2.4 1.8) (end -2.4 -2.3)
    (stroke (width 0.1) (type solid)) (layer "F.Fab") (tstamp 020f044f-97f6-496f-9656-6ba37149108a))
  (fp_line (start -1.9 2.3) (end -2.4 1.8)
    (stroke (width 0.1) (type solid)) (layer "F.Fab") (tstamp ead1002a-ff97-4589-8832-fbdebd6a5f78))
  (fp_line (start 2.4 -2.3) (end 2.4 2.3)
    (stroke (width 0.1) (type solid)) (layer "F.Fab") (tstamp fc4d7687-0ce9-426f-8b44-a053c3e98686))
  (fp_line (start 2.4 2.3) (end -1.9 2.3)
    (stroke (width 0.1) (type solid)) (layer "F.Fab") (tstamp dfeb8ad5-5620-4d56-bda2-4bb898865fe5))
  (fp_line (start -1.65 -2.8) (end -1.65 -1.8)
    (stroke (width 0.1) (type solid)) (layer "User.1") (tstamp 62029402-ef51-4081-a6b2-c59e4783c777))
  (fp_line (start -1.15 -2.3) (end -2.15 -2.3)
    (stroke (width 0.1) (type solid)) (layer "User.1") (tstamp 483704b1-69ce-4a43-96b4-f0263bff5046))
  (fp_circle (center -1.65 -2.3) (end -0.9 -2.3)
    (stroke (width 0.1) (type solid)) (fill none) (layer "User.1") (tstamp 484312a1-6b19-4b85-9411-669698ce9617))
  (pad "1" smd roundrect (at -1.25 2) (size 1.3 2) (layers "F.Cu" "F.Paste" "F.Mask") (roundrect_rratio 0.03846153846) (tstamp ef13c718-a79a-4079-888d-7bbcba0bcf95))
  (pad "2" smd roundrect (at 0 -2) (size 2 2) (layers "F.Cu" "F.Paste" "F.Mask") (roundrect_rratio 0.025) (tstamp 251c4f22-6727-4ad3-80d7-e2947e8b004f))
  (pad "3" smd roundrect (at 1.25 2) (size 1.3 2) (layers "F.Cu" "F.Paste" "F.Mask") (roundrect_rratio 0.03846153846) (tstamp bfc816a1-0256-4300-af62-0ac317b623c6))
  (model "${KICADLIB}/model/passive/Bourns_3214J.stp"
    (offset (xyz 0.3 0 0.2))
    (scale (xyz 1 1 1))
    (rotate (xyz 180 0 0))
  )
)
