(module LOGO (layer F.Cu)
  (at 0 0)
 (fp_text reference "G***" (at 0 0) (layer F.SilkS) hide
  (effects (font (thickness 0.3)))
  )
  (fp_text value "LOGO" (at 0.75 0) (layer F.SilkS) hide
  (effects (font (thickness 0.3)))
  )
  (fp_poly (pts (xy -1.356987 3.027123) (xy -3.061918 3.027123) (xy -3.061918 1.565753) (xy -2.818357 1.565753) (xy -2.818357 2.783561) (xy -1.600548 2.783561) (xy -1.600548 1.565753) (xy -2.818357 1.565753)
     (xy -3.061918 1.565753) (xy -3.061918 1.322191) (xy -1.356987 1.322191) (xy -1.356987 3.027123) )(layer F.SilkS) (width  0.010000)
  )
  (fp_poly (pts (xy -0.869863 2.296438) (xy -0.382740 2.296438) (xy -0.382740 2.418219) (xy -0.388126 2.499840) (xy -0.418515 2.533314) (xy -0.495252 2.539984) (xy -0.504521 2.540000) (xy -0.586142 2.545386)
     (xy -0.619616 2.575775) (xy -0.626287 2.652511) (xy -0.626302 2.661780) (xy -0.620916 2.743402) (xy -0.590527 2.776875) (xy -0.513790 2.783546) (xy -0.504521 2.783561) (xy -0.422900 2.788947)
     (xy -0.389426 2.819336) (xy -0.382755 2.896073) (xy -0.382740 2.905342) (xy -0.382740 3.027123) (xy -1.113425 3.027123) (xy -1.113425 2.540000) (xy -0.991644 2.540000) (xy -0.910023 2.534613)
     (xy -0.876549 2.504224) (xy -0.869879 2.427488) (xy -0.869863 2.418219) (xy -0.875250 2.336597) (xy -0.905639 2.303124) (xy -0.982375 2.296453) (xy -0.991644 2.296438) (xy -1.113425 2.296438)
     (xy -1.113425 1.809315) (xy -0.869863 1.809315) (xy -0.869863 2.296438) )(layer F.SilkS) (width  0.010000)
  )
  (fp_poly (pts (xy -1.113425 -0.382740) (xy -1.600548 -0.382740) (xy -1.600548 -0.626302) (xy -1.113425 -0.626302) (xy -1.113425 -0.382740) )(layer F.SilkS) (width  0.010000)
  )
  (fp_poly (pts (xy -1.113425 -0.748083) (xy -1.108039 -0.829704) (xy -1.077650 -0.863178) (xy -1.000914 -0.869848) (xy -0.991644 -0.869863) (xy -0.626302 -0.869863) (xy -0.626302 -0.626302) (xy -0.139179 -0.626302)
     (xy -0.139179 -0.504521) (xy -0.133792 -0.422900) (xy -0.103403 -0.389426) (xy -0.026667 -0.382755) (xy -0.017398 -0.382740) (xy 0.064224 -0.388126) (xy 0.097697 -0.418515) (xy 0.104368 -0.495252)
     (xy 0.104383 -0.504521) (xy 0.098997 -0.586142) (xy 0.068608 -0.619616) (xy -0.008128 -0.626287) (xy -0.017398 -0.626302) (xy -0.099019 -0.631688) (xy -0.132493 -0.662077) (xy -0.139163 -0.738813)
     (xy -0.139179 -0.748083) (xy -0.133792 -0.829704) (xy -0.103403 -0.863178) (xy -0.026667 -0.869848) (xy -0.017398 -0.869863) (xy 0.104383 -0.869863) (xy 0.104383 -1.356987) (xy 0.347945 -1.356987)
     (xy 0.347945 -0.869863) (xy 0.835068 -0.869863) (xy 0.835068 -0.991644) (xy 0.829682 -1.073266) (xy 0.799293 -1.106739) (xy 0.722557 -1.113410) (xy 0.713287 -1.113425) (xy 0.631666 -1.118811)
     (xy 0.598192 -1.149200) (xy 0.591522 -1.225937) (xy 0.591506 -1.235206) (xy 0.586120 -1.316827) (xy 0.555731 -1.350301) (xy 0.478995 -1.356972) (xy 0.469726 -1.356987) (xy 0.347945 -1.356987)
     (xy 0.347945 -1.844110) (xy 0.226164 -1.844110) (xy 0.144543 -1.849496) (xy 0.111069 -1.879885) (xy 0.104398 -1.956622) (xy 0.104383 -1.965891) (xy 0.098997 -2.047512) (xy 0.068608 -2.080986)
     (xy -0.008128 -2.087657) (xy -0.017398 -2.087672) (xy -0.099019 -2.082285) (xy -0.132493 -2.051897) (xy -0.139163 -1.975160) (xy -0.139179 -1.965891) (xy -0.144565 -1.884269) (xy -0.174954 -1.850796)
     (xy -0.251690 -1.844125) (xy -0.260959 -1.844110) (xy -0.382740 -1.844110) (xy -0.382740 -1.356987) (xy -0.139179 -1.356987) (xy -0.139179 -0.869863) (xy -0.626302 -0.869863) (xy -0.991644 -0.869863)
     (xy -0.910023 -0.875250) (xy -0.876549 -0.905639) (xy -0.869879 -0.982375) (xy -0.869863 -0.991644) (xy -0.875250 -1.073266) (xy -0.905639 -1.106739) (xy -0.982375 -1.113410) (xy -0.991644 -1.113425)
     (xy -1.113425 -1.113425) (xy -1.113425 -1.600548) (xy -0.869863 -1.600548) (xy -0.869863 -1.113425) (xy -0.626302 -1.113425) (xy -0.626302 -1.844110) (xy -0.748083 -1.844110) (xy -0.829704 -1.849496)
     (xy -0.863178 -1.879885) (xy -0.869848 -1.956622) (xy -0.869863 -1.965891) (xy -0.864477 -2.047512) (xy -0.834088 -2.080986) (xy -0.757352 -2.087657) (xy -0.748083 -2.087672) (xy -0.666461 -2.082285)
     (xy -0.632988 -2.051897) (xy -0.626317 -1.975160) (xy -0.626302 -1.965891) (xy -0.620916 -1.884269) (xy -0.590527 -1.850796) (xy -0.513790 -1.844125) (xy -0.504521 -1.844110) (xy -0.422900 -1.849496)
     (xy -0.389426 -1.879885) (xy -0.382755 -1.956622) (xy -0.382740 -1.965891) (xy -0.377354 -2.047512) (xy -0.346965 -2.080986) (xy -0.270229 -2.087657) (xy -0.260959 -2.087672) (xy -0.139179 -2.087672)
     (xy -0.139179 -2.574795) (xy 0.591506 -2.574795) (xy 0.591506 -2.453014) (xy 0.586120 -2.371393) (xy 0.555731 -2.337919) (xy 0.478995 -2.331248) (xy 0.469726 -2.331233) (xy 0.388104 -2.325847)
     (xy 0.354631 -2.295458) (xy 0.347960 -2.218722) (xy 0.347945 -2.209452) (xy 0.353331 -2.127831) (xy 0.383720 -2.094358) (xy 0.460456 -2.087687) (xy 0.469726 -2.087672) (xy 0.591506 -2.087672)
     (xy 0.591506 -1.356987) (xy 0.835068 -1.356987) (xy 0.835068 -2.818357) (xy 1.078630 -2.818357) (xy 1.078630 -0.382740) (xy 0.591506 -0.382740) (xy 0.591506 -0.504521) (xy 0.586120 -0.586142)
     (xy 0.555731 -0.619616) (xy 0.478995 -0.626287) (xy 0.469726 -0.626302) (xy 0.347945 -0.626302) (xy 0.347945 0.104383) (xy 0.469726 0.104383) (xy 0.551347 0.098997) (xy 0.584820 0.068608)
     (xy 0.591491 -0.008128) (xy 0.591506 -0.017398) (xy 0.591506 -0.139179) (xy 1.078630 -0.139179) (xy 1.078630 0.591506) (xy 1.200411 0.591506) (xy 1.282032 0.586120) (xy 1.315505 0.555731)
     (xy 1.322176 0.478995) (xy 1.322191 0.469726) (xy 1.327578 0.388104) (xy 1.357966 0.354631) (xy 1.434703 0.347960) (xy 1.443972 0.347945) (xy 1.525594 0.353331) (xy 1.559067 0.383720)
     (xy 1.565738 0.460456) (xy 1.565753 0.469726) (xy 1.571139 0.551347) (xy 1.601528 0.584820) (xy 1.678264 0.591491) (xy 1.687534 0.591506) (xy 1.769155 0.596893) (xy 1.802629 0.627281)
     (xy 1.809299 0.704018) (xy 1.809315 0.713287) (xy 1.814701 0.794909) (xy 1.845090 0.828382) (xy 1.921826 0.835053) (xy 1.931095 0.835068) (xy 2.052876 0.835068) (xy 2.052876 1.322191)
     (xy 2.174657 1.322191) (xy 2.256278 1.327578) (xy 2.289752 1.357966) (xy 2.296423 1.434703) (xy 2.296438 1.443972) (xy 2.291052 1.525594) (xy 2.260663 1.559067) (xy 2.183926 1.565738)
     (xy 2.174657 1.565753) (xy 2.093036 1.571139) (xy 2.059562 1.601528) (xy 2.052891 1.678264) (xy 2.052876 1.687534) (xy 2.058263 1.769155) (xy 2.088651 1.802629) (xy 2.165388 1.809299)
     (xy 2.174657 1.809315) (xy 2.296438 1.809315) (xy 2.296438 2.296438) (xy 2.418219 2.296438) (xy 2.499840 2.291052) (xy 2.533314 2.260663) (xy 2.539984 2.183926) (xy 2.540000 2.174657)
     (xy 2.545386 2.093036) (xy 2.575775 2.059562) (xy 2.652511 2.052891) (xy 2.661780 2.052876) (xy 2.743402 2.047490) (xy 2.776875 2.017101) (xy 2.783546 1.940365) (xy 2.783561 1.931095)
     (xy 2.778175 1.849474) (xy 2.747786 1.816001) (xy 2.671050 1.809330) (xy 2.661780 1.809315) (xy 2.580159 1.803928) (xy 2.546685 1.773540) (xy 2.540015 1.696803) (xy 2.540000 1.687534)
     (xy 2.545386 1.605912) (xy 2.575775 1.572439) (xy 2.652511 1.565768) (xy 2.661780 1.565753) (xy 2.743402 1.560367) (xy 2.776875 1.529978) (xy 2.783546 1.453241) (xy 2.783561 1.443972)
     (xy 2.778175 1.362351) (xy 2.747786 1.328877) (xy 2.671050 1.322206) (xy 2.661780 1.322191) (xy 2.580159 1.316805) (xy 2.546685 1.286416) (xy 2.540015 1.209680) (xy 2.540000 1.200411)
     (xy 2.534613 1.118789) (xy 2.504224 1.085316) (xy 2.427488 1.078645) (xy 2.418219 1.078630) (xy 2.296438 1.078630) (xy 2.296438 0.713287) (xy 2.540000 0.713287) (xy 2.545386 0.794909)
     (xy 2.575775 0.828382) (xy 2.652511 0.835053) (xy 2.661780 0.835068) (xy 2.743402 0.829682) (xy 2.776875 0.799293) (xy 2.783546 0.722557) (xy 2.783561 0.713287) (xy 2.778175 0.631666)
     (xy 2.747786 0.598192) (xy 2.671050 0.591522) (xy 2.661780 0.591506) (xy 2.580159 0.596893) (xy 2.546685 0.627281) (xy 2.540015 0.704018) (xy 2.540000 0.713287) (xy 2.296438 0.713287)
     (xy 2.296438 0.591506) (xy 2.174657 0.591506) (xy 2.093036 0.586120) (xy 2.059562 0.555731) (xy 2.052891 0.478995) (xy 2.052876 0.469726) (xy 2.047490 0.388104) (xy 2.017101 0.354631)
     (xy 1.940365 0.347960) (xy 1.931095 0.347945) (xy 1.849474 0.342558) (xy 1.816001 0.312170) (xy 1.809330 0.235433) (xy 1.809315 0.226164) (xy 1.809315 0.104383) (xy 1.322191 0.104383)
     (xy 1.322191 -0.017398) (xy 1.327578 -0.099019) (xy 1.357966 -0.132493) (xy 1.434703 -0.139163) (xy 1.443972 -0.139179) (xy 1.525594 -0.144565) (xy 1.559067 -0.174954) (xy 1.565738 -0.251690)
     (xy 1.565753 -0.260959) (xy 1.560367 -0.342581) (xy 1.529978 -0.376054) (xy 1.453241 -0.382725) (xy 1.443972 -0.382740) (xy 1.809315 -0.382740) (xy 1.809315 0.104383) (xy 1.931095 0.104383)
     (xy 2.012717 0.109769) (xy 2.046190 0.140158) (xy 2.052861 0.216895) (xy 2.052876 0.226164) (xy 2.052876 0.347945) (xy 2.540000 0.347945) (xy 2.540000 0.226164) (xy 2.545386 0.144543)
     (xy 2.575775 0.111069) (xy 2.652511 0.104398) (xy 2.661780 0.104383) (xy 2.743402 0.098997) (xy 2.776875 0.068608) (xy 2.783546 -0.008128) (xy 2.783561 -0.017398) (xy 2.783561 -0.139179)
     (xy 2.052876 -0.139179) (xy 2.052876 -0.260959) (xy 2.047490 -0.342581) (xy 2.017101 -0.376054) (xy 1.940365 -0.382725) (xy 1.931095 -0.382740) (xy 1.809315 -0.382740) (xy 1.443972 -0.382740)
     (xy 1.362351 -0.388126) (xy 1.328877 -0.418515) (xy 1.322206 -0.495252) (xy 1.322191 -0.504521) (xy 1.327578 -0.586142) (xy 1.357966 -0.619616) (xy 1.434703 -0.626287) (xy 1.443972 -0.626302)
     (xy 2.296438 -0.626302) (xy 2.296438 -0.382740) (xy 2.783561 -0.382740) (xy 2.783561 -0.626302) (xy 2.296438 -0.626302) (xy 1.443972 -0.626302) (xy 1.525594 -0.631688) (xy 1.559067 -0.662077)
     (xy 1.565738 -0.738813) (xy 1.565753 -0.748083) (xy 1.560367 -0.829704) (xy 1.529978 -0.863178) (xy 1.453241 -0.869848) (xy 1.443972 -0.869863) (xy 1.362351 -0.875250) (xy 1.328877 -0.905639)
     (xy 1.322206 -0.982375) (xy 1.322191 -0.991644) (xy 1.327578 -1.073266) (xy 1.357966 -1.106739) (xy 1.434703 -1.113410) (xy 1.443972 -1.113425) (xy 1.525594 -1.108039) (xy 1.559067 -1.077650)
     (xy 1.565738 -1.000914) (xy 1.565753 -0.991644) (xy 1.565753 -0.869863) (xy 2.783561 -0.869863) (xy 2.783561 -0.991644) (xy 2.788947 -1.073266) (xy 2.819336 -1.106739) (xy 2.896073 -1.113410)
     (xy 2.905342 -1.113425) (xy 2.986963 -1.108039) (xy 3.020437 -1.077650) (xy 3.027108 -1.000914) (xy 3.027123 -0.991644) (xy 3.021737 -0.910023) (xy 2.991348 -0.876549) (xy 2.914611 -0.869879)
     (xy 2.905342 -0.869863) (xy 2.823721 -0.864477) (xy 2.790247 -0.834088) (xy 2.783576 -0.757352) (xy 2.783561 -0.748083) (xy 2.788947 -0.666461) (xy 2.819336 -0.632988) (xy 2.896073 -0.626317)
     (xy 2.905342 -0.626302) (xy 3.027123 -0.626302) (xy 3.027123 0.104383) (xy 2.905342 0.104383) (xy 2.823721 0.109769) (xy 2.790247 0.140158) (xy 2.783576 0.216895) (xy 2.783561 0.226164)
     (xy 2.788947 0.307785) (xy 2.819336 0.341259) (xy 2.896073 0.347930) (xy 2.905342 0.347945) (xy 3.027123 0.347945) (xy 3.027123 0.835068) (xy 2.783561 0.835068) (xy 2.783561 1.322191)
     (xy 2.905342 1.322191) (xy 2.986963 1.327578) (xy 3.020437 1.357966) (xy 3.027108 1.434703) (xy 3.027123 1.443972) (xy 3.021737 1.525594) (xy 2.991348 1.559067) (xy 2.914611 1.565738)
     (xy 2.905342 1.565753) (xy 2.823721 1.571139) (xy 2.790247 1.601528) (xy 2.783576 1.678264) (xy 2.783561 1.687534) (xy 2.788947 1.769155) (xy 2.819336 1.802629) (xy 2.896073 1.809299)
     (xy 2.905342 1.809315) (xy 3.027123 1.809315) (xy 3.027123 3.027123) (xy 2.905342 3.027123) (xy 2.823721 3.021737) (xy 2.790247 2.991348) (xy 2.783576 2.914611) (xy 2.783561 2.905342)
     (xy 2.783561 2.783561) (xy 2.296438 2.783561) (xy 2.296438 2.905342) (xy 2.291052 2.986963) (xy 2.260663 3.020437) (xy 2.183926 3.027108) (xy 2.174657 3.027123) (xy 2.093036 3.021737)
     (xy 2.059562 2.991348) (xy 2.052891 2.914611) (xy 2.052876 2.905342) (xy 2.052876 2.783561) (xy 1.565753 2.783561) (xy 1.565753 3.027123) (xy 0.835068 3.027123) (xy 0.835068 2.905342)
     (xy 0.840454 2.823721) (xy 0.870843 2.790247) (xy 0.947580 2.783576) (xy 0.956849 2.783561) (xy 1.038470 2.778175) (xy 1.071944 2.747786) (xy 1.078615 2.671050) (xy 1.078630 2.661780)
     (xy 1.073243 2.580159) (xy 1.042855 2.546685) (xy 0.966118 2.540015) (xy 0.956849 2.540000) (xy 0.875228 2.534613) (xy 0.841754 2.504224) (xy 0.835083 2.427488) (xy 0.835068 2.418219)
     (xy 0.829682 2.336597) (xy 0.799293 2.303124) (xy 0.722557 2.296453) (xy 0.713287 2.296438) (xy 0.591506 2.296438) (xy 0.591506 3.027123) (xy 0.104383 3.027123) (xy 0.104383 2.905342)
     (xy 0.109769 2.823721) (xy 0.140158 2.790247) (xy 0.216895 2.783576) (xy 0.226164 2.783561) (xy 0.347945 2.783561) (xy 0.347945 2.174657) (xy 0.835068 2.174657) (xy 0.840454 2.256278)
     (xy 0.870843 2.289752) (xy 0.947580 2.296423) (xy 0.956849 2.296438) (xy 1.038470 2.301824) (xy 1.071944 2.332213) (xy 1.078615 2.408949) (xy 1.078630 2.418219) (xy 1.084016 2.499840)
     (xy 1.114405 2.533314) (xy 1.191141 2.539984) (xy 1.200411 2.540000) (xy 1.282032 2.545386) (xy 1.315505 2.575775) (xy 1.322176 2.652511) (xy 1.322191 2.661780) (xy 1.327578 2.743402)
     (xy 1.357966 2.776875) (xy 1.434703 2.783546) (xy 1.443972 2.783561) (xy 1.565753 2.783561) (xy 1.565753 2.296438) (xy 1.078630 2.296438) (xy 1.078630 2.174657) (xy 1.073243 2.093036)
     (xy 1.042855 2.059562) (xy 0.966118 2.052891) (xy 0.956849 2.052876) (xy 1.565753 2.052876) (xy 1.565753 2.296438) (xy 2.052876 2.296438) (xy 2.052876 2.783561) (xy 2.296438 2.783561)
     (xy 2.296438 2.296438) (xy 2.174657 2.296438) (xy 2.093036 2.291052) (xy 2.059562 2.260663) (xy 2.052891 2.183926) (xy 2.052876 2.174657) (xy 2.052876 2.052876) (xy 1.565753 2.052876)
     (xy 0.956849 2.052876) (xy 0.875228 2.058263) (xy 0.841754 2.088651) (xy 0.835083 2.165388) (xy 0.835068 2.174657) (xy 0.347945 2.174657) (xy 0.347945 2.052876) (xy -0.139179 2.052876)
     (xy -0.139179 1.565753) (xy -0.382740 1.565753) (xy -0.382740 2.052876) (xy -0.504521 2.052876) (xy -0.586142 2.047490) (xy -0.619616 2.017101) (xy -0.626287 1.940365) (xy -0.626302 1.931095)
     (xy -0.631688 1.849474) (xy -0.662077 1.816001) (xy -0.738813 1.809330) (xy -0.748083 1.809315) (xy -0.869863 1.809315) (xy -0.869863 1.322191) (xy -0.991644 1.322191) (xy -1.073266 1.316805)
     (xy -1.106739 1.286416) (xy -1.113410 1.209680) (xy -1.113425 1.200411) (xy -1.113425 1.078630) (xy -1.600548 1.078630) (xy -1.600548 0.956849) (xy -1.605935 0.875228) (xy -1.636323 0.841754)
     (xy -1.713060 0.835083) (xy -1.722329 0.835068) (xy -1.803951 0.840454) (xy -1.837424 0.870843) (xy -1.844095 0.947580) (xy -1.844110 0.956849) (xy -1.844110 1.078630) (xy -2.574795 1.078630)
     (xy -2.574795 0.956849) (xy -2.569409 0.875228) (xy -2.539020 0.841754) (xy -2.462283 0.835083) (xy -2.453014 0.835068) (xy -2.331233 0.835068) (xy -2.331233 0.347945) (xy -2.087672 0.347945)
     (xy -2.087672 0.835068) (xy -1.844110 0.835068) (xy -1.844110 0.713287) (xy -1.600548 0.713287) (xy -1.595162 0.794909) (xy -1.564773 0.828382) (xy -1.488037 0.835053) (xy -1.478768 0.835068)
     (xy -1.397146 0.829682) (xy -1.363673 0.799293) (xy -1.357002 0.722557) (xy -1.356987 0.713287) (xy -1.362373 0.631666) (xy -1.392762 0.598192) (xy -1.469498 0.591522) (xy -1.478768 0.591506)
     (xy -1.560389 0.596893) (xy -1.593862 0.627281) (xy -1.600533 0.704018) (xy -1.600548 0.713287) (xy -1.844110 0.713287) (xy -1.844110 0.347945) (xy -2.087672 0.347945) (xy -2.331233 0.347945)
     (xy -2.331233 0.104383) (xy -2.209452 0.104383) (xy -2.127831 0.098997) (xy -2.094358 0.068608) (xy -2.087687 -0.008128) (xy -2.087672 -0.017398) (xy -2.087672 -0.139179) (xy -3.061918 -0.139179)
     (xy -3.061918 -0.626302) (xy -2.940137 -0.626302) (xy -2.858516 -0.631688) (xy -2.825043 -0.662077) (xy -2.818372 -0.738813) (xy -2.818357 -0.748083) (xy -2.823743 -0.829704) (xy -2.854132 -0.863178)
     (xy -2.930868 -0.869848) (xy -2.940137 -0.869863) (xy -3.021759 -0.875250) (xy -3.055232 -0.905639) (xy -3.061903 -0.982375) (xy -3.061918 -0.991644) (xy -3.061918 -1.113425) (xy -2.574795 -1.113425)
     (xy -2.574795 -0.626302) (xy -2.453014 -0.626302) (xy -2.371393 -0.620916) (xy -2.337919 -0.590527) (xy -2.331248 -0.513790) (xy -2.331233 -0.504521) (xy -2.325847 -0.422900) (xy -2.295458 -0.389426)
     (xy -2.218722 -0.382755) (xy -2.209452 -0.382740) (xy -2.087672 -0.382740) (xy -2.087672 -0.869863) (xy -2.209452 -0.869863) (xy -2.291074 -0.875250) (xy -2.324547 -0.905639) (xy -2.331218 -0.982375)
     (xy -2.331233 -0.991644) (xy -2.331233 -1.113425) (xy -1.844110 -1.113425) (xy -1.844110 0.347945) (xy -1.356987 0.347945) (xy -1.356987 0.469726) (xy -1.351600 0.551347) (xy -1.321212 0.584820)
     (xy -1.244475 0.591491) (xy -1.235206 0.591506) (xy -1.113425 0.591506) (xy -0.869863 0.591506) (xy -0.869863 1.322191) (xy -0.748083 1.322191) (xy -0.666461 1.327578) (xy -0.632988 1.357966)
     (xy -0.626317 1.434703) (xy -0.626302 1.443972) (xy -0.620916 1.525594) (xy -0.590527 1.559067) (xy -0.513790 1.565738) (xy -0.504521 1.565753) (xy -0.422900 1.560367) (xy -0.389426 1.529978)
     (xy -0.382755 1.453241) (xy -0.382740 1.443972) (xy -0.388126 1.362351) (xy -0.418515 1.328877) (xy -0.495252 1.322206) (xy -0.504521 1.322191) (xy -0.139179 1.322191) (xy -0.139179 1.443972)
     (xy -0.133792 1.525594) (xy -0.103403 1.559067) (xy -0.026667 1.565738) (xy -0.017398 1.565753) (xy 0.064224 1.571139) (xy 0.097697 1.601528) (xy 0.104368 1.678264) (xy 0.104383 1.687534)
     (xy 0.109769 1.769155) (xy 0.140158 1.802629) (xy 0.216895 1.809299) (xy 0.226164 1.809315) (xy 0.307785 1.803928) (xy 0.341259 1.773540) (xy 0.347930 1.696803) (xy 0.347945 1.687534)
     (xy 0.347945 1.565753) (xy 0.835068 1.565753) (xy 0.835068 1.078630) (xy 1.078630 1.078630) (xy 1.078630 1.809315) (xy 1.809315 1.809315) (xy 1.809315 1.078630) (xy 1.078630 1.078630)
     (xy 0.835068 1.078630) (xy 0.835068 0.835068) (xy 0.956849 0.835068) (xy 1.038470 0.829682) (xy 1.071944 0.799293) (xy 1.078615 0.722557) (xy 1.078630 0.713287) (xy 1.073243 0.631666)
     (xy 1.042855 0.598192) (xy 0.966118 0.591522) (xy 0.956849 0.591506) (xy 0.875228 0.596893) (xy 0.841754 0.627281) (xy 0.835083 0.704018) (xy 0.835068 0.713287) (xy 0.829682 0.794909)
     (xy 0.799293 0.828382) (xy 0.722557 0.835053) (xy 0.713287 0.835068) (xy 0.591506 0.835068) (xy 0.591506 1.322191) (xy -0.139179 1.322191) (xy -0.504521 1.322191) (xy -0.586142 1.316805)
     (xy -0.619616 1.286416) (xy -0.626287 1.209680) (xy -0.626302 1.200411) (xy -0.626302 1.078630) (xy 0.347945 1.078630) (xy 0.347945 0.956849) (xy 0.353331 0.875228) (xy 0.383720 0.841754)
     (xy 0.460456 0.835083) (xy 0.469726 0.835068) (xy 0.591506 0.835068) (xy 0.591506 0.347945) (xy 0.469726 0.347945) (xy 0.388104 0.353331) (xy 0.354631 0.383720) (xy 0.347960 0.460456)
     (xy 0.347945 0.469726) (xy 0.347945 0.591506) (xy -0.139179 0.591506) (xy -0.139179 0.835068) (xy -0.626302 0.835068) (xy -0.626302 0.713287) (xy -0.631688 0.631666) (xy -0.662077 0.598192)
     (xy -0.738813 0.591522) (xy -0.748083 0.591506) (xy -0.869863 0.591506) (xy -1.113425 0.591506) (xy -1.113425 -0.139179) (xy -0.991644 -0.139179) (xy -0.626302 -0.139179) (xy -0.626302 0.347945)
     (xy 0.104383 0.347945) (xy 0.104383 0.104383) (xy -0.382740 0.104383) (xy -0.382740 -0.017398) (xy -0.388126 -0.099019) (xy -0.418515 -0.132493) (xy -0.495252 -0.139163) (xy -0.504521 -0.139179)
     (xy -0.626302 -0.139179) (xy -0.991644 -0.139179) (xy -0.910023 -0.144565) (xy -0.876549 -0.174954) (xy -0.869879 -0.251690) (xy -0.869863 -0.260959) (xy -0.864477 -0.342581) (xy -0.834088 -0.376054)
     (xy -0.757352 -0.382725) (xy -0.748083 -0.382740) (xy -0.666461 -0.388126) (xy -0.632988 -0.418515) (xy -0.626317 -0.495252) (xy -0.626302 -0.504521) (xy -0.626302 -0.626302) (xy -1.113425 -0.626302)
     (xy -1.113425 -0.748083) )(layer F.SilkS) (width  0.010000)
  )
  (fp_poly (pts (xy 0.064224 2.301824) (xy 0.097697 2.332213) (xy 0.104368 2.408949) (xy 0.104383 2.418219) (xy 0.098997 2.499840) (xy 0.068608 2.533314) (xy -0.008128 2.539984) (xy -0.017398 2.540000)
     (xy -0.099019 2.534613) (xy -0.132493 2.504224) (xy -0.139163 2.427488) (xy -0.139179 2.418219) (xy -0.133792 2.336597) (xy -0.103403 2.303124) (xy -0.026667 2.296453) (xy -0.017398 2.296438)
     (xy 0.064224 2.301824) )(layer F.SilkS) (width  0.010000)
  )
  (fp_poly (pts (xy -2.858516 0.109769) (xy -2.825043 0.140158) (xy -2.818372 0.216895) (xy -2.818357 0.226164) (xy -2.812970 0.307785) (xy -2.782582 0.341259) (xy -2.705845 0.347930) (xy -2.696576 0.347945)
     (xy -2.614954 0.353331) (xy -2.581481 0.383720) (xy -2.574810 0.460456) (xy -2.574795 0.469726) (xy -2.580181 0.551347) (xy -2.610570 0.584820) (xy -2.687306 0.591491) (xy -2.696576 0.591506)
     (xy -2.818357 0.591506) (xy -2.818357 1.078630) (xy -3.061918 1.078630) (xy -3.061918 0.104383) (xy -2.940137 0.104383) (xy -2.858516 0.109769) )(layer F.SilkS) (width  0.010000)
  )
  (fp_poly (pts (xy -1.397146 -0.133792) (xy -1.363673 -0.103403) (xy -1.357002 -0.026667) (xy -1.356987 -0.017398) (xy -1.362373 0.064224) (xy -1.392762 0.097697) (xy -1.469498 0.104368) (xy -1.478768 0.104383)
     (xy -1.560389 0.098997) (xy -1.593862 0.068608) (xy -1.600533 -0.008128) (xy -1.600548 -0.017398) (xy -1.595162 -0.099019) (xy -1.564773 -0.132493) (xy -1.488037 -0.139163) (xy -1.478768 -0.139179)
     (xy -1.397146 -0.133792) )(layer F.SilkS) (width  0.010000)
  )
  (fp_poly (pts (xy -1.397146 -1.108039) (xy -1.363673 -1.077650) (xy -1.357002 -1.000914) (xy -1.356987 -0.991644) (xy -1.362373 -0.910023) (xy -1.392762 -0.876549) (xy -1.469498 -0.869879) (xy -1.478768 -0.869863)
     (xy -1.560389 -0.875250) (xy -1.593862 -0.905639) (xy -1.600533 -0.982375) (xy -1.600548 -0.991644) (xy -1.595162 -1.073266) (xy -1.564773 -1.106739) (xy -1.488037 -1.113410) (xy -1.478768 -1.113425)
     (xy -1.397146 -1.108039) )(layer F.SilkS) (width  0.010000)
  )
  (fp_poly (pts (xy -1.356987 -1.356987) (xy -3.061918 -1.356987) (xy -3.061918 -2.818357) (xy -2.818357 -2.818357) (xy -2.818357 -1.600548) (xy -1.600548 -1.600548) (xy -1.600548 -2.818357) (xy -2.818357 -2.818357)
     (xy -3.061918 -2.818357) (xy -3.061918 -3.061918) (xy -1.356987 -3.061918) (xy -1.356987 -1.356987) )(layer F.SilkS) (width  0.010000)
  )
  (fp_poly (pts (xy 3.027123 -1.356987) (xy 1.322191 -1.356987) (xy 1.322191 -2.818357) (xy 1.565753 -2.818357) (xy 1.565753 -1.600548) (xy 2.783561 -1.600548) (xy 2.783561 -2.818357) (xy 1.565753 -2.818357)
     (xy 1.322191 -2.818357) (xy 1.322191 -3.061918) (xy 3.027123 -3.061918) (xy 3.027123 -1.356987) )(layer F.SilkS) (width  0.010000)
  )
  (fp_poly (pts (xy -0.910023 -3.056532) (xy -0.876549 -3.026143) (xy -0.869879 -2.949407) (xy -0.869863 -2.940137) (xy -0.869863 -2.818357) (xy -0.382740 -2.818357) (xy -0.382740 -2.331233) (xy -0.504521 -2.331233)
     (xy -0.586142 -2.336620) (xy -0.619616 -2.367008) (xy -0.626287 -2.443745) (xy -0.626302 -2.453014) (xy -0.631688 -2.534636) (xy -0.662077 -2.568109) (xy -0.738813 -2.574780) (xy -0.748083 -2.574795)
     (xy -0.829704 -2.580181) (xy -0.863178 -2.610570) (xy -0.869848 -2.687306) (xy -0.869863 -2.696576) (xy -0.875250 -2.778197) (xy -0.905639 -2.811671) (xy -0.982375 -2.818341) (xy -0.991644 -2.818357)
     (xy -1.073266 -2.823743) (xy -1.106739 -2.854132) (xy -1.113410 -2.930868) (xy -1.113425 -2.940137) (xy -1.108039 -3.021759) (xy -1.077650 -3.055232) (xy -1.000914 -3.061903) (xy -0.991644 -3.061918)
     (xy -0.910023 -3.056532) )(layer F.SilkS) (width  0.010000)
  )
  (fp_poly (pts (xy 0.104383 -2.818357) (xy -0.382740 -2.818357) (xy -0.382740 -3.061918) (xy 0.104383 -3.061918) (xy 0.104383 -2.818357) )(layer F.SilkS) (width  0.010000)
  )
  (fp_poly (pts (xy 0.551347 -3.056532) (xy 0.584820 -3.026143) (xy 0.591491 -2.949407) (xy 0.591506 -2.940137) (xy 0.586120 -2.858516) (xy 0.555731 -2.825043) (xy 0.478995 -2.818372) (xy 0.469726 -2.818357)
     (xy 0.388104 -2.823743) (xy 0.354631 -2.854132) (xy 0.347960 -2.930868) (xy 0.347945 -2.940137) (xy 0.353331 -3.021759) (xy 0.383720 -3.055232) (xy 0.460456 -3.061903) (xy 0.469726 -3.061918)
     (xy 0.551347 -3.056532) )(layer F.SilkS) (width  0.010000)
  )
  (fp_poly (pts (xy -1.844110 2.540000) (xy -2.574795 2.540000) (xy -2.574795 1.809315) (xy -1.844110 1.809315) (xy -1.844110 2.540000) )(layer F.SilkS) (width  0.010000)
  )
  (fp_poly (pts (xy 1.525594 1.327578) (xy 1.559067 1.357966) (xy 1.565738 1.434703) (xy 1.565753 1.443972) (xy 1.560367 1.525594) (xy 1.529978 1.559067) (xy 1.453241 1.565738) (xy 1.443972 1.565753)
     (xy 1.362351 1.560367) (xy 1.328877 1.529978) (xy 1.322206 1.453241) (xy 1.322191 1.443972) (xy 1.327578 1.362351) (xy 1.357966 1.328877) (xy 1.434703 1.322206) (xy 1.443972 1.322191)
     (xy 1.525594 1.327578) )(layer F.SilkS) (width  0.010000)
  )
  (fp_poly (pts (xy 0.104383 -1.356987) (xy -0.139179 -1.356987) (xy -0.139179 -1.844110) (xy 0.104383 -1.844110) (xy 0.104383 -1.356987) )(layer F.SilkS) (width  0.010000)
  )
  (fp_poly (pts (xy -1.844110 -1.844110) (xy -2.574795 -1.844110) (xy -2.574795 -2.574795) (xy -1.844110 -2.574795) (xy -1.844110 -1.844110) )(layer F.SilkS) (width  0.010000)
  )
  (fp_poly (pts (xy 2.540000 -1.844110) (xy 1.809315 -1.844110) (xy 1.809315 -2.574795) (xy 2.540000 -2.574795) (xy 2.540000 -1.844110) )(layer F.SilkS) (width  0.010000)
  )
)
