(footprint "PinHeader_1x03_P1.27mm_Vertical" (version 20211014) (generator pcbnew)
  (layer "F.Cu")
  (tedit 6116C4B5)
  (descr "Through hole straight pin header, 1x03, 1.27mm pitch, single row")
  (tags "Through hole pin header THT 1x03 1.27mm single row")
  (attr through_hole)
  (fp_text reference "REF**" (at 0 -1.695) (layer "F.SilkS")
    (effects (font (size 1 1) (thickness 0.15)))
    (tstamp 5bba2818-dc05-4f6e-93ab-8cd8656d4dbc)
  )
  (fp_text value "PinHeader_1x03_P1.27mm_Vertical" (at 0 4.235) (layer "F.Fab") hide
    (effects (font (size 1 1) (thickness 0.15)))
    (tstamp 41c21d38-bbc2-457c-b8fc-6ccf92d6bd9f)
  )
  (fp_text user "${REFERENCE}" (at 0 1.27 90) (layer "F.Fab")
    (effects (font (size 1 1) (thickness 0.15)))
    (tstamp bb44e97d-2c6a-4578-a029-ee6ed9361db2)
  )
  (fp_line (start -1.11 -0.76) (end 0 -0.76) (layer "F.SilkS") (width 0.12) (tstamp 166f6045-831f-495c-8d88-dbeda3e761f9))
  (fp_line (start -1.11 0.76) (end -0.563471 0.76) (layer "F.SilkS") (width 0.12) (tstamp 1f449fdb-e817-4801-b346-85d5879d19c7))
  (fp_line (start -1.11 0.76) (end -1.11 3.235) (layer "F.SilkS") (width 0.12) (tstamp 6219069a-c728-4028-9456-f29d438dc2de))
  (fp_line (start 0.30753 3.235) (end 1.11 3.235) (layer "F.SilkS") (width 0.12) (tstamp 7511f51a-42e9-4723-a0bf-932958165f0e))
  (fp_line (start -1.11 3.235) (end -0.30753 3.235) (layer "F.SilkS") (width 0.12) (tstamp a481d370-7315-4dd5-bfd4-6258af89670c))
  (fp_line (start 0.563471 0.76) (end 1.11 0.76) (layer "F.SilkS") (width 0.12) (tstamp b44364f1-6084-4c94-9888-88ae90251ae5))
  (fp_line (start -1.11 0) (end -1.11 -0.76) (layer "F.SilkS") (width 0.12) (tstamp ea0c8257-889d-4811-823a-c093fc28aecd))
  (fp_line (start 1.11 0.76) (end 1.11 3.235) (layer "F.SilkS") (width 0.12) (tstamp ef4970f5-c0a5-448a-b0ab-3d5bf0047190))
  (fp_line (start -1.55 -1.15) (end -1.55 3.7) (layer "F.CrtYd") (width 0.05) (tstamp 2da7b251-42fc-4f2d-abec-22ab4b6856f7))
  (fp_line (start 1.55 3.7) (end 1.55 -1.15) (layer "F.CrtYd") (width 0.05) (tstamp 31c7f525-8d23-4105-a0c6-52cb09629ee2))
  (fp_line (start 1.55 -1.15) (end -1.55 -1.15) (layer "F.CrtYd") (width 0.05) (tstamp 948358de-cf66-4cd1-b048-6a7adb88eb31))
  (fp_line (start -1.55 3.7) (end 1.55 3.7) (layer "F.CrtYd") (width 0.05) (tstamp a0978681-0257-4537-86cd-ddccf7cb15e5))
  (fp_line (start -1.05 3.175) (end -1.05 -0.11) (layer "F.Fab") (width 0.1) (tstamp 223ce8f6-3088-4a04-83c6-af74a7356058))
  (fp_line (start 1.05 3.175) (end -1.05 3.175) (layer "F.Fab") (width 0.1) (tstamp 40c0dec4-fa88-4c69-8a12-52efeeffd3c5))
  (fp_line (start -1.05 -0.11) (end -0.525 -0.635) (layer "F.Fab") (width 0.1) (tstamp 4ff9c61e-9af3-4b33-816a-7fb1f212e993))
  (fp_line (start 1.05 -0.635) (end 1.05 3.175) (layer "F.Fab") (width 0.1) (tstamp 5ab6adf4-ddd8-401f-8548-85262d67d30b))
  (fp_line (start -0.525 -0.635) (end 1.05 -0.635) (layer "F.Fab") (width 0.1) (tstamp b6147104-ab37-413c-96c4-a2c689db1f1f))
  (pad "1" thru_hole rect (at 0 0) (size 1 1) (drill 0.65) (layers *.Cu *.Mask) (tstamp 52f4f0fa-cf45-4b53-89ca-c2761006984a))
  (pad "2" thru_hole oval (at 0 1.27) (size 1 1) (drill 0.65) (layers *.Cu *.Mask) (tstamp 45339d95-6ecf-4f51-90bc-9303abbdbd25))
  (pad "3" thru_hole oval (at 0 2.54) (size 1 1) (drill 0.65) (layers *.Cu *.Mask) (tstamp c1bb5824-7642-4743-ab53-6af2b2c4231e))
  (model "${KICADLIB}/model/connector/PinHeader_1x03_P1.27mm_Vertical.step"
    (offset (xyz 0 0 0))
    (scale (xyz 1 1 1))
    (rotate (xyz 0 0 0))
  )
)
