(footprint "PCI-E_16X-TH" (version 20211014) (generator pcbnew)
  (layer "F.Cu")
  (tedit 5C856356)
  (attr through_hole)
  (fp_text reference "REF**" (at 0 5.2) (layer "F.SilkS")
    (effects (font (size 1 1) (thickness 0.15)))
    (tstamp 63e0ab31-586b-47af-b3e0-5d58db250f77)
  )
  (fp_text value "${REFERENCE}" (at 0 0) (layer "F.Fab")
    (effects (font (size 1 1) (thickness 0.15)))
    (tstamp ffe1bfe3-fbe0-4a78-9cf6-3ff3805b03d2)
  )
  (fp_text user "B1" (at -13.15 1.25 unlocked) (layer "B.SilkS")
    (effects (font (size 0.8 0.8) (thickness 0.15) italic) (justify mirror))
    (tstamp 4fa301a2-4056-4e3b-ad72-295e3e2d8aef)
  )
  (fp_text user "B82" (at 73.35 3.25 unlocked) (layer "B.SilkS")
    (effects (font (size 0.8 0.8) (thickness 0.15) italic) (justify mirror))
    (tstamp 52c62e9d-b477-4f3e-986c-21f32191a6b6)
  )
  (fp_text user "A81" (at 72.35 -1.75 unlocked) (layer "B.SilkS")
    (effects (font (size 0.8 0.8) (thickness 0.15) italic) (justify mirror))
    (tstamp 64aa84e5-9ded-49dd-8e7e-712f478ed907)
  )
  (fp_text user "A2" (at -12.15 -3.25 unlocked) (layer "B.SilkS")
    (effects (font (size 0.8 0.8) (thickness 0.15) italic) (justify mirror))
    (tstamp 7d026015-36b6-489d-9542-d0acdf752a4f)
  )
  (fp_text user "B81" (at 72.35 1.75 unlocked) (layer "B.SilkS")
    (effects (font (size 0.8 0.8) (thickness 0.15) italic) (justify mirror))
    (tstamp 87d677e1-c152-42f8-835f-7def7c367ee4)
  )
  (fp_text user "A1" (at -13.15 -1.25 unlocked) (layer "B.SilkS")
    (effects (font (size 0.8 0.8) (thickness 0.15) italic) (justify mirror))
    (tstamp bee22e41-546e-4aa6-b1d0-f186251f943c)
  )
  (fp_text user "A82" (at 73.35 -3.25 unlocked) (layer "B.SilkS")
    (effects (font (size 0.8 0.8) (thickness 0.15) italic) (justify mirror))
    (tstamp c258d396-5c05-4b3a-a482-8fcf10f0bd1b)
  )
  (fp_text user "B2" (at -12.15 3.25 unlocked) (layer "B.SilkS")
    (effects (font (size 0.8 0.8) (thickness 0.15) italic) (justify mirror))
    (tstamp e1500b62-8fd9-462b-97c4-861e2d2788d2)
  )
  (fp_text user "^" (at -15.5 -1.25 270 unlocked) (layer "F.SilkS")
    (effects (font (size 1 1) (thickness 0.15)))
    (tstamp 1f293c8d-4223-4450-ab6c-8694ad9034d9)
  )
  (fp_line (start 29.65 2.65) (end 30.05 1.85) (layer "B.SilkS") (width 0.1) (tstamp 02624ca9-5835-4018-9394-4888ab1bbc54))
  (fp_line (start 59.65 2.65) (end 60.05 1.85) (layer "B.SilkS") (width 0.1) (tstamp 0e473db4-5415-44ad-98bf-5a6ff38b3bc7))
  (fp_line (start 29.65 -2.65) (end 30.05 -1.85) (layer "B.SilkS") (width 0.1) (tstamp 1ab59cf5-fbf1-43e9-93e6-86adbea93fd9))
  (fp_line (start 49.65 -2.65) (end 50.05 -1.85) (layer "B.SilkS") (width 0.1) (tstamp 1e180c30-069f-478f-a109-08e9df47e026))
  (fp_line (start 9.65 -2.65) (end 10.05 -1.85) (layer "B.SilkS") (width 0.1) (tstamp 2ecf3d73-b871-4479-9e44-3db76fca86a8))
  (fp_line (start -2.35 -2.65) (end -1.95 -1.85) (layer "B.SilkS") (width 0.1) (tstamp 3762e2de-996d-4166-af53-891b405d0fbe))
  (fp_line (start 59.65 -2.65) (end 60.05 -1.85) (layer "B.SilkS") (width 0.1) (tstamp 3d324c9f-255f-4d55-8638-54fadd990b3b))
  (fp_line (start 49.65 2.65) (end 50.05 1.85) (layer "B.SilkS") (width 0.1) (tstamp 3efecd5c-f56f-4db0-bee1-41babf151dda))
  (fp_line (start 69.65 2.65) (end 70.05 1.85) (layer "B.SilkS") (width 0.1) (tstamp 698b92bd-d1c0-40f9-b9d1-4824f0d12f97))
  (fp_line (start -2.35 2.65) (end -1.95 1.85) (layer "B.SilkS") (width 0.1) (tstamp 75f9be8d-ac97-46d5-921f-4f57b51db357))
  (fp_line (start 9.65 2.65) (end 10.05 1.85) (layer "B.SilkS") (width 0.1) (tstamp 80bb4c48-cd94-43d7-a370-530d01db687e))
  (fp_line (start 69.65 -2.65) (end 70.05 -1.85) (layer "B.SilkS") (width 0.1) (tstamp 92630e33-51f9-48ba-b0f5-b6c37382d7c6))
  (fp_line (start 19.65 -2.65) (end 20.05 -1.85) (layer "B.SilkS") (width 0.1) (tstamp 9addafde-71c6-4d7f-92d9-ddd7183869be))
  (fp_line (start 39.65 2.65) (end 40.05 1.85) (layer "B.SilkS") (width 0.1) (tstamp dc9c35d5-e9c8-401c-be42-146211ff1ce2))
  (fp_line (start 19.65 2.65) (end 20.05 1.85) (layer "B.SilkS") (width 0.1) (tstamp df08af40-985b-41cd-a885-c9e755bd9cba))
  (fp_line (start 39.65 -2.65) (end 40.05 -1.85) (layer "B.SilkS") (width 0.1) (tstamp f0fa1fdb-5432-4638-ad4c-fb18e69b6d65))
  (fp_line (start 74.5 4.4) (end -14.5 4.4) (layer "F.SilkS") (width 0.1) (tstamp 34b9e32f-3ef4-4c67-9ef7-fce50ecb58d4))
  (fp_line (start -14.5 4.4) (end -14.5 -4.4) (layer "F.SilkS") (width 0.1) (tstamp 50cbefbf-be88-4cb1-a3a4-7f9ece04f55d))
  (fp_line (start 74.5 -4.4) (end 74.5 4.4) (layer "F.SilkS") (width 0.1) (tstamp a6a66a3f-a3b7-46fc-9df7-3c84efc31243))
  (fp_line (start -14.5 -4.4) (end 74.5 -4.4) (layer "F.SilkS") (width 0.1) (tstamp e63bdb21-a00c-4b08-8b93-cdbb7ff6140b))
  (fp_line (start 29.8 0) (end 30.3 0) (layer "Eco1.User") (width 0.1) (tstamp 004cfeed-2049-469f-b9d9-a6d067c9b9a6))
  (fp_line (start 30.05 -0.25) (end 30.05 0.25) (layer "Eco1.User") (width 0.1) (tstamp 5d9feef3-25eb-4ee5-9a8e-e3118595f7ed))
  (fp_line (start 72.2 0.8) (end 72.2 -0.8) (layer "Eco1.User") (width 0.1) (tstamp fb286288-9010-4e07-ad30-b2dda1409e25))
  (fp_rect (start -0.9 -0.8) (end -12.1 0.8) (layer "Eco1.User") (width 0.1) (fill none) (tstamp 06f48c70-67ce-4ef7-acd0-a51d8a2e5727))
  (fp_rect (start 74.8 0.8) (end 87.6 -0.8) (layer "Eco1.User") (width 0.1) (fill none) (tstamp 10b9899f-a30c-46e3-b38f-5a23164dcab4))
  (fp_rect (start -15.7 -0.8) (end -23.7 0.8) (layer "Eco1.User") (width 0.1) (fill none) (tstamp 9f80f0dc-5ded-484e-a64e-0d804c8cdb71))
  (fp_rect (start 0.9 -0.8) (end 72.2 0.8) (layer "Eco1.User") (width 0.1) (fill none) (tstamp a5d4f77d-93b6-4e2e-8e74-2098ce182c42))
  (fp_rect (start -15 -5) (end 75 5) (layer "F.CrtYd") (width 0.05) (fill none) (tstamp 4cacdc01-d749-4358-a7a4-a2bb27e2195d))
  (fp_line (start 74.5 -4.4) (end 74.5 4.4) (layer "F.Fab") (width 0.1) (tstamp 166ce1fd-3466-4a05-bfa7-81b2429e1753))
  (fp_line (start 74.5 4.4) (end -14.5 4.4) (layer "F.Fab") (width 0.1) (tstamp 4788817c-7fac-448b-ab23-13dfed734205))
  (fp_line (start -14.5 -3.1) (end -13.2 -4.4) (layer "F.Fab") (width 0.1) (tstamp 4e8d0fba-3f36-4dee-b135-6d8314b0497c))
  (fp_line (start -13.2 -4.4) (end 74.5 -4.4) (layer "F.Fab") (width 0.1) (tstamp df979d1f-30bd-4d05-9ce6-629c09edb304))
  (fp_line (start -14.5 4.4) (end -14.5 -3.1) (layer "F.Fab") (width 0.1) (tstamp f5258f77-1061-4b1f-aff5-7fbc8ae67685))
  (pad "" np_thru_hole circle (at 0 0) (size 2.35 2.35) (drill 2.35) (layers F&B.Cu *.Mask) (tstamp 3007cd8d-ca32-47ca-bd45-3e3348ddaa8e))
  (pad "" np_thru_hole circle (at 73.15 0) (size 2.35 2.35) (drill 2.35) (layers F&B.Cu *.Mask) (tstamp d6dc8a18-6baf-427d-860f-f16010dcb684))
  (pad "A1" thru_hole circle (at -11.65 -1.25) (size 1.2 1.2) (drill 0.7) (layers *.Cu *.Mask) (remove_unused_layers) (keep_end_layers) (tstamp 6926fa33-b483-4b27-9021-c8c173bee123))
  (pad "A2" thru_hole circle (at -10.65 -3.25) (size 1.2 1.2) (drill 0.7) (layers *.Cu *.Mask) (remove_unused_layers) (keep_end_layers) (tstamp 70b8ef22-63c9-4fda-901b-ed8decd747e6))
  (pad "A3" thru_hole circle (at -9.65 -1.25) (size 1.2 1.2) (drill 0.7) (layers *.Cu *.Mask) (remove_unused_layers) (keep_end_layers) (tstamp 72ff9cf4-7795-474a-aac4-82144e4ff605))
  (pad "A4" thru_hole circle (at -8.65 -3.25) (size 1.2 1.2) (drill 0.7) (layers *.Cu *.Mask) (remove_unused_layers) (keep_end_layers) (tstamp 7b2ebbef-523c-44aa-abef-4a00da114e9c))
  (pad "A5" thru_hole circle (at -7.65 -1.25) (size 1.2 1.2) (drill 0.7) (layers *.Cu *.Mask) (remove_unused_layers) (keep_end_layers) (tstamp 9c86227d-76ba-49a2-9ffe-628fd0f6d395))
  (pad "A6" thru_hole circle (at -6.65 -3.25) (size 1.2 1.2) (drill 0.7) (layers *.Cu *.Mask) (remove_unused_layers) (keep_end_layers) (tstamp e52521cf-a655-4184-882c-7efca5945974))
  (pad "A7" thru_hole circle (at -5.65 -1.25) (size 1.2 1.2) (drill 0.7) (layers *.Cu *.Mask) (remove_unused_layers) (keep_end_layers) (tstamp a30bd64c-5664-40ec-b5dc-e115cbdaa123))
  (pad "A8" thru_hole circle (at -4.65 -3.25) (size 1.2 1.2) (drill 0.7) (layers *.Cu *.Mask) (remove_unused_layers) (keep_end_layers) (tstamp 11421325-6562-4e89-b32f-01cef4898e37))
  (pad "A9" thru_hole circle (at -3.65 -1.25) (size 1.2 1.2) (drill 0.7) (layers *.Cu *.Mask) (remove_unused_layers) (keep_end_layers) (tstamp ae723def-10ad-4970-8dd2-922f66c64223))
  (pad "A10" thru_hole circle (at -2.65 -3.25) (size 1.2 1.2) (drill 0.7) (layers *.Cu *.Mask) (remove_unused_layers) (keep_end_layers) (tstamp 41cc8096-c52b-4fed-9c2c-3f64528ad4ad))
  (pad "A11" thru_hole circle (at -1.65 -1.25) (size 1.2 1.2) (drill 0.7) (layers *.Cu *.Mask) (remove_unused_layers) (keep_end_layers) (tstamp de9bc919-d259-412e-9baf-f6ca1e262b89))
  (pad "A12" thru_hole circle (at 1.35 -3.25) (size 1.2 1.2) (drill 0.7) (layers *.Cu *.Mask) (remove_unused_layers) (keep_end_layers) (tstamp b99ff350-faba-45bd-b67b-1361e63d261b))
  (pad "A13" thru_hole circle (at 2.35 -1.25) (size 1.2 1.2) (drill 0.7) (layers *.Cu *.Mask) (remove_unused_layers) (keep_end_layers) (tstamp c5d73c9f-d95d-4ab3-adab-38470614b682))
  (pad "A14" thru_hole circle (at 3.35 -3.25) (size 1.2 1.2) (drill 0.7) (layers *.Cu *.Mask) (remove_unused_layers) (keep_end_layers) (tstamp 3319c80f-8108-4efc-a42c-306c87903638))
  (pad "A15" thru_hole circle (at 4.35 -1.25) (size 1.2 1.2) (drill 0.7) (layers *.Cu *.Mask) (remove_unused_layers) (keep_end_layers) (tstamp 972c2052-2a97-4dc1-b5c1-a5f1233ea1d6))
  (pad "A16" thru_hole circle (at 5.35 -3.25) (size 1.2 1.2) (drill 0.7) (layers *.Cu *.Mask) (remove_unused_layers) (keep_end_layers) (tstamp 924d7fbb-4d6c-436e-ba17-6d38b4debbc3))
  (pad "A17" thru_hole circle (at 6.35 -1.25) (size 1.2 1.2) (drill 0.7) (layers *.Cu *.Mask) (remove_unused_layers) (keep_end_layers) (tstamp a2902005-6791-434d-8fae-c10681514034))
  (pad "A18" thru_hole circle (at 7.35 -3.25) (size 1.2 1.2) (drill 0.7) (layers *.Cu *.Mask) (remove_unused_layers) (keep_end_layers) (tstamp 5d34ff41-4663-4625-b2cf-0398adacabd8))
  (pad "A19" thru_hole circle (at 8.35 -1.25) (size 1.2 1.2) (drill 0.7) (layers *.Cu *.Mask) (remove_unused_layers) (keep_end_layers) (tstamp 0e9c3924-2d75-4965-bd4d-14b8275871af))
  (pad "A20" thru_hole circle (at 9.35 -3.25) (size 1.2 1.2) (drill 0.7) (layers *.Cu *.Mask) (remove_unused_layers) (keep_end_layers) (tstamp 5b0bac9b-8304-4e26-8b61-fe469ac0307d))
  (pad "A21" thru_hole circle (at 10.35 -1.25) (size 1.2 1.2) (drill 0.7) (layers *.Cu *.Mask) (remove_unused_layers) (keep_end_layers) (tstamp 1da5c041-d258-45eb-b4b5-98f67536845f))
  (pad "A22" thru_hole circle (at 11.35 -3.25) (size 1.2 1.2) (drill 0.7) (layers *.Cu *.Mask) (remove_unused_layers) (keep_end_layers) (tstamp e8705031-a0f9-4ec4-894b-491c4edcef66))
  (pad "A23" thru_hole circle (at 12.35 -1.25) (size 1.2 1.2) (drill 0.7) (layers *.Cu *.Mask) (remove_unused_layers) (keep_end_layers) (tstamp 062fee89-3865-4f78-8888-3070d12bdcbe))
  (pad "A24" thru_hole circle (at 13.35 -3.25) (size 1.2 1.2) (drill 0.7) (layers *.Cu *.Mask) (remove_unused_layers) (keep_end_layers) (tstamp 1196cc58-dad3-4476-9b10-16848c871afb))
  (pad "A25" thru_hole circle (at 14.35 -1.25) (size 1.2 1.2) (drill 0.7) (layers *.Cu *.Mask) (remove_unused_layers) (keep_end_layers) (tstamp d850bf61-00cc-47d7-a831-44310588d00f))
  (pad "A26" thru_hole circle (at 15.35 -3.25) (size 1.2 1.2) (drill 0.7) (layers *.Cu *.Mask) (remove_unused_layers) (keep_end_layers) (tstamp 6734928d-2306-4e6b-9ad4-e1e43c9d3aa3))
  (pad "A27" thru_hole circle (at 16.35 -1.25) (size 1.2 1.2) (drill 0.7) (layers *.Cu *.Mask) (remove_unused_layers) (keep_end_layers) (tstamp 706d5b5d-54d1-4269-9ccc-cbc4d1b6d1b1))
  (pad "A28" thru_hole circle (at 17.35 -3.25) (size 1.2 1.2) (drill 0.7) (layers *.Cu *.Mask) (remove_unused_layers) (keep_end_layers) (tstamp 3e32c740-2716-4147-bd9f-9660d5d5804c))
  (pad "A29" thru_hole circle (at 18.35 -1.25) (size 1.2 1.2) (drill 0.7) (layers *.Cu *.Mask) (remove_unused_layers) (keep_end_layers) (tstamp 3488d403-86ec-4077-b5b8-2898cd635934))
  (pad "A30" thru_hole circle (at 19.35 -3.25) (size 1.2 1.2) (drill 0.7) (layers *.Cu *.Mask) (remove_unused_layers) (keep_end_layers) (tstamp 54e97ec1-657d-4463-97f7-a8ef82e3139f))
  (pad "A31" thru_hole circle (at 20.35 -1.25) (size 1.2 1.2) (drill 0.7) (layers *.Cu *.Mask) (remove_unused_layers) (keep_end_layers) (tstamp c2e13002-27a6-45b0-9b8f-b1afddb6521f))
  (pad "A32" thru_hole circle (at 21.35 -3.25) (size 1.2 1.2) (drill 0.7) (layers *.Cu *.Mask) (remove_unused_layers) (keep_end_layers) (tstamp c0923b4e-5a86-4c34-a817-05474aa5addf))
  (pad "A33" thru_hole circle (at 22.35 -1.25) (size 1.2 1.2) (drill 0.7) (layers *.Cu *.Mask) (remove_unused_layers) (keep_end_layers) (tstamp a9608310-95ec-47b0-9c10-320c77c07de0))
  (pad "A34" thru_hole circle (at 23.35 -3.25) (size 1.2 1.2) (drill 0.7) (layers *.Cu *.Mask) (remove_unused_layers) (keep_end_layers) (tstamp 5dae07de-3407-4fde-bf8a-f29036b049ca))
  (pad "A35" thru_hole circle (at 24.35 -1.25) (size 1.2 1.2) (drill 0.7) (layers *.Cu *.Mask) (remove_unused_layers) (keep_end_layers) (tstamp 17e54ef0-7377-452a-8a9f-5acd7f5a285c))
  (pad "A36" thru_hole circle (at 25.35 -3.25) (size 1.2 1.2) (drill 0.7) (layers *.Cu *.Mask) (remove_unused_layers) (keep_end_layers) (tstamp 6b634e44-93cd-4866-9513-43de4f30ae14))
  (pad "A37" thru_hole circle (at 26.35 -1.25) (size 1.2 1.2) (drill 0.7) (layers *.Cu *.Mask) (remove_unused_layers) (keep_end_layers) (tstamp 4ff60c5d-e7d0-40db-ad2b-bc80a65b7773))
  (pad "A38" thru_hole circle (at 27.35 -3.25) (size 1.2 1.2) (drill 0.7) (layers *.Cu *.Mask) (remove_unused_layers) (keep_end_layers) (tstamp 6ae3b8fc-cd9d-40ca-81cb-b4bd805d25f6))
  (pad "A39" thru_hole circle (at 28.35 -1.25) (size 1.2 1.2) (drill 0.7) (layers *.Cu *.Mask) (remove_unused_layers) (keep_end_layers) (tstamp d6573b7b-d36d-45c6-9683-92b9566287a1))
  (pad "A40" thru_hole circle (at 29.35 -3.25) (size 1.2 1.2) (drill 0.7) (layers *.Cu *.Mask) (remove_unused_layers) (keep_end_layers) (tstamp 2d2b5ec1-0197-4cda-8b98-ec9a2550d2d9))
  (pad "A41" thru_hole circle (at 30.35 -1.25) (size 1.2 1.2) (drill 0.7) (layers *.Cu *.Mask) (remove_unused_layers) (keep_end_layers) (tstamp c693330e-1f7e-42b7-9aa7-20180409fe5b))
  (pad "A42" thru_hole circle (at 31.35 -3.25) (size 1.2 1.2) (drill 0.7) (layers *.Cu *.Mask) (remove_unused_layers) (keep_end_layers) (tstamp 663ce3b2-b42a-4f0d-8b63-8b0f7e6e371f))
  (pad "A43" thru_hole circle (at 32.35 -1.25) (size 1.2 1.2) (drill 0.7) (layers *.Cu *.Mask) (remove_unused_layers) (keep_end_layers) (tstamp f8f13031-c4de-4e61-a9ff-3ebb3d109358))
  (pad "A44" thru_hole circle (at 33.35 -3.25) (size 1.2 1.2) (drill 0.7) (layers *.Cu *.Mask) (remove_unused_layers) (keep_end_layers) (tstamp d00bad81-ca35-47b8-9c95-63e0e31e860f))
  (pad "A45" thru_hole circle (at 34.35 -1.25) (size 1.2 1.2) (drill 0.7) (layers *.Cu *.Mask) (remove_unused_layers) (keep_end_layers) (tstamp b5eee22b-c30d-4581-b32f-93ab5288850a))
  (pad "A46" thru_hole circle (at 35.35 -3.25) (size 1.2 1.2) (drill 0.7) (layers *.Cu *.Mask) (remove_unused_layers) (keep_end_layers) (tstamp eafc0f6d-13ea-479e-b56f-fd682a40798a))
  (pad "A47" thru_hole circle (at 36.35 -1.25) (size 1.2 1.2) (drill 0.7) (layers *.Cu *.Mask) (remove_unused_layers) (keep_end_layers) (tstamp 93c47df4-3ac7-4c26-bfc5-df888bc8d903))
  (pad "A48" thru_hole circle (at 37.35 -3.25) (size 1.2 1.2) (drill 0.7) (layers *.Cu *.Mask) (remove_unused_layers) (keep_end_layers) (tstamp e829d229-d721-4276-9528-b375c17fd54e))
  (pad "A49" thru_hole circle (at 38.35 -1.25) (size 1.2 1.2) (drill 0.7) (layers *.Cu *.Mask) (remove_unused_layers) (keep_end_layers) (tstamp 9daf64fc-bb48-45a5-a00a-9c16eb0fdcba))
  (pad "A50" thru_hole circle (at 39.35 -3.25) (size 1.2 1.2) (drill 0.7) (layers *.Cu *.Mask) (remove_unused_layers) (keep_end_layers) (tstamp 787dac36-f008-49f9-98e8-aa30bc3f555b))
  (pad "A51" thru_hole circle (at 40.35 -1.25) (size 1.2 1.2) (drill 0.7) (layers *.Cu *.Mask) (remove_unused_layers) (keep_end_layers) (tstamp d93a9795-d14e-40f3-89d1-1ddce239a16f))
  (pad "A52" thru_hole circle (at 41.35 -3.25) (size 1.2 1.2) (drill 0.7) (layers *.Cu *.Mask) (remove_unused_layers) (keep_end_layers) (tstamp 5d68d796-b409-4db5-a83d-165c3859f49f))
  (pad "A53" thru_hole circle (at 42.35 -1.25) (size 1.2 1.2) (drill 0.7) (layers *.Cu *.Mask) (remove_unused_layers) (keep_end_layers) (tstamp 245e2d2c-1ef8-4697-a385-6ad5f05a99ae))
  (pad "A54" thru_hole circle (at 43.35 -3.25) (size 1.2 1.2) (drill 0.7) (layers *.Cu *.Mask) (remove_unused_layers) (keep_end_layers) (tstamp 121f6bf8-8a0a-4019-bda3-26d4c4dd4c4b))
  (pad "A55" thru_hole circle (at 44.35 -1.25) (size 1.2 1.2) (drill 0.7) (layers *.Cu *.Mask) (remove_unused_layers) (keep_end_layers) (tstamp c0012eee-5d02-4b6b-a9da-0d1633e06572))
  (pad "A56" thru_hole circle (at 45.35 -3.25) (size 1.2 1.2) (drill 0.7) (layers *.Cu *.Mask) (remove_unused_layers) (keep_end_layers) (tstamp e12ba0ec-908a-4fe0-b4fc-b74aab2e6c18))
  (pad "A57" thru_hole circle (at 46.35 -1.25) (size 1.2 1.2) (drill 0.7) (layers *.Cu *.Mask) (remove_unused_layers) (keep_end_layers) (tstamp 7c56c4c7-4f3d-4571-8a43-73a29b17ea90))
  (pad "A58" thru_hole circle (at 47.35 -3.25) (size 1.2 1.2) (drill 0.7) (layers *.Cu *.Mask) (remove_unused_layers) (keep_end_layers) (tstamp 41e33040-6da1-42af-a4f1-9a4b42038c18))
  (pad "A59" thru_hole circle (at 48.35 -1.25) (size 1.2 1.2) (drill 0.7) (layers *.Cu *.Mask) (remove_unused_layers) (keep_end_layers) (tstamp 6816f90c-012b-4c3a-a594-72072617639a))
  (pad "A60" thru_hole circle (at 49.35 -3.25) (size 1.2 1.2) (drill 0.7) (layers *.Cu *.Mask) (remove_unused_layers) (keep_end_layers) (tstamp 4b3d1b80-5285-4287-a070-c160156da805))
  (pad "A61" thru_hole circle (at 50.35 -1.25) (size 1.2 1.2) (drill 0.7) (layers *.Cu *.Mask) (remove_unused_layers) (keep_end_layers) (tstamp 9fcb0c16-27db-4f5b-b513-410fac595e8f))
  (pad "A62" thru_hole circle (at 51.35 -3.25) (size 1.2 1.2) (drill 0.7) (layers *.Cu *.Mask) (remove_unused_layers) (keep_end_layers) (tstamp fd5f97fc-5b64-438c-a5a2-da20ab2f7deb))
  (pad "A63" thru_hole circle (at 52.35 -1.25) (size 1.2 1.2) (drill 0.7) (layers *.Cu *.Mask) (remove_unused_layers) (keep_end_layers) (tstamp 6f012ed3-15c4-489a-b433-26c0f45da341))
  (pad "A64" thru_hole circle (at 53.35 -3.25) (size 1.2 1.2) (drill 0.7) (layers *.Cu *.Mask) (remove_unused_layers) (keep_end_layers) (tstamp d0f3c1d6-5ad2-474c-96b6-990bf2c8dffa))
  (pad "A65" thru_hole circle (at 54.35 -1.25) (size 1.2 1.2) (drill 0.7) (layers *.Cu *.Mask) (remove_unused_layers) (keep_end_layers) (tstamp 5a34a473-4336-405d-b1b1-06ba0e85e54e))
  (pad "A66" thru_hole circle (at 55.35 -3.25) (size 1.2 1.2) (drill 0.7) (layers *.Cu *.Mask) (remove_unused_layers) (keep_end_layers) (tstamp 7aa52e24-5e5c-4816-a0cc-08f188d396cd))
  (pad "A67" thru_hole circle (at 56.35 -1.25) (size 1.2 1.2) (drill 0.7) (layers *.Cu *.Mask) (remove_unused_layers) (keep_end_layers) (tstamp ae83284f-7ae7-48cb-80b6-3e27691cb0cd))
  (pad "A68" thru_hole circle (at 57.35 -3.25) (size 1.2 1.2) (drill 0.7) (layers *.Cu *.Mask) (remove_unused_layers) (keep_end_layers) (tstamp 6ac831f7-a8a5-4f8d-9d93-cdefde828ff2))
  (pad "A69" thru_hole circle (at 58.35 -1.25) (size 1.2 1.2) (drill 0.7) (layers *.Cu *.Mask) (remove_unused_layers) (keep_end_layers) (tstamp 4c6d1c4f-815d-4b64-9b7b-5a23cd49842e))
  (pad "A70" thru_hole circle (at 59.35 -3.25) (size 1.2 1.2) (drill 0.7) (layers *.Cu *.Mask) (remove_unused_layers) (keep_end_layers) (tstamp a86ec654-9bc4-4d03-9047-903b5a3c9d93))
  (pad "A71" thru_hole circle (at 60.35 -1.25) (size 1.2 1.2) (drill 0.7) (layers *.Cu *.Mask) (remove_unused_layers) (keep_end_layers) (tstamp 10110213-81a0-4741-8bf8-e33ba8803ce9))
  (pad "A72" thru_hole circle (at 61.35 -3.25) (size 1.2 1.2) (drill 0.7) (layers *.Cu *.Mask) (remove_unused_layers) (keep_end_layers) (tstamp 8ca19f8f-43d8-466c-99e4-36a569cf5bc2))
  (pad "A73" thru_hole circle (at 62.35 -1.25) (size 1.2 1.2) (drill 0.7) (layers *.Cu *.Mask) (remove_unused_layers) (keep_end_layers) (tstamp 0c3779a2-dcc5-40c5-b209-9b3f5468238d))
  (pad "A74" thru_hole circle (at 63.35 -3.25) (size 1.2 1.2) (drill 0.7) (layers *.Cu *.Mask) (remove_unused_layers) (keep_end_layers) (tstamp e0825d72-c70e-4716-b694-e40a8f3b2d4b))
  (pad "A75" thru_hole circle (at 64.35 -1.25) (size 1.2 1.2) (drill 0.7) (layers *.Cu *.Mask) (remove_unused_layers) (keep_end_layers) (tstamp ff467c05-a92d-4125-a9ee-7cbe9868af7f))
  (pad "A76" thru_hole circle (at 65.35 -3.25) (size 1.2 1.2) (drill 0.7) (layers *.Cu *.Mask) (remove_unused_layers) (keep_end_layers) (tstamp e51dd2e3-d2c4-4a23-8341-c2d2163c99ee))
  (pad "A77" thru_hole circle (at 66.35 -1.25) (size 1.2 1.2) (drill 0.7) (layers *.Cu *.Mask) (remove_unused_layers) (keep_end_layers) (tstamp 756fa9bd-5982-4281-b26c-1971b44e1dc1))
  (pad "A78" thru_hole circle (at 67.35 -3.25) (size 1.2 1.2) (drill 0.7) (layers *.Cu *.Mask) (remove_unused_layers) (keep_end_layers) (tstamp 8dcc30f4-281a-4f01-af59-10ed542e427a))
  (pad "A79" thru_hole circle (at 68.35 -1.25) (size 1.2 1.2) (drill 0.7) (layers *.Cu *.Mask) (remove_unused_layers) (keep_end_layers) (tstamp 4696206a-125c-4c96-9a22-75469d7780cc))
  (pad "A80" thru_hole circle (at 69.35 -3.25) (size 1.2 1.2) (drill 0.7) (layers *.Cu *.Mask) (remove_unused_layers) (keep_end_layers) (tstamp 0a697204-577e-42a0-9c69-85abb7d13d66))
  (pad "A81" thru_hole circle (at 70.35 -1.25) (size 1.2 1.2) (drill 0.7) (layers *.Cu *.Mask) (remove_unused_layers) (keep_end_layers) (tstamp 463c4f7b-70c9-4197-a7b5-c4ca49c67c3c))
  (pad "A82" thru_hole circle (at 71.35 -3.25) (size 1.2 1.2) (drill 0.7) (layers *.Cu *.Mask) (remove_unused_layers) (keep_end_layers) (tstamp 17f40011-a472-4f70-92d4-23b07f54ed04))
  (pad "B1" thru_hole circle (at -11.65 1.25) (size 1.2 1.2) (drill 0.7) (layers *.Cu *.Mask) (remove_unused_layers) (keep_end_layers) (tstamp a1cb11e9-a0e4-43fe-b11c-b048081781d6))
  (pad "B2" thru_hole circle (at -10.65 3.25) (size 1.2 1.2) (drill 0.7) (layers *.Cu *.Mask) (remove_unused_layers) (keep_end_layers) (tstamp db3aced5-5090-4160-a102-2f2610b9a1a3))
  (pad "B3" thru_hole circle (at -9.65 1.25) (size 1.2 1.2) (drill 0.7) (layers *.Cu *.Mask) (remove_unused_layers) (keep_end_layers) (tstamp f6994d67-4ec0-40f5-ba12-438858b0a93d))
  (pad "B4" thru_hole circle (at -8.65 3.25) (size 1.2 1.2) (drill 0.7) (layers *.Cu *.Mask) (remove_unused_layers) (keep_end_layers) (tstamp dc731bc7-0be4-4c66-8ab3-db62d30fff82))
  (pad "B5" thru_hole circle (at -7.65 1.25) (size 1.2 1.2) (drill 0.7) (layers *.Cu *.Mask) (remove_unused_layers) (keep_end_layers) (tstamp e63b971d-4fef-42e8-9e44-8a911372a68d))
  (pad "B6" thru_hole circle (at -6.65 3.25) (size 1.2 1.2) (drill 0.7) (layers *.Cu *.Mask) (remove_unused_layers) (keep_end_layers) (tstamp 8900eef2-11a5-45d3-ba8b-3ffbea3c4667))
  (pad "B7" thru_hole circle (at -5.65 1.25) (size 1.2 1.2) (drill 0.7) (layers *.Cu *.Mask) (remove_unused_layers) (keep_end_layers) (tstamp 15f94c9b-0599-4e88-8c84-8051a6d08a09))
  (pad "B8" thru_hole circle (at -4.65 3.25) (size 1.2 1.2) (drill 0.7) (layers *.Cu *.Mask) (remove_unused_layers) (keep_end_layers) (tstamp 3b2671f5-1b3d-40db-9cc2-b93fd38ede46))
  (pad "B9" thru_hole circle (at -3.65 1.25) (size 1.2 1.2) (drill 0.7) (layers *.Cu *.Mask) (remove_unused_layers) (keep_end_layers) (tstamp d50dcd54-1747-42d9-999c-8dafea76c9a2))
  (pad "B10" thru_hole circle (at -2.65 3.25) (size 1.2 1.2) (drill 0.7) (layers *.Cu *.Mask) (remove_unused_layers) (keep_end_layers) (tstamp 497aba2b-1cf3-48ec-8cee-555ef414738c))
  (pad "B11" thru_hole circle (at -1.65 1.25) (size 1.2 1.2) (drill 0.7) (layers *.Cu *.Mask) (remove_unused_layers) (keep_end_layers) (tstamp 6c4f583a-faec-4766-9d0c-d124ee9a7c4a))
  (pad "B12" thru_hole circle (at 1.35 3.25) (size 1.2 1.2) (drill 0.7) (layers *.Cu *.Mask) (remove_unused_layers) (keep_end_layers) (tstamp ae738feb-e212-4703-a95a-1071a73b51cf))
  (pad "B13" thru_hole circle (at 2.35 1.25) (size 1.2 1.2) (drill 0.7) (layers *.Cu *.Mask) (remove_unused_layers) (keep_end_layers) (tstamp a90b2ffa-9d02-4a32-a9aa-5afd0dfe62e4))
  (pad "B14" thru_hole circle (at 3.35 3.25) (size 1.2 1.2) (drill 0.7) (layers *.Cu *.Mask) (remove_unused_layers) (keep_end_layers) (tstamp 54b3158b-5255-4d5b-af83-b89f3f8035bb))
  (pad "B15" thru_hole circle (at 4.35 1.25) (size 1.2 1.2) (drill 0.7) (layers *.Cu *.Mask) (remove_unused_layers) (keep_end_layers) (tstamp aace29ad-69f6-43e2-a652-a7bf24368ee9))
  (pad "B16" thru_hole circle (at 5.35 3.25) (size 1.2 1.2) (drill 0.7) (layers *.Cu *.Mask) (remove_unused_layers) (keep_end_layers) (tstamp de0dc370-0af4-493f-b2f0-f2256c225b47))
  (pad "B17" thru_hole circle (at 6.35 1.25) (size 1.2 1.2) (drill 0.7) (layers *.Cu *.Mask) (remove_unused_layers) (keep_end_layers) (tstamp 24dd0a67-d84d-47ba-9934-c91d049aad9c))
  (pad "B18" thru_hole circle (at 7.35 3.25) (size 1.2 1.2) (drill 0.7) (layers *.Cu *.Mask) (remove_unused_layers) (keep_end_layers) (tstamp 32601fda-1f2e-4d56-a570-1aaa3faafe66))
  (pad "B19" thru_hole circle (at 8.35 1.25) (size 1.2 1.2) (drill 0.7) (layers *.Cu *.Mask) (remove_unused_layers) (keep_end_layers) (tstamp a9f75bfc-cfd4-40b5-8df8-c76a58b298a4))
  (pad "B20" thru_hole circle (at 9.35 3.25) (size 1.2 1.2) (drill 0.7) (layers *.Cu *.Mask) (remove_unused_layers) (keep_end_layers) (tstamp 0b3461e1-8243-4408-a3e8-c7b4f7d8a84f))
  (pad "B21" thru_hole circle (at 10.35 1.25) (size 1.2 1.2) (drill 0.7) (layers *.Cu *.Mask) (remove_unused_layers) (keep_end_layers) (tstamp f28bdf65-4130-4997-8591-0bd70138baaf))
  (pad "B22" thru_hole circle (at 11.35 3.25) (size 1.2 1.2) (drill 0.7) (layers *.Cu *.Mask) (remove_unused_layers) (keep_end_layers) (tstamp 68361bb8-a510-4470-95d8-fdaa079d7245))
  (pad "B23" thru_hole circle (at 12.35 1.25) (size 1.2 1.2) (drill 0.7) (layers *.Cu *.Mask) (remove_unused_layers) (keep_end_layers) (tstamp ff1ce0e1-ba43-432b-a6c3-d250be48904e))
  (pad "B24" thru_hole circle (at 13.35 3.25) (size 1.2 1.2) (drill 0.7) (layers *.Cu *.Mask) (remove_unused_layers) (keep_end_layers) (tstamp 79019976-615d-4f31-9a26-eb6d01117016))
  (pad "B25" thru_hole circle (at 14.35 1.25) (size 1.2 1.2) (drill 0.7) (layers *.Cu *.Mask) (remove_unused_layers) (keep_end_layers) (tstamp ab990cd9-f273-4c91-95b4-428d3d294d28))
  (pad "B26" thru_hole circle (at 15.35 3.25) (size 1.2 1.2) (drill 0.7) (layers *.Cu *.Mask) (remove_unused_layers) (keep_end_layers) (tstamp 58fa5b65-4912-4e1f-a462-329234d788c3))
  (pad "B27" thru_hole circle (at 16.35 1.25) (size 1.2 1.2) (drill 0.7) (layers *.Cu *.Mask) (remove_unused_layers) (keep_end_layers) (tstamp 46d2f3c8-d324-4c23-b645-72580d2b8836))
  (pad "B28" thru_hole circle (at 17.35 3.25) (size 1.2 1.2) (drill 0.7) (layers *.Cu *.Mask) (remove_unused_layers) (keep_end_layers) (tstamp 85cd06ae-e696-4359-b12d-62d141156f84))
  (pad "B29" thru_hole circle (at 18.35 1.25) (size 1.2 1.2) (drill 0.7) (layers *.Cu *.Mask) (remove_unused_layers) (keep_end_layers) (tstamp 8fa6397d-ba9e-4db0-8c9e-8d8ad9830bea))
  (pad "B30" thru_hole circle (at 19.35 3.25) (size 1.2 1.2) (drill 0.7) (layers *.Cu *.Mask) (remove_unused_layers) (keep_end_layers) (tstamp a18f375d-336b-4925-8810-1339fdde025b))
  (pad "B31" thru_hole circle (at 20.35 1.25) (size 1.2 1.2) (drill 0.7) (layers *.Cu *.Mask) (remove_unused_layers) (keep_end_layers) (tstamp 038e0195-3e8a-4e1e-9c55-563200ae992e))
  (pad "B32" thru_hole circle (at 21.35 3.25) (size 1.2 1.2) (drill 0.7) (layers *.Cu *.Mask) (remove_unused_layers) (keep_end_layers) (tstamp d83b6c25-a720-4276-9fb8-8773217c2f15))
  (pad "B33" thru_hole circle (at 22.35 1.25) (size 1.2 1.2) (drill 0.7) (layers *.Cu *.Mask) (remove_unused_layers) (keep_end_layers) (tstamp db90b8b4-6c04-4b9f-90b7-b3270be9d762))
  (pad "B34" thru_hole circle (at 23.35 3.25) (size 1.2 1.2) (drill 0.7) (layers *.Cu *.Mask) (remove_unused_layers) (keep_end_layers) (tstamp 31d06c56-9af2-47e2-9ea4-927adc858bca))
  (pad "B35" thru_hole circle (at 24.35 1.25) (size 1.2 1.2) (drill 0.7) (layers *.Cu *.Mask) (remove_unused_layers) (keep_end_layers) (tstamp 503097cc-0aa4-4519-b3f7-b028a57131da))
  (pad "B36" thru_hole circle (at 25.35 3.25) (size 1.2 1.2) (drill 0.7) (layers *.Cu *.Mask) (remove_unused_layers) (keep_end_layers) (tstamp afb1f902-b24b-42c1-8f2b-7bea00834818))
  (pad "B37" thru_hole circle (at 26.35 1.25) (size 1.2 1.2) (drill 0.7) (layers *.Cu *.Mask) (remove_unused_layers) (keep_end_layers) (tstamp 6fc39a66-9662-4102-b885-e74616839c06))
  (pad "B38" thru_hole circle (at 27.35 3.25) (size 1.2 1.2) (drill 0.7) (layers *.Cu *.Mask) (remove_unused_layers) (keep_end_layers) (tstamp 94a095b0-6f62-4e93-a799-588e263496bc))
  (pad "B39" thru_hole circle (at 28.35 1.25) (size 1.2 1.2) (drill 0.7) (layers *.Cu *.Mask) (remove_unused_layers) (keep_end_layers) (tstamp 34f30412-602f-4141-9563-da13ebd80b15))
  (pad "B40" thru_hole circle (at 29.35 3.25) (size 1.2 1.2) (drill 0.7) (layers *.Cu *.Mask) (remove_unused_layers) (keep_end_layers) (tstamp 62c69777-a31e-4412-b338-d6838f91b3c2))
  (pad "B41" thru_hole circle (at 30.35 1.25) (size 1.2 1.2) (drill 0.7) (layers *.Cu *.Mask) (remove_unused_layers) (keep_end_layers) (tstamp 4faa3bb4-9ee4-4f21-8b77-3ee28553fca4))
  (pad "B42" thru_hole circle (at 31.35 3.25) (size 1.2 1.2) (drill 0.7) (layers *.Cu *.Mask) (remove_unused_layers) (keep_end_layers) (tstamp e98a29d2-7df7-4908-aca8-34615ea4c184))
  (pad "B43" thru_hole circle (at 32.35 1.25) (size 1.2 1.2) (drill 0.7) (layers *.Cu *.Mask) (remove_unused_layers) (keep_end_layers) (tstamp 3be87cc5-1aea-43e0-90b8-a0b8c2f8fecc))
  (pad "B44" thru_hole circle (at 33.35 3.25) (size 1.2 1.2) (drill 0.7) (layers *.Cu *.Mask) (remove_unused_layers) (keep_end_layers) (tstamp 5d373810-403d-4ee5-80dd-3095c6cdf9ad))
  (pad "B45" thru_hole circle (at 34.35 1.25) (size 1.2 1.2) (drill 0.7) (layers *.Cu *.Mask) (remove_unused_layers) (keep_end_layers) (tstamp 53b2a159-5f07-4ed9-a70f-0f0355e25c3e))
  (pad "B46" thru_hole circle (at 35.35 3.25) (size 1.2 1.2) (drill 0.7) (layers *.Cu *.Mask) (remove_unused_layers) (keep_end_layers) (tstamp 6e37b305-7f94-4b42-a44c-d48040a2ee6d))
  (pad "B47" thru_hole circle (at 36.35 1.25) (size 1.2 1.2) (drill 0.7) (layers *.Cu *.Mask) (remove_unused_layers) (keep_end_layers) (tstamp 0ba66a3c-76a9-4db3-a357-9fa13c6c40fa))
  (pad "B48" thru_hole circle (at 37.35 3.25) (size 1.2 1.2) (drill 0.7) (layers *.Cu *.Mask) (remove_unused_layers) (keep_end_layers) (tstamp 94391a8e-352f-4ab1-a279-c0717bc88787))
  (pad "B49" thru_hole circle (at 38.35 1.25) (size 1.2 1.2) (drill 0.7) (layers *.Cu *.Mask) (remove_unused_layers) (keep_end_layers) (tstamp 28f3668f-bf6a-466b-90ee-fec01cc388d9))
  (pad "B50" thru_hole circle (at 39.35 3.25) (size 1.2 1.2) (drill 0.7) (layers *.Cu *.Mask) (remove_unused_layers) (keep_end_layers) (tstamp 479add90-758c-4f8f-8f97-de73750a2c9d))
  (pad "B51" thru_hole circle (at 40.35 1.25) (size 1.2 1.2) (drill 0.7) (layers *.Cu *.Mask) (remove_unused_layers) (keep_end_layers) (tstamp 0849d704-eb28-458d-abd0-223c9f5ab373))
  (pad "B52" thru_hole circle (at 41.35 3.25) (size 1.2 1.2) (drill 0.7) (layers *.Cu *.Mask) (remove_unused_layers) (keep_end_layers) (tstamp 7d7d4467-81d1-449f-9bce-b4836f9d9f48))
  (pad "B53" thru_hole circle (at 42.35 1.25) (size 1.2 1.2) (drill 0.7) (layers *.Cu *.Mask) (remove_unused_layers) (keep_end_layers) (tstamp 61f842ef-b14f-4fc9-86fb-dba834259578))
  (pad "B54" thru_hole circle (at 43.35 3.25) (size 1.2 1.2) (drill 0.7) (layers *.Cu *.Mask) (remove_unused_layers) (keep_end_layers) (tstamp c2d47c3b-35f2-4596-a8a1-a5c27a9980c0))
  (pad "B55" thru_hole circle (at 44.35 1.25) (size 1.2 1.2) (drill 0.7) (layers *.Cu *.Mask) (remove_unused_layers) (keep_end_layers) (tstamp 54cd6eb8-cad4-4b44-900b-f468aa52b0bf))
  (pad "B56" thru_hole circle (at 45.35 3.25) (size 1.2 1.2) (drill 0.7) (layers *.Cu *.Mask) (remove_unused_layers) (keep_end_layers) (tstamp 07bdb19f-be0a-422f-bcf1-6a148c5e146b))
  (pad "B57" thru_hole circle (at 46.35 1.25) (size 1.2 1.2) (drill 0.7) (layers *.Cu *.Mask) (remove_unused_layers) (keep_end_layers) (tstamp cecd8349-65c5-43e1-aacd-b61cc9487999))
  (pad "B58" thru_hole circle (at 47.35 3.25) (size 1.2 1.2) (drill 0.7) (layers *.Cu *.Mask) (remove_unused_layers) (keep_end_layers) (tstamp 85a527fe-ce52-4b0d-b799-a755d5f00ee4))
  (pad "B59" thru_hole circle (at 48.35 1.25) (size 1.2 1.2) (drill 0.7) (layers *.Cu *.Mask) (remove_unused_layers) (keep_end_layers) (tstamp 70a68dba-c9c5-4c04-b616-bd435cc1ab8b))
  (pad "B60" thru_hole circle (at 49.35 3.25) (size 1.2 1.2) (drill 0.7) (layers *.Cu *.Mask) (remove_unused_layers) (keep_end_layers) (tstamp 9c6aa83b-a34e-4567-8703-2921819a1cd5))
  (pad "B61" thru_hole circle (at 50.35 1.25) (size 1.2 1.2) (drill 0.7) (layers *.Cu *.Mask) (remove_unused_layers) (keep_end_layers) (tstamp ddf8e68f-e2aa-4050-922a-b59b1f3fc04e))
  (pad "B62" thru_hole circle (at 51.35 3.25) (size 1.2 1.2) (drill 0.7) (layers *.Cu *.Mask) (remove_unused_layers) (keep_end_layers) (tstamp 58796023-30c4-4fad-b7d3-6f002bbdf003))
  (pad "B63" thru_hole circle (at 52.35 1.25) (size 1.2 1.2) (drill 0.7) (layers *.Cu *.Mask) (remove_unused_layers) (keep_end_layers) (tstamp d8f23fbd-dee7-4915-b4e0-4c743dfd808d))
  (pad "B64" thru_hole circle (at 53.35 3.25) (size 1.2 1.2) (drill 0.7) (layers *.Cu *.Mask) (remove_unused_layers) (keep_end_layers) (tstamp 59945e65-59ce-4200-8603-4b8d3cea220b))
  (pad "B65" thru_hole circle (at 54.35 1.25) (size 1.2 1.2) (drill 0.7) (layers *.Cu *.Mask) (remove_unused_layers) (keep_end_layers) (tstamp 800df8b9-6a6e-4bc4-8d69-c295f20ddb3c))
  (pad "B66" thru_hole circle (at 55.35 3.25) (size 1.2 1.2) (drill 0.7) (layers *.Cu *.Mask) (remove_unused_layers) (keep_end_layers) (tstamp 855a7345-980f-47c2-9533-bae3dd589bec))
  (pad "B67" thru_hole circle (at 56.35 1.25) (size 1.2 1.2) (drill 0.7) (layers *.Cu *.Mask) (remove_unused_layers) (keep_end_layers) (tstamp 40081374-cf6c-4901-9518-93ead562cf39))
  (pad "B68" thru_hole circle (at 57.35 3.25) (size 1.2 1.2) (drill 0.7) (layers *.Cu *.Mask) (remove_unused_layers) (keep_end_layers) (tstamp df680dd9-e60b-4ae8-b10a-c85cba9a31c3))
  (pad "B69" thru_hole circle (at 58.35 1.25) (size 1.2 1.2) (drill 0.7) (layers *.Cu *.Mask) (remove_unused_layers) (keep_end_layers) (tstamp 71d2a5e0-8be7-46a3-bafe-da4205d98bb6))
  (pad "B70" thru_hole circle (at 59.35 3.25) (size 1.2 1.2) (drill 0.7) (layers *.Cu *.Mask) (remove_unused_layers) (keep_end_layers) (tstamp d959015d-a03e-4e5c-b9b1-a3208a83ff12))
  (pad "B71" thru_hole circle (at 60.35 1.25) (size 1.2 1.2) (drill 0.7) (layers *.Cu *.Mask) (remove_unused_layers) (keep_end_layers) (tstamp b0a7b859-073e-4334-9b17-474ffa394586))
  (pad "B72" thru_hole circle (at 61.35 3.25) (size 1.2 1.2) (drill 0.7) (layers *.Cu *.Mask) (remove_unused_layers) (keep_end_layers) (tstamp b13fdc17-185a-4c72-84a5-6c89594aa3a4))
  (pad "B73" thru_hole circle (at 62.35 1.25) (size 1.2 1.2) (drill 0.7) (layers *.Cu *.Mask) (remove_unused_layers) (keep_end_layers) (tstamp 346b35b5-052e-45d6-8296-4bcb6e20c775))
  (pad "B74" thru_hole circle (at 63.35 3.25) (size 1.2 1.2) (drill 0.7) (layers *.Cu *.Mask) (remove_unused_layers) (keep_end_layers) (tstamp ea0ef664-2e35-45f6-b188-3631259e8351))
  (pad "B75" thru_hole circle (at 64.35 1.25) (size 1.2 1.2) (drill 0.7) (layers *.Cu *.Mask) (remove_unused_layers) (keep_end_layers) (tstamp 4e9fd4c7-8bb2-4667-910b-0f9c023c5d91))
  (pad "B76" thru_hole circle (at 65.35 3.25) (size 1.2 1.2) (drill 0.7) (layers *.Cu *.Mask) (remove_unused_layers) (keep_end_layers) (tstamp 09c87f64-438f-4ea8-b138-354489ef627d))
  (pad "B77" thru_hole circle (at 66.35 1.25) (size 1.2 1.2) (drill 0.7) (layers *.Cu *.Mask) (remove_unused_layers) (keep_end_layers) (tstamp 3f32cf16-bda5-43e2-a6d2-8f34e8ebc939))
  (pad "B78" thru_hole circle (at 67.35 3.25) (size 1.2 1.2) (drill 0.7) (layers *.Cu *.Mask) (remove_unused_layers) (keep_end_layers) (tstamp 49a9048c-36ef-499e-80a6-d8f6431e1dff))
  (pad "B79" thru_hole circle (at 68.35 1.25) (size 1.2 1.2) (drill 0.7) (layers *.Cu *.Mask) (remove_unused_layers) (keep_end_layers) (tstamp 5ac6a8ee-cc37-403c-8f02-1a3b29c390a0))
  (pad "B80" thru_hole circle (at 69.35 3.25) (size 1.2 1.2) (drill 0.7) (layers *.Cu *.Mask) (remove_unused_layers) (keep_end_layers) (tstamp 65a4ee8f-942b-4e88-97ab-80ba2587656b))
  (pad "B81" thru_hole circle (at 70.35 1.25) (size 1.2 1.2) (drill 0.7) (layers *.Cu *.Mask) (remove_unused_layers) (keep_end_layers) (tstamp ece4553e-7129-42d2-bbe1-daae8fbe2c32))
  (pad "B82" thru_hole circle (at 71.35 3.25) (size 1.2 1.2) (drill 0.7) (layers *.Cu *.Mask) (remove_unused_layers) (keep_end_layers) (tstamp e1c6715a-a5ef-4126-8c04-56e0d5df41b1))
  (model "${KICADLIB}/model/connector/Amphenol_10018783-10203TLF.step" hide
    (offset (xyz -0.15 0 0))
    (scale (xyz 1 1 1))
    (rotate (xyz -90 0 0))
  )
  (model "${KICADLIB}/model/connector/TE_7-1734774-3.stp"
    (offset (xyz 29.85 0 11))
    (scale (xyz 1 1 1))
    (rotate (xyz 0 0 180))
  )
)
