(footprint "PinSocket_1x06_P2.54mm_Vertical" (version 20211014) (generator pcbnew)
  (layer "F.Cu")
  (tedit 6116C94C)
  (descr "Through hole straight socket strip, 1x06, 2.54mm pitch, single row (from Kicad 4.0.7), script generated")
  (tags "Through hole socket strip THT 1x06 2.54mm single row")
  (attr through_hole)
  (fp_text reference "REF**" (at 0 -2.77) (layer "F.SilkS")
    (effects (font (size 1 1) (thickness 0.15)))
    (tstamp f5266ba9-cd70-405c-82ff-ba4a07032b6d)
  )
  (fp_text value "PinSocket_1x06_P2.54mm_Vertical" (at 0 15.47) (layer "F.Fab") hide
    (effects (font (size 1 1) (thickness 0.15)))
    (tstamp d0d50ab9-e843-4d34-b083-6b12e10f2809)
  )
  (fp_text user "^" (at -2.16 0 270 unlocked) (layer "F.SilkS")
    (effects (font (size 1 1) (thickness 0.15)))
    (tstamp 75eab826-31de-4e7e-811b-5cd030a3d4fe)
  )
  (fp_text user "${REFERENCE}" (at 0 6.35 90) (layer "F.Fab")
    (effects (font (size 1 1) (thickness 0.15)))
    (tstamp 4f323b1d-a0ab-405c-887e-91ad48975f70)
  )
  (fp_line (start -1.33 14.03) (end 1.33 14.03) (layer "F.SilkS") (width 0.12) (tstamp 16dc45dd-284b-49c4-8d67-5ec874d81c24))
  (fp_line (start 1.33 -1.33) (end 1.33 0) (layer "F.SilkS") (width 0.12) (tstamp 49fd0395-a1cd-4087-b03e-b746b216f44e))
  (fp_line (start -1.33 1.27) (end -1.33 14.03) (layer "F.SilkS") (width 0.12) (tstamp 6f67fdcb-7cac-42c8-a268-de9b6071db4f))
  (fp_line (start 1.33 1.27) (end 1.33 14.03) (layer "F.SilkS") (width 0.12) (tstamp a95abb0e-1f6e-4887-b325-932e4b949c1c))
  (fp_line (start -1.33 1.27) (end 1.33 1.27) (layer "F.SilkS") (width 0.12) (tstamp e04dabbe-20f7-4d8c-84b5-5c22de5d5bf0))
  (fp_line (start 0 -1.33) (end 1.33 -1.33) (layer "F.SilkS") (width 0.12) (tstamp f82228dd-749f-41cb-8ec7-9104f2caebd8))
  (fp_line (start 1.75 14.45) (end -1.8 14.45) (layer "F.CrtYd") (width 0.05) (tstamp 237824de-0b38-459c-8be6-c1bb099941f1))
  (fp_line (start 1.75 -1.8) (end 1.75 14.45) (layer "F.CrtYd") (width 0.05) (tstamp 37919e0d-9a63-4e74-b079-45ee9605ae2d))
  (fp_line (start -1.8 -1.8) (end 1.75 -1.8) (layer "F.CrtYd") (width 0.05) (tstamp 706d4eac-6d86-47ea-8c6f-92336a208f74))
  (fp_line (start -1.8 14.45) (end -1.8 -1.8) (layer "F.CrtYd") (width 0.05) (tstamp 95ec9ce0-ac36-4a44-878d-a20159185b15))
  (fp_line (start -1.27 13.97) (end -1.27 -1.27) (layer "F.Fab") (width 0.1) (tstamp 1e0db0a8-2153-4d8c-a1e9-2fe10b26459d))
  (fp_line (start -1.27 -1.27) (end 0.635 -1.27) (layer "F.Fab") (width 0.1) (tstamp 28d46787-900c-4c8a-ba9c-27fa84570d53))
  (fp_line (start 1.27 -0.635) (end 1.27 13.97) (layer "F.Fab") (width 0.1) (tstamp 4d1c33f8-4ad9-46cb-b3d7-7d3820366f3d))
  (fp_line (start 1.27 13.97) (end -1.27 13.97) (layer "F.Fab") (width 0.1) (tstamp 800858ce-0439-41bc-a8ad-6b8e2382165e))
  (fp_line (start 0.635 -1.27) (end 1.27 -0.635) (layer "F.Fab") (width 0.1) (tstamp c1bcad60-bb11-4373-a069-487518f17bfa))
  (pad "1" thru_hole rect (at 0 0) (size 1.7 1.7) (drill 1) (layers *.Cu *.Mask) (tstamp 3e487c67-9d71-4576-a749-aa49a1120aca))
  (pad "2" thru_hole oval (at 0 2.54) (size 1.7 1.7) (drill 1) (layers *.Cu *.Mask) (tstamp bb772217-ecf7-4b41-8155-6890cec89160))
  (pad "3" thru_hole oval (at 0 5.08) (size 1.7 1.7) (drill 1) (layers *.Cu *.Mask) (tstamp 555e6551-c590-4526-943d-e4c43dc51402))
  (pad "4" thru_hole oval (at 0 7.62) (size 1.7 1.7) (drill 1) (layers *.Cu *.Mask) (tstamp d858bf89-de31-40e2-836e-dc8f030ebf2e))
  (pad "5" thru_hole oval (at 0 10.16) (size 1.7 1.7) (drill 1) (layers *.Cu *.Mask) (tstamp 928f4549-9496-4b90-a720-0b5e39ac2523))
  (pad "6" thru_hole oval (at 0 12.7) (size 1.7 1.7) (drill 1) (layers *.Cu *.Mask) (tstamp ed7f299f-2ff2-49b4-97c7-99c274111afb))
  (model "${KICADLIB}/model/connector/PinSocket_1x06_P2.54mm_Vertical.step"
    (offset (xyz 0 0 0))
    (scale (xyz 1 1 1))
    (rotate (xyz 0 0 0))
  )
)
