(module "Vishay_VEML6040" (layer F.Cu) (tedit 5E55AC7C)
  (attr smd)
  (fp_text reference "REF**" (at 0 -1.7 unlocked) (layer F.SilkS)
    (effects (font (size 1 1) (thickness 0.15)))
  )
  (fp_text value "Vishay_VEML6040" (at 0 1.35 unlocked) (layer F.Fab) hide
    (effects (font (size 1 1) (thickness 0.15)))
  )
  (fp_line (start -1.4 0.725) (end -1.4 -0.775) (layer F.CrtYd) (width 0.05))
  (fp_line (start -1.4 0.725) (end 1.4 0.725) (layer F.CrtYd) (width 0.05))
  (fp_line (start 1.4 0.725) (end 1.4 -0.775) (layer F.CrtYd) (width 0.05))
  (fp_line (start -1.4 -0.775) (end 1.4 -0.775) (layer F.CrtYd) (width 0.05))
  (fp_text user "^" (at -2.05 -0.35 270 unlocked) (layer F.SilkS)
    (effects (font (size 1 1) (thickness 0.15)))
  )
  (fp_line (start -1 -0.1) (end -1 0.1) (layer F.SilkS) (width 0.12))
  (fp_line (start 1 0.625) (end -1 0.625) (layer F.SilkS) (width 0.12))
  (fp_line (start 1 -0.1) (end 1 0.1) (layer F.SilkS) (width 0.12))
  (fp_line (start -1 -0.625) (end 1 -0.625) (layer F.SilkS) (width 0.12))
  (pad "1" smd rect (at -0.9 -0.35) (size 0.9 0.35) (layers "F.Cu" "F.Paste" "F.Mask"))
  (pad "2" smd rect (at -0.9 0.35) (size 0.9 0.35) (layers "F.Cu" "F.Paste" "F.Mask"))
  (pad "3" smd rect (at 0.85 0.35) (size 1 0.35) (layers "F.Cu" "F.Paste" "F.Mask"))
  (pad "4" smd rect (at 0.9 -0.35) (size 0.9 0.35) (layers "F.Cu" "F.Paste" "F.Mask"))
  (model "${KICADLIB}/model/other/Vishay_VEML6040.stp"
    (offset (xyz 0 0 0.03))
    (scale (xyz 1 1 1))
    (rotate (xyz 0 0 180))
  )
)
