(footprint "SOP-8-Advance6x5" (version 20211014) (generator pcbnew)
  (layer "F.Cu")
  (tedit 63868A08)
  (attr through_hole)
  (fp_text reference "REF**" (at 0 -3.45) (layer "F.SilkS")
    (effects (font (size 1 1) (thickness 0.15)))
    (tstamp be22fe58-d324-4b04-8000-b29b954b1ddd)
  )
  (fp_text value "REF**" (at 0.175 0.125) (layer "F.Fab")
    (effects (font (size 1 1) (thickness 0.15)))
    (tstamp 6a71d25a-8234-47bd-a920-29909b7008a8)
  )
  (fp_text user "^" (at -4.2 -1.9 270 unlocked) (layer "F.SilkS")
    (effects (font (size 1 1) (thickness 0.15)))
    (tstamp ee32a2ff-aa1c-430a-ad8a-57114885e3a8)
  )
  (fp_line (start -1.05 -2.45) (end -2.95 -2.45) (layer "F.SilkS") (width 0.1) (tstamp 38328733-59be-469d-b964-e5e7fcb6c5d9))
  (fp_line (start -1.05 2.45) (end -2.95 2.45) (layer "F.SilkS") (width 0.1) (tstamp 67adf4a2-87cd-4ee8-b363-b20f65bd0b81))
  (fp_line (start 0.15 -2.45) (end 2.95 -2.45) (layer "F.SilkS") (width 0.1) (tstamp 7c4d9b73-d6cc-4d9f-9f70-9278ac01d2b0))
  (fp_line (start -2.95 0.15) (end -2.95 -0.15) (layer "F.SilkS") (width 0.1) (tstamp 956252ba-41fa-4b59-a199-22d67ed06c5e))
  (fp_line (start 2.95 1.4) (end 2.95 -1.4) (layer "F.SilkS") (width 0.1) (tstamp 9a40a768-4d9d-46f7-bcb3-f313c34232cc))
  (fp_line (start 0.15 2.45) (end 2.95 2.45) (layer "F.SilkS") (width 0.1) (tstamp b777f236-05b6-44b8-899a-229b5e029939))
  (fp_line (start -2.95 -1.45) (end -2.95 -1.1) (layer "F.SilkS") (width 0.1) (tstamp dc2c4323-4c5d-48bd-b096-d483f7c6338f))
  (fp_line (start -2.95 1.45) (end -2.95 1.1) (layer "F.SilkS") (width 0.1) (tstamp fd14e3a4-cbfb-459b-ad6d-ee2a7b8d2c37))
  (fp_poly (pts
      (xy -3.4 2.9)
      (xy 3.4 2.9)
      (xy 3.4 -2.9)
      (xy -3.4 -2.9)
    ) (layer "F.CrtYd") (width 0.05) (fill none) (tstamp b191840c-f435-4228-9160-c3a1c196d569))
  (fp_poly (pts
      (xy -2.2 -2.45)
      (xy 2.95 -2.45)
      (xy 2.95 2.45)
      (xy -2.95 2.45)
      (xy -2.95 -1.7)
    ) (layer "F.Fab") (width 0.127) (fill none) (tstamp 89dddebc-0478-48d5-8d78-b54d81c0a4c7))
  (pad "" smd roundrect (at -0.45 -2.475) (size 1 0.6) (layers "F.Cu" "F.Mask") (roundrect_rratio 0.08333333333) (tstamp 071c225a-a196-456c-947d-fbc8e27f54d1))
  (pad "" smd roundrect (at 3.025 -1.9 180) (size 0.4 0.8) (layers "F.Paste") (roundrect_rratio 0.125) (tstamp 23bfcb3b-fb89-4920-a81c-6f5c902fd096))
  (pad "" smd roundrect (at 3 1.9 180) (size 0.4 0.8) (layers "F.Paste") (roundrect_rratio 0.125) (tstamp 2fcbb274-c05d-4816-a6f8-eccea9a0829a))
  (pad "" smd roundrect (at -0.45 -2.575 270) (size 0.4 1) (layers "F.Paste") (roundrect_rratio 0.125) (tstamp 351d2ef6-08cf-4ce3-b69d-4800c90e2492))
  (pad "" smd roundrect (at -0.425 -1.15) (size 1.5 1.5) (layers "F.Paste") (roundrect_rratio 0.05) (tstamp 411a0a5a-7981-4a69-bc51-1cc6491b6539))
  (pad "" smd roundrect (at 2.8 1.9 90) (size 0.8 0.8) (layers "F.Cu" "F.Mask") (roundrect_rratio 0.0625) (tstamp 4a8afd12-82a0-434c-adfb-967d121c6f3b))
  (pad "" smd roundrect (at -0.45 2.575 270) (size 0.4 1) (layers "F.Paste") (roundrect_rratio 0.125) (tstamp 608ee213-9dce-43a7-8449-dbc58b941104))
  (pad "" smd roundrect (at 1.725 -1.15) (size 1.4 1.5) (layers "F.Paste") (roundrect_rratio 0.05) (tstamp 772c0992-aa65-459e-a452-700aea83e725))
  (pad "" smd roundrect (at 1.725 1.175) (size 1.4 1.5) (layers "F.Paste") (roundrect_rratio 0.05) (tstamp 7a567c6b-d372-443e-afa3-d955b3efd400))
  (pad "" smd roundrect (at -0.45 2.475) (size 1 0.6) (layers "F.Cu" "F.Mask") (roundrect_rratio 0.08333333333) (tstamp a8919406-84df-4e76-aa3f-3827febae144))
  (pad "" smd roundrect (at -0.425 1.175) (size 1.5 1.5) (layers "F.Paste") (roundrect_rratio 0.05) (tstamp c71f3f77-429b-4762-882c-9288db0a60d0))
  (pad "" smd roundrect (at 2.825 -1.9 90) (size 0.8 0.8) (layers "F.Cu" "F.Mask") (roundrect_rratio 0.0625) (tstamp f18b502b-85cf-4197-a62f-a7acb8ae5d66))
  (pad "1" smd roundrect (at -2.795 -1.905) (size 1 0.75) (layers "F.Cu" "F.Paste" "F.Mask") (roundrect_rratio 0.06666666667) (tstamp d44e8a45-7e2a-45fa-bf2c-cfab54891ee3))
  (pad "2" smd roundrect (at -2.795 -0.635) (size 1 0.75) (layers "F.Cu" "F.Paste" "F.Mask") (roundrect_rratio 0.06666666667) (tstamp 46d34df7-ea7c-4e29-90b9-393d9c70ce09))
  (pad "3" smd roundrect (at -2.795 0.635) (size 1 0.75) (layers "F.Cu" "F.Paste" "F.Mask") (roundrect_rratio 0.06666666667) (tstamp 6362eda1-4323-4557-8f85-13a8411f1ba4))
  (pad "4" smd roundrect (at -2.795 1.905) (size 1 0.75) (layers "F.Cu" "F.Paste" "F.Mask") (roundrect_rratio 0.06666666667) (tstamp fbcb82f9-891b-4a8c-8b65-1de65bdfbf32))
  (pad "5" smd roundrect (at 0.7 0) (size 4.1 4.6) (layers "F.Cu" "F.Mask") (roundrect_rratio 0.01219512195) (tstamp 9caffa68-7a59-4c93-9554-5df0799515cf))
  (model "${KICADLIB}/model/SO/SOP-8-Advance6x5.step"
    (offset (xyz 0 0 0))
    (scale (xyz 1 1 1))
    (rotate (xyz -90 0 90))
  )
)
