(footprint "PinHeader_1x02_P2.00mm_Vertical" (version 20211014) (generator pcbnew)
  (layer "F.Cu")
  (tedit 6116C4AC)
  (descr "Through hole straight pin header, 1x02, 2.00mm pitch, single row")
  (tags "Through hole pin header THT 1x02 2.00mm single row")
  (attr through_hole)
  (fp_text reference "REF**" (at 0 -2.06) (layer "F.SilkS")
    (effects (font (size 1 1) (thickness 0.15)))
    (tstamp bd844cdf-dbd7-4d67-8efc-ff42526c5248)
  )
  (fp_text value "PinHeader_1x02_P2.00mm_Vertical" (at 0 4.06) (layer "F.Fab") hide
    (effects (font (size 1 1) (thickness 0.15)))
    (tstamp 2729d5d2-20d0-48a1-90ee-fe597f93accd)
  )
  (fp_text user "${REFERENCE}" (at 0 1 90) (layer "F.Fab")
    (effects (font (size 1 1) (thickness 0.15)))
    (tstamp 856d77d2-8ebe-473a-bae4-ba01805d7d68)
  )
  (fp_line (start -1.06 0) (end -1.06 -1.06) (layer "F.SilkS") (width 0.12) (tstamp 23864bff-d75f-4ee5-a6da-3bb867f78613))
  (fp_line (start 1.06 1) (end 1.06 3.06) (layer "F.SilkS") (width 0.12) (tstamp 721927ee-3110-412e-87d0-755dba232de7))
  (fp_line (start -1.06 1) (end -1.06 3.06) (layer "F.SilkS") (width 0.12) (tstamp 7b85a9cd-fc86-417b-9358-ba418f605686))
  (fp_line (start -1.06 -1.06) (end 0 -1.06) (layer "F.SilkS") (width 0.12) (tstamp 9a1d3dc7-a197-4d3d-8229-fbfa9c6e60c9))
  (fp_line (start -1.06 1) (end 1.06 1) (layer "F.SilkS") (width 0.12) (tstamp b476afd1-166e-4c0f-b1a4-222e3e130193))
  (fp_line (start -1.06 3.06) (end 1.06 3.06) (layer "F.SilkS") (width 0.12) (tstamp e28c87f3-01f7-4269-a575-e589dad5aa24))
  (fp_line (start 1.5 -1.5) (end -1.5 -1.5) (layer "F.CrtYd") (width 0.05) (tstamp 3e86fdd4-cf5f-4da3-8406-96af58ad1ca7))
  (fp_line (start -1.5 3.5) (end 1.5 3.5) (layer "F.CrtYd") (width 0.05) (tstamp 4f076d9a-c93f-4bfa-b714-a3ded7361d4f))
  (fp_line (start -1.5 -1.5) (end -1.5 3.5) (layer "F.CrtYd") (width 0.05) (tstamp 9c852166-093c-413f-99aa-05d466b3fbdc))
  (fp_line (start 1.5 3.5) (end 1.5 -1.5) (layer "F.CrtYd") (width 0.05) (tstamp e9fca069-58a4-428c-9e11-5f6e0cea5c35))
  (fp_line (start 1 -1) (end 1 3) (layer "F.Fab") (width 0.1) (tstamp 0aa2fc7d-0017-4c29-8879-d362f8cb48a2))
  (fp_line (start -0.5 -1) (end 1 -1) (layer "F.Fab") (width 0.1) (tstamp 5412553b-fd31-4bac-ad28-77e6d2d7e812))
  (fp_line (start -1 -0.5) (end -0.5 -1) (layer "F.Fab") (width 0.1) (tstamp 6161a954-760b-44b5-bd7c-aad9b47ce552))
  (fp_line (start -1 3) (end -1 -0.5) (layer "F.Fab") (width 0.1) (tstamp 84018b3f-10ea-41a7-bbe8-040f94a10e89))
  (fp_line (start 1 3) (end -1 3) (layer "F.Fab") (width 0.1) (tstamp a1bbd322-1603-48ff-9981-b5505f0358c3))
  (pad "1" thru_hole rect (at 0 0) (size 1.35 1.35) (drill 0.8) (layers *.Cu *.Mask) (tstamp d9128869-cae5-4580-90d0-9f12d4a13411))
  (pad "2" thru_hole oval (at 0 2) (size 1.35 1.35) (drill 0.8) (layers *.Cu *.Mask) (tstamp 09962aa5-6495-4bff-a10b-35fd6729cea8))
  (model "${KICADLIB}/model/connector/PinHeader_1x02_P2.00mm_Vertical.step"
    (offset (xyz 0 0 0))
    (scale (xyz 1 1 1))
    (rotate (xyz 0 0 0))
  )
)
