(footprint "CAPAE400X570" (version 20221018) (generator pcbnew)
  (layer "F.Cu")
  (descr "SMT capacitor, aluminium electrolytic, 4x5.7, United Chemi-Con ")
  (tags "Capacitor Electrolytic")
  (attr smd)
  (fp_text reference "REF**" (at 0 -3.2) (layer "F.SilkS")
      (effects (font (size 1 1) (thickness 0.15)))
    (tstamp a54bff6e-8a58-42a7-9cac-545314119265)
  )
  (fp_text value "CAPAE400X570" (at 0 3.2) (layer "F.Fab") hide
      (effects (font (size 1 1) (thickness 0.15)))
    (tstamp 59524db7-dfae-4771-8c6d-fe82dbe2f88e)
  )
  (fp_text user "${REFERENCE}" (at 0 0) (layer "F.Fab")
      (effects (font (size 0.8 0.8) (thickness 0.12)))
    (tstamp 3d09c551-10ba-411e-a278-57b2f735845c)
  )
  (fp_line (start -3 -1.56) (end -2.5 -1.56)
    (stroke (width 0.12) (type solid)) (layer "F.SilkS") (tstamp 0a2bd779-99f0-45f5-9a3a-99df1c8fa09b))
  (fp_line (start -2.75 -1.81) (end -2.75 -1.31)
    (stroke (width 0.12) (type solid)) (layer "F.SilkS") (tstamp 7ebb90c0-7ce9-443c-b2ff-c7a4a5899bba))
  (fp_line (start -2.26 -1.195563) (end -2.26 -1.06)
    (stroke (width 0.12) (type solid)) (layer "F.SilkS") (tstamp d2584f27-c8b0-4adf-803c-05443c544d94))
  (fp_line (start -2.26 -1.195563) (end -1.195563 -2.26)
    (stroke (width 0.12) (type solid)) (layer "F.SilkS") (tstamp a99f5b1e-14d9-4540-b3b4-9120879d17d3))
  (fp_line (start -2.26 1.195563) (end -2.26 1.06)
    (stroke (width 0.12) (type solid)) (layer "F.SilkS") (tstamp 92401d5d-2e75-40ec-99d0-598c0671fdd1))
  (fp_line (start -2.26 1.195563) (end -1.195563 2.26)
    (stroke (width 0.12) (type solid)) (layer "F.SilkS") (tstamp 5086b55b-f659-49f7-ac69-9c40dab3bb65))
  (fp_line (start -1.195563 -2.26) (end 2.26 -2.26)
    (stroke (width 0.12) (type solid)) (layer "F.SilkS") (tstamp 6429d21d-058a-41ad-9b8d-b4a62119ea3b))
  (fp_line (start -1.195563 2.26) (end 2.26 2.26)
    (stroke (width 0.12) (type solid)) (layer "F.SilkS") (tstamp 49271058-8683-4f3d-92c7-3e5619652958))
  (fp_line (start 2.26 -2.26) (end 2.26 -1.06)
    (stroke (width 0.12) (type solid)) (layer "F.SilkS") (tstamp 12b04d77-138a-4ce5-b558-ca624b4fcd06))
  (fp_line (start 2.26 2.26) (end 2.26 1.06)
    (stroke (width 0.12) (type solid)) (layer "F.SilkS") (tstamp 59f15e16-2026-4bd5-b101-7df8e95d8cdd))
  (fp_line (start -3.35 -1.05) (end -3.35 1.05)
    (stroke (width 0.05) (type solid)) (layer "F.CrtYd") (tstamp 47d37b0f-45f4-4ca5-aa0e-8c2b35381f7d))
  (fp_line (start -3.35 1.05) (end -2.4 1.05)
    (stroke (width 0.05) (type solid)) (layer "F.CrtYd") (tstamp c1d768ff-95a8-4020-bfde-4a44baf8d1e1))
  (fp_line (start -2.4 -1.25) (end -2.4 -1.05)
    (stroke (width 0.05) (type solid)) (layer "F.CrtYd") (tstamp 4977c8ec-2b9f-4222-9e97-84aff7896e43))
  (fp_line (start -2.4 -1.25) (end -1.25 -2.4)
    (stroke (width 0.05) (type solid)) (layer "F.CrtYd") (tstamp 2d4fd9a9-497f-434e-9237-b19870815c4e))
  (fp_line (start -2.4 -1.05) (end -3.35 -1.05)
    (stroke (width 0.05) (type solid)) (layer "F.CrtYd") (tstamp bd886f67-d3f4-41ed-b3ea-0ca4fc8a4464))
  (fp_line (start -2.4 1.05) (end -2.4 1.25)
    (stroke (width 0.05) (type solid)) (layer "F.CrtYd") (tstamp 4eb857aa-e909-46c1-87b7-41438bd7d12c))
  (fp_line (start -2.4 1.25) (end -1.25 2.4)
    (stroke (width 0.05) (type solid)) (layer "F.CrtYd") (tstamp 4cdacb75-cbb1-48f6-aca4-fd0a53969222))
  (fp_line (start -1.25 -2.4) (end 2.4 -2.4)
    (stroke (width 0.05) (type solid)) (layer "F.CrtYd") (tstamp 9fac3b48-6216-42d6-acbb-777ae2f15a49))
  (fp_line (start -1.25 2.4) (end 2.4 2.4)
    (stroke (width 0.05) (type solid)) (layer "F.CrtYd") (tstamp 1bf0129c-5b0b-4d9e-861a-d2efa46eb049))
  (fp_line (start 2.4 -2.4) (end 2.4 -1.05)
    (stroke (width 0.05) (type solid)) (layer "F.CrtYd") (tstamp 812a9446-6254-48e4-9be3-a4b1d2289cb9))
  (fp_line (start 2.4 -1.05) (end 3.35 -1.05)
    (stroke (width 0.05) (type solid)) (layer "F.CrtYd") (tstamp 860b9d3e-40d3-43be-8d4a-b6b8f48becf5))
  (fp_line (start 2.4 1.05) (end 2.4 2.4)
    (stroke (width 0.05) (type solid)) (layer "F.CrtYd") (tstamp a46d9014-b307-4acd-813d-d43084234211))
  (fp_line (start 3.35 -1.05) (end 3.35 1.05)
    (stroke (width 0.05) (type solid)) (layer "F.CrtYd") (tstamp 325e12a4-9a62-4c80-8784-e6ea3644d292))
  (fp_line (start 3.35 1.05) (end 2.4 1.05)
    (stroke (width 0.05) (type solid)) (layer "F.CrtYd") (tstamp 7ee7401e-5636-4305-980a-9fb520b6a274))
  (fp_line (start -2.15 -1.15) (end -2.15 1.15)
    (stroke (width 0.1) (type solid)) (layer "F.Fab") (tstamp 068ddbae-2eda-4f16-bd38-c22e25d6e30c))
  (fp_line (start -2.15 -1.15) (end -1.15 -2.15)
    (stroke (width 0.1) (type solid)) (layer "F.Fab") (tstamp b2b5cdac-4a0f-4410-a1f9-3891e20a7386))
  (fp_line (start -2.15 1.15) (end -1.15 2.15)
    (stroke (width 0.1) (type solid)) (layer "F.Fab") (tstamp 482af17e-30f4-4227-a0a4-4ced18f46a0e))
  (fp_line (start -1.574773 -1) (end -1.174773 -1)
    (stroke (width 0.1) (type solid)) (layer "F.Fab") (tstamp 2dabb493-1981-485d-a5df-dbab7f1986e3))
  (fp_line (start -1.374773 -1.2) (end -1.374773 -0.8)
    (stroke (width 0.1) (type solid)) (layer "F.Fab") (tstamp 0cddaef3-c7e9-4a4c-8fad-c57d209beb67))
  (fp_line (start -1.15 -2.15) (end 2.15 -2.15)
    (stroke (width 0.1) (type solid)) (layer "F.Fab") (tstamp 5fb2eb18-41d1-469b-90a7-5b4d4d03fd81))
  (fp_line (start -1.15 2.15) (end 2.15 2.15)
    (stroke (width 0.1) (type solid)) (layer "F.Fab") (tstamp 9bd305ac-6aba-46f8-b48a-3a90f8011f9d))
  (fp_line (start 2.15 -2.15) (end 2.15 2.15)
    (stroke (width 0.1) (type solid)) (layer "F.Fab") (tstamp 66b56893-d164-4fe0-b331-8b07ce435ac0))
  (fp_circle (center 0 0) (end 2 0)
    (stroke (width 0.1) (type solid)) (fill none) (layer "F.Fab") (tstamp 86097241-7b41-45ba-a07b-97e34fb136a7))
  (pad "" smd roundrect (at -2.55 0) (size 1 1.4) (layers "F.Paste") (roundrect_rratio 0.05) (tstamp db3456a1-0f04-441f-b2d8-5e179359e7ee))
  (pad "" smd roundrect (at -1.075 0) (size 1 1.4) (layers "F.Paste") (roundrect_rratio 0.05) (tstamp 833cb431-7076-447d-bee1-b843d0d4555e))
  (pad "" smd roundrect (at 1.075 0.025) (size 1 1.4) (layers "F.Paste") (roundrect_rratio 0.05) (tstamp 737e1a1a-36f4-4a20-b6b3-3e9e67738310))
  (pad "" smd roundrect (at 2.55 0.025) (size 1 1.4) (layers "F.Paste") (roundrect_rratio 0.05) (tstamp ddc92325-8673-4418-a7a4-d13f0e693b9c))
  (pad "1" smd roundrect (at -1.8 0) (size 2.6 1.6) (layers "F.Cu" "F.Mask") (roundrect_rratio 0.03125) (tstamp 05084dd6-13d8-4e7e-8f26-81b20c364360))
  (pad "2" smd roundrect (at 1.8 0) (size 2.6 1.6) (layers "F.Cu" "F.Mask") (roundrect_rratio 0.03125) (tstamp bd5f977f-c1f2-4838-ba58-d360e51991f8))
  (model "${KICADLIB}/model/passive/CAPAE400X570.step"
    (offset (xyz 0 0 0))
    (scale (xyz 1 1 1))
    (rotate (xyz 0 0 0))
  )
)
