ISO-10303-21;
HEADER;
FILE_DESCRIPTION(('FreeCAD Model'),'2;1');
FILE_NAME(
'D:/Project/lib/KiCADLib/model/mechanical/Hammond_1455K1201-Screw.step',
  '2019-09-06T15:54:43',('Author'),(''),
  'Open CASCADE STEP processor 7.3','FreeCAD','Unknown');
FILE_SCHEMA(('AUTOMOTIVE_DESIGN { 1 0 10303 214 1 1 1 1 }'));
ENDSEC;
DATA;
#1 = APPLICATION_PROTOCOL_DEFINITION('international standard',
  'automotive_design',2000,#2);
#2 = APPLICATION_CONTEXT(
  'core data for automotive mechanical design processes');
#3 = SHAPE_DEFINITION_REPRESENTATION(#4,#10);
#4 = PRODUCT_DEFINITION_SHAPE('','',#5);
#5 = PRODUCT_DEFINITION('design','',#6,#9);
#6 = PRODUCT_DEFINITION_FORMATION('','',#7);
#7 = PRODUCT('1455_screw','1455_screw','',(#8));
#8 = PRODUCT_CONTEXT('',#2,'mechanical');
#9 = PRODUCT_DEFINITION_CONTEXT('part definition',#2,'design');
#10 = ADVANCED_BREP_SHAPE_REPRESENTATION('',(#11,#15),#1419);
#11 = AXIS2_PLACEMENT_3D('',#12,#13,#14);
#12 = CARTESIAN_POINT('',(0.,0.,0.));
#13 = DIRECTION('',(0.,0.,1.));
#14 = DIRECTION('',(1.,0.,-0.));
#15 = MANIFOLD_SOLID_BREP('',#16);
#16 = CLOSED_SHELL('',(#17,#159,#534,#629,#661,#887,#956,#1007,#1014,
    #1083,#1134,#1141,#1190,#1241,#1248,#1339,#1388,#1392));
#17 = ADVANCED_FACE('',(#18),#32,.F.);
#18 = FACE_BOUND('',#19,.T.);
#19 = EDGE_LOOP('',(#20,#55,#105,#133));
#20 = ORIENTED_EDGE('',*,*,#21,.F.);
#21 = EDGE_CURVE('',#22,#24,#26,.T.);
#22 = VERTEX_POINT('',#23);
#23 = CARTESIAN_POINT('',(60.550368407221,-35.5982821773,-18.01));
#24 = VERTEX_POINT('',#25);
#25 = CARTESIAN_POINT('',(60.550368407221,-35.51,-18.01));
#26 = SURFACE_CURVE('',#27,(#31,#43),.PCURVE_S1.);
#27 = LINE('',#28,#29);
#28 = CARTESIAN_POINT('',(60.550368407221,-35.5982821773,-18.01));
#29 = VECTOR('',#30,1.);
#30 = DIRECTION('',(-4.321453E-17,1.,4.321453E-17));
#31 = PCURVE('',#32,#37);
#32 = PLANE('',#33);
#33 = AXIS2_PLACEMENT_3D('',#34,#35,#36);
#34 = CARTESIAN_POINT('',(62.550368407221,-36.42421356237,-18.01));
#35 = DIRECTION('',(-2.22044604925E-16,4.321453E-17,-1.));
#36 = DIRECTION('',(-1.,-4.321453E-17,2.22044604925E-16));
#37 = DEFINITIONAL_REPRESENTATION('',(#38),#42);
#38 = LINE('',#39,#40);
#39 = CARTESIAN_POINT('',(2.,0.825931385072));
#40 = VECTOR('',#41,1.);
#41 = DIRECTION('',(0.,1.));
#42 = ( GEOMETRIC_REPRESENTATION_CONTEXT(2) 
PARAMETRIC_REPRESENTATION_CONTEXT() REPRESENTATION_CONTEXT('2D SPACE',''
  ) );
#43 = PCURVE('',#44,#49);
#44 = PLANE('',#45);
#45 = AXIS2_PLACEMENT_3D('',#46,#47,#48);
#46 = CARTESIAN_POINT('',(60.550368407221,-35.01,-17.51));
#47 = DIRECTION('',(-1.,-4.321453E-17,2.22044604925E-16));
#48 = DIRECTION('',(2.22044604925E-16,-4.321453E-17,1.));
#49 = DEFINITIONAL_REPRESENTATION('',(#50),#54);
#50 = LINE('',#51,#52);
#51 = CARTESIAN_POINT('',(-0.5,-0.588282177301));
#52 = VECTOR('',#53,1.);
#53 = DIRECTION('',(0.,1.));
#54 = ( GEOMETRIC_REPRESENTATION_CONTEXT(2) 
PARAMETRIC_REPRESENTATION_CONTEXT() REPRESENTATION_CONTEXT('2D SPACE',''
  ) );
#55 = ORIENTED_EDGE('',*,*,#56,.T.);
#56 = EDGE_CURVE('',#22,#57,#59,.T.);
#57 = VERTEX_POINT('',#58);
#58 = CARTESIAN_POINT('',(62.550368407221,-36.42421356237,-18.01));
#59 = SURFACE_CURVE('',#60,(#64,#71),.PCURVE_S1.);
#60 = ( BOUNDED_CURVE() B_SPLINE_CURVE(2,(#61,#62,#63),.UNSPECIFIED.,.F.
,.F.) B_SPLINE_CURVE_WITH_KNOTS((3,3),(1.556374069684E+04,
1.816728260725E+04),.PIECEWISE_BEZIER_KNOTS.) CURVE() 
GEOMETRIC_REPRESENTATION_ITEM() RATIONAL_B_SPLINE_CURVE((
    2.861424526656E+04,2.449611784396E+04,1.819951171345E+04)) 
REPRESENTATION_ITEM('') );
#61 = CARTESIAN_POINT('',(60.550368407221,-35.5982821773,-18.01));
#62 = CARTESIAN_POINT('',(61.137917399855,-35.87893864309,-18.01));
#63 = CARTESIAN_POINT('',(62.550368407221,-36.42421356237,-18.01));
#64 = PCURVE('',#32,#65);
#65 = DEFINITIONAL_REPRESENTATION('',(#66),#70);
#66 = ( BOUNDED_CURVE() B_SPLINE_CURVE(2,(#67,#68,#69),.UNSPECIFIED.,.F.
,.F.) B_SPLINE_CURVE_WITH_KNOTS((3,3),(1.556374069684E+04,
1.816728260725E+04),.PIECEWISE_BEZIER_KNOTS.) CURVE() 
GEOMETRIC_REPRESENTATION_ITEM() RATIONAL_B_SPLINE_CURVE((
    2.861424526656E+04,2.449611784396E+04,1.819951171345E+04)) 
REPRESENTATION_ITEM('') );
#67 = CARTESIAN_POINT('',(2.,0.825931385072));
#68 = CARTESIAN_POINT('',(1.412451007366,0.54527491928));
#69 = CARTESIAN_POINT('',(0.,0.));
#70 = ( GEOMETRIC_REPRESENTATION_CONTEXT(2) 
PARAMETRIC_REPRESENTATION_CONTEXT() REPRESENTATION_CONTEXT('2D SPACE',''
  ) );
#71 = PCURVE('',#72,#77);
#72 = CONICAL_SURFACE('',#73,1.5,0.34906585);
#73 = AXIS2_PLACEMENT_3D('',#74,#75,#76);
#74 = CARTESIAN_POINT('',(62.550368407221,-35.01,-17.51));
#75 = DIRECTION('',(1.,4.321453E-17,-2.22044604925E-16));
#76 = DIRECTION('',(-2.22044604925E-16,4.321453E-17,-1.));
#77 = DEFINITIONAL_REPRESENTATION('',(#78),#104);
#78 = B_SPLINE_CURVE_WITH_KNOTS('',3,(#79,#80,#81,#82,#83,#84,#85,#86,
    #87,#88,#89,#90,#91,#92,#93,#94,#95,#96,#97,#98,#99,#100,#101,#102,
    #103),.UNSPECIFIED.,.F.,.F.,(4,1,1,1,1,1,1,1,1,1,1,1,1,1,1,1,1,1,1,1
    ,1,1,4),(1.556374069684E+04,1.568208351095E+04,1.580042632506E+04,
    1.591876913917E+04,1.603711195328E+04,1.615545476739E+04,
    1.62737975815E+04,1.639214039561E+04,1.651048320972E+04,
    1.662882602383E+04,1.674716883794E+04,1.686551165204E+04,
    1.698385446615E+04,1.710219728026E+04,1.722054009437E+04,
    1.733888290848E+04,1.745722572259E+04,1.75755685367E+04,
    1.769391135081E+04,1.781225416492E+04,1.793059697903E+04,
    1.804893979314E+04,1.816728260725E+04),.QUASI_UNIFORM_KNOTS.);
#79 = CARTESIAN_POINT('',(5.416843716287,-2.00000000029));
#80 = CARTESIAN_POINT('',(5.410736473103,-1.984756820383));
#81 = CARTESIAN_POINT('',(5.398573772002,-1.953509142811));
#82 = CARTESIAN_POINT('',(5.380485985951,-1.90420052939));
#83 = CARTESIAN_POINT('',(5.362555421458,-1.852307029962));
#84 = CARTESIAN_POINT('',(5.344782872932,-1.797662113599));
#85 = CARTESIAN_POINT('',(5.327169032787,-1.740084991652));
#86 = CARTESIAN_POINT('',(5.309714479501,-1.679377165165));
#87 = CARTESIAN_POINT('',(5.292419684929,-1.615320773531));
#88 = CARTESIAN_POINT('',(5.275285016538,-1.547676078977));
#89 = CARTESIAN_POINT('',(5.258310741057,-1.47617873364));
#90 = CARTESIAN_POINT('',(5.24149702781,-1.400536574477));
#91 = CARTESIAN_POINT('',(5.224843952156,-1.320425915598));
#92 = CARTESIAN_POINT('',(5.208351498927,-1.235487225562));
#93 = CARTESIAN_POINT('',(5.19201956587,-1.145320073309));
#94 = CARTESIAN_POINT('',(5.175847967085,-1.049477188891));
#95 = CARTESIAN_POINT('',(5.159836436446,-0.947457468609));
#96 = CARTESIAN_POINT('',(5.143984630992,-0.838697641466));
#97 = CARTESIAN_POINT('',(5.128292134329,-0.722562504453));
#98 = CARTESIAN_POINT('',(5.112758459828,-0.598332628308));
#99 = CARTESIAN_POINT('',(5.097383054407,-0.465191806419));
#100 = CARTESIAN_POINT('',(5.082165299905,-0.322203437862));
#101 = CARTESIAN_POINT('',(5.067104523223,-0.168313196093));
#102 = CARTESIAN_POINT('',(5.057168156717,-5.75942102891E-02));
#103 = CARTESIAN_POINT('',(5.052225889839,-7.136376035393E-17));
#104 = ( GEOMETRIC_REPRESENTATION_CONTEXT(2) 
PARAMETRIC_REPRESENTATION_CONTEXT() REPRESENTATION_CONTEXT('2D SPACE',''
  ) );
#105 = ORIENTED_EDGE('',*,*,#106,.F.);
#106 = EDGE_CURVE('',#107,#57,#109,.T.);
#107 = VERTEX_POINT('',#108);
#108 = CARTESIAN_POINT('',(62.550368407221,-35.51,-18.01));
#109 = SURFACE_CURVE('',#110,(#114,#121),.PCURVE_S1.);
#110 = LINE('',#111,#112);
#111 = CARTESIAN_POINT('',(62.550368407221,-35.51,-18.01));
#112 = VECTOR('',#113,1.);
#113 = DIRECTION('',(4.321453E-17,-1.,-4.321453E-17));
#114 = PCURVE('',#32,#115);
#115 = DEFINITIONAL_REPRESENTATION('',(#116),#120);
#116 = LINE('',#117,#118);
#117 = CARTESIAN_POINT('',(0.,0.914213562373));
#118 = VECTOR('',#119,1.);
#119 = DIRECTION('',(0.,-1.));
#120 = ( GEOMETRIC_REPRESENTATION_CONTEXT(2) 
PARAMETRIC_REPRESENTATION_CONTEXT() REPRESENTATION_CONTEXT('2D SPACE',''
  ) );
#121 = PCURVE('',#122,#127);
#122 = PLANE('',#123);
#123 = AXIS2_PLACEMENT_3D('',#124,#125,#126);
#124 = CARTESIAN_POINT('',(62.550368407221,-35.01,-17.51));
#125 = DIRECTION('',(1.,4.321453E-17,-2.22044604925E-16));
#126 = DIRECTION('',(-2.22044604925E-16,4.321453E-17,-1.));
#127 = DEFINITIONAL_REPRESENTATION('',(#128),#132);
#128 = LINE('',#129,#130);
#129 = CARTESIAN_POINT('',(0.5,-0.5));
#130 = VECTOR('',#131,1.);
#131 = DIRECTION('',(0.,-1.));
#132 = ( GEOMETRIC_REPRESENTATION_CONTEXT(2) 
PARAMETRIC_REPRESENTATION_CONTEXT() REPRESENTATION_CONTEXT('2D SPACE',''
  ) );
#133 = ORIENTED_EDGE('',*,*,#134,.T.);
#134 = EDGE_CURVE('',#107,#24,#135,.T.);
#135 = SURFACE_CURVE('',#136,(#140,#147),.PCURVE_S1.);
#136 = LINE('',#137,#138);
#137 = CARTESIAN_POINT('',(62.550368407221,-35.51,-18.01));
#138 = VECTOR('',#139,1.);
#139 = DIRECTION('',(-1.,-4.321453E-17,2.22044604925E-16));
#140 = PCURVE('',#32,#141);
#141 = DEFINITIONAL_REPRESENTATION('',(#142),#146);
#142 = LINE('',#143,#144);
#143 = CARTESIAN_POINT('',(0.,0.914213562373));
#144 = VECTOR('',#145,1.);
#145 = DIRECTION('',(1.,0.));
#146 = ( GEOMETRIC_REPRESENTATION_CONTEXT(2) 
PARAMETRIC_REPRESENTATION_CONTEXT() REPRESENTATION_CONTEXT('2D SPACE',''
  ) );
#147 = PCURVE('',#148,#153);
#148 = PLANE('',#149);
#149 = AXIS2_PLACEMENT_3D('',#150,#151,#152);
#150 = CARTESIAN_POINT('',(62.550368407221,-35.51,-18.01));
#151 = DIRECTION('',(4.321453E-17,-1.,-4.321453E-17));
#152 = DIRECTION('',(1.,4.321453E-17,-2.22044604925E-16));
#153 = DEFINITIONAL_REPRESENTATION('',(#154),#158);
#154 = LINE('',#155,#156);
#155 = CARTESIAN_POINT('',(0.,0.));
#156 = VECTOR('',#157,1.);
#157 = DIRECTION('',(-1.,0.));
#158 = ( GEOMETRIC_REPRESENTATION_CONTEXT(2) 
PARAMETRIC_REPRESENTATION_CONTEXT() REPRESENTATION_CONTEXT('2D SPACE',''
  ) );
#159 = ADVANCED_FACE('',(#160,#215),#122,.T.);
#160 = FACE_BOUND('',#161,.T.);
#161 = EDGE_LOOP('',(#162,#193));
#162 = ORIENTED_EDGE('',*,*,#163,.T.);
#163 = EDGE_CURVE('',#164,#166,#168,.T.);
#164 = VERTEX_POINT('',#165);
#165 = CARTESIAN_POINT('',(62.550368407221,-35.01,-14.76));
#166 = VERTEX_POINT('',#167);
#167 = CARTESIAN_POINT('',(62.550368407221,-35.01,-20.26));
#168 = SURFACE_CURVE('',#169,(#174,#181),.PCURVE_S1.);
#169 = CIRCLE('',#170,2.75);
#170 = AXIS2_PLACEMENT_3D('',#171,#172,#173);
#171 = CARTESIAN_POINT('',(62.550368407221,-35.01,-17.51));
#172 = DIRECTION('',(1.,4.321453E-17,-2.22044604925E-16));
#173 = DIRECTION('',(-2.22044604925E-16,4.321453E-17,-1.));
#174 = PCURVE('',#122,#175);
#175 = DEFINITIONAL_REPRESENTATION('',(#176),#180);
#176 = CIRCLE('',#177,2.75);
#177 = AXIS2_PLACEMENT_2D('',#178,#179);
#178 = CARTESIAN_POINT('',(0.,0.));
#179 = DIRECTION('',(1.,0.));
#180 = ( GEOMETRIC_REPRESENTATION_CONTEXT(2) 
PARAMETRIC_REPRESENTATION_CONTEXT() REPRESENTATION_CONTEXT('2D SPACE',''
  ) );
#181 = PCURVE('',#182,#187);
#182 = CONICAL_SURFACE('',#183,2.75,0.7155849925);
#183 = AXIS2_PLACEMENT_3D('',#184,#185,#186);
#184 = CARTESIAN_POINT('',(62.550368407221,-35.01,-17.51));
#185 = DIRECTION('',(1.,4.321453E-17,-2.22044604925E-16));
#186 = DIRECTION('',(-2.22044604925E-16,4.321453E-17,-1.));
#187 = DEFINITIONAL_REPRESENTATION('',(#188),#192);
#188 = LINE('',#189,#190);
#189 = CARTESIAN_POINT('',(0.,0.));
#190 = VECTOR('',#191,1.);
#191 = DIRECTION('',(1.,0.));
#192 = ( GEOMETRIC_REPRESENTATION_CONTEXT(2) 
PARAMETRIC_REPRESENTATION_CONTEXT() REPRESENTATION_CONTEXT('2D SPACE',''
  ) );
#193 = ORIENTED_EDGE('',*,*,#194,.T.);
#194 = EDGE_CURVE('',#166,#164,#195,.T.);
#195 = SURFACE_CURVE('',#196,(#201,#208),.PCURVE_S1.);
#196 = CIRCLE('',#197,2.75);
#197 = AXIS2_PLACEMENT_3D('',#198,#199,#200);
#198 = CARTESIAN_POINT('',(62.550368407221,-35.01,-17.51));
#199 = DIRECTION('',(1.,4.321453E-17,-2.22044604925E-16));
#200 = DIRECTION('',(-2.22044604925E-16,4.321453E-17,-1.));
#201 = PCURVE('',#122,#202);
#202 = DEFINITIONAL_REPRESENTATION('',(#203),#207);
#203 = CIRCLE('',#204,2.75);
#204 = AXIS2_PLACEMENT_2D('',#205,#206);
#205 = CARTESIAN_POINT('',(0.,0.));
#206 = DIRECTION('',(1.,0.));
#207 = ( GEOMETRIC_REPRESENTATION_CONTEXT(2) 
PARAMETRIC_REPRESENTATION_CONTEXT() REPRESENTATION_CONTEXT('2D SPACE',''
  ) );
#208 = PCURVE('',#182,#209);
#209 = DEFINITIONAL_REPRESENTATION('',(#210),#214);
#210 = LINE('',#211,#212);
#211 = CARTESIAN_POINT('',(-6.28318530718,0.));
#212 = VECTOR('',#213,1.);
#213 = DIRECTION('',(1.,0.));
#214 = ( GEOMETRIC_REPRESENTATION_CONTEXT(2) 
PARAMETRIC_REPRESENTATION_CONTEXT() REPRESENTATION_CONTEXT('2D SPACE',''
  ) );
#215 = FACE_BOUND('',#216,.T.);
#216 = EDGE_LOOP('',(#217,#247,#275,#308,#336,#364,#397,#418,#419,#447,
    #475,#503));
#217 = ORIENTED_EDGE('',*,*,#218,.T.);
#218 = EDGE_CURVE('',#219,#221,#223,.T.);
#219 = VERTEX_POINT('',#220);
#220 = CARTESIAN_POINT('',(62.550368407221,-34.51,-16.09578643762));
#221 = VERTEX_POINT('',#222);
#222 = CARTESIAN_POINT('',(62.550368407221,-34.51,-17.01));
#223 = SURFACE_CURVE('',#224,(#228,#235),.PCURVE_S1.);
#224 = LINE('',#225,#226);
#225 = CARTESIAN_POINT('',(62.550368407221,-34.51,-16.09578643762));
#226 = VECTOR('',#227,1.);
#227 = DIRECTION('',(-2.22044604925E-16,4.321453E-17,-1.));
#228 = PCURVE('',#122,#229);
#229 = DEFINITIONAL_REPRESENTATION('',(#230),#234);
#230 = LINE('',#231,#232);
#231 = CARTESIAN_POINT('',(-1.414213562373,0.5));
#232 = VECTOR('',#233,1.);
#233 = DIRECTION('',(1.,0.));
#234 = ( GEOMETRIC_REPRESENTATION_CONTEXT(2) 
PARAMETRIC_REPRESENTATION_CONTEXT() REPRESENTATION_CONTEXT('2D SPACE',''
  ) );
#235 = PCURVE('',#236,#241);
#236 = PLANE('',#237);
#237 = AXIS2_PLACEMENT_3D('',#238,#239,#240);
#238 = CARTESIAN_POINT('',(62.550368407221,-34.51,-17.01));
#239 = DIRECTION('',(-4.321453E-17,1.,4.321453E-17));
#240 = DIRECTION('',(-1.,-4.321453E-17,2.22044604925E-16));
#241 = DEFINITIONAL_REPRESENTATION('',(#242),#246);
#242 = LINE('',#243,#244);
#243 = CARTESIAN_POINT('',(0.,0.914213562373));
#244 = VECTOR('',#245,1.);
#245 = DIRECTION('',(0.,-1.));
#246 = ( GEOMETRIC_REPRESENTATION_CONTEXT(2) 
PARAMETRIC_REPRESENTATION_CONTEXT() REPRESENTATION_CONTEXT('2D SPACE',''
  ) );
#247 = ORIENTED_EDGE('',*,*,#248,.T.);
#248 = EDGE_CURVE('',#221,#249,#251,.T.);
#249 = VERTEX_POINT('',#250);
#250 = CARTESIAN_POINT('',(62.550368407221,-33.59578643762,-17.01));
#251 = SURFACE_CURVE('',#252,(#256,#263),.PCURVE_S1.);
#252 = LINE('',#253,#254);
#253 = CARTESIAN_POINT('',(62.550368407221,-34.51,-17.01));
#254 = VECTOR('',#255,1.);
#255 = DIRECTION('',(-4.321453E-17,1.,4.321453E-17));
#256 = PCURVE('',#122,#257);
#257 = DEFINITIONAL_REPRESENTATION('',(#258),#262);
#258 = LINE('',#259,#260);
#259 = CARTESIAN_POINT('',(-0.5,0.5));
#260 = VECTOR('',#261,1.);
#261 = DIRECTION('',(0.,1.));
#262 = ( GEOMETRIC_REPRESENTATION_CONTEXT(2) 
PARAMETRIC_REPRESENTATION_CONTEXT() REPRESENTATION_CONTEXT('2D SPACE',''
  ) );
#263 = PCURVE('',#264,#269);
#264 = PLANE('',#265);
#265 = AXIS2_PLACEMENT_3D('',#266,#267,#268);
#266 = CARTESIAN_POINT('',(62.550368407221,-33.59578643762,-17.01));
#267 = DIRECTION('',(2.22044604925E-16,-4.321453E-17,1.));
#268 = DIRECTION('',(1.,4.321453E-17,-2.22044604925E-16));
#269 = DEFINITIONAL_REPRESENTATION('',(#270),#274);
#270 = LINE('',#271,#272);
#271 = CARTESIAN_POINT('',(0.,-0.914213562373));
#272 = VECTOR('',#273,1.);
#273 = DIRECTION('',(0.,1.));
#274 = ( GEOMETRIC_REPRESENTATION_CONTEXT(2) 
PARAMETRIC_REPRESENTATION_CONTEXT() REPRESENTATION_CONTEXT('2D SPACE',''
  ) );
#275 = ORIENTED_EDGE('',*,*,#276,.T.);
#276 = EDGE_CURVE('',#249,#277,#279,.T.);
#277 = VERTEX_POINT('',#278);
#278 = CARTESIAN_POINT('',(62.550368407221,-33.59578643762,-18.01));
#279 = SURFACE_CURVE('',#280,(#285,#296),.PCURVE_S1.);
#280 = CIRCLE('',#281,1.5);
#281 = AXIS2_PLACEMENT_3D('',#282,#283,#284);
#282 = CARTESIAN_POINT('',(62.550368407221,-35.01,-17.51));
#283 = DIRECTION('',(-1.,-4.321453E-17,2.22044604925E-16));
#284 = DIRECTION('',(-2.22044604925E-16,4.321453E-17,-1.));
#285 = PCURVE('',#122,#286);
#286 = DEFINITIONAL_REPRESENTATION('',(#287),#295);
#287 = ( BOUNDED_CURVE() B_SPLINE_CURVE(2,(#288,#289,#290,#291,#292,#293
,#294),.UNSPECIFIED.,.T.,.F.) B_SPLINE_CURVE_WITH_KNOTS((1,2,2,2,2,1),(
    -2.094395102393,0.,2.094395102393,4.188790204786,6.28318530718,
8.377580409573),.UNSPECIFIED.) CURVE() GEOMETRIC_REPRESENTATION_ITEM() 
RATIONAL_B_SPLINE_CURVE((1.,0.5,1.,0.5,1.,0.5,1.)) REPRESENTATION_ITEM(
  '') );
#288 = CARTESIAN_POINT('',(1.5,0.));
#289 = CARTESIAN_POINT('',(1.5,-2.598076211353));
#290 = CARTESIAN_POINT('',(-0.75,-1.299038105677));
#291 = CARTESIAN_POINT('',(-3.,-3.673940397442E-16));
#292 = CARTESIAN_POINT('',(-0.75,1.299038105677));
#293 = CARTESIAN_POINT('',(1.5,2.598076211353));
#294 = CARTESIAN_POINT('',(1.5,0.));
#295 = ( GEOMETRIC_REPRESENTATION_CONTEXT(2) 
PARAMETRIC_REPRESENTATION_CONTEXT() REPRESENTATION_CONTEXT('2D SPACE',''
  ) );
#296 = PCURVE('',#297,#302);
#297 = CONICAL_SURFACE('',#298,1.5,0.34906585);
#298 = AXIS2_PLACEMENT_3D('',#299,#300,#301);
#299 = CARTESIAN_POINT('',(62.550368407221,-35.01,-17.51));
#300 = DIRECTION('',(1.,4.321453E-17,-2.22044604925E-16));
#301 = DIRECTION('',(-2.22044604925E-16,4.321453E-17,-1.));
#302 = DEFINITIONAL_REPRESENTATION('',(#303),#307);
#303 = LINE('',#304,#305);
#304 = CARTESIAN_POINT('',(6.28318530718,0.));
#305 = VECTOR('',#306,1.);
#306 = DIRECTION('',(-1.,0.));
#307 = ( GEOMETRIC_REPRESENTATION_CONTEXT(2) 
PARAMETRIC_REPRESENTATION_CONTEXT() REPRESENTATION_CONTEXT('2D SPACE',''
  ) );
#308 = ORIENTED_EDGE('',*,*,#309,.T.);
#309 = EDGE_CURVE('',#277,#310,#312,.T.);
#310 = VERTEX_POINT('',#311);
#311 = CARTESIAN_POINT('',(62.550368407221,-34.51,-18.01));
#312 = SURFACE_CURVE('',#313,(#317,#324),.PCURVE_S1.);
#313 = LINE('',#314,#315);
#314 = CARTESIAN_POINT('',(62.550368407221,-33.59578643762,-18.01));
#315 = VECTOR('',#316,1.);
#316 = DIRECTION('',(4.321453E-17,-1.,-4.321453E-17));
#317 = PCURVE('',#122,#318);
#318 = DEFINITIONAL_REPRESENTATION('',(#319),#323);
#319 = LINE('',#320,#321);
#320 = CARTESIAN_POINT('',(0.5,1.414213562373));
#321 = VECTOR('',#322,1.);
#322 = DIRECTION('',(0.,-1.));
#323 = ( GEOMETRIC_REPRESENTATION_CONTEXT(2) 
PARAMETRIC_REPRESENTATION_CONTEXT() REPRESENTATION_CONTEXT('2D SPACE',''
  ) );
#324 = PCURVE('',#325,#330);
#325 = PLANE('',#326);
#326 = AXIS2_PLACEMENT_3D('',#327,#328,#329);
#327 = CARTESIAN_POINT('',(62.550368407221,-34.51,-18.01));
#328 = DIRECTION('',(-2.22044604925E-16,4.321453E-17,-1.));
#329 = DIRECTION('',(-1.,-4.321453E-17,2.22044604925E-16));
#330 = DEFINITIONAL_REPRESENTATION('',(#331),#335);
#331 = LINE('',#332,#333);
#332 = CARTESIAN_POINT('',(0.,0.914213562373));
#333 = VECTOR('',#334,1.);
#334 = DIRECTION('',(0.,-1.));
#335 = ( GEOMETRIC_REPRESENTATION_CONTEXT(2) 
PARAMETRIC_REPRESENTATION_CONTEXT() REPRESENTATION_CONTEXT('2D SPACE',''
  ) );
#336 = ORIENTED_EDGE('',*,*,#337,.T.);
#337 = EDGE_CURVE('',#310,#338,#340,.T.);
#338 = VERTEX_POINT('',#339);
#339 = CARTESIAN_POINT('',(62.550368407221,-34.51,-18.92421356237));
#340 = SURFACE_CURVE('',#341,(#345,#352),.PCURVE_S1.);
#341 = LINE('',#342,#343);
#342 = CARTESIAN_POINT('',(62.550368407221,-34.51,-18.01));
#343 = VECTOR('',#344,1.);
#344 = DIRECTION('',(-2.22044604925E-16,4.321453E-17,-1.));
#345 = PCURVE('',#122,#346);
#346 = DEFINITIONAL_REPRESENTATION('',(#347),#351);
#347 = LINE('',#348,#349);
#348 = CARTESIAN_POINT('',(0.5,0.5));
#349 = VECTOR('',#350,1.);
#350 = DIRECTION('',(1.,0.));
#351 = ( GEOMETRIC_REPRESENTATION_CONTEXT(2) 
PARAMETRIC_REPRESENTATION_CONTEXT() REPRESENTATION_CONTEXT('2D SPACE',''
  ) );
#352 = PCURVE('',#353,#358);
#353 = PLANE('',#354);
#354 = AXIS2_PLACEMENT_3D('',#355,#356,#357);
#355 = CARTESIAN_POINT('',(62.550368407221,-34.51,-18.92421356237));
#356 = DIRECTION('',(-4.321453E-17,1.,4.321453E-17));
#357 = DIRECTION('',(-1.,-4.321453E-17,2.22044604925E-16));
#358 = DEFINITIONAL_REPRESENTATION('',(#359),#363);
#359 = LINE('',#360,#361);
#360 = CARTESIAN_POINT('',(0.,0.914213562373));
#361 = VECTOR('',#362,1.);
#362 = DIRECTION('',(0.,-1.));
#363 = ( GEOMETRIC_REPRESENTATION_CONTEXT(2) 
PARAMETRIC_REPRESENTATION_CONTEXT() REPRESENTATION_CONTEXT('2D SPACE',''
  ) );
#364 = ORIENTED_EDGE('',*,*,#365,.T.);
#365 = EDGE_CURVE('',#338,#366,#368,.T.);
#366 = VERTEX_POINT('',#367);
#367 = CARTESIAN_POINT('',(62.550368407221,-35.51,-18.92421356237));
#368 = SURFACE_CURVE('',#369,(#374,#385),.PCURVE_S1.);
#369 = CIRCLE('',#370,1.5);
#370 = AXIS2_PLACEMENT_3D('',#371,#372,#373);
#371 = CARTESIAN_POINT('',(62.550368407221,-35.01,-17.51));
#372 = DIRECTION('',(-1.,-4.321453E-17,2.22044604925E-16));
#373 = DIRECTION('',(-2.22044604925E-16,4.321453E-17,-1.));
#374 = PCURVE('',#122,#375);
#375 = DEFINITIONAL_REPRESENTATION('',(#376),#384);
#376 = ( BOUNDED_CURVE() B_SPLINE_CURVE(2,(#377,#378,#379,#380,#381,#382
,#383),.UNSPECIFIED.,.T.,.F.) B_SPLINE_CURVE_WITH_KNOTS((1,2,2,2,2,1),(
    -2.094395102393,0.,2.094395102393,4.188790204786,6.28318530718,
8.377580409573),.UNSPECIFIED.) CURVE() GEOMETRIC_REPRESENTATION_ITEM() 
RATIONAL_B_SPLINE_CURVE((1.,0.5,1.,0.5,1.,0.5,1.)) REPRESENTATION_ITEM(
  '') );
#377 = CARTESIAN_POINT('',(1.5,0.));
#378 = CARTESIAN_POINT('',(1.5,-2.598076211353));
#379 = CARTESIAN_POINT('',(-0.75,-1.299038105677));
#380 = CARTESIAN_POINT('',(-3.,-3.673940397442E-16));
#381 = CARTESIAN_POINT('',(-0.75,1.299038105677));
#382 = CARTESIAN_POINT('',(1.5,2.598076211353));
#383 = CARTESIAN_POINT('',(1.5,0.));
#384 = ( GEOMETRIC_REPRESENTATION_CONTEXT(2) 
PARAMETRIC_REPRESENTATION_CONTEXT() REPRESENTATION_CONTEXT('2D SPACE',''
  ) );
#385 = PCURVE('',#386,#391);
#386 = CONICAL_SURFACE('',#387,1.5,0.34906585);
#387 = AXIS2_PLACEMENT_3D('',#388,#389,#390);
#388 = CARTESIAN_POINT('',(62.550368407221,-35.01,-17.51));
#389 = DIRECTION('',(1.,4.321453E-17,-2.22044604925E-16));
#390 = DIRECTION('',(-2.22044604925E-16,4.321453E-17,-1.));
#391 = DEFINITIONAL_REPRESENTATION('',(#392),#396);
#392 = LINE('',#393,#394);
#393 = CARTESIAN_POINT('',(6.28318530718,0.));
#394 = VECTOR('',#395,1.);
#395 = DIRECTION('',(-1.,0.));
#396 = ( GEOMETRIC_REPRESENTATION_CONTEXT(2) 
PARAMETRIC_REPRESENTATION_CONTEXT() REPRESENTATION_CONTEXT('2D SPACE',''
  ) );
#397 = ORIENTED_EDGE('',*,*,#398,.T.);
#398 = EDGE_CURVE('',#366,#107,#399,.T.);
#399 = SURFACE_CURVE('',#400,(#404,#411),.PCURVE_S1.);
#400 = LINE('',#401,#402);
#401 = CARTESIAN_POINT('',(62.550368407221,-35.51,-18.92421356237));
#402 = VECTOR('',#403,1.);
#403 = DIRECTION('',(2.22044604925E-16,-4.321453E-17,1.));
#404 = PCURVE('',#122,#405);
#405 = DEFINITIONAL_REPRESENTATION('',(#406),#410);
#406 = LINE('',#407,#408);
#407 = CARTESIAN_POINT('',(1.414213562373,-0.5));
#408 = VECTOR('',#409,1.);
#409 = DIRECTION('',(-1.,0.));
#410 = ( GEOMETRIC_REPRESENTATION_CONTEXT(2) 
PARAMETRIC_REPRESENTATION_CONTEXT() REPRESENTATION_CONTEXT('2D SPACE',''
  ) );
#411 = PCURVE('',#148,#412);
#412 = DEFINITIONAL_REPRESENTATION('',(#413),#417);
#413 = LINE('',#414,#415);
#414 = CARTESIAN_POINT('',(0.,-0.914213562373));
#415 = VECTOR('',#416,1.);
#416 = DIRECTION('',(0.,1.));
#417 = ( GEOMETRIC_REPRESENTATION_CONTEXT(2) 
PARAMETRIC_REPRESENTATION_CONTEXT() REPRESENTATION_CONTEXT('2D SPACE',''
  ) );
#418 = ORIENTED_EDGE('',*,*,#106,.T.);
#419 = ORIENTED_EDGE('',*,*,#420,.T.);
#420 = EDGE_CURVE('',#57,#421,#423,.T.);
#421 = VERTEX_POINT('',#422);
#422 = CARTESIAN_POINT('',(62.550368407221,-36.42421356237,-17.01));
#423 = SURFACE_CURVE('',#424,(#429,#440),.PCURVE_S1.);
#424 = CIRCLE('',#425,1.5);
#425 = AXIS2_PLACEMENT_3D('',#426,#427,#428);
#426 = CARTESIAN_POINT('',(62.550368407221,-35.01,-17.51));
#427 = DIRECTION('',(-1.,-4.321453E-17,2.22044604925E-16));
#428 = DIRECTION('',(-2.22044604925E-16,4.321453E-17,-1.));
#429 = PCURVE('',#122,#430);
#430 = DEFINITIONAL_REPRESENTATION('',(#431),#439);
#431 = ( BOUNDED_CURVE() B_SPLINE_CURVE(2,(#432,#433,#434,#435,#436,#437
,#438),.UNSPECIFIED.,.T.,.F.) B_SPLINE_CURVE_WITH_KNOTS((1,2,2,2,2,1),(
    -2.094395102393,0.,2.094395102393,4.188790204786,6.28318530718,
8.377580409573),.UNSPECIFIED.) CURVE() GEOMETRIC_REPRESENTATION_ITEM() 
RATIONAL_B_SPLINE_CURVE((1.,0.5,1.,0.5,1.,0.5,1.)) REPRESENTATION_ITEM(
  '') );
#432 = CARTESIAN_POINT('',(1.5,0.));
#433 = CARTESIAN_POINT('',(1.5,-2.598076211353));
#434 = CARTESIAN_POINT('',(-0.75,-1.299038105677));
#435 = CARTESIAN_POINT('',(-3.,-3.673940397442E-16));
#436 = CARTESIAN_POINT('',(-0.75,1.299038105677));
#437 = CARTESIAN_POINT('',(1.5,2.598076211353));
#438 = CARTESIAN_POINT('',(1.5,0.));
#439 = ( GEOMETRIC_REPRESENTATION_CONTEXT(2) 
PARAMETRIC_REPRESENTATION_CONTEXT() REPRESENTATION_CONTEXT('2D SPACE',''
  ) );
#440 = PCURVE('',#72,#441);
#441 = DEFINITIONAL_REPRESENTATION('',(#442),#446);
#442 = LINE('',#443,#444);
#443 = CARTESIAN_POINT('',(6.28318530718,-2.006108939358E-16));
#444 = VECTOR('',#445,1.);
#445 = DIRECTION('',(-1.,1.049970711959E-16));
#446 = ( GEOMETRIC_REPRESENTATION_CONTEXT(2) 
PARAMETRIC_REPRESENTATION_CONTEXT() REPRESENTATION_CONTEXT('2D SPACE',''
  ) );
#447 = ORIENTED_EDGE('',*,*,#448,.T.);
#448 = EDGE_CURVE('',#421,#449,#451,.T.);
#449 = VERTEX_POINT('',#450);
#450 = CARTESIAN_POINT('',(62.550368407221,-35.51,-17.01));
#451 = SURFACE_CURVE('',#452,(#456,#463),.PCURVE_S1.);
#452 = LINE('',#453,#454);
#453 = CARTESIAN_POINT('',(62.550368407221,-36.42421356237,-17.01));
#454 = VECTOR('',#455,1.);
#455 = DIRECTION('',(-4.321453E-17,1.,4.321453E-17));
#456 = PCURVE('',#122,#457);
#457 = DEFINITIONAL_REPRESENTATION('',(#458),#462);
#458 = LINE('',#459,#460);
#459 = CARTESIAN_POINT('',(-0.5,-1.414213562373));
#460 = VECTOR('',#461,1.);
#461 = DIRECTION('',(0.,1.));
#462 = ( GEOMETRIC_REPRESENTATION_CONTEXT(2) 
PARAMETRIC_REPRESENTATION_CONTEXT() REPRESENTATION_CONTEXT('2D SPACE',''
  ) );
#463 = PCURVE('',#464,#469);
#464 = PLANE('',#465);
#465 = AXIS2_PLACEMENT_3D('',#466,#467,#468);
#466 = CARTESIAN_POINT('',(62.550368407221,-35.51,-17.01));
#467 = DIRECTION('',(2.22044604925E-16,-4.321453E-17,1.));
#468 = DIRECTION('',(1.,4.321453E-17,-2.22044604925E-16));
#469 = DEFINITIONAL_REPRESENTATION('',(#470),#474);
#470 = LINE('',#471,#472);
#471 = CARTESIAN_POINT('',(0.,-0.914213562373));
#472 = VECTOR('',#473,1.);
#473 = DIRECTION('',(0.,1.));
#474 = ( GEOMETRIC_REPRESENTATION_CONTEXT(2) 
PARAMETRIC_REPRESENTATION_CONTEXT() REPRESENTATION_CONTEXT('2D SPACE',''
  ) );
#475 = ORIENTED_EDGE('',*,*,#476,.T.);
#476 = EDGE_CURVE('',#449,#477,#479,.T.);
#477 = VERTEX_POINT('',#478);
#478 = CARTESIAN_POINT('',(62.550368407221,-35.51,-16.09578643762));
#479 = SURFACE_CURVE('',#480,(#484,#491),.PCURVE_S1.);
#480 = LINE('',#481,#482);
#481 = CARTESIAN_POINT('',(62.550368407221,-35.51,-17.01));
#482 = VECTOR('',#483,1.);
#483 = DIRECTION('',(2.22044604925E-16,-4.321453E-17,1.));
#484 = PCURVE('',#122,#485);
#485 = DEFINITIONAL_REPRESENTATION('',(#486),#490);
#486 = LINE('',#487,#488);
#487 = CARTESIAN_POINT('',(-0.5,-0.5));
#488 = VECTOR('',#489,1.);
#489 = DIRECTION('',(-1.,0.));
#490 = ( GEOMETRIC_REPRESENTATION_CONTEXT(2) 
PARAMETRIC_REPRESENTATION_CONTEXT() REPRESENTATION_CONTEXT('2D SPACE',''
  ) );
#491 = PCURVE('',#492,#497);
#492 = PLANE('',#493);
#493 = AXIS2_PLACEMENT_3D('',#494,#495,#496);
#494 = CARTESIAN_POINT('',(62.550368407221,-35.51,-16.09578643762));
#495 = DIRECTION('',(4.321453E-17,-1.,-4.321453E-17));
#496 = DIRECTION('',(1.,4.321453E-17,-2.22044604925E-16));
#497 = DEFINITIONAL_REPRESENTATION('',(#498),#502);
#498 = LINE('',#499,#500);
#499 = CARTESIAN_POINT('',(0.,-0.914213562373));
#500 = VECTOR('',#501,1.);
#501 = DIRECTION('',(0.,1.));
#502 = ( GEOMETRIC_REPRESENTATION_CONTEXT(2) 
PARAMETRIC_REPRESENTATION_CONTEXT() REPRESENTATION_CONTEXT('2D SPACE',''
  ) );
#503 = ORIENTED_EDGE('',*,*,#504,.T.);
#504 = EDGE_CURVE('',#477,#219,#505,.T.);
#505 = SURFACE_CURVE('',#506,(#511,#522),.PCURVE_S1.);
#506 = CIRCLE('',#507,1.5);
#507 = AXIS2_PLACEMENT_3D('',#508,#509,#510);
#508 = CARTESIAN_POINT('',(62.550368407221,-35.01,-17.51));
#509 = DIRECTION('',(-1.,-4.321453E-17,2.22044604925E-16));
#510 = DIRECTION('',(-2.22044604925E-16,4.321453E-17,-1.));
#511 = PCURVE('',#122,#512);
#512 = DEFINITIONAL_REPRESENTATION('',(#513),#521);
#513 = ( BOUNDED_CURVE() B_SPLINE_CURVE(2,(#514,#515,#516,#517,#518,#519
,#520),.UNSPECIFIED.,.T.,.F.) B_SPLINE_CURVE_WITH_KNOTS((1,2,2,2,2,1),(
    -2.094395102393,0.,2.094395102393,4.188790204786,6.28318530718,
8.377580409573),.UNSPECIFIED.) CURVE() GEOMETRIC_REPRESENTATION_ITEM() 
RATIONAL_B_SPLINE_CURVE((1.,0.5,1.,0.5,1.,0.5,1.)) REPRESENTATION_ITEM(
  '') );
#514 = CARTESIAN_POINT('',(1.5,0.));
#515 = CARTESIAN_POINT('',(1.5,-2.598076211353));
#516 = CARTESIAN_POINT('',(-0.75,-1.299038105677));
#517 = CARTESIAN_POINT('',(-3.,-3.673940397442E-16));
#518 = CARTESIAN_POINT('',(-0.75,1.299038105677));
#519 = CARTESIAN_POINT('',(1.5,2.598076211353));
#520 = CARTESIAN_POINT('',(1.5,0.));
#521 = ( GEOMETRIC_REPRESENTATION_CONTEXT(2) 
PARAMETRIC_REPRESENTATION_CONTEXT() REPRESENTATION_CONTEXT('2D SPACE',''
  ) );
#522 = PCURVE('',#523,#528);
#523 = CONICAL_SURFACE('',#524,1.5,0.34906585);
#524 = AXIS2_PLACEMENT_3D('',#525,#526,#527);
#525 = CARTESIAN_POINT('',(62.550368407221,-35.01,-17.51));
#526 = DIRECTION('',(1.,4.321453E-17,-2.22044604925E-16));
#527 = DIRECTION('',(-2.22044604925E-16,4.321453E-17,-1.));
#528 = DEFINITIONAL_REPRESENTATION('',(#529),#533);
#529 = LINE('',#530,#531);
#530 = CARTESIAN_POINT('',(6.28318530718,-7.136376035393E-17));
#531 = VECTOR('',#532,1.);
#532 = DIRECTION('',(-1.,0.));
#533 = ( GEOMETRIC_REPRESENTATION_CONTEXT(2) 
PARAMETRIC_REPRESENTATION_CONTEXT() REPRESENTATION_CONTEXT('2D SPACE',''
  ) );
#534 = ADVANCED_FACE('',(#535),#464,.F.);
#535 = FACE_BOUND('',#536,.T.);
#536 = EDGE_LOOP('',(#537,#562,#583,#584));
#537 = ORIENTED_EDGE('',*,*,#538,.F.);
#538 = EDGE_CURVE('',#539,#541,#543,.T.);
#539 = VERTEX_POINT('',#540);
#540 = CARTESIAN_POINT('',(60.550368407221,-35.51,-17.01));
#541 = VERTEX_POINT('',#542);
#542 = CARTESIAN_POINT('',(60.550368407221,-35.5982821773,-17.01));
#543 = SURFACE_CURVE('',#544,(#548,#555),.PCURVE_S1.);
#544 = LINE('',#545,#546);
#545 = CARTESIAN_POINT('',(60.550368407221,-35.51,-17.01));
#546 = VECTOR('',#547,1.);
#547 = DIRECTION('',(4.321453E-17,-1.,-4.321453E-17));
#548 = PCURVE('',#464,#549);
#549 = DEFINITIONAL_REPRESENTATION('',(#550),#554);
#550 = LINE('',#551,#552);
#551 = CARTESIAN_POINT('',(-2.,0.));
#552 = VECTOR('',#553,1.);
#553 = DIRECTION('',(0.,-1.));
#554 = ( GEOMETRIC_REPRESENTATION_CONTEXT(2) 
PARAMETRIC_REPRESENTATION_CONTEXT() REPRESENTATION_CONTEXT('2D SPACE',''
  ) );
#555 = PCURVE('',#44,#556);
#556 = DEFINITIONAL_REPRESENTATION('',(#557),#561);
#557 = LINE('',#558,#559);
#558 = CARTESIAN_POINT('',(0.5,-0.5));
#559 = VECTOR('',#560,1.);
#560 = DIRECTION('',(0.,-1.));
#561 = ( GEOMETRIC_REPRESENTATION_CONTEXT(2) 
PARAMETRIC_REPRESENTATION_CONTEXT() REPRESENTATION_CONTEXT('2D SPACE',''
  ) );
#562 = ORIENTED_EDGE('',*,*,#563,.F.);
#563 = EDGE_CURVE('',#449,#539,#564,.T.);
#564 = SURFACE_CURVE('',#565,(#569,#576),.PCURVE_S1.);
#565 = LINE('',#566,#567);
#566 = CARTESIAN_POINT('',(62.550368407221,-35.51,-17.01));
#567 = VECTOR('',#568,1.);
#568 = DIRECTION('',(-1.,-4.321453E-17,2.22044604925E-16));
#569 = PCURVE('',#464,#570);
#570 = DEFINITIONAL_REPRESENTATION('',(#571),#575);
#571 = LINE('',#572,#573);
#572 = CARTESIAN_POINT('',(0.,0.));
#573 = VECTOR('',#574,1.);
#574 = DIRECTION('',(-1.,0.));
#575 = ( GEOMETRIC_REPRESENTATION_CONTEXT(2) 
PARAMETRIC_REPRESENTATION_CONTEXT() REPRESENTATION_CONTEXT('2D SPACE',''
  ) );
#576 = PCURVE('',#492,#577);
#577 = DEFINITIONAL_REPRESENTATION('',(#578),#582);
#578 = LINE('',#579,#580);
#579 = CARTESIAN_POINT('',(0.,-0.914213562373));
#580 = VECTOR('',#581,1.);
#581 = DIRECTION('',(-1.,0.));
#582 = ( GEOMETRIC_REPRESENTATION_CONTEXT(2) 
PARAMETRIC_REPRESENTATION_CONTEXT() REPRESENTATION_CONTEXT('2D SPACE',''
  ) );
#583 = ORIENTED_EDGE('',*,*,#448,.F.);
#584 = ORIENTED_EDGE('',*,*,#585,.T.);
#585 = EDGE_CURVE('',#421,#541,#586,.T.);
#586 = SURFACE_CURVE('',#587,(#592,#600),.PCURVE_S1.);
#587 = ( BOUNDED_CURVE() B_SPLINE_CURVE(2,(#588,#589,#590,#591),
.UNSPECIFIED.,.F.,.F.) B_SPLINE_CURVE_WITH_KNOTS((3,1,3),(
    3.116891805131E+03,4.431325321474E+03,5.72043371554E+03),
.UNSPECIFIED.) CURVE() GEOMETRIC_REPRESENTATION_ITEM() 
RATIONAL_B_SPLINE_CURVE((1.819951171342E+04,2.137843889108E+04,
2.657521043976E+04,2.861424526654E+04)) REPRESENTATION_ITEM('') );
#588 = CARTESIAN_POINT('',(62.550368407221,-36.42421356237,-17.01));
#589 = CARTESIAN_POINT('',(61.733280622368,-36.10877785974,
    -17.00999999999));
#590 = CARTESIAN_POINT('',(60.818525630308,-35.72637372277,
    -17.00999999999));
#591 = CARTESIAN_POINT('',(60.550368407221,-35.5982821773,-17.01));
#592 = PCURVE('',#464,#593);
#593 = DEFINITIONAL_REPRESENTATION('',(#594),#599);
#594 = ( BOUNDED_CURVE() B_SPLINE_CURVE(2,(#595,#596,#597,#598),
.UNSPECIFIED.,.F.,.F.) B_SPLINE_CURVE_WITH_KNOTS((3,1,3),(
    3.116891805131E+03,4.431325321474E+03,5.72043371554E+03),
.UNSPECIFIED.) CURVE() GEOMETRIC_REPRESENTATION_ITEM() 
RATIONAL_B_SPLINE_CURVE((1.819951171342E+04,2.137843889108E+04,
2.657521043976E+04,2.861424526654E+04)) REPRESENTATION_ITEM('') );
#595 = CARTESIAN_POINT('',(0.,-0.914213562373));
#596 = CARTESIAN_POINT('',(-0.817087784853,-0.598777859746));
#597 = CARTESIAN_POINT('',(-1.731842776913,-0.216373722772));
#598 = CARTESIAN_POINT('',(-2.,-8.828217730096E-02));
#599 = ( GEOMETRIC_REPRESENTATION_CONTEXT(2) 
PARAMETRIC_REPRESENTATION_CONTEXT() REPRESENTATION_CONTEXT('2D SPACE',''
  ) );
#600 = PCURVE('',#72,#601);
#601 = DEFINITIONAL_REPRESENTATION('',(#602),#628);
#602 = B_SPLINE_CURVE_WITH_KNOTS('',3,(#603,#604,#605,#606,#607,#608,
    #609,#610,#611,#612,#613,#614,#615,#616,#617,#618,#619,#620,#621,
    #622,#623,#624,#625,#626,#627),.UNSPECIFIED.,.F.,.F.,(4,1,1,1,1,1,1,
    1,1,1,1,1,1,1,1,1,1,1,1,1,1,1,4),(3.116891805131E+03,
    3.235234619241E+03,3.35357743335E+03,3.47192024746E+03,
    3.590263061569E+03,3.708605875678E+03,3.826948689788E+03,
    3.945291503897E+03,4.063634318007E+03,4.181977132116E+03,
    4.300319946226E+03,4.418662760335E+03,4.537005574445E+03,
    4.655348388554E+03,4.773691202664E+03,4.892034016773E+03,
    5.010376830883E+03,5.128719644992E+03,5.247062459102E+03,
    5.365405273211E+03,5.483748087321E+03,5.60209090143E+03,
    5.72043371554E+03),.QUASI_UNIFORM_KNOTS.);
#603 = CARTESIAN_POINT('',(4.372552070931,0.));
#604 = CARTESIAN_POINT('',(4.367609804053,-5.759421028891E-02));
#605 = CARTESIAN_POINT('',(4.357673437546,-0.168313196092));
#606 = CARTESIAN_POINT('',(4.342612660864,-0.322203437861));
#607 = CARTESIAN_POINT('',(4.327394906362,-0.465191806418));
#608 = CARTESIAN_POINT('',(4.312019500941,-0.598332628306));
#609 = CARTESIAN_POINT('',(4.296485826439,-0.722562504452));
#610 = CARTESIAN_POINT('',(4.280793329776,-0.838697641464));
#611 = CARTESIAN_POINT('',(4.264941524322,-0.947457468607));
#612 = CARTESIAN_POINT('',(4.248929993682,-1.049477188889));
#613 = CARTESIAN_POINT('',(4.232758394897,-1.145320073308));
#614 = CARTESIAN_POINT('',(4.21642646184,-1.235487225561));
#615 = CARTESIAN_POINT('',(4.199934008611,-1.320425915596));
#616 = CARTESIAN_POINT('',(4.183280932957,-1.400536574475));
#617 = CARTESIAN_POINT('',(4.166467219709,-1.476178733639));
#618 = CARTESIAN_POINT('',(4.149492944229,-1.547676078977));
#619 = CARTESIAN_POINT('',(4.132358275837,-1.61532077353));
#620 = CARTESIAN_POINT('',(4.115063481266,-1.679377165165));
#621 = CARTESIAN_POINT('',(4.09760892798,-1.740084991652));
#622 = CARTESIAN_POINT('',(4.079995087835,-1.797662113599));
#623 = CARTESIAN_POINT('',(4.062222539309,-1.852307029962));
#624 = CARTESIAN_POINT('',(4.044291974817,-1.90420052939));
#625 = CARTESIAN_POINT('',(4.026204188767,-1.953509142811));
#626 = CARTESIAN_POINT('',(4.014041487666,-1.984756820383));
#627 = CARTESIAN_POINT('',(4.007934244482,-2.00000000029));
#628 = ( GEOMETRIC_REPRESENTATION_CONTEXT(2) 
PARAMETRIC_REPRESENTATION_CONTEXT() REPRESENTATION_CONTEXT('2D SPACE',''
  ) );
#629 = ADVANCED_FACE('',(#630),#72,.F.);
#630 = FACE_BOUND('',#631,.F.);
#631 = EDGE_LOOP('',(#632,#633,#634,#635));
#632 = ORIENTED_EDGE('',*,*,#56,.T.);
#633 = ORIENTED_EDGE('',*,*,#420,.T.);
#634 = ORIENTED_EDGE('',*,*,#585,.T.);
#635 = ORIENTED_EDGE('',*,*,#636,.T.);
#636 = EDGE_CURVE('',#541,#22,#637,.T.);
#637 = SURFACE_CURVE('',#638,(#643,#650),.PCURVE_S1.);
#638 = CIRCLE('',#639,0.772059531468);
#639 = AXIS2_PLACEMENT_3D('',#640,#641,#642);
#640 = CARTESIAN_POINT('',(60.550368407221,-35.01,-17.51));
#641 = DIRECTION('',(1.,4.321453E-17,-2.22044604925E-16));
#642 = DIRECTION('',(-2.22044604925E-16,4.321453E-17,-1.));
#643 = PCURVE('',#72,#644);
#644 = DEFINITIONAL_REPRESENTATION('',(#645),#649);
#645 = LINE('',#646,#647);
#646 = CARTESIAN_POINT('',(0.,-2.00000000029));
#647 = VECTOR('',#648,1.);
#648 = DIRECTION('',(1.,0.));
#649 = ( GEOMETRIC_REPRESENTATION_CONTEXT(2) 
PARAMETRIC_REPRESENTATION_CONTEXT() REPRESENTATION_CONTEXT('2D SPACE',''
  ) );
#650 = PCURVE('',#44,#651);
#651 = DEFINITIONAL_REPRESENTATION('',(#652),#660);
#652 = ( BOUNDED_CURVE() B_SPLINE_CURVE(2,(#653,#654,#655,#656,#657,#658
,#659),.UNSPECIFIED.,.T.,.F.) B_SPLINE_CURVE_WITH_KNOTS((1,2,2,2,2,1),(
    -2.094395102393,0.,2.094395102393,4.188790204786,6.28318530718,
8.377580409573),.UNSPECIFIED.) CURVE() GEOMETRIC_REPRESENTATION_ITEM() 
RATIONAL_B_SPLINE_CURVE((1.,0.5,1.,0.5,1.,0.5,1.)) REPRESENTATION_ITEM(
  '') );
#653 = CARTESIAN_POINT('',(-0.772059531468,-8.673617E-18));
#654 = CARTESIAN_POINT('',(-0.772059531468,1.33724633497));
#655 = CARTESIAN_POINT('',(0.386029765734,0.668623167485));
#656 = CARTESIAN_POINT('',(1.544119062935,1.804264297926E-16));
#657 = CARTESIAN_POINT('',(0.386029765734,-0.668623167485));
#658 = CARTESIAN_POINT('',(-0.772059531468,-1.33724633497));
#659 = CARTESIAN_POINT('',(-0.772059531468,-8.673617E-18));
#660 = ( GEOMETRIC_REPRESENTATION_CONTEXT(2) 
PARAMETRIC_REPRESENTATION_CONTEXT() REPRESENTATION_CONTEXT('2D SPACE',''
  ) );
#661 = ADVANCED_FACE('',(#662),#44,.F.);
#662 = FACE_BOUND('',#663,.T.);
#663 = EDGE_LOOP('',(#664,#689,#717,#738,#739,#740,#741,#764,#792,#815,
    #838,#866));
#664 = ORIENTED_EDGE('',*,*,#665,.T.);
#665 = EDGE_CURVE('',#666,#668,#670,.T.);
#666 = VERTEX_POINT('',#667);
#667 = CARTESIAN_POINT('',(60.550368407221,-34.51,-17.01));
#668 = VERTEX_POINT('',#669);
#669 = CARTESIAN_POINT('',(60.550368407221,-34.51,-16.92171782269));
#670 = SURFACE_CURVE('',#671,(#675,#682),.PCURVE_S1.);
#671 = LINE('',#672,#673);
#672 = CARTESIAN_POINT('',(60.550368407221,-34.51,-17.01));
#673 = VECTOR('',#674,1.);
#674 = DIRECTION('',(2.22044604925E-16,-4.321453E-17,1.));
#675 = PCURVE('',#44,#676);
#676 = DEFINITIONAL_REPRESENTATION('',(#677),#681);
#677 = LINE('',#678,#679);
#678 = CARTESIAN_POINT('',(0.5,0.5));
#679 = VECTOR('',#680,1.);
#680 = DIRECTION('',(1.,0.));
#681 = ( GEOMETRIC_REPRESENTATION_CONTEXT(2) 
PARAMETRIC_REPRESENTATION_CONTEXT() REPRESENTATION_CONTEXT('2D SPACE',''
  ) );
#682 = PCURVE('',#236,#683);
#683 = DEFINITIONAL_REPRESENTATION('',(#684),#688);
#684 = LINE('',#685,#686);
#685 = CARTESIAN_POINT('',(2.,0.));
#686 = VECTOR('',#687,1.);
#687 = DIRECTION('',(0.,1.));
#688 = ( GEOMETRIC_REPRESENTATION_CONTEXT(2) 
PARAMETRIC_REPRESENTATION_CONTEXT() REPRESENTATION_CONTEXT('2D SPACE',''
  ) );
#689 = ORIENTED_EDGE('',*,*,#690,.T.);
#690 = EDGE_CURVE('',#668,#691,#693,.T.);
#691 = VERTEX_POINT('',#692);
#692 = CARTESIAN_POINT('',(60.550368407221,-35.51,-16.92171782269));
#693 = SURFACE_CURVE('',#694,(#699,#710),.PCURVE_S1.);
#694 = CIRCLE('',#695,0.772059531468);
#695 = AXIS2_PLACEMENT_3D('',#696,#697,#698);
#696 = CARTESIAN_POINT('',(60.550368407221,-35.01,-17.51));
#697 = DIRECTION('',(1.,4.321453E-17,-2.22044604925E-16));
#698 = DIRECTION('',(-2.22044604925E-16,4.321453E-17,-1.));
#699 = PCURVE('',#44,#700);
#700 = DEFINITIONAL_REPRESENTATION('',(#701),#709);
#701 = ( BOUNDED_CURVE() B_SPLINE_CURVE(2,(#702,#703,#704,#705,#706,#707
,#708),.UNSPECIFIED.,.T.,.F.) B_SPLINE_CURVE_WITH_KNOTS((1,2,2,2,2,1),(
    -2.094395102393,0.,2.094395102393,4.188790204786,6.28318530718,
8.377580409573),.UNSPECIFIED.) CURVE() GEOMETRIC_REPRESENTATION_ITEM() 
RATIONAL_B_SPLINE_CURVE((1.,0.5,1.,0.5,1.,0.5,1.)) REPRESENTATION_ITEM(
  '') );
#702 = CARTESIAN_POINT('',(-0.772059531468,-8.673617E-18));
#703 = CARTESIAN_POINT('',(-0.772059531468,1.33724633497));
#704 = CARTESIAN_POINT('',(0.386029765734,0.668623167485));
#705 = CARTESIAN_POINT('',(1.544119062935,1.804264297926E-16));
#706 = CARTESIAN_POINT('',(0.386029765734,-0.668623167485));
#707 = CARTESIAN_POINT('',(-0.772059531468,-1.33724633497));
#708 = CARTESIAN_POINT('',(-0.772059531468,-8.673617E-18));
#709 = ( GEOMETRIC_REPRESENTATION_CONTEXT(2) 
PARAMETRIC_REPRESENTATION_CONTEXT() REPRESENTATION_CONTEXT('2D SPACE',''
  ) );
#710 = PCURVE('',#523,#711);
#711 = DEFINITIONAL_REPRESENTATION('',(#712),#716);
#712 = LINE('',#713,#714);
#713 = CARTESIAN_POINT('',(0.,-2.00000000029));
#714 = VECTOR('',#715,1.);
#715 = DIRECTION('',(1.,0.));
#716 = ( GEOMETRIC_REPRESENTATION_CONTEXT(2) 
PARAMETRIC_REPRESENTATION_CONTEXT() REPRESENTATION_CONTEXT('2D SPACE',''
  ) );
#717 = ORIENTED_EDGE('',*,*,#718,.T.);
#718 = EDGE_CURVE('',#691,#539,#719,.T.);
#719 = SURFACE_CURVE('',#720,(#724,#731),.PCURVE_S1.);
#720 = LINE('',#721,#722);
#721 = CARTESIAN_POINT('',(60.550368407221,-35.51,-16.92171782269));
#722 = VECTOR('',#723,1.);
#723 = DIRECTION('',(-2.22044604925E-16,4.321453E-17,-1.));
#724 = PCURVE('',#44,#725);
#725 = DEFINITIONAL_REPRESENTATION('',(#726),#730);
#726 = LINE('',#727,#728);
#727 = CARTESIAN_POINT('',(0.588282177301,-0.5));
#728 = VECTOR('',#729,1.);
#729 = DIRECTION('',(-1.,0.));
#730 = ( GEOMETRIC_REPRESENTATION_CONTEXT(2) 
PARAMETRIC_REPRESENTATION_CONTEXT() REPRESENTATION_CONTEXT('2D SPACE',''
  ) );
#731 = PCURVE('',#492,#732);
#732 = DEFINITIONAL_REPRESENTATION('',(#733),#737);
#733 = LINE('',#734,#735);
#734 = CARTESIAN_POINT('',(-2.,-0.825931385072));
#735 = VECTOR('',#736,1.);
#736 = DIRECTION('',(0.,-1.));
#737 = ( GEOMETRIC_REPRESENTATION_CONTEXT(2) 
PARAMETRIC_REPRESENTATION_CONTEXT() REPRESENTATION_CONTEXT('2D SPACE',''
  ) );
#738 = ORIENTED_EDGE('',*,*,#538,.T.);
#739 = ORIENTED_EDGE('',*,*,#636,.T.);
#740 = ORIENTED_EDGE('',*,*,#21,.T.);
#741 = ORIENTED_EDGE('',*,*,#742,.T.);
#742 = EDGE_CURVE('',#24,#743,#745,.T.);
#743 = VERTEX_POINT('',#744);
#744 = CARTESIAN_POINT('',(60.550368407221,-35.51,-18.0982821773));
#745 = SURFACE_CURVE('',#746,(#750,#757),.PCURVE_S1.);
#746 = LINE('',#747,#748);
#747 = CARTESIAN_POINT('',(60.550368407221,-35.51,-18.01));
#748 = VECTOR('',#749,1.);
#749 = DIRECTION('',(-2.22044604925E-16,4.321453E-17,-1.));
#750 = PCURVE('',#44,#751);
#751 = DEFINITIONAL_REPRESENTATION('',(#752),#756);
#752 = LINE('',#753,#754);
#753 = CARTESIAN_POINT('',(-0.5,-0.5));
#754 = VECTOR('',#755,1.);
#755 = DIRECTION('',(-1.,0.));
#756 = ( GEOMETRIC_REPRESENTATION_CONTEXT(2) 
PARAMETRIC_REPRESENTATION_CONTEXT() REPRESENTATION_CONTEXT('2D SPACE',''
  ) );
#757 = PCURVE('',#148,#758);
#758 = DEFINITIONAL_REPRESENTATION('',(#759),#763);
#759 = LINE('',#760,#761);
#760 = CARTESIAN_POINT('',(-2.,0.));
#761 = VECTOR('',#762,1.);
#762 = DIRECTION('',(0.,-1.));
#763 = ( GEOMETRIC_REPRESENTATION_CONTEXT(2) 
PARAMETRIC_REPRESENTATION_CONTEXT() REPRESENTATION_CONTEXT('2D SPACE',''
  ) );
#764 = ORIENTED_EDGE('',*,*,#765,.T.);
#765 = EDGE_CURVE('',#743,#766,#768,.T.);
#766 = VERTEX_POINT('',#767);
#767 = CARTESIAN_POINT('',(60.550368407221,-34.51,-18.0982821773));
#768 = SURFACE_CURVE('',#769,(#774,#785),.PCURVE_S1.);
#769 = CIRCLE('',#770,0.772059531468);
#770 = AXIS2_PLACEMENT_3D('',#771,#772,#773);
#771 = CARTESIAN_POINT('',(60.550368407221,-35.01,-17.51));
#772 = DIRECTION('',(1.,4.321453E-17,-2.22044604925E-16));
#773 = DIRECTION('',(-2.22044604925E-16,4.321453E-17,-1.));
#774 = PCURVE('',#44,#775);
#775 = DEFINITIONAL_REPRESENTATION('',(#776),#784);
#776 = ( BOUNDED_CURVE() B_SPLINE_CURVE(2,(#777,#778,#779,#780,#781,#782
,#783),.UNSPECIFIED.,.T.,.F.) B_SPLINE_CURVE_WITH_KNOTS((1,2,2,2,2,1),(
    -2.094395102393,0.,2.094395102393,4.188790204786,6.28318530718,
8.377580409573),.UNSPECIFIED.) CURVE() GEOMETRIC_REPRESENTATION_ITEM() 
RATIONAL_B_SPLINE_CURVE((1.,0.5,1.,0.5,1.,0.5,1.)) REPRESENTATION_ITEM(
  '') );
#777 = CARTESIAN_POINT('',(-0.772059531468,-8.673617E-18));
#778 = CARTESIAN_POINT('',(-0.772059531468,1.33724633497));
#779 = CARTESIAN_POINT('',(0.386029765734,0.668623167485));
#780 = CARTESIAN_POINT('',(1.544119062935,1.804264297926E-16));
#781 = CARTESIAN_POINT('',(0.386029765734,-0.668623167485));
#782 = CARTESIAN_POINT('',(-0.772059531468,-1.33724633497));
#783 = CARTESIAN_POINT('',(-0.772059531468,-8.673617E-18));
#784 = ( GEOMETRIC_REPRESENTATION_CONTEXT(2) 
PARAMETRIC_REPRESENTATION_CONTEXT() REPRESENTATION_CONTEXT('2D SPACE',''
  ) );
#785 = PCURVE('',#386,#786);
#786 = DEFINITIONAL_REPRESENTATION('',(#787),#791);
#787 = LINE('',#788,#789);
#788 = CARTESIAN_POINT('',(-6.28318530718,-2.00000000029));
#789 = VECTOR('',#790,1.);
#790 = DIRECTION('',(1.,0.));
#791 = ( GEOMETRIC_REPRESENTATION_CONTEXT(2) 
PARAMETRIC_REPRESENTATION_CONTEXT() REPRESENTATION_CONTEXT('2D SPACE',''
  ) );
#792 = ORIENTED_EDGE('',*,*,#793,.T.);
#793 = EDGE_CURVE('',#766,#794,#796,.T.);
#794 = VERTEX_POINT('',#795);
#795 = CARTESIAN_POINT('',(60.550368407221,-34.51,-18.01));
#796 = SURFACE_CURVE('',#797,(#801,#808),.PCURVE_S1.);
#797 = LINE('',#798,#799);
#798 = CARTESIAN_POINT('',(60.550368407221,-34.51,-18.0982821773));
#799 = VECTOR('',#800,1.);
#800 = DIRECTION('',(2.22044604925E-16,-4.321453E-17,1.));
#801 = PCURVE('',#44,#802);
#802 = DEFINITIONAL_REPRESENTATION('',(#803),#807);
#803 = LINE('',#804,#805);
#804 = CARTESIAN_POINT('',(-0.588282177301,0.5));
#805 = VECTOR('',#806,1.);
#806 = DIRECTION('',(1.,0.));
#807 = ( GEOMETRIC_REPRESENTATION_CONTEXT(2) 
PARAMETRIC_REPRESENTATION_CONTEXT() REPRESENTATION_CONTEXT('2D SPACE',''
  ) );
#808 = PCURVE('',#353,#809);
#809 = DEFINITIONAL_REPRESENTATION('',(#810),#814);
#810 = LINE('',#811,#812);
#811 = CARTESIAN_POINT('',(2.,0.825931385072));
#812 = VECTOR('',#813,1.);
#813 = DIRECTION('',(0.,1.));
#814 = ( GEOMETRIC_REPRESENTATION_CONTEXT(2) 
PARAMETRIC_REPRESENTATION_CONTEXT() REPRESENTATION_CONTEXT('2D SPACE',''
  ) );
#815 = ORIENTED_EDGE('',*,*,#816,.T.);
#816 = EDGE_CURVE('',#794,#817,#819,.T.);
#817 = VERTEX_POINT('',#818);
#818 = CARTESIAN_POINT('',(60.550368407221,-34.42171782269,-18.01));
#819 = SURFACE_CURVE('',#820,(#824,#831),.PCURVE_S1.);
#820 = LINE('',#821,#822);
#821 = CARTESIAN_POINT('',(60.550368407221,-34.51,-18.01));
#822 = VECTOR('',#823,1.);
#823 = DIRECTION('',(-4.321453E-17,1.,4.321453E-17));
#824 = PCURVE('',#44,#825);
#825 = DEFINITIONAL_REPRESENTATION('',(#826),#830);
#826 = LINE('',#827,#828);
#827 = CARTESIAN_POINT('',(-0.5,0.5));
#828 = VECTOR('',#829,1.);
#829 = DIRECTION('',(0.,1.));
#830 = ( GEOMETRIC_REPRESENTATION_CONTEXT(2) 
PARAMETRIC_REPRESENTATION_CONTEXT() REPRESENTATION_CONTEXT('2D SPACE',''
  ) );
#831 = PCURVE('',#325,#832);
#832 = DEFINITIONAL_REPRESENTATION('',(#833),#837);
#833 = LINE('',#834,#835);
#834 = CARTESIAN_POINT('',(2.,0.));
#835 = VECTOR('',#836,1.);
#836 = DIRECTION('',(0.,1.));
#837 = ( GEOMETRIC_REPRESENTATION_CONTEXT(2) 
PARAMETRIC_REPRESENTATION_CONTEXT() REPRESENTATION_CONTEXT('2D SPACE',''
  ) );
#838 = ORIENTED_EDGE('',*,*,#839,.T.);
#839 = EDGE_CURVE('',#817,#840,#842,.T.);
#840 = VERTEX_POINT('',#841);
#841 = CARTESIAN_POINT('',(60.550368407221,-34.42171782269,-17.01));
#842 = SURFACE_CURVE('',#843,(#848,#859),.PCURVE_S1.);
#843 = CIRCLE('',#844,0.772059531468);
#844 = AXIS2_PLACEMENT_3D('',#845,#846,#847);
#845 = CARTESIAN_POINT('',(60.550368407221,-35.01,-17.51));
#846 = DIRECTION('',(1.,4.321453E-17,-2.22044604925E-16));
#847 = DIRECTION('',(-2.22044604925E-16,4.321453E-17,-1.));
#848 = PCURVE('',#44,#849);
#849 = DEFINITIONAL_REPRESENTATION('',(#850),#858);
#850 = ( BOUNDED_CURVE() B_SPLINE_CURVE(2,(#851,#852,#853,#854,#855,#856
,#857),.UNSPECIFIED.,.T.,.F.) B_SPLINE_CURVE_WITH_KNOTS((1,2,2,2,2,1),(
    -2.094395102393,0.,2.094395102393,4.188790204786,6.28318530718,
8.377580409573),.UNSPECIFIED.) CURVE() GEOMETRIC_REPRESENTATION_ITEM() 
RATIONAL_B_SPLINE_CURVE((1.,0.5,1.,0.5,1.,0.5,1.)) REPRESENTATION_ITEM(
  '') );
#851 = CARTESIAN_POINT('',(-0.772059531468,-8.673617E-18));
#852 = CARTESIAN_POINT('',(-0.772059531468,1.33724633497));
#853 = CARTESIAN_POINT('',(0.386029765734,0.668623167485));
#854 = CARTESIAN_POINT('',(1.544119062935,1.804264297926E-16));
#855 = CARTESIAN_POINT('',(0.386029765734,-0.668623167485));
#856 = CARTESIAN_POINT('',(-0.772059531468,-1.33724633497));
#857 = CARTESIAN_POINT('',(-0.772059531468,-8.673617E-18));
#858 = ( GEOMETRIC_REPRESENTATION_CONTEXT(2) 
PARAMETRIC_REPRESENTATION_CONTEXT() REPRESENTATION_CONTEXT('2D SPACE',''
  ) );
#859 = PCURVE('',#297,#860);
#860 = DEFINITIONAL_REPRESENTATION('',(#861),#865);
#861 = LINE('',#862,#863);
#862 = CARTESIAN_POINT('',(0.,-2.00000000029));
#863 = VECTOR('',#864,1.);
#864 = DIRECTION('',(1.,0.));
#865 = ( GEOMETRIC_REPRESENTATION_CONTEXT(2) 
PARAMETRIC_REPRESENTATION_CONTEXT() REPRESENTATION_CONTEXT('2D SPACE',''
  ) );
#866 = ORIENTED_EDGE('',*,*,#867,.T.);
#867 = EDGE_CURVE('',#840,#666,#868,.T.);
#868 = SURFACE_CURVE('',#869,(#873,#880),.PCURVE_S1.);
#869 = LINE('',#870,#871);
#870 = CARTESIAN_POINT('',(60.550368407221,-34.42171782269,-17.01));
#871 = VECTOR('',#872,1.);
#872 = DIRECTION('',(4.321453E-17,-1.,-4.321453E-17));
#873 = PCURVE('',#44,#874);
#874 = DEFINITIONAL_REPRESENTATION('',(#875),#879);
#875 = LINE('',#876,#877);
#876 = CARTESIAN_POINT('',(0.5,0.588282177301));
#877 = VECTOR('',#878,1.);
#878 = DIRECTION('',(0.,-1.));
#879 = ( GEOMETRIC_REPRESENTATION_CONTEXT(2) 
PARAMETRIC_REPRESENTATION_CONTEXT() REPRESENTATION_CONTEXT('2D SPACE',''
  ) );
#880 = PCURVE('',#264,#881);
#881 = DEFINITIONAL_REPRESENTATION('',(#882),#886);
#882 = LINE('',#883,#884);
#883 = CARTESIAN_POINT('',(-2.,-0.825931385072));
#884 = VECTOR('',#885,1.);
#885 = DIRECTION('',(0.,-1.));
#886 = ( GEOMETRIC_REPRESENTATION_CONTEXT(2) 
PARAMETRIC_REPRESENTATION_CONTEXT() REPRESENTATION_CONTEXT('2D SPACE',''
  ) );
#887 = ADVANCED_FACE('',(#888),#353,.F.);
#888 = FACE_BOUND('',#889,.T.);
#889 = EDGE_LOOP('',(#890,#891,#934,#935));
#890 = ORIENTED_EDGE('',*,*,#793,.F.);
#891 = ORIENTED_EDGE('',*,*,#892,.T.);
#892 = EDGE_CURVE('',#766,#338,#893,.T.);
#893 = SURFACE_CURVE('',#894,(#898,#905),.PCURVE_S1.);
#894 = ( BOUNDED_CURVE() B_SPLINE_CURVE(2,(#895,#896,#897),
.UNSPECIFIED.,.F.,.F.) B_SPLINE_CURVE_WITH_KNOTS((3,3),(
    1.556374069684E+04,1.816728260725E+04),.PIECEWISE_BEZIER_KNOTS.) 
CURVE() GEOMETRIC_REPRESENTATION_ITEM() RATIONAL_B_SPLINE_CURVE((
    2.861424526656E+04,2.449611784396E+04,1.819951171345E+04)) 
REPRESENTATION_ITEM('') );
#895 = CARTESIAN_POINT('',(60.550368407221,-34.51,-18.0982821773));
#896 = CARTESIAN_POINT('',(61.137917399855,-34.51,-18.37893864309));
#897 = CARTESIAN_POINT('',(62.550368407221,-34.51,-18.92421356237));
#898 = PCURVE('',#353,#899);
#899 = DEFINITIONAL_REPRESENTATION('',(#900),#904);
#900 = ( BOUNDED_CURVE() B_SPLINE_CURVE(2,(#901,#902,#903),
.UNSPECIFIED.,.F.,.F.) B_SPLINE_CURVE_WITH_KNOTS((3,3),(
    1.556374069684E+04,1.816728260725E+04),.PIECEWISE_BEZIER_KNOTS.) 
CURVE() GEOMETRIC_REPRESENTATION_ITEM() RATIONAL_B_SPLINE_CURVE((
    2.861424526656E+04,2.449611784396E+04,1.819951171345E+04)) 
REPRESENTATION_ITEM('') );
#901 = CARTESIAN_POINT('',(2.,0.825931385072));
#902 = CARTESIAN_POINT('',(1.412451007366,0.54527491928));
#903 = CARTESIAN_POINT('',(0.,0.));
#904 = ( GEOMETRIC_REPRESENTATION_CONTEXT(2) 
PARAMETRIC_REPRESENTATION_CONTEXT() REPRESENTATION_CONTEXT('2D SPACE',''
  ) );
#905 = PCURVE('',#386,#906);
#906 = DEFINITIONAL_REPRESENTATION('',(#907),#933);
#907 = B_SPLINE_CURVE_WITH_KNOTS('',3,(#908,#909,#910,#911,#912,#913,
    #914,#915,#916,#917,#918,#919,#920,#921,#922,#923,#924,#925,#926,
    #927,#928,#929,#930,#931,#932),.UNSPECIFIED.,.F.,.F.,(4,1,1,1,1,1,1,
    1,1,1,1,1,1,1,1,1,1,1,1,1,1,1,4),(1.556374069684E+04,
    1.568208351095E+04,1.580042632506E+04,1.591876913917E+04,
    1.603711195328E+04,1.615545476739E+04,1.62737975815E+04,
    1.639214039561E+04,1.651048320972E+04,1.662882602383E+04,
    1.674716883794E+04,1.686551165204E+04,1.698385446615E+04,
    1.710219728026E+04,1.722054009437E+04,1.733888290848E+04,
    1.745722572259E+04,1.75755685367E+04,1.769391135081E+04,
    1.781225416492E+04,1.793059697903E+04,1.804893979314E+04,
    1.816728260725E+04),.QUASI_UNIFORM_KNOTS.);
#908 = CARTESIAN_POINT('',(0.704454735902,-2.00000000029));
#909 = CARTESIAN_POINT('',(0.698347492718,-1.984756820383));
#910 = CARTESIAN_POINT('',(0.686184791617,-1.953509142811));
#911 = CARTESIAN_POINT('',(0.668097005566,-1.90420052939));
#912 = CARTESIAN_POINT('',(0.650166441073,-1.852307029962));
#913 = CARTESIAN_POINT('',(0.632393892547,-1.797662113599));
#914 = CARTESIAN_POINT('',(0.614780052401,-1.740084991653));
#915 = CARTESIAN_POINT('',(0.597325499115,-1.679377165165));
#916 = CARTESIAN_POINT('',(0.580030704544,-1.615320773531));
#917 = CARTESIAN_POINT('',(0.562896036152,-1.547676078977));
#918 = CARTESIAN_POINT('',(0.545921760671,-1.47617873364));
#919 = CARTESIAN_POINT('',(0.529108047424,-1.400536574477));
#920 = CARTESIAN_POINT('',(0.51245497177,-1.320425915598));
#921 = CARTESIAN_POINT('',(0.495962518541,-1.235487225562));
#922 = CARTESIAN_POINT('',(0.479630585484,-1.14532007331));
#923 = CARTESIAN_POINT('',(0.463458986699,-1.049477188891));
#924 = CARTESIAN_POINT('',(0.44744745606,-0.947457468609));
#925 = CARTESIAN_POINT('',(0.431595650606,-0.838697641466));
#926 = CARTESIAN_POINT('',(0.415903153944,-0.722562504454));
#927 = CARTESIAN_POINT('',(0.400369479442,-0.598332628308));
#928 = CARTESIAN_POINT('',(0.384994074022,-0.465191806419));
#929 = CARTESIAN_POINT('',(0.36977631952,-0.322203437862));
#930 = CARTESIAN_POINT('',(0.354715542838,-0.168313196093));
#931 = CARTESIAN_POINT('',(0.344779176332,-5.759421028911E-02));
#932 = CARTESIAN_POINT('',(0.339836909454,0.));
#933 = ( GEOMETRIC_REPRESENTATION_CONTEXT(2) 
PARAMETRIC_REPRESENTATION_CONTEXT() REPRESENTATION_CONTEXT('2D SPACE',''
  ) );
#934 = ORIENTED_EDGE('',*,*,#337,.F.);
#935 = ORIENTED_EDGE('',*,*,#936,.T.);
#936 = EDGE_CURVE('',#310,#794,#937,.T.);
#937 = SURFACE_CURVE('',#938,(#942,#949),.PCURVE_S1.);
#938 = LINE('',#939,#940);
#939 = CARTESIAN_POINT('',(62.550368407221,-34.51,-18.01));
#940 = VECTOR('',#941,1.);
#941 = DIRECTION('',(-1.,-4.321453E-17,2.22044604925E-16));
#942 = PCURVE('',#353,#943);
#943 = DEFINITIONAL_REPRESENTATION('',(#944),#948);
#944 = LINE('',#945,#946);
#945 = CARTESIAN_POINT('',(0.,0.914213562373));
#946 = VECTOR('',#947,1.);
#947 = DIRECTION('',(1.,0.));
#948 = ( GEOMETRIC_REPRESENTATION_CONTEXT(2) 
PARAMETRIC_REPRESENTATION_CONTEXT() REPRESENTATION_CONTEXT('2D SPACE',''
  ) );
#949 = PCURVE('',#325,#950);
#950 = DEFINITIONAL_REPRESENTATION('',(#951),#955);
#951 = LINE('',#952,#953);
#952 = CARTESIAN_POINT('',(0.,0.));
#953 = VECTOR('',#954,1.);
#954 = DIRECTION('',(1.,0.));
#955 = ( GEOMETRIC_REPRESENTATION_CONTEXT(2) 
PARAMETRIC_REPRESENTATION_CONTEXT() REPRESENTATION_CONTEXT('2D SPACE',''
  ) );
#956 = ADVANCED_FACE('',(#957),#148,.F.);
#957 = FACE_BOUND('',#958,.T.);
#958 = EDGE_LOOP('',(#959,#960,#961,#962));
#959 = ORIENTED_EDGE('',*,*,#742,.F.);
#960 = ORIENTED_EDGE('',*,*,#134,.F.);
#961 = ORIENTED_EDGE('',*,*,#398,.F.);
#962 = ORIENTED_EDGE('',*,*,#963,.T.);
#963 = EDGE_CURVE('',#366,#743,#964,.T.);
#964 = SURFACE_CURVE('',#965,(#970,#978),.PCURVE_S1.);
#965 = ( BOUNDED_CURVE() B_SPLINE_CURVE(2,(#966,#967,#968,#969),
.UNSPECIFIED.,.F.,.F.) B_SPLINE_CURVE_WITH_KNOTS((3,1,3),(
    3.116891805131E+03,4.431325321474E+03,5.72043371554E+03),
.UNSPECIFIED.) CURVE() GEOMETRIC_REPRESENTATION_ITEM() 
RATIONAL_B_SPLINE_CURVE((1.819951171342E+04,2.137843889108E+04,
2.657521043976E+04,2.861424526654E+04)) REPRESENTATION_ITEM('') );
#966 = CARTESIAN_POINT('',(62.550368407221,-35.51,-18.92421356237));
#967 = CARTESIAN_POINT('',(61.733280622368,-35.51,-18.60877785974));
#968 = CARTESIAN_POINT('',(60.818525630308,-35.51,-18.22637372277));
#969 = CARTESIAN_POINT('',(60.550368407221,-35.51,-18.0982821773));
#970 = PCURVE('',#148,#971);
#971 = DEFINITIONAL_REPRESENTATION('',(#972),#977);
#972 = ( BOUNDED_CURVE() B_SPLINE_CURVE(2,(#973,#974,#975,#976),
.UNSPECIFIED.,.F.,.F.) B_SPLINE_CURVE_WITH_KNOTS((3,1,3),(
    3.116891805131E+03,4.431325321474E+03,5.72043371554E+03),
.UNSPECIFIED.) CURVE() GEOMETRIC_REPRESENTATION_ITEM() 
RATIONAL_B_SPLINE_CURVE((1.819951171342E+04,2.137843889108E+04,
2.657521043976E+04,2.861424526654E+04)) REPRESENTATION_ITEM('') );
#973 = CARTESIAN_POINT('',(0.,-0.914213562373));
#974 = CARTESIAN_POINT('',(-0.817087784853,-0.598777859746));
#975 = CARTESIAN_POINT('',(-1.731842776913,-0.216373722772));
#976 = CARTESIAN_POINT('',(-2.,-8.828217730096E-02));
#977 = ( GEOMETRIC_REPRESENTATION_CONTEXT(2) 
PARAMETRIC_REPRESENTATION_CONTEXT() REPRESENTATION_CONTEXT('2D SPACE',''
  ) );
#978 = PCURVE('',#386,#979);
#979 = DEFINITIONAL_REPRESENTATION('',(#980),#1006);
#980 = B_SPLINE_CURVE_WITH_KNOTS('',3,(#981,#982,#983,#984,#985,#986,
    #987,#988,#989,#990,#991,#992,#993,#994,#995,#996,#997,#998,#999,
    #1000,#1001,#1002,#1003,#1004,#1005),.UNSPECIFIED.,.F.,.F.,(4,1,1,1,
    1,1,1,1,1,1,1,1,1,1,1,1,1,1,1,1,1,1,4),(3.116891805131E+03,
    3.235234619241E+03,3.35357743335E+03,3.47192024746E+03,
    3.590263061569E+03,3.708605875678E+03,3.826948689788E+03,
    3.945291503897E+03,4.063634318007E+03,4.181977132116E+03,
    4.300319946226E+03,4.418662760335E+03,4.537005574445E+03,
    4.655348388554E+03,4.773691202664E+03,4.892034016773E+03,
    5.010376830883E+03,5.128719644992E+03,5.247062459102E+03,
    5.365405273211E+03,5.483748087321E+03,5.60209090143E+03,
    5.72043371554E+03),.QUASI_UNIFORM_KNOTS.);
#981 = CARTESIAN_POINT('',(-0.339836909454,0.));
#982 = CARTESIAN_POINT('',(-0.344779176332,-5.759421028892E-02));
#983 = CARTESIAN_POINT('',(-0.354715542838,-0.168313196092));
#984 = CARTESIAN_POINT('',(-0.36977631952,-0.322203437861));
#985 = CARTESIAN_POINT('',(-0.384994074022,-0.465191806418));
#986 = CARTESIAN_POINT('',(-0.400369479443,-0.598332628306));
#987 = CARTESIAN_POINT('',(-0.415903153944,-0.722562504452));
#988 = CARTESIAN_POINT('',(-0.431595650607,-0.838697641465));
#989 = CARTESIAN_POINT('',(-0.447447456061,-0.947457468607));
#990 = CARTESIAN_POINT('',(-0.4634589867,-1.04947718889));
#991 = CARTESIAN_POINT('',(-0.479630585486,-1.145320073308));
#992 = CARTESIAN_POINT('',(-0.495962518542,-1.235487225561));
#993 = CARTESIAN_POINT('',(-0.512454971772,-1.320425915597));
#994 = CARTESIAN_POINT('',(-0.529108047426,-1.400536574476));
#995 = CARTESIAN_POINT('',(-0.545921760673,-1.476178733639));
#996 = CARTESIAN_POINT('',(-0.562896036154,-1.547676078977));
#997 = CARTESIAN_POINT('',(-0.580030704545,-1.615320773531));
#998 = CARTESIAN_POINT('',(-0.597325499117,-1.679377165165));
#999 = CARTESIAN_POINT('',(-0.614780052403,-1.740084991653));
#1000 = CARTESIAN_POINT('',(-0.632393892548,-1.797662113599));
#1001 = CARTESIAN_POINT('',(-0.650166441074,-1.852307029962));
#1002 = CARTESIAN_POINT('',(-0.668097005567,-1.90420052939));
#1003 = CARTESIAN_POINT('',(-0.686184791617,-1.953509142811));
#1004 = CARTESIAN_POINT('',(-0.698347492718,-1.984756820383));
#1005 = CARTESIAN_POINT('',(-0.704454735902,-2.00000000029));
#1006 = ( GEOMETRIC_REPRESENTATION_CONTEXT(2) 
PARAMETRIC_REPRESENTATION_CONTEXT() REPRESENTATION_CONTEXT('2D SPACE',''
  ) );
#1007 = ADVANCED_FACE('',(#1008),#386,.F.);
#1008 = FACE_BOUND('',#1009,.F.);
#1009 = EDGE_LOOP('',(#1010,#1011,#1012,#1013));
#1010 = ORIENTED_EDGE('',*,*,#892,.T.);
#1011 = ORIENTED_EDGE('',*,*,#365,.T.);
#1012 = ORIENTED_EDGE('',*,*,#963,.T.);
#1013 = ORIENTED_EDGE('',*,*,#765,.T.);
#1014 = ADVANCED_FACE('',(#1015),#264,.F.);
#1015 = FACE_BOUND('',#1016,.T.);
#1016 = EDGE_LOOP('',(#1017,#1018,#1061,#1062));
#1017 = ORIENTED_EDGE('',*,*,#867,.F.);
#1018 = ORIENTED_EDGE('',*,*,#1019,.T.);
#1019 = EDGE_CURVE('',#840,#249,#1020,.T.);
#1020 = SURFACE_CURVE('',#1021,(#1025,#1032),.PCURVE_S1.);
#1021 = ( BOUNDED_CURVE() B_SPLINE_CURVE(2,(#1022,#1023,#1024),
.UNSPECIFIED.,.F.,.F.) B_SPLINE_CURVE_WITH_KNOTS((3,3),(
    1.556374069684E+04,1.816728260725E+04),.PIECEWISE_BEZIER_KNOTS.) 
CURVE() GEOMETRIC_REPRESENTATION_ITEM() RATIONAL_B_SPLINE_CURVE((
    2.861424526656E+04,2.449611784396E+04,1.819951171345E+04)) 
REPRESENTATION_ITEM('') );
#1022 = CARTESIAN_POINT('',(60.550368407221,-34.42171782269,-17.01));
#1023 = CARTESIAN_POINT('',(61.137917399855,-34.1410613569,
    -17.00999999999));
#1024 = CARTESIAN_POINT('',(62.550368407221,-33.59578643762,-17.01));
#1025 = PCURVE('',#264,#1026);
#1026 = DEFINITIONAL_REPRESENTATION('',(#1027),#1031);
#1027 = ( BOUNDED_CURVE() B_SPLINE_CURVE(2,(#1028,#1029,#1030),
.UNSPECIFIED.,.F.,.F.) B_SPLINE_CURVE_WITH_KNOTS((3,3),(
    1.556374069684E+04,1.816728260725E+04),.PIECEWISE_BEZIER_KNOTS.) 
CURVE() GEOMETRIC_REPRESENTATION_ITEM() RATIONAL_B_SPLINE_CURVE((
    2.861424526656E+04,2.449611784396E+04,1.819951171345E+04)) 
REPRESENTATION_ITEM('') );
#1028 = CARTESIAN_POINT('',(-2.,-0.825931385072));
#1029 = CARTESIAN_POINT('',(-1.412451007366,-0.54527491928));
#1030 = CARTESIAN_POINT('',(0.,0.));
#1031 = ( GEOMETRIC_REPRESENTATION_CONTEXT(2) 
PARAMETRIC_REPRESENTATION_CONTEXT() REPRESENTATION_CONTEXT('2D SPACE',''
  ) );
#1032 = PCURVE('',#297,#1033);
#1033 = DEFINITIONAL_REPRESENTATION('',(#1034),#1060);
#1034 = B_SPLINE_CURVE_WITH_KNOTS('',3,(#1035,#1036,#1037,#1038,#1039,
    #1040,#1041,#1042,#1043,#1044,#1045,#1046,#1047,#1048,#1049,#1050,
    #1051,#1052,#1053,#1054,#1055,#1056,#1057,#1058,#1059),
  .UNSPECIFIED.,.F.,.F.,(4,1,1,1,1,1,1,1,1,1,1,1,1,1,1,1,1,1,1,1,1,1,4),
  (1.556374069684E+04,1.568208351095E+04,1.580042632506E+04,
    1.591876913917E+04,1.603711195328E+04,1.615545476739E+04,
    1.62737975815E+04,1.639214039561E+04,1.651048320972E+04,
    1.662882602383E+04,1.674716883794E+04,1.686551165204E+04,
    1.698385446615E+04,1.710219728026E+04,1.722054009437E+04,
    1.733888290848E+04,1.745722572259E+04,1.75755685367E+04,
    1.769391135081E+04,1.781225416492E+04,1.793059697903E+04,
    1.804893979314E+04,1.816728260725E+04),.QUASI_UNIFORM_KNOTS.);
#1035 = CARTESIAN_POINT('',(2.275251062697,-2.00000000029));
#1036 = CARTESIAN_POINT('',(2.269143819513,-1.984756820383));
#1037 = CARTESIAN_POINT('',(2.256981118412,-1.953509142811));
#1038 = CARTESIAN_POINT('',(2.238893332361,-1.90420052939));
#1039 = CARTESIAN_POINT('',(2.220962767868,-1.852307029962));
#1040 = CARTESIAN_POINT('',(2.203190219342,-1.797662113599));
#1041 = CARTESIAN_POINT('',(2.185576379196,-1.740084991653));
#1042 = CARTESIAN_POINT('',(2.16812182591,-1.679377165165));
#1043 = CARTESIAN_POINT('',(2.150827031339,-1.615320773531));
#1044 = CARTESIAN_POINT('',(2.133692362947,-1.547676078977));
#1045 = CARTESIAN_POINT('',(2.116718087467,-1.47617873364));
#1046 = CARTESIAN_POINT('',(2.099904374219,-1.400536574477));
#1047 = CARTESIAN_POINT('',(2.083251298565,-1.320425915598));
#1048 = CARTESIAN_POINT('',(2.066758845336,-1.235487225562));
#1049 = CARTESIAN_POINT('',(2.050426912279,-1.14532007331));
#1050 = CARTESIAN_POINT('',(2.034255313494,-1.049477188891));
#1051 = CARTESIAN_POINT('',(2.018243782855,-0.947457468609));
#1052 = CARTESIAN_POINT('',(2.002391977401,-0.838697641466));
#1053 = CARTESIAN_POINT('',(1.986699480739,-0.722562504454));
#1054 = CARTESIAN_POINT('',(1.971165806237,-0.598332628308));
#1055 = CARTESIAN_POINT('',(1.955790400817,-0.465191806419));
#1056 = CARTESIAN_POINT('',(1.940572646315,-0.322203437862));
#1057 = CARTESIAN_POINT('',(1.925511869633,-0.168313196093));
#1058 = CARTESIAN_POINT('',(1.915575503127,-5.759421028911E-02));
#1059 = CARTESIAN_POINT('',(1.910633236249,0.));
#1060 = ( GEOMETRIC_REPRESENTATION_CONTEXT(2) 
PARAMETRIC_REPRESENTATION_CONTEXT() REPRESENTATION_CONTEXT('2D SPACE',''
  ) );
#1061 = ORIENTED_EDGE('',*,*,#248,.F.);
#1062 = ORIENTED_EDGE('',*,*,#1063,.T.);
#1063 = EDGE_CURVE('',#221,#666,#1064,.T.);
#1064 = SURFACE_CURVE('',#1065,(#1069,#1076),.PCURVE_S1.);
#1065 = LINE('',#1066,#1067);
#1066 = CARTESIAN_POINT('',(62.550368407221,-34.51,-17.01));
#1067 = VECTOR('',#1068,1.);
#1068 = DIRECTION('',(-1.,-4.321453E-17,2.22044604925E-16));
#1069 = PCURVE('',#264,#1070);
#1070 = DEFINITIONAL_REPRESENTATION('',(#1071),#1075);
#1071 = LINE('',#1072,#1073);
#1072 = CARTESIAN_POINT('',(0.,-0.914213562373));
#1073 = VECTOR('',#1074,1.);
#1074 = DIRECTION('',(-1.,0.));
#1075 = ( GEOMETRIC_REPRESENTATION_CONTEXT(2) 
PARAMETRIC_REPRESENTATION_CONTEXT() REPRESENTATION_CONTEXT('2D SPACE',''
  ) );
#1076 = PCURVE('',#236,#1077);
#1077 = DEFINITIONAL_REPRESENTATION('',(#1078),#1082);
#1078 = LINE('',#1079,#1080);
#1079 = CARTESIAN_POINT('',(0.,0.));
#1080 = VECTOR('',#1081,1.);
#1081 = DIRECTION('',(1.,0.));
#1082 = ( GEOMETRIC_REPRESENTATION_CONTEXT(2) 
PARAMETRIC_REPRESENTATION_CONTEXT() REPRESENTATION_CONTEXT('2D SPACE',''
  ) );
#1083 = ADVANCED_FACE('',(#1084),#325,.F.);
#1084 = FACE_BOUND('',#1085,.T.);
#1085 = EDGE_LOOP('',(#1086,#1087,#1088,#1089));
#1086 = ORIENTED_EDGE('',*,*,#816,.F.);
#1087 = ORIENTED_EDGE('',*,*,#936,.F.);
#1088 = ORIENTED_EDGE('',*,*,#309,.F.);
#1089 = ORIENTED_EDGE('',*,*,#1090,.T.);
#1090 = EDGE_CURVE('',#277,#817,#1091,.T.);
#1091 = SURFACE_CURVE('',#1092,(#1097,#1105),.PCURVE_S1.);
#1092 = ( BOUNDED_CURVE() B_SPLINE_CURVE(2,(#1093,#1094,#1095,#1096),
.UNSPECIFIED.,.F.,.F.) B_SPLINE_CURVE_WITH_KNOTS((3,1,3),(
    3.116891805131E+03,4.431325321474E+03,5.72043371554E+03),
.UNSPECIFIED.) CURVE() GEOMETRIC_REPRESENTATION_ITEM() 
RATIONAL_B_SPLINE_CURVE((1.819951171342E+04,2.137843889108E+04,
2.657521043976E+04,2.861424526654E+04)) REPRESENTATION_ITEM('') );
#1093 = CARTESIAN_POINT('',(62.550368407221,-33.59578643762,-18.01));
#1094 = CARTESIAN_POINT('',(61.733280622368,-33.91122214025,-18.01));
#1095 = CARTESIAN_POINT('',(60.818525630308,-34.29362627722,-18.01));
#1096 = CARTESIAN_POINT('',(60.550368407221,-34.42171782269,-18.01));
#1097 = PCURVE('',#325,#1098);
#1098 = DEFINITIONAL_REPRESENTATION('',(#1099),#1104);
#1099 = ( BOUNDED_CURVE() B_SPLINE_CURVE(2,(#1100,#1101,#1102,#1103),
.UNSPECIFIED.,.F.,.F.) B_SPLINE_CURVE_WITH_KNOTS((3,1,3),(
    3.116891805131E+03,4.431325321474E+03,5.72043371554E+03),
.UNSPECIFIED.) CURVE() GEOMETRIC_REPRESENTATION_ITEM() 
RATIONAL_B_SPLINE_CURVE((1.819951171342E+04,2.137843889108E+04,
2.657521043976E+04,2.861424526654E+04)) REPRESENTATION_ITEM('') );
#1100 = CARTESIAN_POINT('',(0.,0.914213562373));
#1101 = CARTESIAN_POINT('',(0.817087784853,0.598777859746));
#1102 = CARTESIAN_POINT('',(1.731842776913,0.216373722772));
#1103 = CARTESIAN_POINT('',(2.,8.828217730096E-02));
#1104 = ( GEOMETRIC_REPRESENTATION_CONTEXT(2) 
PARAMETRIC_REPRESENTATION_CONTEXT() REPRESENTATION_CONTEXT('2D SPACE',''
  ) );
#1105 = PCURVE('',#297,#1106);
#1106 = DEFINITIONAL_REPRESENTATION('',(#1107),#1133);
#1107 = B_SPLINE_CURVE_WITH_KNOTS('',3,(#1108,#1109,#1110,#1111,#1112,
    #1113,#1114,#1115,#1116,#1117,#1118,#1119,#1120,#1121,#1122,#1123,
    #1124,#1125,#1126,#1127,#1128,#1129,#1130,#1131,#1132),
  .UNSPECIFIED.,.F.,.F.,(4,1,1,1,1,1,1,1,1,1,1,1,1,1,1,1,1,1,1,1,1,1,4),
  (3.116891805131E+03,3.235234619241E+03,3.35357743335E+03,
    3.47192024746E+03,3.590263061569E+03,3.708605875678E+03,
    3.826948689788E+03,3.945291503897E+03,4.063634318007E+03,
    4.181977132116E+03,4.300319946226E+03,4.418662760335E+03,
    4.537005574445E+03,4.655348388554E+03,4.773691202664E+03,
    4.892034016773E+03,5.010376830883E+03,5.128719644992E+03,
    5.247062459102E+03,5.365405273211E+03,5.483748087321E+03,
    5.60209090143E+03,5.72043371554E+03),.QUASI_UNIFORM_KNOTS.);
#1108 = CARTESIAN_POINT('',(1.230959417341,0.));
#1109 = CARTESIAN_POINT('',(1.226017150463,-5.759421028892E-02));
#1110 = CARTESIAN_POINT('',(1.216080783957,-0.168313196092));
#1111 = CARTESIAN_POINT('',(1.201020007275,-0.322203437861));
#1112 = CARTESIAN_POINT('',(1.185802252773,-0.465191806418));
#1113 = CARTESIAN_POINT('',(1.170426847352,-0.598332628306));
#1114 = CARTESIAN_POINT('',(1.15489317285,-0.722562504452));
#1115 = CARTESIAN_POINT('',(1.139200676188,-0.838697641465));
#1116 = CARTESIAN_POINT('',(1.123348870733,-0.947457468607));
#1117 = CARTESIAN_POINT('',(1.107337340094,-1.04947718889));
#1118 = CARTESIAN_POINT('',(1.091165741309,-1.145320073308));
#1119 = CARTESIAN_POINT('',(1.074833808252,-1.235487225561));
#1120 = CARTESIAN_POINT('',(1.058341355023,-1.320425915597));
#1121 = CARTESIAN_POINT('',(1.041688279369,-1.400536574476));
#1122 = CARTESIAN_POINT('',(1.024874566121,-1.476178733639));
#1123 = CARTESIAN_POINT('',(1.007900290641,-1.547676078977));
#1124 = CARTESIAN_POINT('',(0.990765622249,-1.615320773531));
#1125 = CARTESIAN_POINT('',(0.973470827678,-1.679377165165));
#1126 = CARTESIAN_POINT('',(0.956016274392,-1.740084991653));
#1127 = CARTESIAN_POINT('',(0.938402434246,-1.797662113599));
#1128 = CARTESIAN_POINT('',(0.92062988572,-1.852307029962));
#1129 = CARTESIAN_POINT('',(0.902699321228,-1.90420052939));
#1130 = CARTESIAN_POINT('',(0.884611535177,-1.953509142811));
#1131 = CARTESIAN_POINT('',(0.872448834076,-1.984756820383));
#1132 = CARTESIAN_POINT('',(0.866341590892,-2.00000000029));
#1133 = ( GEOMETRIC_REPRESENTATION_CONTEXT(2) 
PARAMETRIC_REPRESENTATION_CONTEXT() REPRESENTATION_CONTEXT('2D SPACE',''
  ) );
#1134 = ADVANCED_FACE('',(#1135),#297,.F.);
#1135 = FACE_BOUND('',#1136,.F.);
#1136 = EDGE_LOOP('',(#1137,#1138,#1139,#1140));
#1137 = ORIENTED_EDGE('',*,*,#1019,.T.);
#1138 = ORIENTED_EDGE('',*,*,#276,.T.);
#1139 = ORIENTED_EDGE('',*,*,#1090,.T.);
#1140 = ORIENTED_EDGE('',*,*,#839,.T.);
#1141 = ADVANCED_FACE('',(#1142),#492,.F.);
#1142 = FACE_BOUND('',#1143,.T.);
#1143 = EDGE_LOOP('',(#1144,#1145,#1188,#1189));
#1144 = ORIENTED_EDGE('',*,*,#718,.F.);
#1145 = ORIENTED_EDGE('',*,*,#1146,.T.);
#1146 = EDGE_CURVE('',#691,#477,#1147,.T.);
#1147 = SURFACE_CURVE('',#1148,(#1152,#1159),.PCURVE_S1.);
#1148 = ( BOUNDED_CURVE() B_SPLINE_CURVE(2,(#1149,#1150,#1151),
.UNSPECIFIED.,.F.,.F.) B_SPLINE_CURVE_WITH_KNOTS((3,3),(
    1.556374069684E+04,1.816728260725E+04),.PIECEWISE_BEZIER_KNOTS.) 
CURVE() GEOMETRIC_REPRESENTATION_ITEM() RATIONAL_B_SPLINE_CURVE((
    2.861424526656E+04,2.449611784396E+04,1.819951171345E+04)) 
REPRESENTATION_ITEM('') );
#1149 = CARTESIAN_POINT('',(60.550368407221,-35.51,-16.92171782269));
#1150 = CARTESIAN_POINT('',(61.137917399855,-35.51,-16.6410613569));
#1151 = CARTESIAN_POINT('',(62.550368407221,-35.51,-16.09578643762));
#1152 = PCURVE('',#492,#1153);
#1153 = DEFINITIONAL_REPRESENTATION('',(#1154),#1158);
#1154 = ( BOUNDED_CURVE() B_SPLINE_CURVE(2,(#1155,#1156,#1157),
.UNSPECIFIED.,.F.,.F.) B_SPLINE_CURVE_WITH_KNOTS((3,3),(
    1.556374069684E+04,1.816728260725E+04),.PIECEWISE_BEZIER_KNOTS.) 
CURVE() GEOMETRIC_REPRESENTATION_ITEM() RATIONAL_B_SPLINE_CURVE((
    2.861424526656E+04,2.449611784396E+04,1.819951171345E+04)) 
REPRESENTATION_ITEM('') );
#1155 = CARTESIAN_POINT('',(-2.,-0.825931385072));
#1156 = CARTESIAN_POINT('',(-1.412451007366,-0.54527491928));
#1157 = CARTESIAN_POINT('',(0.,0.));
#1158 = ( GEOMETRIC_REPRESENTATION_CONTEXT(2) 
PARAMETRIC_REPRESENTATION_CONTEXT() REPRESENTATION_CONTEXT('2D SPACE',''
  ) );
#1159 = PCURVE('',#523,#1160);
#1160 = DEFINITIONAL_REPRESENTATION('',(#1161),#1187);
#1161 = B_SPLINE_CURVE_WITH_KNOTS('',3,(#1162,#1163,#1164,#1165,#1166,
    #1167,#1168,#1169,#1170,#1171,#1172,#1173,#1174,#1175,#1176,#1177,
    #1178,#1179,#1180,#1181,#1182,#1183,#1184,#1185,#1186),
  .UNSPECIFIED.,.F.,.F.,(4,1,1,1,1,1,1,1,1,1,1,1,1,1,1,1,1,1,1,1,1,1,4),
  (1.556374069684E+04,1.568208351095E+04,1.580042632506E+04,
    1.591876913917E+04,1.603711195328E+04,1.615545476739E+04,
    1.62737975815E+04,1.639214039561E+04,1.651048320972E+04,
    1.662882602383E+04,1.674716883794E+04,1.686551165204E+04,
    1.698385446615E+04,1.710219728026E+04,1.722054009437E+04,
    1.733888290848E+04,1.745722572259E+04,1.75755685367E+04,
    1.769391135081E+04,1.781225416492E+04,1.793059697903E+04,
    1.804893979314E+04,1.816728260725E+04),.QUASI_UNIFORM_KNOTS.);
#1162 = CARTESIAN_POINT('',(3.846047389492,-2.00000000029));
#1163 = CARTESIAN_POINT('',(3.839940146308,-1.984756820383));
#1164 = CARTESIAN_POINT('',(3.827777445207,-1.953509142811));
#1165 = CARTESIAN_POINT('',(3.809689659156,-1.90420052939));
#1166 = CARTESIAN_POINT('',(3.791759094663,-1.852307029962));
#1167 = CARTESIAN_POINT('',(3.773986546137,-1.797662113599));
#1168 = CARTESIAN_POINT('',(3.756372705992,-1.740084991653));
#1169 = CARTESIAN_POINT('',(3.738918152705,-1.679377165165));
#1170 = CARTESIAN_POINT('',(3.721623358134,-1.615320773531));
#1171 = CARTESIAN_POINT('',(3.704488689743,-1.547676078977));
#1172 = CARTESIAN_POINT('',(3.687514414262,-1.47617873364));
#1173 = CARTESIAN_POINT('',(3.670700701015,-1.400536574477));
#1174 = CARTESIAN_POINT('',(3.654047625361,-1.320425915598));
#1175 = CARTESIAN_POINT('',(3.637555172132,-1.235487225562));
#1176 = CARTESIAN_POINT('',(3.621223239075,-1.14532007331));
#1177 = CARTESIAN_POINT('',(3.60505164029,-1.049477188891));
#1178 = CARTESIAN_POINT('',(3.589040109651,-0.947457468609));
#1179 = CARTESIAN_POINT('',(3.573188304197,-0.838697641466));
#1180 = CARTESIAN_POINT('',(3.557495807534,-0.722562504454));
#1181 = CARTESIAN_POINT('',(3.541962133033,-0.598332628308));
#1182 = CARTESIAN_POINT('',(3.526586727612,-0.465191806419));
#1183 = CARTESIAN_POINT('',(3.51136897311,-0.322203437862));
#1184 = CARTESIAN_POINT('',(3.496308196428,-0.168313196093));
#1185 = CARTESIAN_POINT('',(3.486371829922,-5.75942102891E-02));
#1186 = CARTESIAN_POINT('',(3.481429563044,-7.136376035393E-17));
#1187 = ( GEOMETRIC_REPRESENTATION_CONTEXT(2) 
PARAMETRIC_REPRESENTATION_CONTEXT() REPRESENTATION_CONTEXT('2D SPACE',''
  ) );
#1188 = ORIENTED_EDGE('',*,*,#476,.F.);
#1189 = ORIENTED_EDGE('',*,*,#563,.T.);
#1190 = ADVANCED_FACE('',(#1191),#236,.F.);
#1191 = FACE_BOUND('',#1192,.T.);
#1192 = EDGE_LOOP('',(#1193,#1194,#1195,#1196));
#1193 = ORIENTED_EDGE('',*,*,#665,.F.);
#1194 = ORIENTED_EDGE('',*,*,#1063,.F.);
#1195 = ORIENTED_EDGE('',*,*,#218,.F.);
#1196 = ORIENTED_EDGE('',*,*,#1197,.T.);
#1197 = EDGE_CURVE('',#219,#668,#1198,.T.);
#1198 = SURFACE_CURVE('',#1199,(#1204,#1212),.PCURVE_S1.);
#1199 = ( BOUNDED_CURVE() B_SPLINE_CURVE(2,(#1200,#1201,#1202,#1203),
.UNSPECIFIED.,.F.,.F.) B_SPLINE_CURVE_WITH_KNOTS((3,1,3),(
    3.116891805131E+03,4.431325321474E+03,5.72043371554E+03),
.UNSPECIFIED.) CURVE() GEOMETRIC_REPRESENTATION_ITEM() 
RATIONAL_B_SPLINE_CURVE((1.819951171342E+04,2.137843889108E+04,
2.657521043976E+04,2.861424526654E+04)) REPRESENTATION_ITEM('') );
#1200 = CARTESIAN_POINT('',(62.550368407221,-34.51,-16.09578643762));
#1201 = CARTESIAN_POINT('',(61.733280622368,-34.51,-16.41122214025));
#1202 = CARTESIAN_POINT('',(60.818525630308,-34.51,-16.79362627722));
#1203 = CARTESIAN_POINT('',(60.550368407221,-34.51,-16.92171782269));
#1204 = PCURVE('',#236,#1205);
#1205 = DEFINITIONAL_REPRESENTATION('',(#1206),#1211);
#1206 = ( BOUNDED_CURVE() B_SPLINE_CURVE(2,(#1207,#1208,#1209,#1210),
.UNSPECIFIED.,.F.,.F.) B_SPLINE_CURVE_WITH_KNOTS((3,1,3),(
    3.116891805131E+03,4.431325321474E+03,5.72043371554E+03),
.UNSPECIFIED.) CURVE() GEOMETRIC_REPRESENTATION_ITEM() 
RATIONAL_B_SPLINE_CURVE((1.819951171342E+04,2.137843889108E+04,
2.657521043976E+04,2.861424526654E+04)) REPRESENTATION_ITEM('') );
#1207 = CARTESIAN_POINT('',(0.,0.914213562373));
#1208 = CARTESIAN_POINT('',(0.817087784853,0.598777859746));
#1209 = CARTESIAN_POINT('',(1.731842776913,0.216373722772));
#1210 = CARTESIAN_POINT('',(2.,8.828217730096E-02));
#1211 = ( GEOMETRIC_REPRESENTATION_CONTEXT(2) 
PARAMETRIC_REPRESENTATION_CONTEXT() REPRESENTATION_CONTEXT('2D SPACE',''
  ) );
#1212 = PCURVE('',#523,#1213);
#1213 = DEFINITIONAL_REPRESENTATION('',(#1214),#1240);
#1214 = B_SPLINE_CURVE_WITH_KNOTS('',3,(#1215,#1216,#1217,#1218,#1219,
    #1220,#1221,#1222,#1223,#1224,#1225,#1226,#1227,#1228,#1229,#1230,
    #1231,#1232,#1233,#1234,#1235,#1236,#1237,#1238,#1239),
  .UNSPECIFIED.,.F.,.F.,(4,1,1,1,1,1,1,1,1,1,1,1,1,1,1,1,1,1,1,1,1,1,4),
  (3.116891805131E+03,3.235234619241E+03,3.35357743335E+03,
    3.47192024746E+03,3.590263061569E+03,3.708605875678E+03,
    3.826948689788E+03,3.945291503897E+03,4.063634318007E+03,
    4.181977132116E+03,4.300319946226E+03,4.418662760335E+03,
    4.537005574445E+03,4.655348388554E+03,4.773691202664E+03,
    4.892034016773E+03,5.010376830883E+03,5.128719644992E+03,
    5.247062459102E+03,5.365405273211E+03,5.483748087321E+03,
    5.60209090143E+03,5.72043371554E+03),.QUASI_UNIFORM_KNOTS.);
#1215 = CARTESIAN_POINT('',(2.801755744136,0.));
#1216 = CARTESIAN_POINT('',(2.796813477258,-5.759421028893E-02));
#1217 = CARTESIAN_POINT('',(2.786877110752,-0.168313196092));
#1218 = CARTESIAN_POINT('',(2.77181633407,-0.322203437861));
#1219 = CARTESIAN_POINT('',(2.756598579568,-0.465191806418));
#1220 = CARTESIAN_POINT('',(2.741223174147,-0.598332628306));
#1221 = CARTESIAN_POINT('',(2.725689499646,-0.722562504452));
#1222 = CARTESIAN_POINT('',(2.709997002983,-0.838697641465));
#1223 = CARTESIAN_POINT('',(2.694145197529,-0.947457468607));
#1224 = CARTESIAN_POINT('',(2.67813366689,-1.04947718889));
#1225 = CARTESIAN_POINT('',(2.661962068104,-1.145320073308));
#1226 = CARTESIAN_POINT('',(2.645630135048,-1.235487225561));
#1227 = CARTESIAN_POINT('',(2.629137681818,-1.320425915597));
#1228 = CARTESIAN_POINT('',(2.612484606164,-1.400536574476));
#1229 = CARTESIAN_POINT('',(2.595670892917,-1.476178733639));
#1230 = CARTESIAN_POINT('',(2.578696617436,-1.547676078977));
#1231 = CARTESIAN_POINT('',(2.561561949044,-1.615320773531));
#1232 = CARTESIAN_POINT('',(2.544267154473,-1.679377165165));
#1233 = CARTESIAN_POINT('',(2.526812601187,-1.740084991653));
#1234 = CARTESIAN_POINT('',(2.509198761042,-1.797662113599));
#1235 = CARTESIAN_POINT('',(2.491426212515,-1.852307029962));
#1236 = CARTESIAN_POINT('',(2.473495648023,-1.90420052939));
#1237 = CARTESIAN_POINT('',(2.455407861973,-1.953509142811));
#1238 = CARTESIAN_POINT('',(2.443245160871,-1.984756820383));
#1239 = CARTESIAN_POINT('',(2.437137917687,-2.00000000029));
#1240 = ( GEOMETRIC_REPRESENTATION_CONTEXT(2) 
PARAMETRIC_REPRESENTATION_CONTEXT() REPRESENTATION_CONTEXT('2D SPACE',''
  ) );
#1241 = ADVANCED_FACE('',(#1242),#523,.F.);
#1242 = FACE_BOUND('',#1243,.F.);
#1243 = EDGE_LOOP('',(#1244,#1245,#1246,#1247));
#1244 = ORIENTED_EDGE('',*,*,#1146,.T.);
#1245 = ORIENTED_EDGE('',*,*,#504,.T.);
#1246 = ORIENTED_EDGE('',*,*,#1197,.T.);
#1247 = ORIENTED_EDGE('',*,*,#690,.T.);
#1248 = ADVANCED_FACE('',(#1249),#1262,.T.);
#1249 = FACE_BOUND('',#1250,.T.);
#1250 = EDGE_LOOP('',(#1251,#1289,#1311,#1338));
#1251 = ORIENTED_EDGE('',*,*,#1252,.T.);
#1252 = EDGE_CURVE('',#1253,#1253,#1255,.T.);
#1253 = VERTEX_POINT('',#1254);
#1254 = CARTESIAN_POINT('',(54.550368407221,-35.01,-18.76));
#1255 = SURFACE_CURVE('',#1256,(#1261,#1273),.PCURVE_S1.);
#1256 = CIRCLE('',#1257,1.25);
#1257 = AXIS2_PLACEMENT_3D('',#1258,#1259,#1260);
#1258 = CARTESIAN_POINT('',(54.550368407221,-35.01,-17.51));
#1259 = DIRECTION('',(1.,4.321453E-17,-2.22044604925E-16));
#1260 = DIRECTION('',(2.22044604925E-16,-4.321453E-17,1.));
#1261 = PCURVE('',#1262,#1267);
#1262 = CONICAL_SURFACE('',#1263,1.5,0.7853981625);
#1263 = AXIS2_PLACEMENT_3D('',#1264,#1265,#1266);
#1264 = CARTESIAN_POINT('',(54.800368407221,-35.01,-17.51));
#1265 = DIRECTION('',(1.,4.321453E-17,-2.22044604925E-16));
#1266 = DIRECTION('',(2.22044604925E-16,-4.321453E-17,1.));
#1267 = DEFINITIONAL_REPRESENTATION('',(#1268),#1272);
#1268 = LINE('',#1269,#1270);
#1269 = CARTESIAN_POINT('',(0.,-0.250000000224));
#1270 = VECTOR('',#1271,1.);
#1271 = DIRECTION('',(1.,0.));
#1272 = ( GEOMETRIC_REPRESENTATION_CONTEXT(2) 
PARAMETRIC_REPRESENTATION_CONTEXT() REPRESENTATION_CONTEXT('2D SPACE',''
  ) );
#1273 = PCURVE('',#1274,#1279);
#1274 = PLANE('',#1275);
#1275 = AXIS2_PLACEMENT_3D('',#1276,#1277,#1278);
#1276 = CARTESIAN_POINT('',(54.550368407221,-35.01,-17.51));
#1277 = DIRECTION('',(-1.,-4.321453E-17,2.22044604925E-16));
#1278 = DIRECTION('',(2.22044604925E-16,-4.321453E-17,1.));
#1279 = DEFINITIONAL_REPRESENTATION('',(#1280),#1288);
#1280 = ( BOUNDED_CURVE() B_SPLINE_CURVE(2,(#1281,#1282,#1283,#1284,
#1285,#1286,#1287),.UNSPECIFIED.,.T.,.F.) B_SPLINE_CURVE_WITH_KNOTS((1,2
    ,2,2,2,1),(-2.094395102393,0.,2.094395102393,4.188790204786,
6.28318530718,8.377580409573),.UNSPECIFIED.) CURVE() 
GEOMETRIC_REPRESENTATION_ITEM() RATIONAL_B_SPLINE_CURVE((1.,0.5,1.,0.5,
1.,0.5,1.)) REPRESENTATION_ITEM('') );
#1281 = CARTESIAN_POINT('',(1.25,0.));
#1282 = CARTESIAN_POINT('',(1.25,-2.165063509461));
#1283 = CARTESIAN_POINT('',(-0.625,-1.082531754731));
#1284 = CARTESIAN_POINT('',(-2.5,-3.061616997868E-16));
#1285 = CARTESIAN_POINT('',(-0.625,1.082531754731));
#1286 = CARTESIAN_POINT('',(1.25,2.165063509461));
#1287 = CARTESIAN_POINT('',(1.25,0.));
#1288 = ( GEOMETRIC_REPRESENTATION_CONTEXT(2) 
PARAMETRIC_REPRESENTATION_CONTEXT() REPRESENTATION_CONTEXT('2D SPACE',''
  ) );
#1289 = ORIENTED_EDGE('',*,*,#1290,.T.);
#1290 = EDGE_CURVE('',#1253,#1291,#1293,.T.);
#1291 = VERTEX_POINT('',#1292);
#1292 = CARTESIAN_POINT('',(55.050368407221,-35.01,-19.26));
#1293 = SEAM_CURVE('',#1294,(#1297,#1304),.PCURVE_S1.);
#1294 = B_SPLINE_CURVE_WITH_KNOTS('',1,(#1295,#1296),.UNSPECIFIED.,.F.,
  .F.,(2,2),(-0.353553390593,0.353553390593),.PIECEWISE_BEZIER_KNOTS.);
#1295 = CARTESIAN_POINT('',(54.550368406997,-35.01,-18.76000000022));
#1296 = CARTESIAN_POINT('',(55.050368407445,-35.01,-19.25999999977));
#1297 = PCURVE('',#1262,#1298);
#1298 = DEFINITIONAL_REPRESENTATION('',(#1299),#1303);
#1299 = LINE('',#1300,#1301);
#1300 = CARTESIAN_POINT('',(9.424777960769,0.));
#1301 = VECTOR('',#1302,1.);
#1302 = DIRECTION('',(0.,1.));
#1303 = ( GEOMETRIC_REPRESENTATION_CONTEXT(2) 
PARAMETRIC_REPRESENTATION_CONTEXT() REPRESENTATION_CONTEXT('2D SPACE',''
  ) );
#1304 = PCURVE('',#1262,#1305);
#1305 = DEFINITIONAL_REPRESENTATION('',(#1306),#1310);
#1306 = LINE('',#1307,#1308);
#1307 = CARTESIAN_POINT('',(3.14159265359,0.));
#1308 = VECTOR('',#1309,1.);
#1309 = DIRECTION('',(0.,1.));
#1310 = ( GEOMETRIC_REPRESENTATION_CONTEXT(2) 
PARAMETRIC_REPRESENTATION_CONTEXT() REPRESENTATION_CONTEXT('2D SPACE',''
  ) );
#1311 = ORIENTED_EDGE('',*,*,#1312,.T.);
#1312 = EDGE_CURVE('',#1291,#1291,#1313,.T.);
#1313 = SURFACE_CURVE('',#1314,(#1319,#1326),.PCURVE_S1.);
#1314 = CIRCLE('',#1315,1.75);
#1315 = AXIS2_PLACEMENT_3D('',#1316,#1317,#1318);
#1316 = CARTESIAN_POINT('',(55.050368407221,-35.01,-17.51));
#1317 = DIRECTION('',(-1.,-4.321453E-17,2.22044604925E-16));
#1318 = DIRECTION('',(2.22044604925E-16,-4.321453E-17,1.));
#1319 = PCURVE('',#1262,#1320);
#1320 = DEFINITIONAL_REPRESENTATION('',(#1321),#1325);
#1321 = LINE('',#1322,#1323);
#1322 = CARTESIAN_POINT('',(12.566370614359,0.250000000224));
#1323 = VECTOR('',#1324,1.);
#1324 = DIRECTION('',(-1.,0.));
#1325 = ( GEOMETRIC_REPRESENTATION_CONTEXT(2) 
PARAMETRIC_REPRESENTATION_CONTEXT() REPRESENTATION_CONTEXT('2D SPACE',''
  ) );
#1326 = PCURVE('',#1327,#1332);
#1327 = CYLINDRICAL_SURFACE('',#1328,1.75);
#1328 = AXIS2_PLACEMENT_3D('',#1329,#1330,#1331);
#1329 = CARTESIAN_POINT('',(62.550368407221,-35.01,-17.51));
#1330 = DIRECTION('',(-1.,-4.321453E-17,2.22044604925E-16));
#1331 = DIRECTION('',(2.22044604925E-16,-4.321453E-17,1.));
#1332 = DEFINITIONAL_REPRESENTATION('',(#1333),#1337);
#1333 = LINE('',#1334,#1335);
#1334 = CARTESIAN_POINT('',(0.,7.5));
#1335 = VECTOR('',#1336,1.);
#1336 = DIRECTION('',(1.,0.));
#1337 = ( GEOMETRIC_REPRESENTATION_CONTEXT(2) 
PARAMETRIC_REPRESENTATION_CONTEXT() REPRESENTATION_CONTEXT('2D SPACE',''
  ) );
#1338 = ORIENTED_EDGE('',*,*,#1290,.F.);
#1339 = ADVANCED_FACE('',(#1340),#1327,.T.);
#1340 = FACE_BOUND('',#1341,.T.);
#1341 = EDGE_LOOP('',(#1342,#1366,#1386,#1387));
#1342 = ORIENTED_EDGE('',*,*,#1343,.F.);
#1343 = EDGE_CURVE('',#1344,#1344,#1346,.T.);
#1344 = VERTEX_POINT('',#1345);
#1345 = CARTESIAN_POINT('',(61.4,-35.01,-19.26));
#1346 = SURFACE_CURVE('',#1347,(#1352,#1359),.PCURVE_S1.);
#1347 = CIRCLE('',#1348,1.75);
#1348 = AXIS2_PLACEMENT_3D('',#1349,#1350,#1351);
#1349 = CARTESIAN_POINT('',(61.4,-35.01,-17.51));
#1350 = DIRECTION('',(1.,4.321453E-17,-2.22044604925E-16));
#1351 = DIRECTION('',(2.22044604925E-16,-4.321453E-17,1.));
#1352 = PCURVE('',#1327,#1353);
#1353 = DEFINITIONAL_REPRESENTATION('',(#1354),#1358);
#1354 = LINE('',#1355,#1356);
#1355 = CARTESIAN_POINT('',(12.566370614359,1.150368407221));
#1356 = VECTOR('',#1357,1.);
#1357 = DIRECTION('',(-1.,0.));
#1358 = ( GEOMETRIC_REPRESENTATION_CONTEXT(2) 
PARAMETRIC_REPRESENTATION_CONTEXT() REPRESENTATION_CONTEXT('2D SPACE',''
  ) );
#1359 = PCURVE('',#182,#1360);
#1360 = DEFINITIONAL_REPRESENTATION('',(#1361),#1365);
#1361 = LINE('',#1362,#1363);
#1362 = CARTESIAN_POINT('',(-3.14159265359,-1.150368408039));
#1363 = VECTOR('',#1364,1.);
#1364 = DIRECTION('',(1.,0.));
#1365 = ( GEOMETRIC_REPRESENTATION_CONTEXT(2) 
PARAMETRIC_REPRESENTATION_CONTEXT() REPRESENTATION_CONTEXT('2D SPACE',''
  ) );
#1366 = ORIENTED_EDGE('',*,*,#1367,.T.);
#1367 = EDGE_CURVE('',#1344,#1291,#1368,.T.);
#1368 = SEAM_CURVE('',#1369,(#1372,#1379),.PCURVE_S1.);
#1369 = B_SPLINE_CURVE_WITH_KNOTS('',1,(#1370,#1371),.UNSPECIFIED.,.F.,
  .F.,(2,2),(1.150368407221,7.5),.PIECEWISE_BEZIER_KNOTS.);
#1370 = CARTESIAN_POINT('',(61.4,-35.01,-19.26));
#1371 = CARTESIAN_POINT('',(55.050368407221,-35.01,-19.26));
#1372 = PCURVE('',#1327,#1373);
#1373 = DEFINITIONAL_REPRESENTATION('',(#1374),#1378);
#1374 = LINE('',#1375,#1376);
#1375 = CARTESIAN_POINT('',(9.424777960769,0.));
#1376 = VECTOR('',#1377,1.);
#1377 = DIRECTION('',(0.,1.));
#1378 = ( GEOMETRIC_REPRESENTATION_CONTEXT(2) 
PARAMETRIC_REPRESENTATION_CONTEXT() REPRESENTATION_CONTEXT('2D SPACE',''
  ) );
#1379 = PCURVE('',#1327,#1380);
#1380 = DEFINITIONAL_REPRESENTATION('',(#1381),#1385);
#1381 = LINE('',#1382,#1383);
#1382 = CARTESIAN_POINT('',(3.14159265359,0.));
#1383 = VECTOR('',#1384,1.);
#1384 = DIRECTION('',(0.,1.));
#1385 = ( GEOMETRIC_REPRESENTATION_CONTEXT(2) 
PARAMETRIC_REPRESENTATION_CONTEXT() REPRESENTATION_CONTEXT('2D SPACE',''
  ) );
#1386 = ORIENTED_EDGE('',*,*,#1312,.F.);
#1387 = ORIENTED_EDGE('',*,*,#1367,.F.);
#1388 = ADVANCED_FACE('',(#1389),#1274,.T.);
#1389 = FACE_BOUND('',#1390,.T.);
#1390 = EDGE_LOOP('',(#1391));
#1391 = ORIENTED_EDGE('',*,*,#1252,.F.);
#1392 = ADVANCED_FACE('',(#1393),#182,.T.);
#1393 = FACE_BOUND('',#1394,.T.);
#1394 = EDGE_LOOP('',(#1395,#1396,#1416,#1417,#1418));
#1395 = ORIENTED_EDGE('',*,*,#1343,.T.);
#1396 = ORIENTED_EDGE('',*,*,#1397,.T.);
#1397 = EDGE_CURVE('',#1344,#166,#1398,.T.);
#1398 = SEAM_CURVE('',#1399,(#1402,#1409),.PCURVE_S1.);
#1399 = B_SPLINE_CURVE_WITH_KNOTS('',1,(#1400,#1401),.UNSPECIFIED.,.F.,
  .F.,(2,2),(-1.524253086706,0.),.PIECEWISE_BEZIER_KNOTS.);
#1400 = CARTESIAN_POINT('',(61.399999999182,-35.01,-19.26000000094));
#1401 = CARTESIAN_POINT('',(62.550368407221,-35.01,-20.26));
#1402 = PCURVE('',#182,#1403);
#1403 = DEFINITIONAL_REPRESENTATION('',(#1404),#1408);
#1404 = LINE('',#1405,#1406);
#1405 = CARTESIAN_POINT('',(6.28318530718,0.));
#1406 = VECTOR('',#1407,1.);
#1407 = DIRECTION('',(0.,1.));
#1408 = ( GEOMETRIC_REPRESENTATION_CONTEXT(2) 
PARAMETRIC_REPRESENTATION_CONTEXT() REPRESENTATION_CONTEXT('2D SPACE',''
  ) );
#1409 = PCURVE('',#182,#1410);
#1410 = DEFINITIONAL_REPRESENTATION('',(#1411),#1415);
#1411 = LINE('',#1412,#1413);
#1412 = CARTESIAN_POINT('',(0.,0.));
#1413 = VECTOR('',#1414,1.);
#1414 = DIRECTION('',(0.,1.));
#1415 = ( GEOMETRIC_REPRESENTATION_CONTEXT(2) 
PARAMETRIC_REPRESENTATION_CONTEXT() REPRESENTATION_CONTEXT('2D SPACE',''
  ) );
#1416 = ORIENTED_EDGE('',*,*,#163,.F.);
#1417 = ORIENTED_EDGE('',*,*,#194,.F.);
#1418 = ORIENTED_EDGE('',*,*,#1397,.F.);
#1419 = ( GEOMETRIC_REPRESENTATION_CONTEXT(3) 
GLOBAL_UNCERTAINTY_ASSIGNED_CONTEXT((#1423)) 
GLOBAL_UNIT_ASSIGNED_CONTEXT((#1420,#1421,#1422)) REPRESENTATION_CONTEXT
('Context #1','3D Context with UNIT and UNCERTAINTY') );
#1420 = ( LENGTH_UNIT() NAMED_UNIT(*) SI_UNIT(.MILLI.,.METRE.) );
#1421 = ( NAMED_UNIT(*) PLANE_ANGLE_UNIT() SI_UNIT($,.RADIAN.) );
#1422 = ( NAMED_UNIT(*) SI_UNIT($,.STERADIAN.) SOLID_ANGLE_UNIT() );
#1423 = UNCERTAINTY_MEASURE_WITH_UNIT(LENGTH_MEASURE(1.E-06),#1420,
  'distance_accuracy_value','confusion accuracy');
#1424 = PRODUCT_RELATED_PRODUCT_CATEGORY('part',$,(#7));
#1425 = MECHANICAL_DESIGN_GEOMETRIC_PRESENTATION_REPRESENTATION('',(
    #1426),#1419);
#1426 = STYLED_ITEM('color',(#1427),#15);
#1427 = PRESENTATION_STYLE_ASSIGNMENT((#1428,#1434));
#1428 = SURFACE_STYLE_USAGE(.BOTH.,#1429);
#1429 = SURFACE_SIDE_STYLE('',(#1430));
#1430 = SURFACE_STYLE_FILL_AREA(#1431);
#1431 = FILL_AREA_STYLE('',(#1432));
#1432 = FILL_AREA_STYLE_COLOUR('',#1433);
#1433 = DRAUGHTING_PRE_DEFINED_COLOUR('white');
#1434 = CURVE_STYLE('',#1435,POSITIVE_LENGTH_MEASURE(0.1),#1433);
#1435 = DRAUGHTING_PRE_DEFINED_CURVE_FONT('continuous');
ENDSEC;
END-ISO-10303-21;
