(footprint "PCI-E_16X-PCB" (version 20211014) (generator pcbnew)
  (layer "F.Cu")
  (tedit 5E55B050)
  (attr exclude_from_pos_files exclude_from_bom)
  (fp_text reference "REF**" (at -6.5 -6.8) (layer "F.SilkS")
    (effects (font (size 1 1) (thickness 0.15)))
    (tstamp 8cb74036-6c66-4c40-af1f-5f674bb5fced)
  )
  (fp_text value "PCI-E_16X-PCB" (at 9.25 -5.2) (layer "F.Fab") hide
    (effects (font (size 1 1) (thickness 0.15)))
    (tstamp f743b378-e60e-46da-9c63-e9806ad878aa)
  )
  (fp_text user "A11" (at -2.3 -4.9) (layer "B.SilkS")
    (effects (font (size 0.8 0.8) (thickness 0.15) italic) (justify mirror))
    (tstamp 01aa66ec-c204-46db-9471-dbd88931ac4e)
  )
  (fp_text user "A82" (at 70.7 -4.9 -180) (layer "B.SilkS")
    (effects (font (size 0.8 0.8) (thickness 0.15) italic) (justify mirror))
    (tstamp 439eb263-3768-48ba-bceb-724a8eaa5f8c)
  )
  (fp_text user "A12" (at 2.2 -4.9) (layer "B.SilkS")
    (effects (font (size 0.8 0.8) (thickness 0.15) italic) (justify mirror))
    (tstamp aa07ccab-65da-4072-99a9-9fbd288c7e56)
  )
  (fp_text user "A1" (at -11.3 -4.9 180) (layer "B.SilkS")
    (effects (font (size 0.8 0.8) (thickness 0.15) italic) (justify mirror))
    (tstamp bdb4eab6-0a86-4646-8291-1296c8bb03e8)
  )
  (fp_text user "B12" (at 2.3 -4.9 180) (layer "F.SilkS")
    (effects (font (size 0.8 0.8) (thickness 0.15) italic))
    (tstamp 19bb4397-623f-4873-bc74-eff8823f75b8)
  )
  (fp_text user "B1" (at -11.1 -4.9 180) (layer "F.SilkS")
    (effects (font (size 0.8 0.8) (thickness 0.15) italic))
    (tstamp 515134f9-5960-4773-a0ec-4ba3ea12138b)
  )
  (fp_text user "B11" (at -2.1 -4.9 180) (layer "F.SilkS")
    (effects (font (size 0.8 0.8) (thickness 0.15) italic))
    (tstamp bc3a4b7a-f2c8-40bd-ac75-89d3e5ce5d5b)
  )
  (fp_text user "B82" (at 70.8 -4.9 180) (layer "F.SilkS")
    (effects (font (size 0.8 0.8) (thickness 0.15) italic))
    (tstamp d88a9a53-47e9-43a5-8b21-177d0acc98ed)
  )
  (fp_text user "edge conn pci-e std bevel & gold-finger" (at 29 -2 unlocked) (layer "F.Fab")
    (effects (font (size 1 1) (thickness 0.15)))
    (tstamp 82e16a6a-b2c8-4127-b702-a933d49a8632)
  )
  (fp_line (start 31.5 -4.5) (end 31.5 -5.5) (layer "B.SilkS") (width 0.1) (tstamp 3e5ac8e3-ce4d-4912-a2c2-2aa65d2af13d))
  (fp_line (start 21.5 -4.5) (end 21.5 -5.5) (layer "B.SilkS") (width 0.1) (tstamp 56e226c7-5eab-4589-965f-a33dfa5aa352))
  (fp_line (start 51.5 -4.5) (end 51.5 -5.5) (layer "B.SilkS") (width 0.1) (tstamp 63fdf7e6-c9bc-4ea5-987e-fe14b92fec8d))
  (fp_line (start 61.5 -4.5) (end 61.5 -5.5) (layer "B.SilkS") (width 0.1) (tstamp 6dcabca3-9404-41ad-98e2-35d513d95425))
  (fp_line (start 41.5 -4.5) (end 41.5 -5.5) (layer "B.SilkS") (width 0.1) (tstamp 7f9091c7-ff6d-447c-9f3a-9746d868d137))
  (fp_line (start 11.5 -4.5) (end 11.5 -5.5) (layer "B.SilkS") (width 0.1) (tstamp a666a16e-fe53-4696-9c7b-ea4ca24c2ff6))
  (fp_line (start 41.5 -5.5) (end 41.5 -4.5) (layer "F.SilkS") (width 0.1) (tstamp 533100ce-5396-417e-a7a0-3fa36db031cc))
  (fp_line (start 31.5 -5.5) (end 31.5 -4.5) (layer "F.SilkS") (width 0.1) (tstamp 5928ba24-7795-41ae-a7db-e260855fbba9))
  (fp_line (start 51.5 -5.5) (end 51.5 -4.5) (layer "F.SilkS") (width 0.1) (tstamp 6c5c84ef-4910-4052-b8a0-6d7fab9b48ff))
  (fp_line (start 21.5 -5.5) (end 21.5 -4.5) (layer "F.SilkS") (width 0.1) (tstamp 71f0069c-0e7c-4b9e-906d-2fb0974acb74))
  (fp_line (start 11.5 -5.5) (end 11.5 -4.5) (layer "F.SilkS") (width 0.1) (tstamp e6d92507-49db-48b0-b6e9-8a09564725ab))
  (fp_line (start 61.5 -5.5) (end 61.5 -4.5) (layer "F.SilkS") (width 0.1) (tstamp eda07ec5-2e97-446c-9ae9-38b593f9a02a))
  (fp_line (start 87.6 0) (end 87.6 -7) (layer "Eco1.User") (width 0.1) (tstamp 037aacfe-8d3b-43d9-bc55-d9925800fe4e))
  (fp_line (start -15.7 0) (end -23.7 0) (layer "Eco1.User") (width 0.1) (tstamp 15d7ee5a-102d-47d2-9d5a-5c0eb09885ab))
  (fp_line (start 0.95 0.9) (end 1.45 1.4) (layer "Eco1.User") (width 0.1) (tstamp 1a9a7ca9-a221-4e29-912f-968e6c98fcb4))
  (fp_line (start 3 -6) (end 70 -6) (layer "Eco1.User") (width 0.1) (tstamp 1e98bb46-acbb-42c5-878c-df268d332e82))
  (fp_line (start 30 -7.5) (end 30 -6) (layer "Eco1.User") (width 0.1) (tstamp 3a4b3714-a54c-46f6-b1a7-90a8af4cc4df))
  (fp_line (start 72.15 0.9) (end 72.15 -7) (layer "Eco1.User") (width 0.1) (tstamp 3a71aa6f-9643-4594-8d30-22822a01a56c))
  (fp_line (start 72.15 -7) (end 74.8 -7) (layer "Eco1.User") (width 0.1) (tstamp 415f2ebd-9f43-4a78-b815-8f429641b7c2))
  (fp_line (start -3 -6) (end -10 -6) (layer "Eco1.User") (width 0.1) (tstamp 48fcc0b6-5d31-4baf-9028-8621698e7027))
  (fp_line (start 74.8 0) (end 87.6 0) (layer "Eco1.User") (width 0.1) (tstamp 5d23a908-de7b-4b54-bc23-e046d118b973))
  (fp_line (start -0.95 0.9) (end -0.95 -7.450167) (layer "Eco1.User") (width 0.1) (tstamp 686b5096-4686-4790-959c-6499bbd5fee8))
  (fp_line (start -12.15 0.9) (end -11.65 1.4) (layer "Eco1.User") (width 0.1) (tstamp 6c407d1b-ff91-4e99-997e-bc1f67a75d05))
  (fp_line (start 1.45 1.4) (end 71.65 1.4) (layer "Eco1.User") (width 0.1) (tstamp 8139fff4-e893-4fcb-bbae-b4f7da0da986))
  (fp_line (start -1.449868 1.4) (end -11.65 1.4) (layer "Eco1.User") (width 0.1) (tstamp 88cc3b54-ceb8-4a99-b37c-a64255cfbec8))
  (fp_line (start 74.8 -7) (end 74.8 0) (layer "Eco1.User") (width 0.1) (tstamp 909789d5-70dd-4f99-a822-f66a668fc27d))
  (fp_line (start -12.15 0.9) (end -12.15 -7.5) (layer "Eco1.User") (width 0.1) (tstamp 9feadb49-c951-4220-884e-fb680c61a2e4))
  (fp_line (start 72.15 0.9) (end 71.65 1.4) (layer "Eco1.User") (width 0.1) (tstamp b31c56d5-77c5-4600-8213-f3ce38fb9b98))
  (fp_line (start -15.7 0) (end -15.7 -7.5) (layer "Eco1.User") (width 0.1) (tstamp b5fa8e97-5112-4f19-96a4-d0d16eca9c2d))
  (fp_line (start -23.7 0) (end -23.7 -7.5) (layer "Eco1.User") (width 0.1) (tstamp c834dfea-bacd-414e-aa70-31f1a2258d89))
  (fp_line (start -1.45 1.4) (end -0.95 0.9) (layer "Eco1.User") (width 0.1) (tstamp e06a6b70-bead-4001-84fd-ee06895eca43))
  (fp_line (start 0.95 0.9) (end 0.95 -7.45) (layer "Eco1.User") (width 0.1) (tstamp ffca809e-4da4-4706-9448-40e500ec8cb7))
  (fp_arc (start -0.95 -7.45) (mid 0 -8.4) (end 0.95 -7.45) (layer "Eco1.User") (width 0.1) (tstamp 88f815be-3d2b-4d45-98ea-64e0d1f36f8f))
  (fp_poly (pts
      (xy 72.15 0.1)
      (xy 1 0.1)
      (xy 1 -8.4)
      (xy -1 -8.4)
      (xy -1 0.1)
      (xy -12.15 0.1)
      (xy -12.15 -9)
      (xy 72.15 -9)
    ) (layer "F.CrtYd") (width 0.05) (fill none) (tstamp 816b5eea-35d0-4e2d-ad04-01db531caa94))
  (fp_line (start 0.95 -7.45) (end 0.95 0.9) (layer "F.Fab") (width 0.1) (tstamp 0d075d06-ec5d-4f93-8c31-665701938e34))
  (fp_line (start -12.15 0.9) (end -12.15 -6.2) (layer "F.Fab") (width 0.1) (tstamp 1fc854e3-5200-4b1a-8f2f-a95c226b46f2))
  (fp_line (start -12.15 0.9) (end -11.65 1.4) (layer "F.Fab") (width 0.1) (tstamp 3138e4a1-0ae8-44b7-9c82-27aa7b2d800b))
  (fp_line (start 1.45 1.4) (end 71.65 1.4) (layer "F.Fab") (width 0.1) (tstamp 66d33401-8049-4d26-8aa8-a6e7f80e391d))
  (fp_line (start -0.95 0.9) (end -0.95 -7.45) (layer "F.Fab") (width 0.1) (tstamp 6bbca1c2-6bc6-49db-9671-268d75d152b3))
  (fp_line (start 72.15 0.9) (end 72.15 -6.2) (layer "F.Fab") (width 0.1) (tstamp 78bd1b33-31d0-43dc-b84f-054042b7473b))
  (fp_line (start -1.45 1.4) (end -0.95 0.9) (layer "F.Fab") (width 0.1) (tstamp 870b2036-cf3a-49b6-985d-6a10f553e39e))
  (fp_line (start -11.65 1.4) (end -1.45 1.4) (layer "F.Fab") (width 0.1) (tstamp aec70a90-b248-44a5-81c3-3c097fbb7ac3))
  (fp_line (start 0.95 0.9) (end 1.45 1.4) (layer "F.Fab") (width 0.1) (tstamp bc119471-c5f1-44c4-808f-d5f59b7ea84b))
  (fp_line (start 71.65 1.4) (end 72.15 0.9) (layer "F.Fab") (width 0.1) (tstamp f8136d71-f8bb-42f8-8522-dfbbe0cbfa96))
  (fp_arc (start -0.95 -7.45) (mid 0 -8.4) (end 0.95 -7.45) (layer "F.Fab") (width 0.1) (tstamp 027c70c6-40e2-4010-95b0-4bc475800e36))
  (pad "A1" smd rect (at -11.5 -2.6) (size 0.7 3.2) (layers "B.Cu" "B.Mask") (tstamp 90c51342-5bdb-49e4-9d0a-3ee4d0d826a0))
  (pad "A2" smd rect (at -10.5 -2.1) (size 0.7 4.2) (layers "B.Cu" "B.Mask") (tstamp ace571c0-9e22-4d43-888e-615dd177d994))
  (pad "A3" smd rect (at -9.5 -2.1) (size 0.7 4.2) (layers "B.Cu" "B.Mask") (tstamp 7ab0f597-8cf2-43a6-b5f4-ece7f45b9142))
  (pad "A4" smd rect (at -8.5 -2.1) (size 0.7 4.2) (layers "B.Cu" "B.Mask") (tstamp 3f8875d0-7693-4a08-8e99-10114ab82caf))
  (pad "A5" smd rect (at -7.5 -2.1) (size 0.7 4.2) (layers "B.Cu" "B.Mask") (tstamp 2836d3e5-2868-4ee3-9ed1-6edad029dbbe))
  (pad "A6" smd rect (at -6.5 -2.1) (size 0.7 4.2) (layers "B.Cu" "B.Mask") (tstamp 70a5d938-5c75-4c81-b399-0dea5652f7d4))
  (pad "A7" smd rect (at -5.5 -2.1) (size 0.7 4.2) (layers "B.Cu" "B.Mask") (tstamp 617d9fd1-3bc0-48e5-b992-084f332fe9ec))
  (pad "A8" smd rect (at -4.5 -2.1) (size 0.7 4.2) (layers "B.Cu" "B.Mask") (tstamp bafe5945-0723-4016-afd1-7760a000cd80))
  (pad "A9" smd rect (at -3.5 -2.1) (size 0.7 4.2) (layers "B.Cu" "B.Mask") (tstamp 797e54bb-217f-4f32-be8c-89ac6999ac56))
  (pad "A10" smd rect (at -2.5 -2.1) (size 0.7 4.2) (layers "B.Cu" "B.Mask") (tstamp df1d60ec-e75f-4822-8972-051083867ba8))
  (pad "A11" smd rect (at -1.5 -2.1) (size 0.7 4.2) (layers "B.Cu" "B.Mask") (tstamp adbb3fe3-e7c3-47ec-869c-314d230f86f9))
  (pad "A12" smd rect (at 1.5 -2.1) (size 0.7 4.2) (layers "B.Cu" "B.Mask") (tstamp 2b4605f2-2a04-413c-8b37-1862192a9040))
  (pad "A13" smd rect (at 2.5 -2.1) (size 0.7 4.2) (layers "B.Cu" "B.Mask") (tstamp f2f2b644-4f89-44cf-927b-61882fb483d6))
  (pad "A14" smd rect (at 3.5 -2.1) (size 0.7 4.2) (layers "B.Cu" "B.Mask") (tstamp 2e27a9a5-7990-4a79-9e71-e7de21acab96))
  (pad "A15" smd rect (at 4.5 -2.1) (size 0.7 4.2) (layers "B.Cu" "B.Mask") (tstamp 611006c1-7ac9-4008-9508-c605a84e55ca))
  (pad "A16" smd rect (at 5.5 -2.1) (size 0.7 4.2) (layers "B.Cu" "B.Mask") (tstamp 93237d20-a87e-46ff-8b22-7c55aeb7c9f4))
  (pad "A17" smd rect (at 6.5 -2.1) (size 0.7 4.2) (layers "B.Cu" "B.Mask") (tstamp 0257acd5-9a72-472c-bf00-55c0dd363129))
  (pad "A18" smd rect (at 7.5 -2.1) (size 0.7 4.2) (layers "B.Cu" "B.Mask") (tstamp 8d80d5e0-65b3-4b4a-ad30-fdfd9d4df5a7))
  (pad "A19" smd rect (at 8.5 -2.1) (size 0.7 4.2) (layers "B.Cu" "B.Mask") (tstamp 34f770ba-4dd1-48c6-a574-8d82e743ac05))
  (pad "A20" smd rect (at 9.5 -2.1) (size 0.7 4.2) (layers "B.Cu" "B.Mask") (tstamp 98008ffe-7e9f-4592-94a4-0e3f985a5d4d))
  (pad "A21" smd rect (at 10.5 -2.1) (size 0.7 4.2) (layers "B.Cu" "B.Mask") (tstamp 902cce44-96f3-4b54-9a0c-7119eed55040))
  (pad "A22" smd rect (at 11.5 -2.1) (size 0.7 4.2) (layers "B.Cu" "B.Mask") (tstamp ce135032-aeed-4a3d-8856-bde2ccbe133f))
  (pad "A23" smd rect (at 12.5 -2.1) (size 0.7 4.2) (layers "B.Cu" "B.Mask") (tstamp 22e1bd83-e793-4800-9161-923c393761eb))
  (pad "A24" smd rect (at 13.5 -2.1) (size 0.7 4.2) (layers "B.Cu" "B.Mask") (tstamp b50180df-cd51-44db-b08e-7876e738ff65))
  (pad "A25" smd rect (at 14.5 -2.1) (size 0.7 4.2) (layers "B.Cu" "B.Mask") (tstamp 7fc1b549-f748-466f-94d5-2213ad1d9709))
  (pad "A26" smd rect (at 15.5 -2.1) (size 0.7 4.2) (layers "B.Cu" "B.Mask") (tstamp b2cccde3-7f87-4f5f-9542-e76a7d2c5c3b))
  (pad "A27" smd rect (at 16.5 -2.1) (size 0.7 4.2) (layers "B.Cu" "B.Mask") (tstamp 31207e00-ae67-4e5e-9b34-e7580b9d9668))
  (pad "A28" smd rect (at 17.5 -2.1) (size 0.7 4.2) (layers "B.Cu" "B.Mask") (tstamp 68eec246-126c-41df-bec5-5837081d1eea))
  (pad "A29" smd rect (at 18.5 -2.1) (size 0.7 4.2) (layers "B.Cu" "B.Mask") (tstamp f42b95d3-7fc5-4f03-8189-b26170d92ddf))
  (pad "A30" smd rect (at 19.5 -2.1) (size 0.7 4.2) (layers "B.Cu" "B.Mask") (tstamp 4f168179-0604-4988-82ad-5273d6180820))
  (pad "A31" smd rect (at 20.5 -2.1) (size 0.7 4.2) (layers "B.Cu" "B.Mask") (tstamp 253f819d-c575-4bb1-becc-00c44d71bd7b))
  (pad "A32" smd rect (at 21.5 -2.1) (size 0.7 4.2) (layers "B.Cu" "B.Mask") (tstamp 4ed20f87-74ce-4e01-8b2d-43db4f681652))
  (pad "A33" smd rect (at 22.5 -2.1) (size 0.7 4.2) (layers "B.Cu" "B.Mask") (tstamp 709b2eac-b584-477b-a554-827b06b420e4))
  (pad "A34" smd rect (at 23.5 -2.1) (size 0.7 4.2) (layers "B.Cu" "B.Mask") (tstamp 1a03bb18-33d5-4d6c-a02c-ff4f58bfe869))
  (pad "A35" smd rect (at 24.5 -2.1) (size 0.7 4.2) (layers "B.Cu" "B.Mask") (tstamp 8802a9ba-3286-4a80-8060-0c7f9908bd39))
  (pad "A36" smd rect (at 25.5 -2.1) (size 0.7 4.2) (layers "B.Cu" "B.Mask") (tstamp e11813b1-0a03-4926-b809-0ba2c7c82cc3))
  (pad "A37" smd rect (at 26.5 -2.1) (size 0.7 4.2) (layers "B.Cu" "B.Mask") (tstamp 9f275bdf-c746-4dc6-b38d-a6ddc9afffbc))
  (pad "A38" smd rect (at 27.5 -2.1) (size 0.7 4.2) (layers "B.Cu" "B.Mask") (tstamp c4a7fc35-dc86-40d6-a77b-71eb54f2e8b9))
  (pad "A39" smd rect (at 28.5 -2.1) (size 0.7 4.2) (layers "B.Cu" "B.Mask") (tstamp 00872ae1-ee83-4261-9272-420206dbcf0f))
  (pad "A40" smd rect (at 29.5 -2.1) (size 0.7 4.2) (layers "B.Cu" "B.Mask") (tstamp e5219d5f-2640-4247-92fd-a0c3b0a8df91))
  (pad "A41" smd rect (at 30.5 -2.1) (size 0.7 4.2) (layers "B.Cu" "B.Mask") (tstamp 31690741-63cb-4437-a206-76006709eb4e))
  (pad "A42" smd rect (at 31.5 -2.1) (size 0.7 4.2) (layers "B.Cu" "B.Mask") (tstamp 5c3d3cb3-3ea2-4b24-80c4-b78ddc637bfc))
  (pad "A43" smd rect (at 32.5 -2.1) (size 0.7 4.2) (layers "B.Cu" "B.Mask") (tstamp 95188ef4-d211-44c1-9eb6-ca793bc6ea82))
  (pad "A44" smd rect (at 33.5 -2.1) (size 0.7 4.2) (layers "B.Cu" "B.Mask") (tstamp 2097eabe-26cf-4bae-b252-224c0c45909b))
  (pad "A45" smd rect (at 34.5 -2.1) (size 0.7 4.2) (layers "B.Cu" "B.Mask") (tstamp 65873327-4bc1-4d17-a9cd-edfbe8b01592))
  (pad "A46" smd rect (at 35.5 -2.1) (size 0.7 4.2) (layers "B.Cu" "B.Mask") (tstamp b53a3f85-58f5-492a-8edd-4d29107190ea))
  (pad "A47" smd rect (at 36.5 -2.1) (size 0.7 4.2) (layers "B.Cu" "B.Mask") (tstamp 7ce3d173-ba1f-4415-a0ff-6d60966b5b9f))
  (pad "A48" smd rect (at 37.5 -2.1) (size 0.7 4.2) (layers "B.Cu" "B.Mask") (tstamp 898583c9-beaf-4ec9-a13d-b6cd260eca88))
  (pad "A49" smd rect (at 38.5 -2.1) (size 0.7 4.2) (layers "B.Cu" "B.Mask") (tstamp 3225e8be-f5f0-4746-bf93-ebd7aed35312))
  (pad "A50" smd rect (at 39.5 -2.1) (size 0.7 4.2) (layers "B.Cu" "B.Mask") (tstamp aaf7613a-e0a3-4a9c-9446-cc79ad8b5452))
  (pad "A51" smd rect (at 40.5 -2.1) (size 0.7 4.2) (layers "B.Cu" "B.Mask") (tstamp 0a3b3185-fead-44b5-a7e1-c95bd695c4f1))
  (pad "A52" smd rect (at 41.5 -2.1) (size 0.7 4.2) (layers "B.Cu" "B.Mask") (tstamp cd97ca9a-ec93-4c7c-baae-7cff3105c814))
  (pad "A53" smd rect (at 42.5 -2.1) (size 0.7 4.2) (layers "B.Cu" "B.Mask") (tstamp 2d5931d6-e246-4daa-b194-4dead2f22f0d))
  (pad "A54" smd rect (at 43.5 -2.1) (size 0.7 4.2) (layers "B.Cu" "B.Mask") (tstamp df124260-0ae4-4754-92ac-6ef56dbfa08d))
  (pad "A55" smd rect (at 44.5 -2.1) (size 0.7 4.2) (layers "B.Cu" "B.Mask") (tstamp 88b7ac67-9e6e-4712-a589-8764c1ba22ab))
  (pad "A56" smd rect (at 45.5 -2.1) (size 0.7 4.2) (layers "B.Cu" "B.Mask") (tstamp 55fe539d-8e55-4015-83de-be6de0d66f71))
  (pad "A57" smd rect (at 46.5 -2.1) (size 0.7 4.2) (layers "B.Cu" "B.Mask") (tstamp 391ae093-1d47-45ba-acd6-05174bd74cf1))
  (pad "A58" smd rect (at 47.5 -2.1) (size 0.7 4.2) (layers "B.Cu" "B.Mask") (tstamp 3d3c83b0-948c-4a07-87ae-0c6a55c93401))
  (pad "A59" smd rect (at 48.5 -2.1) (size 0.7 4.2) (layers "B.Cu" "B.Mask") (tstamp 604b395f-3a51-42f1-aaa5-54362c29c1bb))
  (pad "A60" smd rect (at 49.5 -2.1) (size 0.7 4.2) (layers "B.Cu" "B.Mask") (tstamp 73e2e399-fb75-49f6-9a2c-c7ea257eda3f))
  (pad "A61" smd rect (at 50.5 -2.1) (size 0.7 4.2) (layers "B.Cu" "B.Mask") (tstamp b1639388-d4be-4c90-91fc-d0b63440a5e6))
  (pad "A62" smd rect (at 51.5 -2.1) (size 0.7 4.2) (layers "B.Cu" "B.Mask") (tstamp 7ef836f6-0720-4895-9053-c8725c525d8f))
  (pad "A63" smd rect (at 52.5 -2.1) (size 0.7 4.2) (layers "B.Cu" "B.Mask") (tstamp 45746825-14ec-47c5-8299-73107d52a757))
  (pad "A64" smd rect (at 53.5 -2.1) (size 0.7 4.2) (layers "B.Cu" "B.Mask") (tstamp 89a77ba5-e25f-423a-b387-0b7bc7c5ccc8))
  (pad "A65" smd rect (at 54.5 -2.1) (size 0.7 4.2) (layers "B.Cu" "B.Mask") (tstamp 994fdb6c-76d1-4cf7-bece-70092dd788fd))
  (pad "A66" smd rect (at 55.5 -2.1) (size 0.7 4.2) (layers "B.Cu" "B.Mask") (tstamp d20d3d04-8a4f-4ec7-aa51-2454dde8515a))
  (pad "A67" smd rect (at 56.5 -2.1) (size 0.7 4.2) (layers "B.Cu" "B.Mask") (tstamp 0ae268f2-cc08-469a-97c5-bdf2b834f39d))
  (pad "A68" smd rect (at 57.5 -2.1) (size 0.7 4.2) (layers "B.Cu" "B.Mask") (tstamp 3d36de0f-f904-4cbb-b3ee-b4fccfd90ac5))
  (pad "A69" smd rect (at 58.5 -2.1) (size 0.7 4.2) (layers "B.Cu" "B.Mask") (tstamp 74517ba3-f93d-46d5-8dbc-0247f1a237e4))
  (pad "A70" smd rect (at 59.5 -2.1) (size 0.7 4.2) (layers "B.Cu" "B.Mask") (tstamp 5c0a9eed-f552-43f4-9912-1f9c3b2a2d2c))
  (pad "A71" smd rect (at 60.5 -2.1) (size 0.7 4.2) (layers "B.Cu" "B.Mask") (tstamp 44b1a970-fc34-468c-8980-b2d1df68200a))
  (pad "A72" smd rect (at 61.5 -2.1) (size 0.7 4.2) (layers "B.Cu" "B.Mask") (tstamp c49d4e8f-d130-4ef3-b14b-2000101619c3))
  (pad "A73" smd rect (at 62.5 -2.1) (size 0.7 4.2) (layers "B.Cu" "B.Mask") (tstamp c4e47275-1a86-45e3-a4b8-e149f15ff646))
  (pad "A74" smd rect (at 63.5 -2.1) (size 0.7 4.2) (layers "B.Cu" "B.Mask") (tstamp cd0eec0a-0b3a-4482-81c4-677e7d289b4d))
  (pad "A75" smd rect (at 64.5 -2.1) (size 0.7 4.2) (layers "B.Cu" "B.Mask") (tstamp 7c048490-e45c-44c1-a2ae-72140b289df5))
  (pad "A76" smd rect (at 65.5 -2.1) (size 0.7 4.2) (layers "B.Cu" "B.Mask") (tstamp 0700b3eb-e7aa-4878-a3ad-4e277dbcadaf))
  (pad "A77" smd rect (at 66.5 -2.1) (size 0.7 4.2) (layers "B.Cu" "B.Mask") (tstamp 7f30e7d2-776e-45b9-b0c0-3adbaeb3a36f))
  (pad "A78" smd rect (at 67.5 -2.1) (size 0.7 4.2) (layers "B.Cu" "B.Mask") (tstamp 0de26d8e-0ca1-4cb4-9b1a-07b575787740))
  (pad "A79" smd rect (at 68.5 -2.1) (size 0.7 4.2) (layers "B.Cu" "B.Mask") (tstamp b42dc8cc-8d01-49e3-b19a-48d0b68bd4bb))
  (pad "A80" smd rect (at 69.5 -2.1) (size 0.7 4.2) (layers "B.Cu" "B.Mask") (tstamp 22f54939-945d-4ee8-9178-ba82b8ed8816))
  (pad "A81" smd rect (at 70.5 -2.1) (size 0.7 4.2) (layers "B.Cu" "B.Mask") (tstamp 35eb61f4-a19c-4351-acc2-bf3ab87961c2))
  (pad "A82" smd rect (at 71.5 -2.1) (size 0.7 4.2) (layers "B.Cu" "B.Mask") (tstamp 65bd05ab-71e6-4c55-8b3d-81191109e0a9))
  (pad "B1" smd rect (at -11.5 -2.1) (size 0.7 4.2) (layers "F.Cu" "F.Mask") (tstamp 01311f55-1dce-4af0-ac49-ec1078b515c7))
  (pad "B2" smd rect (at -10.5 -2.1) (size 0.7 4.2) (layers "F.Cu" "F.Mask") (tstamp 152d385e-4185-4744-825e-fe393de45acf))
  (pad "B3" smd rect (at -9.5 -2.1) (size 0.7 4.2) (layers "F.Cu" "F.Mask") (tstamp 5a104e2c-b9da-4df6-be9c-f72ab8636bb7))
  (pad "B4" smd rect (at -8.5 -2.1) (size 0.7 4.2) (layers "F.Cu" "F.Mask") (tstamp 333ba84b-7e40-4a31-b522-7457189828ff))
  (pad "B5" smd rect (at -7.5 -2.1) (size 0.7 4.2) (layers "F.Cu" "F.Mask") (tstamp c5a9cf58-e995-43ff-b1ba-2b1f732ddb6a))
  (pad "B6" smd rect (at -6.5 -2.1) (size 0.7 4.2) (layers "F.Cu" "F.Mask") (tstamp 334fb832-67ef-42ff-b349-510a52a8bc63))
  (pad "B7" smd rect (at -5.5 -2.1) (size 0.7 4.2) (layers "F.Cu" "F.Mask") (tstamp e86cdb6d-8fcb-4703-8702-04d846368c51))
  (pad "B8" smd rect (at -4.5 -2.1) (size 0.7 4.2) (layers "F.Cu" "F.Mask") (tstamp 74460c8c-b51b-41c1-806e-52030eb36ded))
  (pad "B9" smd rect (at -3.5 -2.1) (size 0.7 4.2) (layers "F.Cu" "F.Mask") (tstamp 10a40389-afe0-4b8f-a24d-fef342ab587d))
  (pad "B10" smd rect (at -2.5 -2.1) (size 0.7 4.2) (layers "F.Cu" "F.Mask") (tstamp 0b84f848-7bb1-4037-ad7e-c024acfd609d))
  (pad "B11" smd rect (at -1.5 -2.1) (size 0.7 4.2) (layers "F.Cu" "F.Mask") (tstamp ad84e2b1-f796-41f8-8bb8-93fa473ca491))
  (pad "B12" smd rect (at 1.5 -2.1) (size 0.7 4.2) (layers "F.Cu" "F.Mask") (tstamp 44912d36-659c-4777-946c-9b01755a257c))
  (pad "B13" smd rect (at 2.5 -2.1) (size 0.7 4.2) (layers "F.Cu" "F.Mask") (tstamp 0b3bea37-5281-4a8a-9628-0e655931d3b8))
  (pad "B14" smd rect (at 3.5 -2.1) (size 0.7 4.2) (layers "F.Cu" "F.Mask") (tstamp a04179c5-d115-45e3-96c0-0d7d3344d1fe))
  (pad "B15" smd rect (at 4.5 -2.1) (size 0.7 4.2) (layers "F.Cu" "F.Mask") (tstamp 813c9163-be15-48fd-b989-c472d8bb2e29))
  (pad "B16" smd rect (at 5.5 -2.1) (size 0.7 4.2) (layers "F.Cu" "F.Mask") (tstamp ce0e966d-785d-4f77-be93-77db23da4973))
  (pad "B17" smd rect (at 6.5 -2.1) (size 0.7 4.2) (layers "F.Cu" "F.Mask") (tstamp b15ac739-4808-44fc-b552-50ea4a74a933))
  (pad "B18" smd rect (at 7.5 -2.1) (size 0.7 4.2) (layers "F.Cu" "F.Mask") (tstamp c2930b2b-4f5d-4f88-8f56-ac5588b2f43d))
  (pad "B19" smd rect (at 8.5 -2.1) (size 0.7 4.2) (layers "F.Cu" "F.Mask") (tstamp 5bea09a5-c86b-44b9-86bc-2b76447383ca))
  (pad "B20" smd rect (at 9.5 -2.1) (size 0.7 4.2) (layers "F.Cu" "F.Mask") (tstamp 009f4c47-f8b0-4d94-aa18-1cdccd32e48f))
  (pad "B21" smd rect (at 10.5 -2.1) (size 0.7 4.2) (layers "F.Cu" "F.Mask") (tstamp ccac81b8-e494-462b-97ef-cd64edba6484))
  (pad "B22" smd rect (at 11.5 -2.1) (size 0.7 4.2) (layers "F.Cu" "F.Mask") (tstamp a905ecbc-eb26-4028-8bb6-cb935d827930))
  (pad "B23" smd rect (at 12.5 -2.1) (size 0.7 4.2) (layers "F.Cu" "F.Mask") (tstamp 55acd476-f4ae-4b4b-9988-ea0a503c15b6))
  (pad "B24" smd rect (at 13.5 -2.1) (size 0.7 4.2) (layers "F.Cu" "F.Mask") (tstamp 02d0b8a2-f9e6-4d31-b345-6539afad3b79))
  (pad "B25" smd rect (at 14.5 -2.1) (size 0.7 4.2) (layers "F.Cu" "F.Mask") (tstamp 1e21d307-bd76-4139-b7e1-4572cfe04a6f))
  (pad "B26" smd rect (at 15.5 -2.1) (size 0.7 4.2) (layers "F.Cu" "F.Mask") (tstamp 6a00e085-e4fd-4581-b8a2-61b2ac5a1b86))
  (pad "B27" smd rect (at 16.5 -2.1) (size 0.7 4.2) (layers "F.Cu" "F.Mask") (tstamp 72865d5f-d2cf-459d-b303-30c6c3d47d5f))
  (pad "B28" smd rect (at 17.5 -2.1) (size 0.7 4.2) (layers "F.Cu" "F.Mask") (tstamp 3af194cc-e3e8-4440-9933-60a110d2a27c))
  (pad "B29" smd rect (at 18.5 -2.1) (size 0.7 4.2) (layers "F.Cu" "F.Mask") (tstamp 05784135-3e85-4857-b352-dd85af443b8e))
  (pad "B30" smd rect (at 19.5 -2.1) (size 0.7 4.2) (layers "F.Cu" "F.Mask") (tstamp 9cca385e-f61c-491c-b7e4-1d9e571bd1d6))
  (pad "B31" smd rect (at 20.5 -2.1) (size 0.7 4.2) (layers "F.Cu" "F.Mask") (tstamp d97b6552-c76d-4d27-a395-781f96e0a562))
  (pad "B32" smd rect (at 21.5 -2.1) (size 0.7 4.2) (layers "F.Cu" "F.Mask") (tstamp 9e1eea4a-c4b3-44cc-9364-ab09772e25a0))
  (pad "B33" smd rect (at 22.5 -2.1) (size 0.7 4.2) (layers "F.Cu" "F.Mask") (tstamp acf2a0bc-6371-4be0-b624-d51f4de6619b))
  (pad "B34" smd rect (at 23.5 -2.1) (size 0.7 4.2) (layers "F.Cu" "F.Mask") (tstamp 92f7741a-6c26-4e8e-a78a-2d1f7cf5ed08))
  (pad "B35" smd rect (at 24.5 -2.1) (size 0.7 4.2) (layers "F.Cu" "F.Mask") (tstamp 316311da-63a2-48f2-ae02-cc50306a8845))
  (pad "B36" smd rect (at 25.5 -2.1) (size 0.7 4.2) (layers "F.Cu" "F.Mask") (tstamp 81f48ccf-6c1e-4f88-bb9a-3261443ee2b1))
  (pad "B37" smd rect (at 26.5 -2.1) (size 0.7 4.2) (layers "F.Cu" "F.Mask") (tstamp a6c39b19-6352-4ebf-b4c6-08c0b5ea674c))
  (pad "B38" smd rect (at 27.5 -2.1) (size 0.7 4.2) (layers "F.Cu" "F.Mask") (tstamp 8fd9250a-5351-4547-9974-adfed98fdbaa))
  (pad "B39" smd rect (at 28.5 -2.1) (size 0.7 4.2) (layers "F.Cu" "F.Mask") (tstamp 365db273-80f6-4113-a053-56c72f3d6ee1))
  (pad "B40" smd rect (at 29.5 -2.1) (size 0.7 4.2) (layers "F.Cu" "F.Mask") (tstamp 26d11f06-5cdc-4ae1-a15d-e71b951a5f0b))
  (pad "B41" smd rect (at 30.5 -2.1) (size 0.7 4.2) (layers "F.Cu" "F.Mask") (tstamp def344f7-4dbc-4ecb-bc8a-ba0274243cf4))
  (pad "B42" smd rect (at 31.5 -2.1) (size 0.7 4.2) (layers "F.Cu" "F.Mask") (tstamp 5428c2da-33a4-400a-b41a-6cc4b6df28ff))
  (pad "B43" smd rect (at 32.5 -2.1) (size 0.7 4.2) (layers "F.Cu" "F.Mask") (tstamp f49c7ce4-787b-4b0e-83c4-dbaa48268ae0))
  (pad "B44" smd rect (at 33.5 -2.1) (size 0.7 4.2) (layers "F.Cu" "F.Mask") (tstamp 4a5b26dd-c9a2-4130-b408-1984a4894bcb))
  (pad "B45" smd rect (at 34.5 -2.1) (size 0.7 4.2) (layers "F.Cu" "F.Mask") (tstamp f42a3a71-2dd0-415c-9f3f-4358ce2f0404))
  (pad "B46" smd rect (at 35.5 -2.1) (size 0.7 4.2) (layers "F.Cu" "F.Mask") (tstamp 1614c5f8-ac77-4d1e-99f6-da0207c4b6d4))
  (pad "B47" smd rect (at 36.5 -2.1) (size 0.7 4.2) (layers "F.Cu" "F.Mask") (tstamp d4d2b043-c978-47c1-be5f-a3e38aaa8a2c))
  (pad "B48" smd rect (at 37.5 -2.1) (size 0.7 4.2) (layers "F.Cu" "F.Mask") (tstamp da65c1e4-f747-4cc8-bbcb-549ed67a6a50))
  (pad "B49" smd rect (at 38.5 -2.1) (size 0.7 4.2) (layers "F.Cu" "F.Mask") (tstamp 12a897c0-a5f1-4e94-8eb1-30a8bcd72150))
  (pad "B50" smd rect (at 39.5 -2.1) (size 0.7 4.2) (layers "F.Cu" "F.Mask") (tstamp 88f8defe-2409-4b55-9f58-218de9fd8bdb))
  (pad "B51" smd rect (at 40.5 -2.1) (size 0.7 4.2) (layers "F.Cu" "F.Mask") (tstamp 97688a32-a56b-4b7b-82f4-37534e7143e4))
  (pad "B52" smd rect (at 41.5 -2.1) (size 0.7 4.2) (layers "F.Cu" "F.Mask") (tstamp f05f3e3e-5d21-4491-aedb-64df84e8a6c7))
  (pad "B53" smd rect (at 42.5 -2.1) (size 0.7 4.2) (layers "F.Cu" "F.Mask") (tstamp 9d1142c4-6ac1-4951-9db9-558b67ab15b0))
  (pad "B54" smd rect (at 43.5 -2.1) (size 0.7 4.2) (layers "F.Cu" "F.Mask") (tstamp 5e984999-bbed-472a-854c-3e1589ea2646))
  (pad "B55" smd rect (at 44.5 -2.1) (size 0.7 4.2) (layers "F.Cu" "F.Mask") (tstamp aa8d6a7e-5bfe-4077-8591-ad33b6d0db58))
  (pad "B56" smd rect (at 45.5 -2.1) (size 0.7 4.2) (layers "F.Cu" "F.Mask") (tstamp bc8fbd7e-c279-4b37-bdfa-fcb3110c88ac))
  (pad "B57" smd rect (at 46.5 -2.1) (size 0.7 4.2) (layers "F.Cu" "F.Mask") (tstamp 27300241-a701-43d6-b824-fb1808963269))
  (pad "B58" smd rect (at 47.5 -2.1) (size 0.7 4.2) (layers "F.Cu" "F.Mask") (tstamp 6241eb7d-2962-4f37-adf0-2b7cca35eefc))
  (pad "B59" smd rect (at 48.5 -2.1) (size 0.7 4.2) (layers "F.Cu" "F.Mask") (tstamp 1360212f-e2ba-485a-8efb-69da32242558))
  (pad "B60" smd rect (at 49.5 -2.1) (size 0.7 4.2) (layers "F.Cu" "F.Mask") (tstamp a10061bc-ca29-4f45-b5f9-e736f48cdfd5))
  (pad "B61" smd rect (at 50.5 -2.1) (size 0.7 4.2) (layers "F.Cu" "F.Mask") (tstamp 15ca9b48-0637-4287-9722-f8b6eb74c1ff))
  (pad "B62" smd rect (at 51.5 -2.1) (size 0.7 4.2) (layers "F.Cu" "F.Mask") (tstamp 6aad6d40-a76b-4daa-a73b-b980de45ba5c))
  (pad "B63" smd rect (at 52.5 -2.1) (size 0.7 4.2) (layers "F.Cu" "F.Mask") (tstamp 670f8c04-a5cd-4fcd-89e3-6c1fa5ca5518))
  (pad "B64" smd rect (at 53.5 -2.1) (size 0.7 4.2) (layers "F.Cu" "F.Mask") (tstamp 630a7eee-a472-4dda-9bb6-1601cc6ed4eb))
  (pad "B65" smd rect (at 54.5 -2.1) (size 0.7 4.2) (layers "F.Cu" "F.Mask") (tstamp 1c5753e4-25ad-4c0b-afdb-3f7c7e5ffdb3))
  (pad "B66" smd rect (at 55.5 -2.1) (size 0.7 4.2) (layers "F.Cu" "F.Mask") (tstamp e4bc7af4-2938-4771-8743-2d171d7b7406))
  (pad "B67" smd rect (at 56.5 -2.1) (size 0.7 4.2) (layers "F.Cu" "F.Mask") (tstamp cf0d6fd1-e4ed-4d65-a554-8462a0854ce8))
  (pad "B68" smd rect (at 57.5 -2.1) (size 0.7 4.2) (layers "F.Cu" "F.Mask") (tstamp 162eceb0-9f2e-436d-ac60-a22e2a4ab05e))
  (pad "B69" smd rect (at 58.5 -2.1) (size 0.7 4.2) (layers "F.Cu" "F.Mask") (tstamp 8c4c9ecf-f10a-427a-870e-6b0d1d729e83))
  (pad "B70" smd rect (at 59.5 -2.1) (size 0.7 4.2) (layers "F.Cu" "F.Mask") (tstamp 4a9038cf-b565-4a76-8976-3f65afc5d7b8))
  (pad "B71" smd rect (at 60.5 -2.1) (size 0.7 4.2) (layers "F.Cu" "F.Mask") (tstamp 33e9c3dc-f236-48b1-9702-55c1ec1fdc98))
  (pad "B72" smd rect (at 61.5 -2.1) (size 0.7 4.2) (layers "F.Cu" "F.Mask") (tstamp e6566953-e1d6-40a5-a428-08d6b4022f26))
  (pad "B73" smd rect (at 62.5 -2.1) (size 0.7 4.2) (layers "F.Cu" "F.Mask") (tstamp ae107dff-e66c-41cb-b78e-d1599c3ee77a))
  (pad "B74" smd rect (at 63.5 -2.1) (size 0.7 4.2) (layers "F.Cu" "F.Mask") (tstamp 80bff7fd-e1a6-4bd3-96db-f93d73dbe354))
  (pad "B75" smd rect (at 64.5 -2.1) (size 0.7 4.2) (layers "F.Cu" "F.Mask") (tstamp 857813c1-500f-4015-8c90-530eb0f3d259))
  (pad "B76" smd rect (at 65.5 -2.1) (size 0.7 4.2) (layers "F.Cu" "F.Mask") (tstamp ea2a1c3f-b882-48e9-b734-946ae6ee6851))
  (pad "B77" smd rect (at 66.5 -2.1) (size 0.7 4.2) (layers "F.Cu" "F.Mask") (tstamp b77ab999-114d-4ed1-89a5-b75eda6342ec))
  (pad "B78" smd rect (at 67.5 -2.1) (size 0.7 4.2) (layers "F.Cu" "F.Mask") (tstamp 89d7d7af-833c-4224-84cd-cf728e8660ea))
  (pad "B79" smd rect (at 68.5 -2.1) (size 0.7 4.2) (layers "F.Cu" "F.Mask") (tstamp 7b60fcba-2a90-404e-8a87-1bd15a043c9b))
  (pad "B80" smd rect (at 69.5 -2.1) (size 0.7 4.2) (layers "F.Cu" "F.Mask") (tstamp 81fa4eea-3e26-4576-9515-fe392d3ad108))
  (pad "B81" smd rect (at 70.5 -2.6) (size 0.7 3.2) (layers "F.Cu" "F.Mask") (tstamp 88b6dc66-567c-402d-aec2-d8a77b3bacc6))
  (pad "B82" smd rect (at 71.5 -2.1) (size 0.7 4.2) (layers "F.Cu" "F.Mask") (tstamp 2f142953-23b3-4d46-852f-51dfb17fb2f8))
  (zone (net 0) (net_name "") (layers "In1.Cu" "In2.Cu" "In3.Cu" "In4.Cu" "In5.Cu" "In6.Cu" "In7.Cu" "In8.Cu" "In9.Cu" "In10.Cu" "In11.Cu" "In12.Cu" "In13.Cu" "In14.Cu" "In15.Cu" "In16.Cu" "In17.Cu" "In18.Cu" "In19.Cu" "In20.Cu" "In21.Cu" "In22.Cu" "In23.Cu" "In24.Cu" "In25.Cu" "In26.Cu" "In27.Cu" "In28.Cu" "In29.Cu" "In30.Cu" "F.CrtYd") (tstamp 3855a121-7039-44db-a4dc-e928306d9d51) (hatch edge 0.508)
    (connect_pads (clearance 0))
    (min_thickness 0.254)
    (keepout (tracks allowed) (vias allowed) (pads allowed) (copperpour not_allowed) (footprints allowed))
    (fill (thermal_gap 0.508) (thermal_bridge_width 0.508))
    (polygon
      (pts
        (xy 71.9 0.7)
        (xy 71.5 1.1)
        (xy 1.5 1.1)
        (xy 1.1 0.7)
        (xy 1.1 -4.2)
        (xy 71.9 -4.2)
      )
    )
  )
  (zone (net 0) (net_name "") (layers "In1.Cu" "In2.Cu" "In3.Cu" "In4.Cu" "In5.Cu" "In6.Cu" "In7.Cu" "In8.Cu" "In9.Cu" "In10.Cu" "In11.Cu" "In12.Cu" "In13.Cu" "In14.Cu" "In15.Cu" "In16.Cu" "In17.Cu" "In18.Cu" "In19.Cu" "In20.Cu" "In21.Cu" "In22.Cu" "In23.Cu" "In24.Cu" "In25.Cu" "In26.Cu" "In27.Cu" "In28.Cu" "In29.Cu" "In30.Cu" "F.CrtYd") (tstamp db6d1163-35f0-457e-9b69-04ae8de74eb4) (hatch edge 0.508)
    (connect_pads (clearance 0))
    (min_thickness 0.254)
    (keepout (tracks allowed) (vias allowed) (pads allowed) (copperpour not_allowed) (footprints allowed))
    (fill (thermal_gap 0.508) (thermal_bridge_width 0.508))
    (polygon
      (pts
        (xy -1.1 0.7)
        (xy -1.5 1.1)
        (xy -11.6 1.1)
        (xy -11.9 0.8)
        (xy -11.9 -4.2)
        (xy -1.1 -4.2)
      )
    )
  )
  (model "${KICADLIB}/model/connector/TE_5-2337939-8.stp"
    (offset (xyz 30 6 -0.85))
    (scale (xyz 1 1 1))
    (rotate (xyz -90 0 180))
  )
)
