(footprint "PinHeader_2x05_P2.54mm_Vertical" (version 20210722) (generator pcbnew) (layer "F.Cu")
  (tedit 6116C8C6)
  (descr "Through hole straight pin header, 2x05, 2.54mm pitch, double rows")
  (tags "Through hole pin header THT 2x05 2.54mm double row")
  (attr through_hole)
  (fp_text reference "REF**" (at 1.27 -2.33) (layer "F.SilkS")
    (effects (font (size 1 1) (thickness 0.15)))
    (tstamp 6dd3f4b4-9e8f-4cb8-8ebe-9fd7766eae35)
  )
  (fp_text value "PinHeader_2x05_P2.54mm_Vertical" (at 1.27 12.49) (layer "F.Fab") hide
    (effects (font (size 1 1) (thickness 0.15)))
    (tstamp 875b6075-8d0b-4e4c-ab69-8b106605856e)
  )
  (fp_text user "${REFERENCE}" (at 1.27 5.08 90) (layer "F.Fab")
    (effects (font (size 1 1) (thickness 0.15)))
    (tstamp 452f8b78-d9cd-47b0-905b-15f6386a4941)
  )
  (fp_line (start -1.33 0) (end -1.33 -1.33) (layer "F.SilkS") (width 0.12) (tstamp 46af9175-97a1-408f-bc56-91bba89d2708))
  (fp_line (start -1.33 11.49) (end 3.87 11.49) (layer "F.SilkS") (width 0.12) (tstamp 674f25bf-9dc9-410d-a8e4-dbd00e6371d0))
  (fp_line (start 1.27 1.27) (end 1.27 -1.33) (layer "F.SilkS") (width 0.12) (tstamp 7bd47100-32fa-475f-9f79-c1f2b8b899c9))
  (fp_line (start 3.87 -1.33) (end 3.87 11.49) (layer "F.SilkS") (width 0.12) (tstamp 960a9e6f-24af-4cf7-9f4b-6ced81268f67))
  (fp_line (start 1.27 -1.33) (end 3.87 -1.33) (layer "F.SilkS") (width 0.12) (tstamp ab34424f-3995-477d-8731-4864da784196))
  (fp_line (start -1.33 1.27) (end -1.33 11.49) (layer "F.SilkS") (width 0.12) (tstamp bb144e2d-df0a-4c99-8deb-38c941158069))
  (fp_line (start -1.33 -1.33) (end 0 -1.33) (layer "F.SilkS") (width 0.12) (tstamp ef421177-169c-4def-bd77-525b91d7ee93))
  (fp_line (start -1.33 1.27) (end 1.27 1.27) (layer "F.SilkS") (width 0.12) (tstamp fa8b298b-34ac-4419-bbf5-f14ec998491e))
  (fp_line (start 4.35 11.95) (end 4.35 -1.8) (layer "F.CrtYd") (width 0.05) (tstamp 3cd383e4-e6ca-4766-9362-b08dcc04f856))
  (fp_line (start -1.8 -1.8) (end -1.8 11.95) (layer "F.CrtYd") (width 0.05) (tstamp 4d11007e-11e3-4697-bced-2041b81f67f3))
  (fp_line (start -1.8 11.95) (end 4.35 11.95) (layer "F.CrtYd") (width 0.05) (tstamp e64896af-4615-4f0f-985e-a81a420e8d52))
  (fp_line (start 4.35 -1.8) (end -1.8 -1.8) (layer "F.CrtYd") (width 0.05) (tstamp f1ca31e5-fd31-4258-aa4c-5dbd64b70462))
  (fp_line (start -1.27 0) (end 0 -1.27) (layer "F.Fab") (width 0.1) (tstamp 4a5f1b1f-0a05-4cf4-90fc-49fd51bb49a0))
  (fp_line (start 0 -1.27) (end 3.81 -1.27) (layer "F.Fab") (width 0.1) (tstamp 6c41ed8b-6a8b-4a55-9d5d-9204711f66c1))
  (fp_line (start -1.27 11.43) (end -1.27 0) (layer "F.Fab") (width 0.1) (tstamp b0b9742b-b87a-40c5-a3ae-9ad94ef08482))
  (fp_line (start 3.81 -1.27) (end 3.81 11.43) (layer "F.Fab") (width 0.1) (tstamp c7736f64-537c-42a6-978b-b1c8cc8e8479))
  (fp_line (start 3.81 11.43) (end -1.27 11.43) (layer "F.Fab") (width 0.1) (tstamp d8c4af36-5c35-4f62-86fb-62454a54326a))
  (pad "1" thru_hole rect (at 0 0) (size 1.7 1.7) (drill 1) (layers *.Cu *.Mask) (tstamp a0970828-57e0-4982-a1f3-c10bf32feeaf))
  (pad "2" thru_hole oval (at 2.54 0) (size 1.7 1.7) (drill 1) (layers *.Cu *.Mask) (tstamp 52120e11-e6d3-4717-8fd5-17487060e9ee))
  (pad "3" thru_hole oval (at 0 2.54) (size 1.7 1.7) (drill 1) (layers *.Cu *.Mask) (tstamp d9aed132-5621-4d85-a0ef-fb3e2cf3bd3b))
  (pad "4" thru_hole oval (at 2.54 2.54) (size 1.7 1.7) (drill 1) (layers *.Cu *.Mask) (tstamp 690bc047-5274-4564-99aa-42375be944e1))
  (pad "5" thru_hole oval (at 0 5.08) (size 1.7 1.7) (drill 1) (layers *.Cu *.Mask) (tstamp 13f1ad3b-7f7c-4545-8d64-1e4b22838aa0))
  (pad "6" thru_hole oval (at 2.54 5.08) (size 1.7 1.7) (drill 1) (layers *.Cu *.Mask) (tstamp 1c52272d-1e5b-492f-bc97-68643f9b23f4))
  (pad "7" thru_hole oval (at 0 7.62) (size 1.7 1.7) (drill 1) (layers *.Cu *.Mask) (tstamp 9193a922-4f00-4a01-bce0-d7d22de547ac))
  (pad "8" thru_hole oval (at 2.54 7.62) (size 1.7 1.7) (drill 1) (layers *.Cu *.Mask) (tstamp cc5523a6-b705-4c68-aec1-3e8e0f37529d))
  (pad "9" thru_hole oval (at 0 10.16) (size 1.7 1.7) (drill 1) (layers *.Cu *.Mask) (tstamp 91e2960b-9354-477e-abb1-ba5c76fb23c5))
  (pad "10" thru_hole oval (at 2.54 10.16) (size 1.7 1.7) (drill 1) (layers *.Cu *.Mask) (tstamp 2db35c7e-2419-451b-a55c-752c8686d194))
  (model "${KICADLIB}/model/connector/PinHeader_2x05_P2.54mm_Vertical.step"
    (offset (xyz 0 0 0))
    (scale (xyz 1 1 1))
    (rotate (xyz 0 0 0))
  )
)
