(footprint "PinHeader_1x10_P2.54mm_Vertical" (version 20211014) (generator pcbnew)
  (layer "F.Cu")
  (tedit 6116C7AA)
  (descr "Through hole straight pin header, 1x10, 2.54mm pitch, single row")
  (tags "Through hole pin header THT 1x10 2.54mm single row")
  (attr through_hole)
  (fp_text reference "REF**" (at 0 -2.33) (layer "F.SilkS")
    (effects (font (size 1 1) (thickness 0.15)))
    (tstamp 9f26ae3a-ca1d-47e2-8079-c7764f90562e)
  )
  (fp_text value "PinHeader_1x10_P2.54mm_Vertical" (at 0 25.19) (layer "F.Fab") hide
    (effects (font (size 1 1) (thickness 0.15)))
    (tstamp 66d923ba-deb2-4607-a7c3-149620f48365)
  )
  (fp_text user "${REFERENCE}" (at 0 11.43 90) (layer "F.Fab")
    (effects (font (size 1 1) (thickness 0.15)))
    (tstamp fee991e5-972c-4126-8e51-83db3875007b)
  )
  (fp_line (start -1.33 1.27) (end 1.33 1.27) (layer "F.SilkS") (width 0.12) (tstamp 26d79b3a-92f5-43af-920d-18dccd87c46d))
  (fp_line (start -1.33 1.27) (end -1.33 24.19) (layer "F.SilkS") (width 0.12) (tstamp 4726b3c7-9727-4d65-a310-317232fa74f5))
  (fp_line (start -1.33 0) (end -1.33 -1.33) (layer "F.SilkS") (width 0.12) (tstamp 9a0c09cb-7260-4441-a811-051b0d11b7a9))
  (fp_line (start -1.33 -1.33) (end 0 -1.33) (layer "F.SilkS") (width 0.12) (tstamp a2ca149b-7ed7-4667-aca1-9f83c44ad9e0))
  (fp_line (start 1.33 1.27) (end 1.33 24.19) (layer "F.SilkS") (width 0.12) (tstamp d3d081a4-7053-47f0-8446-78548f1efd8c))
  (fp_line (start -1.33 24.19) (end 1.33 24.19) (layer "F.SilkS") (width 0.12) (tstamp fc469afb-806c-4e74-95d0-e228ad86cc77))
  (fp_line (start -1.8 -1.8) (end -1.8 24.65) (layer "F.CrtYd") (width 0.05) (tstamp 054dff24-cdfe-4394-9eed-bf09100dafdf))
  (fp_line (start 1.8 -1.8) (end -1.8 -1.8) (layer "F.CrtYd") (width 0.05) (tstamp 2e46795d-d23d-4e57-afb8-c7e24b638c07))
  (fp_line (start 1.8 24.65) (end 1.8 -1.8) (layer "F.CrtYd") (width 0.05) (tstamp a146509c-beb2-4009-aded-b7207b71d66c))
  (fp_line (start -1.8 24.65) (end 1.8 24.65) (layer "F.CrtYd") (width 0.05) (tstamp f0ac7492-0dd3-46c2-ae6a-59a0007674ab))
  (fp_line (start 1.27 -1.27) (end 1.27 24.13) (layer "F.Fab") (width 0.1) (tstamp 0b1ef124-e092-443b-a65a-9d0e10055ac8))
  (fp_line (start -1.27 -0.635) (end -0.635 -1.27) (layer "F.Fab") (width 0.1) (tstamp 58c154ee-9eed-4dbe-b764-a73f4a488849))
  (fp_line (start -1.27 24.13) (end -1.27 -0.635) (layer "F.Fab") (width 0.1) (tstamp 59aabccf-9fe7-4547-b586-48161ea03294))
  (fp_line (start 1.27 24.13) (end -1.27 24.13) (layer "F.Fab") (width 0.1) (tstamp 79ee1f7a-caa2-4caf-95cb-47f94841c047))
  (fp_line (start -0.635 -1.27) (end 1.27 -1.27) (layer "F.Fab") (width 0.1) (tstamp b3f099f5-a8e0-4cb7-8579-472f297e4c81))
  (pad "1" thru_hole rect (at 0 0) (size 1.7 1.7) (drill 1) (layers *.Cu *.Mask) (tstamp fdb94d49-06c8-44fe-befe-42abf2b190cc))
  (pad "2" thru_hole oval (at 0 2.54) (size 1.7 1.7) (drill 1) (layers *.Cu *.Mask) (tstamp 54e44425-a83d-46ff-9eb2-70049164cbb8))
  (pad "3" thru_hole oval (at 0 5.08) (size 1.7 1.7) (drill 1) (layers *.Cu *.Mask) (tstamp bf93db3c-af02-492d-9de7-abc22f498532))
  (pad "4" thru_hole oval (at 0 7.62) (size 1.7 1.7) (drill 1) (layers *.Cu *.Mask) (tstamp c72cacd5-64ee-4bb5-a021-6cac3bfdf9d5))
  (pad "5" thru_hole oval (at 0 10.16) (size 1.7 1.7) (drill 1) (layers *.Cu *.Mask) (tstamp 86912ba3-e874-4d92-a74d-cb04804fea84))
  (pad "6" thru_hole oval (at 0 12.7) (size 1.7 1.7) (drill 1) (layers *.Cu *.Mask) (tstamp 9957190c-e9e2-453e-af94-1edf67257ca1))
  (pad "7" thru_hole oval (at 0 15.24) (size 1.7 1.7) (drill 1) (layers *.Cu *.Mask) (tstamp c656d0c1-05f3-4592-9554-725d70f6cba0))
  (pad "8" thru_hole oval (at 0 17.78) (size 1.7 1.7) (drill 1) (layers *.Cu *.Mask) (tstamp 12d1d070-3128-4487-a7f7-187f5349c029))
  (pad "9" thru_hole oval (at 0 20.32) (size 1.7 1.7) (drill 1) (layers *.Cu *.Mask) (tstamp 9bf38197-09f7-4f37-950e-cfc3b106ac3e))
  (pad "10" thru_hole oval (at 0 22.86) (size 1.7 1.7) (drill 1) (layers *.Cu *.Mask) (tstamp 312f104a-5447-4974-9e66-c39605c896c9))
  (model "${KICADLIB}/model/connector/PinHeader_1x10_P2.54mm_Vertical.step"
    (offset (xyz 0 0 0))
    (scale (xyz 1 1 1))
    (rotate (xyz 0 0 0))
  )
)
