(footprint "PinHeader_1x07_P2.54mm_Vertical" (version 20211014) (generator pcbnew)
  (layer "F.Cu")
  (tedit 6116C795)
  (descr "Through hole straight pin header, 1x07, 2.54mm pitch, single row")
  (tags "Through hole pin header THT 1x07 2.54mm single row")
  (attr through_hole)
  (fp_text reference "REF**" (at 0 -2.33) (layer "F.SilkS")
    (effects (font (size 1 1) (thickness 0.15)))
    (tstamp ba875b90-935d-4943-ad65-6333967ffa56)
  )
  (fp_text value "PinHeader_1x07_P2.54mm_Vertical" (at 0 17.57) (layer "F.Fab") hide
    (effects (font (size 1 1) (thickness 0.15)))
    (tstamp e6f41b03-8e9a-417b-9deb-9d383d34ca66)
  )
  (fp_text user "${REFERENCE}" (at 0 7.62 90) (layer "F.Fab")
    (effects (font (size 1 1) (thickness 0.15)))
    (tstamp c26d323c-e74e-4888-bd40-5e4155aed369)
  )
  (fp_line (start -1.33 16.57) (end 1.33 16.57) (layer "F.SilkS") (width 0.12) (tstamp 2664f5f0-4705-4967-9b4c-52b48b9a50a6))
  (fp_line (start 1.33 1.27) (end 1.33 16.57) (layer "F.SilkS") (width 0.12) (tstamp 41e9a5a4-1286-4960-9a49-5efd81b71dd7))
  (fp_line (start -1.33 -1.33) (end 0 -1.33) (layer "F.SilkS") (width 0.12) (tstamp 49ab47e6-06ad-4a72-b3fb-d5942361b29c))
  (fp_line (start -1.33 1.27) (end 1.33 1.27) (layer "F.SilkS") (width 0.12) (tstamp 4b610287-861c-4fc1-a572-3979aa5e271b))
  (fp_line (start -1.33 0) (end -1.33 -1.33) (layer "F.SilkS") (width 0.12) (tstamp 82e0ad18-cfde-4c8b-bf96-02b2e075871e))
  (fp_line (start -1.33 1.27) (end -1.33 16.57) (layer "F.SilkS") (width 0.12) (tstamp 85a1d8f0-5b3e-4e22-8432-da8830022794))
  (fp_line (start -1.8 17.05) (end 1.8 17.05) (layer "F.CrtYd") (width 0.05) (tstamp 062d35eb-49e7-4006-8d1c-6cf7349ced65))
  (fp_line (start 1.8 -1.8) (end -1.8 -1.8) (layer "F.CrtYd") (width 0.05) (tstamp 6732107c-3fcf-42fe-a99f-50603ce7edd6))
  (fp_line (start -1.8 -1.8) (end -1.8 17.05) (layer "F.CrtYd") (width 0.05) (tstamp e1e7b200-8e1f-4b8b-b728-0f00db5a776b))
  (fp_line (start 1.8 17.05) (end 1.8 -1.8) (layer "F.CrtYd") (width 0.05) (tstamp e489df37-3f64-42be-8a1d-b2fde5734369))
  (fp_line (start -1.27 16.51) (end -1.27 -0.635) (layer "F.Fab") (width 0.1) (tstamp 365e2296-feb5-4b1c-990d-62a172476861))
  (fp_line (start 1.27 -1.27) (end 1.27 16.51) (layer "F.Fab") (width 0.1) (tstamp 4529b341-ec90-4732-8a19-1897be219a41))
  (fp_line (start 1.27 16.51) (end -1.27 16.51) (layer "F.Fab") (width 0.1) (tstamp 7e388578-e2ae-420f-95a3-50dd38983024))
  (fp_line (start -1.27 -0.635) (end -0.635 -1.27) (layer "F.Fab") (width 0.1) (tstamp adaeceb9-db2c-4965-a57a-5deb096ba615))
  (fp_line (start -0.635 -1.27) (end 1.27 -1.27) (layer "F.Fab") (width 0.1) (tstamp fb572abc-a909-4633-ace8-8784991abfbe))
  (pad "1" thru_hole rect (at 0 0) (size 1.7 1.7) (drill 1) (layers *.Cu *.Mask) (remove_unused_layers) (keep_end_layers) (tstamp 837632fd-e9d5-45b3-bb72-1eed84539d5b))
  (pad "2" thru_hole oval (at 0 2.54) (size 1.7 1.7) (drill 1) (layers *.Cu *.Mask) (remove_unused_layers) (keep_end_layers) (tstamp 78685d85-2654-4934-b120-5f5a8871b20a))
  (pad "3" thru_hole oval (at 0 5.08) (size 1.7 1.7) (drill 1) (layers *.Cu *.Mask) (remove_unused_layers) (keep_end_layers) (tstamp 3cef943c-54a2-44eb-ac3e-98ccc6e2ee26))
  (pad "4" thru_hole oval (at 0 7.62) (size 1.7 1.7) (drill 1) (layers *.Cu *.Mask) (remove_unused_layers) (keep_end_layers) (tstamp 031e19c6-84d7-4c77-a22b-1e21b7c549ba))
  (pad "5" thru_hole oval (at 0 10.16) (size 1.7 1.7) (drill 1) (layers *.Cu *.Mask) (remove_unused_layers) (keep_end_layers) (tstamp 3cfabd81-8f06-4c68-9ce6-4f44adab6685))
  (pad "6" thru_hole oval (at 0 12.7) (size 1.7 1.7) (drill 1) (layers *.Cu *.Mask) (remove_unused_layers) (keep_end_layers) (tstamp 4fa4bd0d-18c6-4fce-8921-98c7f945d4a8))
  (pad "7" thru_hole oval (at 0 15.24) (size 1.7 1.7) (drill 1) (layers *.Cu *.Mask) (remove_unused_layers) (keep_end_layers) (tstamp 04774b4b-4a9b-4b89-aa09-f7250e7b04d6))
  (model "${KICADLIB}/model/connector/PinHeader_1x07_P2.54mm_Vertical.step"
    (offset (xyz 0 0 0))
    (scale (xyz 1 1 1))
    (rotate (xyz 0 0 0))
  )
)
