(footprint "TO-277A" (version 20211014) (generator pcbnew)
  (layer "F.Cu")
  (tedit 5E51D77F)
  (descr "Thermal enhanced ultra thin SMD package; 3 leads; body: 4.3x6.1x0.43mm, https://www.vishay.com/docs/95570/to-277asmpc.pdf")
  (tags "TO-277A SMPC")
  (attr smd)
  (fp_text reference "REF**" (at 0 -4.5 -180) (layer "F.SilkS")
    (effects (font (size 1 1) (thickness 0.15)))
    (tstamp 201d897b-f55d-4b40-bfbe-351596e5fdba)
  )
  (fp_text value "TO-277A" (at 0 4.5 -180) (layer "F.Fab")
    (effects (font (size 1 1) (thickness 0.15)))
    (tstamp 03adce69-6448-40ac-ba8d-b46671e52a69)
  )
  (fp_text user "${REFERENCE}" (at 0 0) (layer "F.Fab")
    (effects (font (size 1 1) (thickness 0.15)))
    (tstamp 4d93f64b-dee8-40bd-bb29-4fbab5a02d61)
  )
  (fp_line (start 2.26 -3.16) (end 1.92 -3.16) (layer "F.SilkS") (width 0.12) (tstamp 4e15d524-8424-496c-9745-408abce75821))
  (fp_line (start -2.26 -3.16) (end -2.26 -1.5) (layer "F.SilkS") (width 0.12) (tstamp 67b3407f-9af3-45b3-8557-9dc2f29877cf))
  (fp_line (start 2.26 -1.5) (end 2.26 -3.16) (layer "F.SilkS") (width 0.12) (tstamp 775fde79-cae6-4a81-8534-d6e6e32b5f54))
  (fp_line (start -0.16 -3.16) (end 0.16 -3.16) (layer "F.SilkS") (width 0.12) (tstamp 8f6ae0f7-228a-49f7-a365-57651129ee47))
  (fp_line (start -1.92 -3.4) (end -1.92 -3.16) (layer "F.SilkS") (width 0.12) (tstamp b88e83db-b847-4baf-a0ce-ff67c976a139))
  (fp_line (start -1.92 -3.16) (end -2.26 -3.16) (layer "F.SilkS") (width 0.12) (tstamp e83a9729-17c8-447a-859f-9840bbd15f35))
  (fp_line (start -2.65 -3.65) (end 2.65 -3.65) (layer "F.CrtYd") (width 0.05) (tstamp 40e77054-2c10-4876-8e71-340cb063d99f))
  (fp_line (start 2.65 3.65) (end -2.65 3.65) (layer "F.CrtYd") (width 0.05) (tstamp 54f16a34-0893-410b-8b00-f52b6da9ba43))
  (fp_line (start -2.65 -3.65) (end -2.65 3.65) (layer "F.CrtYd") (width 0.05) (tstamp ca051309-c5a9-4cab-bf11-3c155fc72398))
  (fp_line (start 2.65 3.65) (end 2.65 -3.65) (layer "F.CrtYd") (width 0.05) (tstamp dbf5fdc0-e5d7-4310-8449-a7e6feedc0e6))
  (fp_line (start -2.15 3.05) (end 2.15 3.05) (layer "F.Fab") (width 0.1) (tstamp 88648328-5a20-487e-847f-628ad1de7cbd))
  (fp_line (start -2.15 -3.05) (end -2.15 3.05) (layer "F.Fab") (width 0.1) (tstamp 8e235b3a-f1da-4ee9-b898-da14eab626dc))
  (fp_line (start 2.15 -3.05) (end -2.15 -3.05) (layer "F.Fab") (width 0.1) (tstamp aad036ea-973a-44de-8956-f6de669c92ea))
  (fp_line (start -0.5 -1.95) (end 0.5 -1.95) (layer "F.Fab") (width 0.1) (tstamp c715e84d-ac3d-4c6b-8dfc-0749cfa21293))
  (fp_line (start 2.15 3.05) (end 2.15 -3.05) (layer "F.Fab") (width 0.1) (tstamp ce939d5f-0a77-4bdf-9329-63206414fe47))
  (fp_poly (pts
      (xy 0.5 -1.45)
      (xy -0.5 -1.45)
      (xy 0 -1.95)
    ) (layer "F.Fab") (width 0.1) (fill none) (tstamp a140fc08-9f57-479e-b834-e7aa0622e9e5))
  (pad "" smd rect (at 0 1.04) (size 1.25 1.2) (layers "F.Paste") (tstamp 7268aa26-a821-47f7-b9a8-dc977d50b429))
  (pad "" smd rect (at -1.7 2.7) (size 1.25 1.2) (layers "F.Paste") (tstamp 76a30f5d-2f6c-476a-875d-ee4f6870778b))
  (pad "" smd rect (at -1.7 1.04) (size 1.25 1.2) (layers "F.Paste") (tstamp 873cd269-19f0-403d-9bd1-ebbb237ed34d))
  (pad "" smd rect (at 1.7 -0.65) (size 1.25 1.2) (layers "F.Paste") (tstamp a14db0c0-57e5-4920-96c1-c0e3ffb1f068))
  (pad "" smd rect (at 1.7 1.04) (size 1.25 1.2) (layers "F.Paste") (tstamp aa8ae21b-3fe2-4bd2-8e8d-c27b94f3577e))
  (pad "" smd rect (at 1.7 2.7) (size 1.25 1.2) (layers "F.Paste") (tstamp bf085ebf-4428-4c11-b5eb-bec05f4ae584))
  (pad "" smd rect (at 0 2.7) (size 1.25 1.2) (layers "F.Paste") (tstamp de349dac-e3ce-4895-8b56-15cfb8a19365))
  (pad "" smd rect (at 0 -0.65) (size 1.25 1.2) (layers "F.Paste") (tstamp f10aa9c2-f5c3-449e-ad9b-663f9c1da7e9))
  (pad "" smd rect (at -1.7 -0.65 180) (size 1.25 1.2) (layers "F.Paste") (tstamp f7a79fb0-3b74-4515-bed5-59edc95fd65d))
  (pad "1" smd rect (at 0 1.04) (size 4.8 4.72) (layers "F.Cu" "F.Mask") (tstamp 0ece8895-419a-44ab-9ce2-a5fb41f27634))
  (pad "2" smd rect (at 1.04 -2.765) (size 1.4 1.27) (layers "F.Cu" "F.Paste" "F.Mask") (tstamp 0b54efec-5b16-4298-b110-e4dc71cbead9))
  (pad "2" smd rect (at -1.04 -2.765) (size 1.4 1.27) (layers "F.Cu" "F.Paste" "F.Mask") (tstamp e21d1680-4c47-48ea-9daf-5f925a5a52d4))
  (model "${KICADLIB}/model/diode/TO-277A.step"
    (offset (xyz 0 0 0))
    (scale (xyz 1 1 1))
    (rotate (xyz 0 0 0))
  )
)
