(footprint "PinSocket_1x02_P2.00mm_Vertical" (version 20211014) (generator pcbnew)
  (layer "F.Cu")
  (tedit 6116C938)
  (descr "Through hole straight socket strip, 1x02, 2.00mm pitch, single row (from Kicad 4.0.7), script generated")
  (tags "Through hole socket strip THT 1x02 2.00mm single row")
  (attr through_hole)
  (fp_text reference "REF**" (at 0 -2.5) (layer "F.SilkS")
    (effects (font (size 1 1) (thickness 0.15)))
    (tstamp 4ca13f57-842a-4ddf-8ca9-0819e4286681)
  )
  (fp_text value "PinSocket_1x02_P2.00mm_Vertical" (at 0 4.5) (layer "F.Fab") hide
    (effects (font (size 1 1) (thickness 0.15)))
    (tstamp ac62395d-6e81-497c-b551-d378ba77aa5b)
  )
  (fp_text user "^" (at -1.89 0.01 270 unlocked) (layer "F.SilkS")
    (effects (font (size 1 1) (thickness 0.15)))
    (tstamp 504e8c1e-f5ca-49fe-8b93-508006f96c7f)
  )
  (fp_text user "${REFERENCE}" (at 0 1 90) (layer "F.Fab")
    (effects (font (size 1 1) (thickness 0.15)))
    (tstamp 14246aab-d5c6-4f78-8430-921e55865aae)
  )
  (fp_line (start -1.06 1) (end 1.06 1) (layer "F.SilkS") (width 0.12) (tstamp 45398db1-e0bf-49e5-afa1-f364f1f2e38f))
  (fp_line (start -1.06 1) (end -1.06 3.06) (layer "F.SilkS") (width 0.12) (tstamp 9ff9b11d-39bc-4bdc-b51f-8a1c78c7a643))
  (fp_line (start 1.06 1) (end 1.06 3.06) (layer "F.SilkS") (width 0.12) (tstamp b7dc7b35-e98a-49b6-8cc5-3d05be81507a))
  (fp_line (start 1.06 -1.06) (end 1.06 0) (layer "F.SilkS") (width 0.12) (tstamp bc4ff5f8-81da-4910-9ae8-eaf2a5910838))
  (fp_line (start 0 -1.06) (end 1.06 -1.06) (layer "F.SilkS") (width 0.12) (tstamp c51f540e-3d63-47c8-be1f-267b0ae4a397))
  (fp_line (start -1.06 3.06) (end 1.06 3.06) (layer "F.SilkS") (width 0.12) (tstamp db8c6a1f-2be6-464b-b82e-f21be14d7d4e))
  (fp_line (start -1.5 -1.5) (end 1.5 -1.5) (layer "F.CrtYd") (width 0.05) (tstamp 373c3907-c1e0-468f-b69b-823ae243388a))
  (fp_line (start 1.5 3.5) (end -1.5 3.5) (layer "F.CrtYd") (width 0.05) (tstamp 4448ac7b-5fda-4eab-ac14-9bc1548c0235))
  (fp_line (start -1.5 3.5) (end -1.5 -1.5) (layer "F.CrtYd") (width 0.05) (tstamp b1391c94-5ede-4a24-9524-054053b3cb4c))
  (fp_line (start 1.5 -1.5) (end 1.5 3.5) (layer "F.CrtYd") (width 0.05) (tstamp f1495b84-bfee-4399-b117-836e4406d09a))
  (fp_line (start 1 -0.5) (end 1 3) (layer "F.Fab") (width 0.1) (tstamp 0981c252-a712-4e09-943e-4be3d1110918))
  (fp_line (start -1 -1) (end 0.5 -1) (layer "F.Fab") (width 0.1) (tstamp 27845122-0cc8-47d7-ba8b-3210e4869840))
  (fp_line (start 1 3) (end -1 3) (layer "F.Fab") (width 0.1) (tstamp 63275ac0-3d0f-41a1-aead-7088259b4803))
  (fp_line (start 0.5 -1) (end 1 -0.5) (layer "F.Fab") (width 0.1) (tstamp b392f923-8c1e-4a8f-ac83-2495a9c142a0))
  (fp_line (start -1 3) (end -1 -1) (layer "F.Fab") (width 0.1) (tstamp b4e86805-96e6-45e8-aaf8-14a34a8657b6))
  (pad "1" thru_hole rect (at 0 0) (size 1.35 1.35) (drill 0.8) (layers *.Cu *.Mask) (tstamp d1b9e8f0-f32e-427d-9660-93cebf0cba62))
  (pad "2" thru_hole oval (at 0 2) (size 1.35 1.35) (drill 0.8) (layers *.Cu *.Mask) (tstamp 684afc4f-9306-463f-8d5f-78ef27fcbcaa))
  (model "${KICADLIB}/model/connector/PinSocket_1x02_P2.00mm_Vertical.step"
    (offset (xyz 0 0 0))
    (scale (xyz 1 1 1))
    (rotate (xyz 0 0 0))
  )
)
