(footprint "PinHeader_1x04_P2.54mm_Horizontal" (version 20210722) (generator pcbnew) (layer "F.Cu")
  (tedit 6116C4F1)
  (descr "Through hole angled pin header, 1x04, 2.54mm pitch, 6mm pin length, single row")
  (tags "Through hole angled pin header THT 1x04 2.54mm single row")
  (attr through_hole)
  (fp_text reference "REF**" (at -1.8 3.8 270) (layer "F.SilkS")
    (effects (font (size 1 1) (thickness 0.15)))
    (tstamp 268f39db-7959-40e7-ae3d-8f0f4a8baea9)
  )
  (fp_text value "PinHeader_1x04_P2.54mm_Horizontal" (at 4.385 9.89) (layer "F.Fab") hide
    (effects (font (size 1 1) (thickness 0.15)))
    (tstamp 8cdcca2a-bdfd-4c00-9377-b26df48158e2)
  )
  (fp_text user "^" (at -1.7 0 -90 unlocked) (layer "F.SilkS")
    (effects (font (size 1 1) (thickness 0.15)))
    (tstamp c22e4944-5568-4c9a-bbb9-7d82c60c04aa)
  )
  (fp_text user "${REFERENCE}" (at 2.77 3.81 90) (layer "F.Fab")
    (effects (font (size 1 1) (thickness 0.15)))
    (tstamp 3a623c88-6499-4088-9f05-00eb2c5b2298)
  )
  (fp_line (start 1.042929 2.16) (end 1.44 2.16) (layer "F.SilkS") (width 0.12) (tstamp 0e69add7-7360-4709-ac51-0202d360f0d4))
  (fp_line (start 1.11 -0.38) (end 1.44 -0.38) (layer "F.SilkS") (width 0.12) (tstamp 148ce213-2989-4326-8839-087a31022260))
  (fp_line (start 10.1 5.46) (end 4.1 5.46) (layer "F.SilkS") (width 0.12) (tstamp 19ba1c69-f6a7-446d-a96c-7f937639df13))
  (fp_line (start 1.042929 8) (end 1.44 8) (layer "F.SilkS") (width 0.12) (tstamp 1e89e1ba-549d-4918-aae3-626bd09179d3))
  (fp_line (start 1.042929 5.46) (end 1.44 5.46) (layer "F.SilkS") (width 0.12) (tstamp 256b1d01-7609-4e34-a505-836cf477fd7d))
  (fp_line (start 10.1 -0.38) (end 10.1 0.38) (layer "F.SilkS") (width 0.12) (tstamp 27953c62-c595-4452-818a-e3eab56b88c2))
  (fp_line (start 4.1 -0.2) (end 10.1 -0.2) (layer "F.SilkS") (width 0.12) (tstamp 2a356554-e1dc-4f43-bbd9-fffb8cb0fbe7))
  (fp_line (start 1.042929 7.24) (end 1.44 7.24) (layer "F.SilkS") (width 0.12) (tstamp 3245c989-a54b-4333-bdec-768b718945e0))
  (fp_line (start 1.042929 4.7) (end 1.44 4.7) (layer "F.SilkS") (width 0.12) (tstamp 41973948-9b89-4ded-ba94-b70c44112b4d))
  (fp_line (start 4.1 7.24) (end 10.1 7.24) (layer "F.SilkS") (width 0.12) (tstamp 44d96918-26f0-40f9-945f-ead92b630bf8))
  (fp_line (start 4.1 -1.33) (end 1.44 -1.33) (layer "F.SilkS") (width 0.12) (tstamp 47452cc9-a27e-4b3d-9742-5081d229e644))
  (fp_line (start 4.1 0.04) (end 10.1 0.04) (layer "F.SilkS") (width 0.12) (tstamp 4f0bc1a1-a9f0-4fd4-a2a2-34fad2bb973d))
  (fp_line (start 10.1 0.38) (end 4.1 0.38) (layer "F.SilkS") (width 0.12) (tstamp 5de771fe-ee1f-4fa5-a618-4f5a3f85c20d))
  (fp_line (start 4.1 2.16) (end 10.1 2.16) (layer "F.SilkS") (width 0.12) (tstamp 5ff41022-e7e5-4440-a73a-bf9877d83b93))
  (fp_line (start 4.1 -0.38) (end 10.1 -0.38) (layer "F.SilkS") (width 0.12) (tstamp 663705a9-7750-4e53-86fa-c917d2b6fd18))
  (fp_line (start 10.1 2.16) (end 10.1 2.92) (layer "F.SilkS") (width 0.12) (tstamp 68986ce0-28a5-40a4-ad23-13bf65660d5f))
  (fp_line (start 4.1 0.28) (end 10.1 0.28) (layer "F.SilkS") (width 0.12) (tstamp 71ce6054-e2a3-4fe7-b83b-0cbe793f6d32))
  (fp_line (start 10.1 2.92) (end 4.1 2.92) (layer "F.SilkS") (width 0.12) (tstamp 84807403-4ff5-464a-98e0-03dfb3d54249))
  (fp_line (start 1.042929 2.92) (end 1.44 2.92) (layer "F.SilkS") (width 0.12) (tstamp 8751692c-9b09-4a1d-aa61-7fabb3c05405))
  (fp_line (start 4.1 -0.08) (end 10.1 -0.08) (layer "F.SilkS") (width 0.12) (tstamp 92f362ee-5182-47a2-8c94-10f25c7303b8))
  (fp_line (start 4.1 8.95) (end 4.1 -1.33) (layer "F.SilkS") (width 0.12) (tstamp 959dd1fe-9999-4dce-93ba-176cee5cfcc4))
  (fp_line (start 10.1 7.24) (end 10.1 8) (layer "F.SilkS") (width 0.12) (tstamp a233ed60-5fa3-4599-b38f-18bb636d8e26))
  (fp_line (start 1.44 -1.33) (end 1.44 8.95) (layer "F.SilkS") (width 0.12) (tstamp c512c2ba-0159-47de-8286-a27aebccfc2e))
  (fp_line (start 1.44 3.81) (end 4.1 3.81) (layer "F.SilkS") (width 0.12) (tstamp cf545008-9818-4dd6-b6da-26e8325aaba6))
  (fp_line (start 1.44 6.35) (end 4.1 6.35) (layer "F.SilkS") (width 0.12) (tstamp d044102e-ff9b-44ff-ab30-0c2185fe5b47))
  (fp_line (start 1.44 8.95) (end 4.1 8.95) (layer "F.SilkS") (width 0.12) (tstamp d4083c4d-90b7-48bc-be3e-db6d0958f679))
  (fp_line (start 10.1 4.7) (end 10.1 5.46) (layer "F.SilkS") (width 0.12) (tstamp dfcf72ba-b7da-4a47-a6f5-34c6815e5c38))
  (fp_line (start 1.44 1.27) (end 4.1 1.27) (layer "F.SilkS") (width 0.12) (tstamp e3c35eeb-f6b7-4e68-8be0-e179dc59992c))
  (fp_line (start 4.1 -0.32) (end 10.1 -0.32) (layer "F.SilkS") (width 0.12) (tstamp e5808be1-a323-4997-b5aa-963c3c654d6a))
  (fp_line (start 1.11 0.38) (end 1.44 0.38) (layer "F.SilkS") (width 0.12) (tstamp e6fda465-13af-420b-9116-c7c80fc6d6f0))
  (fp_line (start 10.1 8) (end 4.1 8) (layer "F.SilkS") (width 0.12) (tstamp ec30cec6-444a-4047-bba4-97f2cb9e0d58))
  (fp_line (start 4.1 4.7) (end 10.1 4.7) (layer "F.SilkS") (width 0.12) (tstamp ecc224a8-8127-4a39-981b-de09bb39182a))
  (fp_line (start 4.1 0.16) (end 10.1 0.16) (layer "F.SilkS") (width 0.12) (tstamp ff1a74a4-24ec-4a45-b079-89383a941c12))
  (fp_line (start -1.8 -1.8) (end -1.8 9.4) (layer "F.CrtYd") (width 0.05) (tstamp 3dd3faa9-ecb8-4ef1-a21c-f8419fc3d051))
  (fp_line (start 10.55 -1.8) (end -1.8 -1.8) (layer "F.CrtYd") (width 0.05) (tstamp 95046654-f40c-4e37-a955-0e9d5d3edf7b))
  (fp_line (start -1.8 9.4) (end 10.55 9.4) (layer "F.CrtYd") (width 0.05) (tstamp e9d7146b-af04-47b1-81ca-7b1a579b3520))
  (fp_line (start 10.55 9.4) (end 10.55 -1.8) (layer "F.CrtYd") (width 0.05) (tstamp ea6ed4ec-45df-450b-9f9d-d9b4e6cd9557))
  (fp_line (start -0.32 7.3) (end -0.32 7.94) (layer "F.Fab") (width 0.1) (tstamp 04b84fe6-081f-48ad-a994-6b73969b7784))
  (fp_line (start -0.32 2.22) (end 1.5 2.22) (layer "F.Fab") (width 0.1) (tstamp 05d65b37-9bb3-4318-a3fd-b202f18ba925))
  (fp_line (start -0.32 -0.32) (end -0.32 0.32) (layer "F.Fab") (width 0.1) (tstamp 0abd5340-3446-41aa-8b9f-c0cb67f396a7))
  (fp_line (start 4.04 4.76) (end 10.04 4.76) (layer "F.Fab") (width 0.1) (tstamp 17951724-40a2-452f-96a2-2474d2f0655c))
  (fp_line (start 1.5 -0.635) (end 2.135 -1.27) (layer "F.Fab") (width 0.1) (tstamp 17a28c96-10e5-4906-a2b8-7216cc3d5186))
  (fp_line (start 4.04 -1.27) (end 4.04 8.89) (layer "F.Fab") (width 0.1) (tstamp 23e4a949-3e7d-400f-963d-73baeb063fd0))
  (fp_line (start 10.04 7.3) (end 10.04 7.94) (layer "F.Fab") (width 0.1) (tstamp 27371b9e-e60f-424e-8efd-4194a8373663))
  (fp_line (start 4.04 8.89) (end 1.5 8.89) (layer "F.Fab") (width 0.1) (tstamp 2e949790-4ab4-4d91-b417-4dc7063a8474))
  (fp_line (start -0.32 2.86) (end 1.5 2.86) (layer "F.Fab") (width 0.1) (tstamp 30c14510-7aa2-4a1f-8f4f-8734fc564a1c))
  (fp_line (start 4.04 2.22) (end 10.04 2.22) (layer "F.Fab") (width 0.1) (tstamp 38b370b5-7a2c-42b7-8f1e-222c61fcc3e0))
  (fp_line (start -0.32 -0.32) (end 1.5 -0.32) (layer "F.Fab") (width 0.1) (tstamp 3ea935ba-7e9d-45aa-92d3-39d7d8929d15))
  (fp_line (start 4.04 0.32) (end 10.04 0.32) (layer "F.Fab") (width 0.1) (tstamp 46679c47-d150-4a8a-bb34-51abe682f001))
  (fp_line (start 10.04 2.22) (end 10.04 2.86) (layer "F.Fab") (width 0.1) (tstamp 57044b4e-5d3d-4066-8aa2-33834aed6b0c))
  (fp_line (start 4.04 7.94) (end 10.04 7.94) (layer "F.Fab") (width 0.1) (tstamp 573a58e6-8086-46c8-991c-871806a16783))
  (fp_line (start 4.04 -0.32) (end 10.04 -0.32) (layer "F.Fab") (width 0.1) (tstamp 583473de-9ead-4857-817c-660df2c3ddab))
  (fp_line (start 4.04 5.4) (end 10.04 5.4) (layer "F.Fab") (width 0.1) (tstamp 64633a82-dcb8-4117-86b1-2dd6227d771a))
  (fp_line (start 2.135 -1.27) (end 4.04 -1.27) (layer "F.Fab") (width 0.1) (tstamp 65f97224-6406-4302-8960-9c30a7292c0f))
  (fp_line (start 4.04 7.3) (end 10.04 7.3) (layer "F.Fab") (width 0.1) (tstamp 67a6d504-1342-4498-b4f2-562154ed93c5))
  (fp_line (start -0.32 4.76) (end -0.32 5.4) (layer "F.Fab") (width 0.1) (tstamp 6d4ba30a-fbae-4638-97e6-7572eac46201))
  (fp_line (start -0.32 2.22) (end -0.32 2.86) (layer "F.Fab") (width 0.1) (tstamp 6e23e15d-1119-41c2-89e3-15e089c40250))
  (fp_line (start -0.32 5.4) (end 1.5 5.4) (layer "F.Fab") (width 0.1) (tstamp 884876d1-8f90-4785-80b5-b97239b5684b))
  (fp_line (start -0.32 7.3) (end 1.5 7.3) (layer "F.Fab") (width 0.1) (tstamp 88b42277-cbec-4da7-8a44-aecae68128f4))
  (fp_line (start 10.04 -0.32) (end 10.04 0.32) (layer "F.Fab") (width 0.1) (tstamp c0414a4b-3c41-4296-98cf-bbf0e4f350d8))
  (fp_line (start -0.32 0.32) (end 1.5 0.32) (layer "F.Fab") (width 0.1) (tstamp c731b6a4-91e6-4acb-bd60-0bc6511f1539))
  (fp_line (start -0.32 4.76) (end 1.5 4.76) (layer "F.Fab") (width 0.1) (tstamp e0213af0-b1dd-4cfa-b117-7a99d3d517f8))
  (fp_line (start 1.5 8.89) (end 1.5 -0.635) (layer "F.Fab") (width 0.1) (tstamp e0d4e49e-33bf-4273-8cda-f5aeab4d338e))
  (fp_line (start -0.32 7.94) (end 1.5 7.94) (layer "F.Fab") (width 0.1) (tstamp e9e4a2c9-2ebc-472d-afb9-e0c48dabd400))
  (fp_line (start 4.04 2.86) (end 10.04 2.86) (layer "F.Fab") (width 0.1) (tstamp f63f7944-1fd4-40bd-bf4f-a9e3a19e78bc))
  (fp_line (start 10.04 4.76) (end 10.04 5.4) (layer "F.Fab") (width 0.1) (tstamp f7acbc26-8ff4-4359-b1f5-a23cf8424850))
  (pad "1" thru_hole rect (at 0 0) (size 1.7 1.7) (drill 1) (layers *.Cu *.Mask) (tstamp 2b53cdb1-3a94-4f74-877f-a6f700e566ca))
  (pad "2" thru_hole oval (at 0 2.54) (size 1.7 1.7) (drill 1) (layers *.Cu *.Mask) (tstamp ef418d63-53e3-4865-b0c2-bb02dd10e214))
  (pad "3" thru_hole oval (at 0 5.08) (size 1.7 1.7) (drill 1) (layers *.Cu *.Mask) (tstamp 7ac6b2f7-bede-4e81-97f5-76f833b139cf))
  (pad "4" thru_hole oval (at 0 7.62) (size 1.7 1.7) (drill 1) (layers *.Cu *.Mask) (tstamp fce2a3e3-c992-4601-a7d0-11c16e255fc2))
  (model "${KICADLIB}/model/connector/PinHeader_1x04_P2.54mm_Horizontal.step"
    (offset (xyz 0 0 0))
    (scale (xyz 1 1 1))
    (rotate (xyz 0 0 0))
  )
)
