(footprint "SOT-886" (version 20211014) (generator pcbnew)
  (layer "F.Cu")
  (tedit 5EBAFF34)
  (descr "SOT-886")
  (tags "SOT-886")
  (attr smd)
  (fp_text reference "REF**" (at 0 -2 180) (layer "F.SilkS")
    (effects (font (size 1 1) (thickness 0.15)))
    (tstamp 67b2780e-f540-487f-b18b-90a3f850aee9)
  )
  (fp_text value "SOT-886" (at 0 1.8 180) (layer "F.Fab") hide
    (effects (font (size 1 1) (thickness 0.15)))
    (tstamp 934e6c92-9b32-4919-85e6-574b85ffbc69)
  )
  (fp_text user "^" (at -1.4 -0.5 270 unlocked) (layer "F.SilkS")
    (effects (font (size 1 1) (thickness 0.15)))
    (tstamp 830f3adf-afb4-4bda-99ae-b8c24b4d1672)
  )
  (fp_text user "${REFERENCE}" (at 0 0 90) (layer "F.Fab")
    (effects (font (size 0.35 0.35) (thickness 0.05)))
    (tstamp 96dd7a16-764b-4e9a-9de3-5a35a6c156fb)
  )
  (fp_line (start 0.6 -0.85) (end -0.6 -0.85) (layer "F.SilkS") (width 0.1) (tstamp 0c92b7e2-02c4-4fb9-b210-80c704c329ff))
  (fp_line (start 0.6 0.85) (end 0.6 -0.85) (layer "F.SilkS") (width 0.1) (tstamp 108a4437-1f97-4f3b-b5c3-fc3a175cbd7a))
  (fp_line (start -0.6 -0.85) (end -0.6 0.85) (layer "F.SilkS") (width 0.1) (tstamp 397db97c-cee8-44c8-bf03-552acc8a46c2))
  (fp_line (start -0.6 0.85) (end 0.6 0.85) (layer "F.SilkS") (width 0.1) (tstamp 3ee2c079-baf8-45d4-9682-89cc7ce55e2d))
  (fp_line (start 0.75 1) (end -0.75 1) (layer "F.CrtYd") (width 0.05) (tstamp 03408e1b-204d-432c-a906-f34dd98c4148))
  (fp_line (start -0.75 -1) (end 0.75 -1) (layer "F.CrtYd") (width 0.05) (tstamp 67e606ee-8b80-4482-9488-aa406f9639c1))
  (fp_line (start -0.75 -1) (end -0.75 1) (layer "F.CrtYd") (width 0.05) (tstamp b3b25fbd-5e0a-4579-ada8-1d151b424584))
  (fp_line (start 0.75 1) (end 0.75 -1) (layer "F.CrtYd") (width 0.05) (tstamp f06223a2-bfff-4ac0-8903-7f0fab2e2717))
  (fp_line (start 0.6 -0.85) (end -0.3 -0.85) (layer "F.Fab") (width 0.1) (tstamp 254aff57-4f18-4b97-9020-47155f64d77e))
  (fp_line (start 0.6 0.85) (end 0.6 -0.85) (layer "F.Fab") (width 0.1) (tstamp 354e7663-0188-48d7-94ee-2c56c1d19574))
  (fp_line (start -0.6 0.85) (end 0.6 0.85) (layer "F.Fab") (width 0.1) (tstamp 76d119ad-e0bf-4bb1-86e6-b549bd445f7f))
  (fp_line (start -0.3 -0.85) (end -0.6 -0.55) (layer "F.Fab") (width 0.1) (tstamp dfbec4cc-ef1e-4c53-9568-aac039413171))
  (fp_line (start -0.6 -0.55) (end -0.6 0.85) (layer "F.Fab") (width 0.1) (tstamp e112fec0-07c8-4132-ba4a-23af3b2b9865))
  (pad "1" smd rect (at -0.34 -0.5) (size 0.33 0.27) (layers "F.Cu" "F.Paste" "F.Mask") (tstamp 794c8928-b76b-44ab-8d9d-d91a17d7e18f))
  (pad "2" smd rect (at -0.34 0) (size 0.33 0.27) (layers "F.Cu" "F.Paste" "F.Mask") (tstamp a387bd4c-523a-465d-ab15-d5702f5c1961))
  (pad "3" smd rect (at -0.34 0.5) (size 0.33 0.27) (layers "F.Cu" "F.Paste" "F.Mask") (tstamp 55bfc895-bee5-43ea-94f4-c49e60f78e46))
  (pad "4" smd rect (at 0.34 0.5) (size 0.33 0.27) (layers "F.Cu" "F.Paste" "F.Mask") (tstamp 8bf40f79-636b-4195-8887-9179ba64a476))
  (pad "5" smd rect (at 0.34 0) (size 0.33 0.27) (layers "F.Cu" "F.Paste" "F.Mask") (tstamp 57cc8527-7773-467b-ae07-29a5731d9b44))
  (pad "6" smd rect (at 0.34 -0.5) (size 0.33 0.27) (layers "F.Cu" "F.Paste" "F.Mask") (tstamp 51c36047-fecf-420e-a496-5a890de01e11))
  (model "${KICADLIB}/model/SOT/SOT-886.step"
    (offset (xyz 0 0 0))
    (scale (xyz 1 1 1))
    (rotate (xyz 0 0 0))
  )
)
