(footprint "PinHeader_1x07_P1.27mm_Vertical" (version 20211014) (generator pcbnew)
  (layer "F.Cu")
  (tedit 6116C782)
  (descr "Through hole straight pin header, 1x07, 1.27mm pitch, single row")
  (tags "Through hole pin header THT 1x07 1.27mm single row")
  (attr through_hole)
  (fp_text reference "REF**" (at 0 -1.695) (layer "F.SilkS")
    (effects (font (size 1 1) (thickness 0.15)))
    (tstamp 974e8a1b-c291-4123-933f-86f2302074c2)
  )
  (fp_text value "PinHeader_1x07_P1.27mm_Vertical" (at 0 9.315) (layer "F.Fab") hide
    (effects (font (size 1 1) (thickness 0.15)))
    (tstamp bd40fe26-f6de-429b-b5e8-4b582f449a2b)
  )
  (fp_text user "${REFERENCE}" (at 0 3.81 90) (layer "F.Fab")
    (effects (font (size 1 1) (thickness 0.15)))
    (tstamp 9e54a3ed-8226-4b16-aa56-179fabb0158a)
  )
  (fp_line (start -1.11 0.76) (end -1.11 8.315) (layer "F.SilkS") (width 0.12) (tstamp 0eadf250-6b33-447e-a059-4b4bc9cf53cb))
  (fp_line (start 1.11 0.76) (end 1.11 8.315) (layer "F.SilkS") (width 0.12) (tstamp 1b64bc25-e471-4839-893f-4935c5bfb952))
  (fp_line (start 0.30753 8.315) (end 1.11 8.315) (layer "F.SilkS") (width 0.12) (tstamp 5707270e-cc60-4211-aada-39e89d7e3ef5))
  (fp_line (start -1.11 -0.76) (end 0 -0.76) (layer "F.SilkS") (width 0.12) (tstamp 68408c8f-2c44-44cf-9032-253f02894cf8))
  (fp_line (start -1.11 0) (end -1.11 -0.76) (layer "F.SilkS") (width 0.12) (tstamp 90a0c1a4-7a42-4d5e-9992-473511c0379e))
  (fp_line (start 0.563471 0.76) (end 1.11 0.76) (layer "F.SilkS") (width 0.12) (tstamp a19c2155-0d39-4401-bcde-7fdffc634b50))
  (fp_line (start -1.11 8.315) (end -0.30753 8.315) (layer "F.SilkS") (width 0.12) (tstamp f5ded644-60a9-49c1-9ea0-8991ba41984c))
  (fp_line (start -1.11 0.76) (end -0.563471 0.76) (layer "F.SilkS") (width 0.12) (tstamp fa8e1029-0848-41d1-9ed9-a979da09b546))
  (fp_line (start -1.55 8.8) (end 1.55 8.8) (layer "F.CrtYd") (width 0.05) (tstamp 07c6815b-2c2e-4f9b-a06a-32247952a238))
  (fp_line (start -1.55 -1.15) (end -1.55 8.8) (layer "F.CrtYd") (width 0.05) (tstamp 58230320-81e9-468a-9f58-458c7e00720a))
  (fp_line (start 1.55 -1.15) (end -1.55 -1.15) (layer "F.CrtYd") (width 0.05) (tstamp 673b4b50-29cf-473d-b4b9-31875911448d))
  (fp_line (start 1.55 8.8) (end 1.55 -1.15) (layer "F.CrtYd") (width 0.05) (tstamp babfe59c-33dd-45fd-a651-08216c2445cf))
  (fp_line (start 1.05 8.255) (end -1.05 8.255) (layer "F.Fab") (width 0.1) (tstamp 34481d34-f97b-4d64-9224-e92376bf5bf5))
  (fp_line (start 1.05 -0.635) (end 1.05 8.255) (layer "F.Fab") (width 0.1) (tstamp 7b251400-6d4c-45e8-9928-e0e55b0a4a86))
  (fp_line (start -0.525 -0.635) (end 1.05 -0.635) (layer "F.Fab") (width 0.1) (tstamp 923eff49-8f38-492f-9375-aa34d8d7e14b))
  (fp_line (start -1.05 8.255) (end -1.05 -0.11) (layer "F.Fab") (width 0.1) (tstamp 9f31551f-8601-4040-a59c-cdb2a166b8a7))
  (fp_line (start -1.05 -0.11) (end -0.525 -0.635) (layer "F.Fab") (width 0.1) (tstamp abeb55a7-7b0c-4791-9b75-19928f9c4329))
  (pad "1" thru_hole rect (at 0 0) (size 1 1) (drill 0.65) (layers *.Cu *.Mask) (tstamp 71d4ffa0-e3c6-47fd-a638-48672d9dcd64))
  (pad "2" thru_hole oval (at 0 1.27) (size 1 1) (drill 0.65) (layers *.Cu *.Mask) (tstamp 4214f206-dc1b-4da9-b51f-c33020fa4bca))
  (pad "3" thru_hole oval (at 0 2.54) (size 1 1) (drill 0.65) (layers *.Cu *.Mask) (tstamp 243ff681-3049-4980-a65e-99610422e93e))
  (pad "4" thru_hole oval (at 0 3.81) (size 1 1) (drill 0.65) (layers *.Cu *.Mask) (tstamp d183a655-8eea-464e-96a4-a2cf20ec4391))
  (pad "5" thru_hole oval (at 0 5.08) (size 1 1) (drill 0.65) (layers *.Cu *.Mask) (tstamp 27d7a5c1-8e94-4fbb-90a4-791d73cef744))
  (pad "6" thru_hole oval (at 0 6.35) (size 1 1) (drill 0.65) (layers *.Cu *.Mask) (tstamp 44ab25d5-12b3-4832-9ae3-abe69cc1b78f))
  (pad "7" thru_hole oval (at 0 7.62) (size 1 1) (drill 0.65) (layers *.Cu *.Mask) (tstamp 76509aa1-7eb9-45c8-9bfc-668f8b5e843d))
  (model "${KICADLIB}/model/connector/PinHeader_1x07_P1.27mm_Vertical.step"
    (offset (xyz 0 0 0))
    (scale (xyz 1 1 1))
    (rotate (xyz 0 0 0))
  )
)
