(footprint "PinHeader_2x25_P2.54mm_Vertical" (version 20211014) (generator pcbnew)
  (layer "F.Cu")
  (tedit 6116C92E)
  (descr "Through hole straight pin header, 2x25, 2.54mm pitch, double rows")
  (tags "Through hole pin header THT 2x25 2.54mm double row")
  (attr through_hole)
  (fp_text reference "REF**" (at 1.27 -2.33) (layer "F.SilkS")
    (effects (font (size 1 1) (thickness 0.15)))
    (tstamp ad86ec66-f7f5-4df2-bba3-996844ae33fc)
  )
  (fp_text value "PinHeader_2x25_P2.54mm_Vertical" (at 1.27 63.29) (layer "F.Fab") hide
    (effects (font (size 1 1) (thickness 0.15)))
    (tstamp 4db37b0d-1a55-4cb4-920e-6297c05c4e1b)
  )
  (fp_text user "^" (at -2.25 0 270 unlocked) (layer "F.SilkS")
    (effects (font (size 1 1) (thickness 0.15)))
    (tstamp 2b0ff424-2815-490c-9c8a-4babc5c68ee0)
  )
  (fp_text user "${REFERENCE}" (at 1.27 30.48 90) (layer "F.Fab")
    (effects (font (size 1 1) (thickness 0.15)))
    (tstamp 68744ddd-b0ab-4ea1-961a-069004317224)
  )
  (fp_line (start -1.33 1.27) (end 1.27 1.27) (layer "F.SilkS") (width 0.12) (tstamp 4f1cdea7-3454-4074-8200-ab18b4f2b5cd))
  (fp_line (start 3.87 -1.33) (end 3.87 62.29) (layer "F.SilkS") (width 0.12) (tstamp 59aa6746-274e-4759-976d-68f3e9a828aa))
  (fp_line (start 1.27 1.27) (end 1.27 -1.33) (layer "F.SilkS") (width 0.12) (tstamp 5a71a316-309c-4ef6-98fc-2f9064cfe268))
  (fp_line (start -1.33 62.29) (end 3.87 62.29) (layer "F.SilkS") (width 0.12) (tstamp 7dc44cc5-7471-4dc9-b2ea-385c0f2463bb))
  (fp_line (start 1.27 -1.33) (end 3.87 -1.33) (layer "F.SilkS") (width 0.12) (tstamp a9f214e0-4740-4638-8ed2-29fa6fab8ebd))
  (fp_line (start -1.33 -1.33) (end 0 -1.33) (layer "F.SilkS") (width 0.12) (tstamp aa4c00a6-6bfc-4dbe-9841-e418ee086efd))
  (fp_line (start -1.33 0) (end -1.33 -1.33) (layer "F.SilkS") (width 0.12) (tstamp d9e33bee-82fc-4818-9420-e7240467bd93))
  (fp_line (start -1.33 1.27) (end -1.33 62.29) (layer "F.SilkS") (width 0.12) (tstamp e9e89990-f3e8-4747-a8ad-9dd53863034d))
  (fp_line (start 4.35 -1.8) (end -1.8 -1.8) (layer "F.CrtYd") (width 0.05) (tstamp 1a761f09-0e00-45fd-9284-e6243684c3dd))
  (fp_line (start -1.8 62.75) (end 4.35 62.75) (layer "F.CrtYd") (width 0.05) (tstamp 216b427f-eb9b-44e5-89ac-e07af97c81e3))
  (fp_line (start 4.35 62.75) (end 4.35 -1.8) (layer "F.CrtYd") (width 0.05) (tstamp 6f319150-a936-456f-8c6b-a8570cf7d947))
  (fp_line (start -1.8 -1.8) (end -1.8 62.75) (layer "F.CrtYd") (width 0.05) (tstamp bc499afe-b1c5-40c7-b0de-8b0d38efcc82))
  (fp_line (start -1.27 62.23) (end -1.27 0) (layer "F.Fab") (width 0.1) (tstamp 3cce7e9a-8d4f-4e4e-8783-45d675d9fa57))
  (fp_line (start 3.81 -1.27) (end 3.81 62.23) (layer "F.Fab") (width 0.1) (tstamp 4bdeb10a-a262-4002-9d23-605ef7838e70))
  (fp_line (start -1.27 0) (end 0 -1.27) (layer "F.Fab") (width 0.1) (tstamp 661712d6-ea10-4fd0-b6b9-61f9eb3681b7))
  (fp_line (start 0 -1.27) (end 3.81 -1.27) (layer "F.Fab") (width 0.1) (tstamp 82a7f0b5-d84a-4e49-b7fd-c5c9573aac04))
  (fp_line (start 3.81 62.23) (end -1.27 62.23) (layer "F.Fab") (width 0.1) (tstamp edde451b-a3fe-4a76-8251-631671365578))
  (pad "1" thru_hole rect (at 0 0) (size 1.7 1.7) (drill 1) (layers *.Cu *.Mask) (tstamp ab55dd0d-5b57-4bb3-90f6-66cf7a70989a))
  (pad "2" thru_hole oval (at 2.54 0) (size 1.7 1.7) (drill 1) (layers *.Cu *.Mask) (tstamp ac7e7bcb-f2db-4f3e-88ad-a3ded2b0232a))
  (pad "3" thru_hole oval (at 0 2.54) (size 1.7 1.7) (drill 1) (layers *.Cu *.Mask) (tstamp 6f2dcf93-0ab6-4daf-aee8-11a53b583203))
  (pad "4" thru_hole oval (at 2.54 2.54) (size 1.7 1.7) (drill 1) (layers *.Cu *.Mask) (tstamp d1da4265-40ac-4b58-a69a-71e3264753f3))
  (pad "5" thru_hole oval (at 0 5.08) (size 1.7 1.7) (drill 1) (layers *.Cu *.Mask) (tstamp 0cbe2f0c-1cc5-42a4-92da-3b4c6e2d7125))
  (pad "6" thru_hole oval (at 2.54 5.08) (size 1.7 1.7) (drill 1) (layers *.Cu *.Mask) (tstamp 03a95faa-84a4-4aa9-9a83-ee497ce9c988))
  (pad "7" thru_hole oval (at 0 7.62) (size 1.7 1.7) (drill 1) (layers *.Cu *.Mask) (tstamp 9b1e8630-c2b1-4064-98b3-d1ca209d592a))
  (pad "8" thru_hole oval (at 2.54 7.62) (size 1.7 1.7) (drill 1) (layers *.Cu *.Mask) (tstamp 388cdd23-3d95-4521-97de-b2951d6f1710))
  (pad "9" thru_hole oval (at 0 10.16) (size 1.7 1.7) (drill 1) (layers *.Cu *.Mask) (tstamp 375d508d-5d34-4106-9149-609091e7cac0))
  (pad "10" thru_hole oval (at 2.54 10.16) (size 1.7 1.7) (drill 1) (layers *.Cu *.Mask) (tstamp 7ee59454-8f52-493f-bc74-f59c7393fc47))
  (pad "11" thru_hole oval (at 0 12.7) (size 1.7 1.7) (drill 1) (layers *.Cu *.Mask) (tstamp 8ab0de5f-25a6-44a8-876e-d83f100f5baf))
  (pad "12" thru_hole oval (at 2.54 12.7) (size 1.7 1.7) (drill 1) (layers *.Cu *.Mask) (tstamp 7294c440-e220-4ff9-9138-962e9699a068))
  (pad "13" thru_hole oval (at 0 15.24) (size 1.7 1.7) (drill 1) (layers *.Cu *.Mask) (tstamp adbed71b-578f-4f14-8c66-8aba9b76be99))
  (pad "14" thru_hole oval (at 2.54 15.24) (size 1.7 1.7) (drill 1) (layers *.Cu *.Mask) (tstamp 38bc43b3-956d-41a2-aace-5f34dcd96944))
  (pad "15" thru_hole oval (at 0 17.78) (size 1.7 1.7) (drill 1) (layers *.Cu *.Mask) (tstamp e84e1f66-2f36-40f8-9984-1c1afc579ef4))
  (pad "16" thru_hole oval (at 2.54 17.78) (size 1.7 1.7) (drill 1) (layers *.Cu *.Mask) (tstamp e4a27d7c-ad50-4acc-a6a8-b7ecccc99cfc))
  (pad "17" thru_hole oval (at 0 20.32) (size 1.7 1.7) (drill 1) (layers *.Cu *.Mask) (tstamp 790d6821-8980-4ea7-8aee-a000ecae65a4))
  (pad "18" thru_hole oval (at 2.54 20.32) (size 1.7 1.7) (drill 1) (layers *.Cu *.Mask) (tstamp ef956b6f-1536-4cf1-a250-30c5e6a1ebfa))
  (pad "19" thru_hole oval (at 0 22.86) (size 1.7 1.7) (drill 1) (layers *.Cu *.Mask) (tstamp 040c2685-aecc-4375-9a01-47548f244ab6))
  (pad "20" thru_hole oval (at 2.54 22.86) (size 1.7 1.7) (drill 1) (layers *.Cu *.Mask) (tstamp 461a3e7e-1d4b-4d31-b240-08dded1d7f80))
  (pad "21" thru_hole oval (at 0 25.4) (size 1.7 1.7) (drill 1) (layers *.Cu *.Mask) (tstamp 43db8cae-f519-4618-9dec-156ff06d4e72))
  (pad "22" thru_hole oval (at 2.54 25.4) (size 1.7 1.7) (drill 1) (layers *.Cu *.Mask) (tstamp 85de6c87-aead-4f0e-a651-0f48a1d7965d))
  (pad "23" thru_hole oval (at 0 27.94) (size 1.7 1.7) (drill 1) (layers *.Cu *.Mask) (tstamp 04929950-6bd6-4ad1-8976-929bfaca9621))
  (pad "24" thru_hole oval (at 2.54 27.94) (size 1.7 1.7) (drill 1) (layers *.Cu *.Mask) (tstamp 89cedb76-feba-4b61-b6b4-bc86f836105c))
  (pad "25" thru_hole oval (at 0 30.48) (size 1.7 1.7) (drill 1) (layers *.Cu *.Mask) (tstamp a0d7e55e-ec27-42fe-8419-89d1bdd9e1cf))
  (pad "26" thru_hole oval (at 2.54 30.48) (size 1.7 1.7) (drill 1) (layers *.Cu *.Mask) (tstamp 2fd86847-8b2a-4075-b81d-1c9d9c56ee29))
  (pad "27" thru_hole oval (at 0 33.02) (size 1.7 1.7) (drill 1) (layers *.Cu *.Mask) (tstamp 0b91bd32-9968-43bb-9f51-87364be0e1fe))
  (pad "28" thru_hole oval (at 2.54 33.02) (size 1.7 1.7) (drill 1) (layers *.Cu *.Mask) (tstamp e4f8ac14-f663-4787-9a21-f08e6ada7542))
  (pad "29" thru_hole oval (at 0 35.56) (size 1.7 1.7) (drill 1) (layers *.Cu *.Mask) (tstamp 13e35dfc-72a3-49a0-af57-82fa9de7aafa))
  (pad "30" thru_hole oval (at 2.54 35.56) (size 1.7 1.7) (drill 1) (layers *.Cu *.Mask) (tstamp d9766cd8-d90a-4326-b5f8-63e7d8c22ddf))
  (pad "31" thru_hole oval (at 0 38.1) (size 1.7 1.7) (drill 1) (layers *.Cu *.Mask) (tstamp fbe5c099-c0a2-4d50-8249-e2cb8db98e3b))
  (pad "32" thru_hole oval (at 2.54 38.1) (size 1.7 1.7) (drill 1) (layers *.Cu *.Mask) (tstamp 952d12c4-c22a-43eb-a21f-17bcd807277b))
  (pad "33" thru_hole oval (at 0 40.64) (size 1.7 1.7) (drill 1) (layers *.Cu *.Mask) (tstamp 94bb3cbc-2c80-4970-a330-3dcdc7343997))
  (pad "34" thru_hole oval (at 2.54 40.64) (size 1.7 1.7) (drill 1) (layers *.Cu *.Mask) (tstamp 6d0919a3-36d4-44f7-a95c-ccb904bd412f))
  (pad "35" thru_hole oval (at 0 43.18) (size 1.7 1.7) (drill 1) (layers *.Cu *.Mask) (tstamp 8e1383a3-72a2-4adf-a8da-333cb2e70d18))
  (pad "36" thru_hole oval (at 2.54 43.18) (size 1.7 1.7) (drill 1) (layers *.Cu *.Mask) (tstamp 57aa960d-a8a0-4c9c-a8c0-2b70145dc693))
  (pad "37" thru_hole oval (at 0 45.72) (size 1.7 1.7) (drill 1) (layers *.Cu *.Mask) (tstamp a863d63d-ff2c-4a22-8a46-3c1f4de8ed40))
  (pad "38" thru_hole oval (at 2.54 45.72) (size 1.7 1.7) (drill 1) (layers *.Cu *.Mask) (tstamp 15c6655e-6c18-481f-aa0c-44d23999ae29))
  (pad "39" thru_hole oval (at 0 48.26) (size 1.7 1.7) (drill 1) (layers *.Cu *.Mask) (tstamp ae673f22-b81b-4155-8cd4-aca67e98e12a))
  (pad "40" thru_hole oval (at 2.54 48.26) (size 1.7 1.7) (drill 1) (layers *.Cu *.Mask) (tstamp 0a76bf06-cc9e-4b46-b9d8-0c36d1ed3aa2))
  (pad "41" thru_hole oval (at 0 50.8) (size 1.7 1.7) (drill 1) (layers *.Cu *.Mask) (tstamp a0920389-ddab-48ef-8512-01b09459e64a))
  (pad "42" thru_hole oval (at 2.54 50.8) (size 1.7 1.7) (drill 1) (layers *.Cu *.Mask) (tstamp 3768ea07-f2c6-4ec2-a78e-3e9f34446345))
  (pad "43" thru_hole oval (at 0 53.34) (size 1.7 1.7) (drill 1) (layers *.Cu *.Mask) (tstamp 5a58a56a-2f4b-4725-88ed-86dc6d0fbc82))
  (pad "44" thru_hole oval (at 2.54 53.34) (size 1.7 1.7) (drill 1) (layers *.Cu *.Mask) (tstamp d05627e6-a605-4777-bc5f-196b040e9828))
  (pad "45" thru_hole oval (at 0 55.88) (size 1.7 1.7) (drill 1) (layers *.Cu *.Mask) (tstamp bc0f95bd-eff0-420a-ac8a-032645ce8dfe))
  (pad "46" thru_hole oval (at 2.54 55.88) (size 1.7 1.7) (drill 1) (layers *.Cu *.Mask) (tstamp c067ae9e-d028-438d-84fa-2fd0a72395ad))
  (pad "47" thru_hole oval (at 0 58.42) (size 1.7 1.7) (drill 1) (layers *.Cu *.Mask) (tstamp a88de23c-a92d-4311-aed5-dcc7a12ab3b4))
  (pad "48" thru_hole oval (at 2.54 58.42) (size 1.7 1.7) (drill 1) (layers *.Cu *.Mask) (tstamp 6d69bc94-7aa0-45d2-acd1-c67d7b7f11cd))
  (pad "49" thru_hole oval (at 0 60.96) (size 1.7 1.7) (drill 1) (layers *.Cu *.Mask) (tstamp 9acdfc82-2efd-4795-998e-49b3b23f73cb))
  (pad "50" thru_hole oval (at 2.54 60.96) (size 1.7 1.7) (drill 1) (layers *.Cu *.Mask) (tstamp 84a40379-b57a-42c7-8ae3-aabed858106e))
  (model "${KICADLIB}/model/connector/PinHeader_2x25_P2.54mm_Vertical.step"
    (offset (xyz 0 0 0))
    (scale (xyz 1 1 1))
    (rotate (xyz 0 0 0))
  )
)
