(footprint "DFN100X100X55-5" (version 20211014) (generator pcbnew)
  (layer "F.Cu")
  (tedit 5F45A586)
  (attr smd)
  (fp_text reference "REF**" (at 0 -1.1 unlocked) (layer "F.SilkS")
    (effects (font (size 0.7 0.7) (thickness 0.1)))
    (tstamp a8c58f67-df70-4c89-897a-8e042ab53ad9)
  )
  (fp_text value "DFN100X100X55-5" (at 0 -1.25 unlocked) (layer "F.Fab") hide
    (effects (font (size 1 1) (thickness 0.15)))
    (tstamp 87dba404-6021-4697-9238-fa6870c44161)
  )
  (fp_text user "^" (at -0.325 1.4 unlocked) (layer "F.SilkS")
    (effects (font (size 1 1) (thickness 0.15)))
    (tstamp aa013c2e-924c-4ae7-83c5-7b623914236a)
  )
  (fp_text user "${REF}" (at 0 0 unlocked) (layer "F.Fab")
    (effects (font (size 0.25 0.25) (thickness 0.02)))
    (tstamp 1d7d5ec2-3dfb-4019-b93e-e604b3cad9a8)
  )
  (fp_line (start -0.1 -0.5) (end 0.1 -0.5) (layer "F.SilkS") (width 0.1) (tstamp 161e9151-db29-4fac-8b8c-b866ea24e550))
  (fp_line (start -0.1 0.5) (end 0.1 0.5) (layer "F.SilkS") (width 0.1) (tstamp 724509b3-e5e2-4433-a7f3-f3d5ad60ae03))
  (fp_line (start 0.5 0.4) (end 0.5 -0.4) (layer "F.SilkS") (width 0.1) (tstamp a6017082-70d1-45e2-a001-1731bd12a3e5))
  (fp_line (start -0.5 0.4) (end -0.5 -0.4) (layer "F.SilkS") (width 0.1) (tstamp a7e1b3b6-ec9e-4073-acd2-92d40f69e44e))
  (fp_rect (start -0.7 -0.8) (end 0.7 0.8) (layer "F.CrtYd") (width 0.05) (fill none) (tstamp 1cb47f95-452e-4dcf-91ee-47b2f558d562))
  (fp_line (start -0.5 0.25) (end -0.5 -0.5) (layer "F.Fab") (width 0.05) (tstamp 270d3ba7-6ce8-4942-95eb-e78b1adfee06))
  (fp_line (start -0.5 -0.5) (end 0.5 -0.5) (layer "F.Fab") (width 0.05) (tstamp 4a65a8a8-aba7-4898-8ee0-6a99d7e8f1bb))
  (fp_line (start 0.5 -0.5) (end 0.5 0.5) (layer "F.Fab") (width 0.05) (tstamp b8c89672-bc63-4fd8-9f29-5c73505e8dda))
  (fp_line (start -0.5 0.25) (end -0.25 0.5) (layer "F.Fab") (width 0.05) (tstamp c1f7df71-0f68-4027-b4b9-d916a1b1a232))
  (fp_line (start -0.25 0.5) (end 0.5 0.5) (layer "F.Fab") (width 0.05) (tstamp dae2a288-a6f2-4b13-8c44-4a5cbcb24719))
  (pad "1" smd custom (at -0.325 0.5 180) (size 0.1 0.1) (layers "F.Cu" "F.Paste" "F.Mask")
    (options (clearance outline) (anchor rect))
    (primitives
      (gr_poly (pts
          (xy 0.125 -0.2)
          (xy -0.125 -0.2)
          (xy -0.125 0.02)
          (xy 0.125 0.27)
        ) (width 0.01) (fill yes))
    ) (tstamp 2f1827c8-e502-4579-8bd0-59b33fad27b2))
  (pad "2" smd custom (at 0.325 0.5 180) (size 0.1 0.1) (layers "F.Cu" "F.Paste" "F.Mask")
    (options (clearance outline) (anchor rect))
    (primitives
      (gr_poly (pts
          (xy -0.125 -0.2)
          (xy 0.125 -0.2)
          (xy 0.125 0.02)
          (xy -0.05 0.2)
          (xy -0.125 0.2)
        ) (width 0.01) (fill yes))
    ) (tstamp 8d300f08-319a-4461-9bdf-50d28c08186c))
  (pad "3" smd custom (at 0.325 -0.5) (size 0.1 0.1) (layers "F.Cu" "F.Paste" "F.Mask")
    (options (clearance outline) (anchor rect))
    (primitives
      (gr_poly (pts
          (xy 0.125 -0.2)
          (xy -0.125 -0.2)
          (xy -0.125 0.02)
          (xy 0.05 0.2)
          (xy 0.125 0.2)
        ) (width 0.01) (fill yes))
    ) (tstamp fa92c13f-6fd5-42d9-a294-d2f3738164a5))
  (pad "4" smd custom (at -0.325 -0.5) (size 0.1 0.1) (layers "F.Cu" "F.Paste" "F.Mask")
    (options (clearance outline) (anchor rect))
    (primitives
      (gr_poly (pts
          (xy -0.125 -0.2)
          (xy 0.125 -0.2)
          (xy 0.125 0.02)
          (xy -0.05 0.2)
          (xy -0.125 0.2)
        ) (width 0.01) (fill yes))
    ) (tstamp 9923ed31-0ced-4768-9b52-8f3e4eb0ea7d))
  (pad "5" smd rect (at 0 0 45) (size 0.48 0.48) (layers "F.Cu" "F.Paste" "F.Mask") (tstamp 425331d7-704e-4d7a-8b97-51d2d8d04b3e))
  (model "${KICADLIB}/model/DFN/DFN100X100X55-5.step"
    (offset (xyz 0 0 0))
    (scale (xyz 1 1 1))
    (rotate (xyz -90 0 0))
  )
)
