(footprint "icon_pwron"
	(version 20240108)
	(generator "pcbnew")
	(generator_version "8.0")
	(layer "F.Cu")
	(property "Reference" "REF**"
		(at 0.025 -1.625 0)
		(layer "F.SilkS")
		(hide yes)
		(uuid "f2563940-10dc-4d8d-8518-f1a3e6720ce2")
		(effects
			(font
				(size 0.8 0.8)
				(thickness 0.15)
			)
		)
	)
	(property "Value" "icon_pwron"
		(at 0 3.65 0)
		(unlocked yes)
		(layer "F.Fab")
		(hide yes)
		(uuid "dbb8f9a9-8841-431d-9000-1442852c22b3")
		(effects
			(font
				(size 1 1)
				(thickness 0.15)
			)
		)
	)
	(property "Footprint" "icon_pwron"
		(at 0 2.25 0)
		(unlocked yes)
		(layer "F.Fab")
		(hide yes)
		(uuid "76255e8b-6c80-4cf4-b1ca-040b8aabecb5")
		(effects
			(font
				(size 1.27 1.27)
			)
		)
	)
	(property "Datasheet" ""
		(at 0 0 0)
		(unlocked yes)
		(layer "F.Fab")
		(hide yes)
		(uuid "98be9772-e2a4-46b6-94b7-ecbd51bac7ac")
		(effects
			(font
				(size 1.27 1.27)
			)
		)
	)
	(property "Description" ""
		(at 0 0 0)
		(unlocked yes)
		(layer "F.Fab")
		(hide yes)
		(uuid "2efe2f98-374f-487a-bcbd-2bbc7fd57eba")
		(effects
			(font
				(size 1.27 1.27)
			)
		)
	)
	(attr smd)
	(fp_poly
		(pts
			(xy 0.001494 -0.980127) (xy 0.009365 -0.979604) (xy 0.017195 -0.978677) (xy 0.024962 -0.977348) (xy 0.032642 -0.975618)
			(xy 0.040209 -0.973487) (xy 0.047641 -0.970957) (xy 0.054913 -0.968029) (xy 0.062002 -0.964703) (xy 0.068388 -0.961262)
			(xy 0.074648 -0.95745) (xy 0.080763 -0.953289) (xy 0.086716 -0.9488) (xy 0.092488 -0.944002) (xy 0.09806 -0.938916)
			(xy 0.103416 -0.933564) (xy 0.108537 -0.927966) (xy 0.113405 -0.922143) (xy 0.118001 -0.916115) (xy 0.122308 -0.909903)
			(xy 0.126308 -0.903528) (xy 0.129982 -0.897011) (xy 0.133312 -0.890371) (xy 0.13628 -0.883631) (xy 0.138869 -0.87681)
			(xy 0.144714 -0.860063) (xy 0.145266 -0.462383) (xy 0.145526 -0.210785) (xy 0.14444 -0.08592) (xy 0.142949 -0.055514)
			(xy 0.140589 -0.038194) (xy 0.137184 -0.027761) (xy 0.132555 -0.018014) (xy 0.128731 -0.010363) (xy 0.124429 -0.002904)
			(xy 0.119681 0.004336) (xy 0.114518 0.011331) (xy 0.108969 0.018056) (xy 0.103067 0.024484) (xy 0.096841 0.030591)
			(xy 0.090323 0.036351) (xy 0.083543 0.041737) (xy 0.076532 0.046724) (xy 0.06932 0.051286) (xy 0.061939 0.055397)
			(xy 0.054419 0.059032) (xy 0.046791 0.062165) (xy 0.039086 0.06477) (xy 0.031334 0.066821) (xy 0.028095 0.067507)
			(xy 0.024693 0.068132) (xy 0.017509 0.069195) (xy 0.01 0.07) (xy 0.00239 0.070534) (xy -0.005101 0.070786)
			(xy -0.012251 0.070744) (xy -0.01563 0.070609) (xy -0.01884 0.070397) (xy -0.021855 0.070105) (xy -0.024646 0.069733)
			(xy -0.033886 0.068013) (xy -0.042946 0.065746) (xy -0.051806 0.062948) (xy -0.060445 0.059633) (xy -0.068843 0.055818)
			(xy -0.076979 0.051516) (xy -0.084832 0.046744) (xy -0.092381 0.041517) (xy -0.099607 0.03585) (xy -0.106487 0.029757)
			(xy -0.113003 0.023255) (xy -0.119133 0.016359) (xy -0.124856 0.009083) (xy -0.130151 0.001443) (xy -0.134999 -0.006546)
			(xy -0.139379 -0.014869) (xy -0.144672 -0.025069) (xy -0.145765 -0.027335) (xy -0.146773 -0.02969)
			(xy -0.147699 -0.032235) (xy -0.148546 -0.035071) (xy -0.149318 -0.038299) (xy -0.150019 -0.04202)
			(xy -0.150651 -0.046335) (xy -0.151219 -0.051346) (xy -0.151726 -0.057154) (xy -0.152175 -0.06386)
			(xy -0.152569 -0.071565) (xy -0.152913 -0.08037) (xy -0.153209 -0.090376) (xy -0.153461 -0.101685)
			(xy -0.153847 -0.128615) (xy -0.154098 -0.161968) (xy -0.154242 -0.202555) (xy -0.154317 -0.308663)
			(xy -0.154293 -0.453413) (xy -0.154234 -0.70607) (xy -0.152789 -0.829404) (xy -0.15095 -0.858892)
			(xy -0.148052 -0.87563) (xy -0.143854 -0.886146) (xy -0.13812 -0.896966) (xy -0.135085 -0.902631)
			(xy -0.131678 -0.908264) (xy -0.127926 -0.91384) (xy -0.123856 -0.919333) (xy -0.119496 -0.924719)
			(xy -0.114871 -0.929972) (xy -0.110009 -0.935068) (xy -0.104937 -0.93998) (xy -0.099682 -0.944685)
			(xy -0.09427 -0.949156) (xy -0.08873 -0.953369) (xy -0.083088 -0.957299) (xy -0.07737 -0.96092) (xy -0.071604 -0.964207)
			(xy -0.065817 -0.967136) (xy -0.060036 -0.96968) (xy -0.052708 -0.972418) (xy -0.045228 -0.974745)
			(xy -0.037621 -0.976662) (xy -0.029909 -0.978169) (xy -0.022118 -0.979269) (xy -0.014271 -0.979961)
			(xy -0.006393 -0.980247)
		)
		(stroke
			(width 0.001993)
			(type solid)
		)
		(fill solid)
		(layer "F.SilkS")
		(uuid "491151fb-cce9-4445-9d9f-0788c87d301d")
	)
	(fp_poly
		(pts
			(xy -0.447164 -0.678744) (xy -0.441636 -0.678377) (xy -0.436148 -0.677797) (xy -0.430074 -0.676932)
			(xy -0.424159 -0.675887) (xy -0.418398 -0.674661) (xy -0.412786 -0.67325) (xy -0.407319 -0.671653)
			(xy -0.40199 -0.669867) (xy -0.396795 -0.66789) (xy -0.391729 -0.66572) (xy -0.386787 -0.663354)
			(xy -0.381963 -0.660789) (xy -0.377252 -0.658024) (xy -0.37265 -0.655057) (xy -0.368151 -0.651885)
			(xy -0.36375 -0.648505) (xy -0.359442 -0.644915) (xy -0.355222 -0.641114) (xy -0.346685 -0.63256)
			(xy -0.338919 -0.623608) (xy -0.331934 -0.61429) (xy -0.325735 -0.604636) (xy -0.32033 -0.594678)
			(xy -0.315727 -0.584447) (xy -0.311932 -0.573973) (xy -0.308955 -0.563289) (xy -0.306801 -0.552425)
			(xy -0.305478 -0.541412) (xy -0.304994 -0.530281) (xy -0.305356 -0.519064) (xy -0.306572 -0.507791)
			(xy -0.308648 -0.496494) (xy -0.311593 -0.485204) (xy -0.315413 -0.473951) (xy -0.317482 -0.468754)
			(xy -0.319668 -0.463777) (xy -0.322001 -0.458985) (xy -0.324512 -0.454342) (xy -0.327231 -0.449811)
			(xy -0.330189 -0.445355) (xy -0.333416 -0.440939) (xy -0.336942 -0.436525) (xy -0.340796 -0.432079)
			(xy -0.345011 -0.427562) (xy -0.349615 -0.42294) (xy -0.35464 -0.418175) (xy -0.360115 -0.413232)
			(xy -0.36607 -0.408073) (xy -0.372537 -0.402663) (xy -0.379545 -0.396965) (xy -0.395986 -0.383283)
			(xy -0.411894 -0.369077) (xy -0.427259 -0.354362) (xy -0.44207 -0.339153) (xy -0.456317 -0.323464)
			(xy -0.469989 -0.307311) (xy -0.483076 -0.290708) (xy -0.495568 -0.27367) (xy -0.507455 -0.256211)
			(xy -0.518725 -0.238347) (xy -0.529368 -0.220092) (xy -0.539374 -0.20146) (xy -0.548733 -0.182468)
			(xy -0.557434 -0.163128) (xy -0.565467 -0.143457) (xy -0.572821 -0.123468) (xy -0.57674 -0.111825)
			(xy -0.580387 -0.10019) (xy -0.583766 -0.088547) (xy -0.586878 -0.076878) (xy -0.589727 -0.06517)
			(xy -0.592314 -0.053405) (xy -0.594643 -0.041568) (xy -0.596716 -0.029642) (xy -0.598536 -0.017613)
			(xy -0.600104 -0.005463) (xy -0.601425 0.006822) (xy -0.6025 0.01926) (xy -0.603332 0.031865) (xy -0.603923 0.044654)
			(xy -0.604395 0.070847) (xy -0.60416 0.089276) (xy -0.603445 0.107361) (xy -0.602242 0.125139) (xy -0.600541 0.142642)
			(xy -0.598335 0.159907) (xy -0.595616 0.176967) (xy -0.592375 0.193857) (xy -0.588603 0.210612) (xy -0.584292 0.227266)
			(xy -0.579435 0.243855) (xy -0.574022 0.260412) (xy -0.568044 0.276972) (xy -0.561495 0.293571) (xy -0.554365 0.310242)
			(xy -0.546646 0.32702) (xy -0.538329 0.34394) (xy -0.526511 0.366167) (xy -0.513942 0.387693) (xy -0.500628 0.408513)
			(xy -0.486569 0.428627) (xy -0.471771 0.44803) (xy -0.456234 0.46672) (xy -0.439963 0.484694) (xy -0.42296 0.50195)
			(xy -0.405228 0.518484) (xy -0.38677 0.534293) (xy -0.367589 0.549376) (xy -0.347688 0.563729) (xy -0.327069 0.577348)
			(xy -0.305736 0.590232) (xy -0.283692 0.602378) (xy -0.260939 0.613782) (xy -0.239907 0.623405) (xy -0.21914 0.632041)
			(xy -0.198412 0.639756) (xy -0.187994 0.643291) (xy -0.177501 0.646621) (xy -0.15618 0.652704) (xy -0.134225 0.658075)
			(xy -0.111411 0.662801) (xy -0.087514 0.666951) (xy -0.073294 0.668683) (xy -0.055632 0.67002) (xy -0.035611 0.670949)
			(xy -0.014313 0.671453) (xy 0.007179 0.67152) (xy 0.027782 0.671135) (xy 0.046413 0.670282) (xy 0.061989 0.668949)
			(xy 0.088666 0.665372) (xy 0.101562 0.663249) (xy 0.114213 0.66089) (xy 0.126656 0.658282) (xy 0.138928 0.655416)
			(xy 0.151065 0.652279) (xy 0.163105 0.648862) (xy 0.175083 0.645153) (xy 0.187038 0.641141) (xy 0.199006 0.636815)
			(xy 0.211024 0.632165) (xy 0.223128 0.627179) (xy 0.235356 0.621846) (xy 0.260331 0.610098) (xy 0.28252 0.598671)
			(xy 0.303985 0.586576) (xy 0.324728 0.573811) (xy 0.344753 0.560373) (xy 0.364061 0.54626) (xy 0.382656 0.531469)
			(xy 0.400539 0.515998) (xy 0.417714 0.499844) (xy 0.434183 0.483005) (xy 0.449948 0.465478) (xy 0.465011 0.447262)
			(xy 0.479377 0.428352) (xy 0.493046 0.408748) (xy 0.506021 0.388446) (xy 0.518306 0.367444) (xy 0.529902 0.345739)
			(xy 0.539936 0.325266) (xy 0.549151 0.304777) (xy 0.557551 0.284255) (xy 0.565139 0.263685) (xy 0.571918 0.243049)
			(xy 0.577891 0.222332) (xy 0.583061 0.201517) (xy 0.587431 0.180588) (xy 0.591005 0.159527) (xy 0.593785 0.13832)
			(xy 0.595774 0.116948) (xy 0.596977 0.095396) (xy 0.597395 0.073648) (xy 0.597033 0.051686) (xy 0.595892 0.029496)
			(xy 0.593976 0.007059) (xy 0.590222 -0.022215) (xy 0.584976 -0.05121) (xy 0.578269 -0.07987) (xy 0.570132 -0.108141)
			(xy 0.560595 -0.135968) (xy 0.549688 -0.163294) (xy 0.537441 -0.190066) (xy 0.523885 -0.216226) (xy 0.509051 -0.241721)
			(xy 0.492968 -0.266495) (xy 0.475668 -0.290492) (xy 0.45718 -0.313658) (xy 0.437535 -0.335937) (xy 0.416763 -0.357274)
			(xy 0.394895 -0.377613) (xy 0.37196 -0.396899) (xy 0.363792 -0.40352) (xy 0.356324 -0.409787) (xy 0.349517 -0.415756)
			(xy 0.343327 -0.421484) (xy 0.337713 -0.427029) (xy 0.332633 -0.432447) (xy 0.328044 -0.437796) (xy 0.323906 -0.443134)
			(xy 0.320176 -0.448516) (xy 0.316811 -0.454) (xy 0.313771 -0.459644) (xy 0.311013 -0.465504) (xy 0.308495 -0.471638)
			(xy 0.306175 -0.478103) (xy 0.304012 -0.484956) (xy 0.301962 -0.492254) (xy 0.301131 -0.495691) (xy 0.300388 -0.499402)
			(xy 0.299732 -0.503347) (xy 0.299167 -0.507486) (xy 0.298692 -0.511777) (xy 0.29831 -0.516181) (xy 0.297828 -0.525161)
			(xy 0.297731 -0.529656) (xy 0.297732 -0.534101) (xy 0.297831 -0.538454) (xy 0.298031 -0.542675) (xy 0.298332 -0.546723)
			(xy 0.298736 -0.550558) (xy 0.299245 -0.554138) (xy 0.299859 -0.557424) (xy 0.301207 -0.563306) (xy 0.302699 -0.568986)
			(xy 0.304344 -0.574481) (xy 0.306153 -0.579808) (xy 0.308134 -0.584983) (xy 0.310298 -0.590025) (xy 0.312653 -0.594949)
			(xy 0.31521 -0.599774) (xy 0.317977 -0.604517) (xy 0.320965 -0.609194) (xy 0.324183 -0.613823) (xy 0.32764 -0.61842)
			(xy 0.331346 -0.623004) (xy 0.33531 -0.627591) (xy 0.339543 -0.632198) (xy 0.344053 -0.636843) (xy 0.348926 -0.641644)
			(xy 0.353359 -0.645812) (xy 0.355446 -0.647684) (xy 0.357465 -0.64943) (xy 0.359429 -0.65106) (xy 0.361353 -0.652585)
			(xy 0.36325 -0.654016) (xy 0.365135 -0.655363) (xy 0.36702 -0.656637) (xy 0.36892 -0.657849) (xy 0.370848 -0.659009)
			(xy 0.372819 -0.660128) (xy 0.374847 -0.661217) (xy 0.376944 -0.662286) (xy 0.385208 -0.666091) (xy 0.393669 -0.669392)
			(xy 0.402293 -0.672188) (xy 0.411048 -0.67448) (xy 0.419901 -0.676268) (xy 0.428819 -0.67755) (xy 0.43777 -0.678329)
			(xy 0.446721 -0.678602) (xy 0.455639 -0.678371) (xy 0.464491 -0.677634) (xy 0.473245 -0.676393) (xy 0.481868 -0.674647)
			(xy 0.490328 -0.672396) (xy 0.498591 -0.669639) (xy 0.506625 -0.666377) (xy 0.514398 -0.66261) (xy 0.522451 -0.657982)
			(xy 0.531521 -0.652084) (xy 0.541477 -0.645031) (xy 0.552187 -0.636944) (xy 0.563522 -0.627938) (xy 0.575351 -0.618133)
			(xy 0.587543 -0.607646) (xy 0.599968 -0.596595) (xy 0.612496 -0.585099) (xy 0.624996 -0.573274) (xy 0.637338 -0.561239)
			(xy 0.649391 -0.549111) (xy 0.661025 -0.537009) (xy 0.672108 -0.525051) (xy 0.682512 -0.513354) (xy 0.692105 -0.502036)
			(xy 0.711598 -0.47755) (xy 0.730187 -0.452478) (xy 0.747861 -0.426845) (xy 0.764608 -0.400677) (xy 0.780418 -0.374)
			(xy 0.795277 -0.346839) (xy 0.809176 -0.319221) (xy 0.822102 -0.291171) (xy 0.834045 -0.262715) (xy 0.844993 -0.233879)
			(xy 0.854935 -0.204689) (xy 0.863859 -0.17517) (xy 0.871754 -0.145348) (xy 0.878608 -0.11525) (xy 0.884411 -0.084901)
			(xy 0.889151 -0.054326) (xy 0.89184 -0.032615) (xy 0.893993 -0.010692) (xy 0.895612 0.011401) (xy 0.896698 0.033622)
			(xy 0.897255 0.055928) (xy 0.897284 0.07828) (xy 0.896788 0.100635) (xy 0.89577 0.122951) (xy 0.894232 0.145188)
			(xy 0.892176 0.167302) (xy 0.889605 0.189253) (xy 0.88652 0.211) (xy 0.882925 0.232499) (xy 0.878822 0.25371)
			(xy 0.874213 0.274592) (xy 0.8691 0.295102) (xy 0.863903 0.313951) (xy 0.858292 0.332699) (xy 0.852271 0.351341)
			(xy 0.845841 0.369874) (xy 0.839005 0.388292) (xy 0.831763 0.406592) (xy 0.824118 0.42477) (xy 0.816072 0.44282)
			(xy 0.807627 0.46074) (xy 0.798786 0.478524) (xy 0.789548 0.496169) (xy 0.779918 0.513669) (xy 0.769896 0.531022)
			(xy 0.759485 0.548222) (xy 0.748687 0.565266) (xy 0.737503 0.582149) (xy 0.72547 0.599474) (xy 0.713074 0.616442)
			(xy 0.700314 0.633053) (xy 0.687192 0.649305) (xy 0.673708 0.6652) (xy 0.659862 0.680736) (xy 0.645654 0.695914)
			(xy 0.631084 0.710734) (xy 0.616152 0.725194) (xy 0.600859 0.739295) (xy 0.585206 0.753037) (xy 0.569191 0.76642)
			(xy 0.552816 0.779442) (xy 0.536081 0.792105) (xy 0.518986 0.804407) (xy 0.50153 0.816349) (xy 0.486288 0.826395)
			(xy 0.472217 0.835387) (xy 0.458845 0.843596) (xy 0.445702 0.851291) (xy 0.432316 0.858742) (xy 0.418214 0.866216)
			(xy 0.402925 0.873984) (xy 0.385977 0.882315) (xy 0.367817 0.890912) (xy 0.349722 0.899041) (xy 0.331665 0.906711)
			(xy 0.313622 0.91393) (xy 0.295568 0.920704) (xy 0.277476 0.92704) (xy 0.259322 0.932947) (xy 0.241079 0.938431)
			(xy 0.222722 0.9435) (xy 0.204227 0.948161) (xy 0.185566 0.952422) (xy 0.166715 0.956289) (xy 0.147649 0.959771)
			(xy 0.128341 0.962874) (xy 0.108767 0.965606) (xy 0.0889 0.967975) (xy 0.076018 0.969042) (xy 0.058584 0.970012)
			(xy 0.016274 0.971502) (xy -0.025603 0.972132) (xy -0.042497 0.972027) (xy -0.054624 0.971589) (xy -0.054624 0.97159)
			(xy -0.084271 0.969165) (xy -0.113576 0.965876) (xy -0.142549 0.961719) (xy -0.171199 0.956693) (xy -0.199535 0.950793)
			(xy -0.227565 0.944017) (xy -0.255299 0.936361) (xy -0.282746 0.927824) (xy -0.309914 0.918401) (xy -0.336814 0.90809)
			(xy -0.363453 0.896888) (xy -0.389842 0.884792) (xy -0.415989 0.871799) (xy -0.441902 0.857906) (xy -0.467592 0.843111)
			(xy -0.493067 0.827409) (xy -0.511879 0.815081) (xy -0.530365 0.802266) (xy -0.548512 0.788978) (xy -0.566309 0.775226)
			(xy -0.583744 0.761022) (xy -0.600807 0.746377) (xy -0.617484 0.731302) (xy -0.633765 0.715809) (xy -0.649639 0.699909)
			(xy -0.665093 0.683614) (xy -0.680116 0.666934) (xy -0.694697 0.649881) (xy -0.708824 0.632466) (xy -0.722485 0.614701)
			(xy -0.735669 0.596596) (xy -0.748365 0.578163) (xy -0.757943 0.56366) (xy -0.766724 0.549922) (xy -0.774894 0.536628)
			(xy -0.782638 0.523456) (xy -0.790141 0.510083) (xy -0.797588 0.496187) (xy -0.805163 0.481446) (xy -0.813053 0.465537)
			(xy -0.829947 0.429324) (xy -0.83765 0.41149) (xy -0.844878 0.393767) (xy -0.851645 0.376103) (xy -0.857969 0.358443)
			(xy -0.863864 0.340736) (xy -0.869347 0.322929) (xy -0.874432 0.304968) (xy -0.879135 0.286802) (xy -0.883472 0.268377)
			(xy -0.887459 0.249639) (xy -0.891111 0.230538) (xy -0.894444 0.211018) (xy -0.900215 0.170516) (xy -0.901871 0.152022)
			(xy -0.903055 0.127986) (xy -0.903767 0.100243) (xy -0.904008 0.070629) (xy -0.903776 0.04098) (xy -0.903071 0.013132)
			(xy -0.901894 -0.011079) (xy -0.900243 -0.029819) (xy -0.895598 -0.063145) (xy -0.889894 -0.095978)
			(xy -0.883133 -0.128313) (xy -0.875317 -0.160149) (xy -0.866447 -0.191481) (xy -0.856524 -0.222306)
			(xy -0.845549 -0.252623) (xy -0.833524 -0.282426) (xy -0.82045 -0.311715) (xy -0.806328 -0.340484)
			(xy -0.79116 -0.368732) (xy -0.774947 -0.396454) (xy -0.75769 -0.423649) (xy -0.739391 -0.450313)
			(xy -0.720051 -0.476442) (xy -0.699671 -0.502035) (xy -0.690071 -0.513351) (xy -0.679657 -0.525051)
			(xy -0.668559 -0.537017) (xy -0.65691 -0.54913) (xy -0.632482 -0.573319) (xy -0.607426 -0.596668)
			(xy -0.582795 -0.618225) (xy -0.570968 -0.628033) (xy -0.559642 -0.637037) (xy -0.548949 -0.645117)
			(xy -0.53902 -0.652155) (xy -0.529987 -0.65803) (xy -0.521982 -0.662625) (xy -0.517171 -0.665026)
			(xy -0.512229 -0.667243) (xy -0.507167 -0.669275) (xy -0.501999 -0.671119) (xy -0.496737 -0.672773)
			(xy -0.491393 -0.674234) (xy -0.485979 -0.675501) (xy -0.480508 -0.676572) (xy -0.474991 -0.677444)
			(xy -0.469442 -0.678114) (xy -0.463872 -0.678582) (xy -0.458295 -0.678844) (xy -0.452721 -0.678899)
		)
		(stroke
			(width 0.001993)
			(type solid)
		)
		(fill solid)
		(layer "F.SilkS")
		(uuid "b80ed854-db9f-4360-97a7-2e02736753d9")
	)
	(fp_rect
		(start -1.25 -1.1)
		(end 1.25 1.1)
		(stroke
			(width 0.05)
			(type solid)
		)
		(fill none)
		(layer "F.CrtYd")
		(uuid "2dfc84fc-e600-4596-8c70-7ed4c9022868")
	)
	(fp_rect
		(start 1.15 -1)
		(end -1.15 1)
		(stroke
			(width 0.1)
			(type solid)
		)
		(fill none)
		(layer "F.Fab")
		(uuid "cc22e355-0b15-4303-9784-52a4012e3bab")
	)
	(fp_text user "${REFERENCE}"
		(at 0 0 0)
		(layer "F.Fab")
		(uuid "5efabdcb-ef53-42e1-86eb-3e03412ffaa9")
		(effects
			(font
				(size 0.5 0.5)
				(thickness 0.125)
			)
		)
	)
	(group ""
		(uuid "d282901a-f95e-41e5-aa93-99fb99a0428f")
		(members "491151fb-cce9-4445-9d9f-0788c87d301d" "b80ed854-db9f-4360-97a7-2e02736753d9")
	)
)
