(module "Amphenol_10132798-021100LF" (layer F.Cu) (tedit 5E55AFB7)
  (attr smd)
  (fp_text reference "REF**" (at 0 -4) (layer F.SilkS)
    (effects (font (size 1 1) (thickness 0.15)))
  )
  (fp_text value "Amphenol_10132798-021100LF" (at 0 -3.7) (layer F.Fab) hide
    (effects (font (size 1 1) (thickness 0.15)))
  )
  (fp_line (start 3.55 -1.8) (end 3.55 -1) (layer F.SilkS) (width 0.15))
  (fp_line (start 3.55 1.8) (end 3.55 1) (layer F.SilkS) (width 0.15))
  (fp_line (start -3.55 1.8) (end -3.55 1) (layer F.SilkS) (width 0.15))
  (fp_line (start -3.55 -1.8) (end -3.55 -1) (layer F.SilkS) (width 0.15))
  (fp_line (start -2.5 2.2) (end -2.6 2.3) (layer F.SilkS) (width 0.15))
  (fp_line (start -2.5 2.2) (end -2.6 2.1) (layer F.SilkS) (width 0.15))
  (fp_line (start -3.55 -1.8) (end -2.5 -1.8) (layer F.SilkS) (width 0.15))
  (fp_line (start -3.55 1.8) (end -2.5 1.8) (layer F.SilkS) (width 0.15))
  (fp_line (start 3.55 -1.8) (end 2.5 -1.8) (layer F.SilkS) (width 0.15))
  (fp_line (start 3.55 1.8) (end 2.5 1.8) (layer F.SilkS) (width 0.15))
  (pad "1" smd rect (at -2.25 1.8) (size 0.3 1.6) (layers "F.Cu" "F.Paste" "F.Mask"))
  (pad "2" smd rect (at -2.25 -1.8) (size 0.3 1.6) (layers "F.Cu" "F.Paste" "F.Mask"))
  (pad "3" smd rect (at -1.75 1.8) (size 0.3 1.6) (layers "F.Cu" "F.Paste" "F.Mask"))
  (pad "4" smd rect (at -1.75 -1.8) (size 0.3 1.6) (layers "F.Cu" "F.Paste" "F.Mask"))
  (pad "5" smd rect (at -1.25 1.8) (size 0.3 1.6) (layers "F.Cu" "F.Paste" "F.Mask"))
  (pad "6" smd rect (at -1.25 -1.8) (size 0.3 1.6) (layers "F.Cu" "F.Paste" "F.Mask"))
  (pad "7" smd rect (at -0.75 1.8) (size 0.3 1.6) (layers "F.Cu" "F.Paste" "F.Mask"))
  (pad "8" smd rect (at -0.75 -1.8) (size 0.3 1.6) (layers "F.Cu" "F.Paste" "F.Mask"))
  (pad "9" smd rect (at -0.25 1.8) (size 0.3 1.6) (layers "F.Cu" "F.Paste" "F.Mask"))
  (pad "10" smd rect (at -0.25 -1.8) (size 0.3 1.6) (layers "F.Cu" "F.Paste" "F.Mask"))
  (pad "11" smd rect (at 0.25 1.8) (size 0.3 1.6) (layers "F.Cu" "F.Paste" "F.Mask"))
  (pad "12" smd rect (at 0.25 -1.8) (size 0.3 1.6) (layers "F.Cu" "F.Paste" "F.Mask"))
  (pad "13" smd rect (at 0.75 1.8) (size 0.3 1.6) (layers "F.Cu" "F.Paste" "F.Mask"))
  (pad "14" smd rect (at 0.75 -1.8) (size 0.3 1.6) (layers "F.Cu" "F.Paste" "F.Mask"))
  (pad "15" smd rect (at 1.25 1.8) (size 0.3 1.6) (layers "F.Cu" "F.Paste" "F.Mask"))
  (pad "16" smd rect (at 1.25 -1.8) (size 0.3 1.6) (layers "F.Cu" "F.Paste" "F.Mask"))
  (pad "17" smd rect (at 1.75 1.8) (size 0.3 1.6) (layers "F.Cu" "F.Paste" "F.Mask"))
  (pad "18" smd rect (at 1.75 -1.8) (size 0.3 1.6) (layers "F.Cu" "F.Paste" "F.Mask"))
  (pad "19" smd rect (at 2.25 1.8) (size 0.3 1.6) (layers "F.Cu" "F.Paste" "F.Mask"))
  (pad "20" smd rect (at 2.25 -1.8) (size 0.3 1.6) (layers "F.Cu" "F.Paste" "F.Mask"))
  (pad "" smd rect (at -3.95 0) (size 0.8 1.8) (layers "F.Cu" "F.Paste" "F.Mask"))
  (pad "" smd rect (at 3.95 0 180) (size 0.8 1.8) (layers "F.Cu" "F.Paste" "F.Mask"))
  (pad "" thru_hole circle (at -3.3 -1.5 180) (size 0.7 0.7) (drill 0.7) (layers *.Cu *.Mask))
  (pad "" thru_hole circle (at 3.3 -1.5 180) (size 0.7 0.7) (drill 0.7) (layers *.Cu *.Mask))
  (model "${KICADLIB}/model/connector/10132798-021100LF.stp"
    (at (xyz 0 0 0))
    (scale (xyz 1 1 1))
    (rotate (xyz -90 0 0))
  )
)
