(module "DFN200X200X065-10" (layer F.Cu) (tedit 5EC5EB1A)
  (attr smd)
  (fp_text reference "REF**" (at 0 -1.95) (layer F.SilkS)
    (effects (font (size 1 1) (thickness 0.15)))
  )
  (fp_text value "DFN200X200X065-10" (at 0 -2.3) (layer F.Fab) hide
    (effects (font (size 1 1) (thickness 0.15)))
  )
  (fp_line (start -1 -1) (end -0.25 -1) (layer F.SilkS) (width 0.15))
  (fp_line (start 1 -1) (end 0.25 -1) (layer F.SilkS) (width 0.15))
  (fp_line (start -1 1) (end -0.25 1) (layer F.SilkS) (width 0.15))
  (fp_line (start 1 1) (end 0.25 1) (layer F.SilkS) (width 0.15))
  (fp_line (start -1 1) (end 1 1) (layer F.Fab) (width 0.1))
  (fp_line (start 1 1) (end 1 -1) (layer F.Fab) (width 0.1))
  (fp_line (start 1 -1) (end -0.5 -1) (layer F.Fab) (width 0.1))
  (fp_line (start -0.5 -1) (end -1 -0.5) (layer F.Fab) (width 0.1))
  (fp_line (start -1 -0.5) (end -1 1) (layer F.Fab) (width 0.1))
  (fp_text user "${REFERENCE}" (at 0 0 unlocked) (layer F.Fab)
    (effects (font (size 0.4 0.4) (thickness 0.05)))
  )
  (fp_text user "^" (at -2.05 -0.75 270 unlocked) (layer F.SilkS)
    (effects (font (size 1 1) (thickness 0.15)))
  )
  (fp_line (start 1.3 -1.3) (end 1.3 1.3) (layer F.CrtYd) (width 0.05))
  (fp_line (start 1.3 1.3) (end -1.3 1.3) (layer F.CrtYd) (width 0.05))
  (fp_line (start -1.3 1.3) (end -1.3 -1.3) (layer F.CrtYd) (width 0.05))
  (fp_line (start -1.3 -1.3) (end 1.3 -1.3) (layer F.CrtYd) (width 0.05))
  (pad "1" smd rect (at -0.9 -0.75) (size 0.7 0.3) (layers "F.Cu" "F.Paste" "F.Mask") (tstamp 400346eb-fecd-4378-b803-bd903c49c18d))
  (pad "2" smd rect (at -0.9 -0.25) (size 0.7 0.3) (layers "F.Cu" "F.Paste" "F.Mask") (tstamp 3ba67ddd-50d0-4daf-9f67-0fd1191083a6))
  (pad "3" smd rect (at -0.9 0.25) (size 0.7 0.3) (layers "F.Cu" "F.Paste" "F.Mask") (tstamp a5796eed-121f-49c2-b4c5-85810e3ffaf1))
  (pad "4" smd rect (at -0.9 0.75) (size 0.7 0.3) (layers "F.Cu" "F.Paste" "F.Mask") (tstamp 15bc2f76-cc5b-4514-932b-e5cb3667c319))
  (pad "6" smd rect (at 0.9 0.75) (size 0.7 0.3) (layers "F.Cu" "F.Paste" "F.Mask") (tstamp 28871326-7d75-4946-aeef-ba3ee83b2789))
  (pad "7" smd rect (at 0.9 0.25) (size 0.7 0.3) (layers "F.Cu" "F.Paste" "F.Mask") (tstamp a1687e6d-2551-43a3-914e-421f1185f591))
  (pad "8" smd rect (at 0.9 -0.25) (size 0.7 0.3) (layers "F.Cu" "F.Paste" "F.Mask") (tstamp 6ef6c4b1-b63d-4717-9c1b-de1c77fef7ca))
  (pad "9" smd rect (at 0.9 -0.75) (size 0.7 0.3) (layers "F.Cu" "F.Paste" "F.Mask") (tstamp 92928806-9244-46e6-bb57-da436705d792))
  (pad "5" smd rect (at 0 0.9 90) (size 0.7 0.3) (layers "F.Cu" "F.Paste" "F.Mask") (tstamp 80d527db-e105-464c-ae98-e640d8925d00))
  (pad "10" smd rect (at 0 -0.9 90) (size 0.7 0.3) (layers "F.Cu" "F.Paste" "F.Mask") (tstamp a96f08b6-850c-40ae-84c7-a6971311e88b))
  (model "${KICADLIB}/model/DFN/DFN10-SI1133.step"
    (at (xyz 0 0 0))
    (scale (xyz 1 1 1))
    (rotate (xyz 0 0 0))
  )
)
