(footprint "Relay_DPDT_FormC" (version 20221018) (generator pcbnew)
  (layer "F.Cu")
  (fp_text reference "REF**" (at 0 -7.19) (layer "F.SilkS")
      (effects (font (size 1 1) (thickness 0.15)))
    (tstamp f966e3e4-1909-4562-892b-1a1a31a71b6c)
  )
  (fp_text value "Relay_DPDT_FormC" (at 0 -5.27) (layer "F.Fab") hide
      (effects (font (size 1 1) (thickness 0.15)))
    (tstamp 818e7d7f-3e7d-4319-b40e-fa2fa0264960)
  )
  (fp_text user "^" (at -12 5.75 unlocked) (layer "B.SilkS")
      (effects (font (size 1 1) (thickness 0.15)) (justify mirror))
    (tstamp 60645fbd-5daf-4aa1-95cf-40e3aefca5fc)
  )
  (fp_text user "^" (at -12 7.5 unlocked) (layer "F.SilkS")
      (effects (font (size 1 1) (thickness 0.15)))
    (tstamp 71c6ad6a-c32f-4479-a880-c2d8b9a34b60)
  )
  (fp_text user "${REFERENCE}" (at 0 0 unlocked) (layer "F.Fab")
      (effects (font (size 1 1) (thickness 0.15)))
    (tstamp b5f79670-c8f7-45fb-9268-d80ad0d111fb)
  )
  (fp_line (start -14.5 -6.35) (end 14.5 -6.35)
    (stroke (width 0.15) (type solid)) (layer "F.SilkS") (tstamp 25406c7a-9aec-4b7e-a3f0-8a2346e6c06d))
  (fp_line (start -14.5 6.35) (end -14.5 -6.35)
    (stroke (width 0.15) (type solid)) (layer "F.SilkS") (tstamp 779a1f18-db37-4245-9f2d-a1594b2ad6e0))
  (fp_line (start 14.5 -6.35) (end 14.5 6.35)
    (stroke (width 0.15) (type solid)) (layer "F.SilkS") (tstamp 71577a64-99f0-4533-875b-488c92573838))
  (fp_line (start 14.5 6.35) (end -14.5 6.35)
    (stroke (width 0.15) (type solid)) (layer "F.SilkS") (tstamp 3a7a8d8a-a131-4a61-a5a5-219a79f78a8d))
  (fp_rect (start -14.8 -6.6) (end 14.7 6.6)
    (stroke (width 0.05) (type solid)) (fill none) (layer "F.CrtYd") (tstamp 0d662227-efa1-47e9-bea8-5b6e4e2c98a5))
  (fp_line (start -14.5 -6.35) (end 14.5 -6.35)
    (stroke (width 0.1) (type solid)) (layer "F.Fab") (tstamp 2ebe2530-824f-4035-8f8d-de32d1edd859))
  (fp_line (start -14.5 5.55) (end -14.5 -6.35)
    (stroke (width 0.1) (type solid)) (layer "F.Fab") (tstamp 3f1b7a77-a2eb-4208-b4eb-c83a7df3838d))
  (fp_line (start -13.7 6.35) (end -14.5 5.55)
    (stroke (width 0.1) (type solid)) (layer "F.Fab") (tstamp cebf4bd2-ccdb-4c1d-8cd6-1157a8bd1f25))
  (fp_line (start 14.5 -6.35) (end 14.5 6.35)
    (stroke (width 0.1) (type solid)) (layer "F.Fab") (tstamp b498b358-158f-462f-966f-7127ac0c243f))
  (fp_line (start 14.5 6.35) (end -13.7 6.35)
    (stroke (width 0.1) (type solid)) (layer "F.Fab") (tstamp be760efd-fc2a-40db-a47d-f85b578b1d07))
  (pad "1" thru_hole circle (at -12.01 3.75) (size 2 2) (drill 1.3) (layers "*.Cu" "*.Mask") (tstamp d923ad9a-c4ba-48cd-8806-b86ce073d2e2))
  (pad "3" thru_hole circle (at 3.11 3.75) (size 2 2) (drill 1.3) (layers "*.Cu" "*.Mask") (tstamp 93042122-12d4-4d4d-a6e8-92cfab12052c))
  (pad "4" thru_hole circle (at 8.15 3.75) (size 2 2) (drill 1.3) (layers "*.Cu" "*.Mask") (tstamp 825774b2-33bf-4926-8dbb-3ac01cfe7d84))
  (pad "5" thru_hole circle (at 13.19 3.75) (size 2 2) (drill 1.3) (layers "*.Cu" "*.Mask") (tstamp 68757970-8f78-4252-84c7-6cd6c0b1177d))
  (pad "8" thru_hole circle (at 13.19 -3.75) (size 2 2) (drill 1.3) (layers "*.Cu" "*.Mask") (tstamp 8a59c512-f570-44a2-86c2-96e17866a1f2))
  (pad "9" thru_hole circle (at 8.15 -3.75) (size 2 2) (drill 1.3) (layers "*.Cu" "*.Mask") (tstamp b42c8b6d-b1a3-46a8-9675-3f57af14d633))
  (pad "10" thru_hole circle (at 3.11 -3.75) (size 2 2) (drill 1.3) (layers "*.Cu" "*.Mask") (tstamp e9d4f065-a44f-4a67-b9c0-99d0ad6f3bb5))
  (pad "12" thru_hole circle (at -12.01 -3.75) (size 2 2) (drill 1.3) (layers "*.Cu" "*.Mask") (tstamp 17f465ad-5f24-476a-bb93-2a316bc23987))
  (model "${KICADLIB}/model/mechanical/TE_RZ_5mm_relay.step"
    (offset (xyz 0 0 0))
    (scale (xyz 1 1 1))
    (rotate (xyz 0 0 0))
  )
)
