(footprint "INDC1608" (version 20221018) (generator pcbnew)
  (layer "F.Cu")
  (descr "Resistor SMD 0603, reflow soldering, Vishay (see dcrcw.pdf)")
  (tags "resistor 0603")
  (attr smd)
  (fp_text reference "REF**" (at 0 -1.2) (layer "F.SilkS")
      (effects (font (size 1 1) (thickness 0.15)))
    (tstamp 56f0313e-2ac0-481b-924c-1fb77d034e3b)
  )
  (fp_text value "INDC1608" (at 0 1.3) (layer "F.Fab") hide
      (effects (font (size 1 1) (thickness 0.15)))
    (tstamp 0e67eaf9-3ce6-440c-9764-4bbef5b02fa6)
  )
  (fp_text user "${REFERENCE}" (at 0 0) (layer "F.Fab")
      (effects (font (size 0.35 0.35) (thickness 0.075)))
    (tstamp 241c2354-b667-452d-b19a-d5b8fff39f12)
  )
  (fp_line (start -0.275 -0.4) (end 0.275 -0.4)
    (stroke (width 0.1) (type solid)) (layer "F.SilkS") (tstamp 1d34c15c-5158-450e-8009-6037e8095ca8))
  (fp_line (start 0.275 0.4) (end -0.275 0.4)
    (stroke (width 0.1) (type solid)) (layer "F.SilkS") (tstamp d725fd9a-ad48-4316-a5c2-199014b10842))
  (fp_line (start -1.1 -0.5) (end -1.1 0.5)
    (stroke (width 0.05) (type solid)) (layer "F.CrtYd") (tstamp 2fd4d18e-efe6-4156-beca-482e54733bd9))
  (fp_line (start -1.1 -0.5) (end 1.1 -0.5)
    (stroke (width 0.05) (type solid)) (layer "F.CrtYd") (tstamp 2c8adf80-fa60-418a-a858-ef7207739071))
  (fp_line (start -1.1 0.5) (end 1.1 0.5)
    (stroke (width 0.05) (type solid)) (layer "F.CrtYd") (tstamp b242380f-ed0b-4df4-8a53-aa86d2770fb7))
  (fp_line (start 1.1 -0.5) (end 1.1 0.5)
    (stroke (width 0.05) (type solid)) (layer "F.CrtYd") (tstamp 975a8f32-8862-4384-8b79-bc64c798b86f))
  (fp_poly
    (pts
      (xy 0.8 0.4)
      (xy -0.7 0.4)
      (xy -0.8 0.3)
      (xy -0.8 -0.4)
      (xy 0.8 -0.4)
    )

    (stroke (width 0.05) (type solid)) (fill none) (layer "F.Fab") (tstamp 5f5cbfa4-aecb-49e4-bb0d-90d169d2d377))
  (pad "1" smd roundrect (at -0.7 0) (size 0.7 0.9) (layers "F.Cu" "F.Paste" "F.Mask") (roundrect_rratio 0.07142857143) (tstamp d7a561a8-cd58-47da-a449-458bc0128452))
  (pad "2" smd roundrect (at 0.7 0) (size 0.7 0.9) (layers "F.Cu" "F.Paste" "F.Mask") (roundrect_rratio 0.07142857143) (tstamp c05ef672-23aa-4bf7-bc09-d0e3734805bb))
  (model "${KICADLIB}/model/passive/INDC1608.step"
    (offset (xyz 0 0 0))
    (scale (xyz 1 1 1))
    (rotate (xyz 0 0 0))
  )
)
