(footprint "SOT-883" (version 20221018) (generator pcbnew)
  (layer "F.Cu")
  (attr smd)
  (fp_text reference "REF**" (at 0 -1.3 unlocked) (layer "F.SilkS")
      (effects (font (size 1 1) (thickness 0.15)))
    (tstamp 31bbba5c-51e7-4546-87d2-d2af46c1f5f0)
  )
  (fp_text value "SOT-883" (at 0 1 unlocked) (layer "F.Fab") hide
      (effects (font (size 1 1) (thickness 0.15)))
    (tstamp b317a1ca-6791-4839-87c5-78be4fc2fb9e)
  )
  (fp_text user "${REFERENCE}" (at 0 0 90 unlocked) (layer "F.Fab")
      (effects (font (size 0.25 0.25) (thickness 0.05)))
    (tstamp 1ec56dce-4ecf-4e46-9075-10c7a29695ac)
  )
  (fp_line (start -0.3 0.1) (end -0.3 -0.1)
    (stroke (width 0.1) (type solid)) (layer "F.SilkS") (tstamp cb200c1c-fa7c-41d4-95a0-7318a9fdf7cf))
  (fp_line (start 0.3 -0.1) (end 0.3 0.1)
    (stroke (width 0.1) (type solid)) (layer "F.SilkS") (tstamp d913fef1-cfc2-4243-adfb-7c89a0ff6264))
  (fp_rect (start -0.4 -0.7) (end 0.4 0.7)
    (stroke (width 0.05) (type solid)) (fill none) (layer "F.CrtYd") (tstamp 6972fd51-9fc5-4772-984c-1cf84394a119))
  (fp_line (start -0.3 -0.5) (end -0.3 0.3)
    (stroke (width 0.1) (type solid)) (layer "F.Fab") (tstamp 887b9e45-e211-425c-ab61-bb5ef6558755))
  (fp_line (start -0.3 -0.5) (end 0.3 -0.5)
    (stroke (width 0.1) (type solid)) (layer "F.Fab") (tstamp f2c69480-14de-4c57-9e40-e1ba66d15177))
  (fp_line (start -0.3 0.3) (end -0.1 0.5)
    (stroke (width 0.1) (type solid)) (layer "F.Fab") (tstamp 3b94560a-28e4-444e-adc4-d2cea800705e))
  (fp_line (start 0.3 0.5) (end -0.1 0.5)
    (stroke (width 0.1) (type solid)) (layer "F.Fab") (tstamp 55cc8067-0420-4cd7-b403-d741716836a6))
  (fp_line (start 0.3 0.5) (end 0.3 -0.5)
    (stroke (width 0.1) (type solid)) (layer "F.Fab") (tstamp eae5f124-f3a7-45f0-921a-f3bdad3be9c3))
  (pad "1" smd roundrect (at -0.25 0.4) (size 0.3 0.4) (layers "F.Cu" "F.Paste" "F.Mask") (roundrect_rratio 0.1666666667) (tstamp f7a6791b-9448-4084-b78b-3eb1608157f1))
  (pad "2" smd roundrect (at 0.25 0.4) (size 0.3 0.4) (layers "F.Cu" "F.Paste" "F.Mask") (roundrect_rratio 0.1666666667) (tstamp 1a00628d-c9c3-4f29-b9ec-baf9f152c953))
  (pad "3" smd roundrect (at 0 -0.4 90) (size 0.4 0.55) (layers "F.Cu" "F.Paste" "F.Mask") (roundrect_rratio 0.125) (tstamp 0c80f627-9505-44d3-988f-9d98dcca3c5e))
  (model "${KICADLIB}/model/SOT/SOT-883.step"
    (offset (xyz 0 0 0))
    (scale (xyz 1 1 1))
    (rotate (xyz 0 0 0))
  )
)
