(footprint "PinHeader_2x06_P2.54mm_Vertical" (version 20211014) (generator pcbnew)
  (layer "F.Cu")
  (tedit 6116C8D3)
  (descr "Through hole straight pin header, 2x06, 2.54mm pitch, double rows")
  (tags "Through hole pin header THT 2x06 2.54mm double row")
  (attr through_hole)
  (fp_text reference "REF**" (at 1.27 -2.33) (layer "F.SilkS")
    (effects (font (size 1 1) (thickness 0.15)))
    (tstamp 4fe960a0-be6d-44f6-aad7-80f5f7811384)
  )
  (fp_text value "PinHeader_2x06_P2.54mm_Vertical" (at 1.27 15.03) (layer "F.Fab") hide
    (effects (font (size 1 1) (thickness 0.15)))
    (tstamp 8c7accc6-3d40-49e0-a562-f38f6e310aa2)
  )
  (fp_text user "${REFERENCE}" (at 1.27 6.35 90) (layer "F.Fab")
    (effects (font (size 1 1) (thickness 0.15)))
    (tstamp 685574a3-edc2-4fe1-97cb-0a5cb979d564)
  )
  (fp_line (start 1.27 1.27) (end 1.27 -1.33) (layer "F.SilkS") (width 0.12) (tstamp 0dfb5e98-b5f9-49b3-b802-2ea842643be9))
  (fp_line (start 3.87 -1.33) (end 3.87 14.03) (layer "F.SilkS") (width 0.12) (tstamp 2d5d786f-6250-4e60-b4e0-184f1149d7d4))
  (fp_line (start -1.33 14.03) (end 3.87 14.03) (layer "F.SilkS") (width 0.12) (tstamp 4bee45b8-2e64-4735-b55f-4e813b2b479c))
  (fp_line (start -1.33 1.27) (end -1.33 14.03) (layer "F.SilkS") (width 0.12) (tstamp 65b29515-c4d4-4026-bfec-d42f8fe6e125))
  (fp_line (start 1.27 -1.33) (end 3.87 -1.33) (layer "F.SilkS") (width 0.12) (tstamp 661749e7-dff6-42c2-a9be-0da630fecf33))
  (fp_line (start -1.33 1.27) (end 1.27 1.27) (layer "F.SilkS") (width 0.12) (tstamp 71cb05ec-64f5-4528-8cf3-f7a904b641d4))
  (fp_line (start -1.33 -1.33) (end 0 -1.33) (layer "F.SilkS") (width 0.12) (tstamp 83927dce-f119-4d70-8b68-c8f6a6f10864))
  (fp_line (start -1.33 0) (end -1.33 -1.33) (layer "F.SilkS") (width 0.12) (tstamp c412f650-99ce-4341-81d4-f0766e7943a6))
  (fp_line (start 4.35 -1.8) (end -1.8 -1.8) (layer "F.CrtYd") (width 0.05) (tstamp 62a04eb1-bd3c-46b6-af61-e13d9b099415))
  (fp_line (start -1.8 -1.8) (end -1.8 14.5) (layer "F.CrtYd") (width 0.05) (tstamp 6d92e7f5-68f6-49f2-8d94-43ebcb9bad1c))
  (fp_line (start -1.8 14.5) (end 4.35 14.5) (layer "F.CrtYd") (width 0.05) (tstamp 9d143767-ca61-412e-b93b-604be4d31431))
  (fp_line (start 4.35 14.5) (end 4.35 -1.8) (layer "F.CrtYd") (width 0.05) (tstamp f3f925c6-8ecf-4f30-9e61-3015b758a025))
  (fp_line (start -1.27 0) (end 0 -1.27) (layer "F.Fab") (width 0.1) (tstamp 121d254a-6f1b-4f67-80e6-074ef1ddeae7))
  (fp_line (start 3.81 13.97) (end -1.27 13.97) (layer "F.Fab") (width 0.1) (tstamp 6138d8f4-50c7-4583-afb7-f08be8ed92b5))
  (fp_line (start 0 -1.27) (end 3.81 -1.27) (layer "F.Fab") (width 0.1) (tstamp 76f92b12-dc00-468d-9fb2-7906d2a1545a))
  (fp_line (start -1.27 13.97) (end -1.27 0) (layer "F.Fab") (width 0.1) (tstamp 858ed904-96a7-432b-b90b-f9cee69b58a3))
  (fp_line (start 3.81 -1.27) (end 3.81 13.97) (layer "F.Fab") (width 0.1) (tstamp ae7a1578-f73c-46c5-87a8-7bf155b13a00))
  (pad "1" thru_hole rect (at 0 0) (size 1.7 1.7) (drill 1) (layers *.Cu *.Mask) (tstamp f05d32e9-1db9-4abe-b074-3feb7ab99f1d))
  (pad "2" thru_hole oval (at 2.54 0) (size 1.7 1.7) (drill 1) (layers *.Cu *.Mask) (tstamp 57e4bf33-903e-4bdd-899c-8543f90c828e))
  (pad "3" thru_hole oval (at 0 2.54) (size 1.7 1.7) (drill 1) (layers *.Cu *.Mask) (tstamp c464b17c-de7c-47dc-9a22-ff21d956e967))
  (pad "4" thru_hole oval (at 2.54 2.54) (size 1.7 1.7) (drill 1) (layers *.Cu *.Mask) (tstamp 19b71d34-a177-4475-afc4-4ebe09b58c43))
  (pad "5" thru_hole oval (at 0 5.08) (size 1.7 1.7) (drill 1) (layers *.Cu *.Mask) (tstamp c36e66c8-f2e0-48b7-bcbc-d6d2e8012ebe))
  (pad "6" thru_hole oval (at 2.54 5.08) (size 1.7 1.7) (drill 1) (layers *.Cu *.Mask) (tstamp 64402083-f169-477a-9fe0-5dbde5f6d063))
  (pad "7" thru_hole oval (at 0 7.62) (size 1.7 1.7) (drill 1) (layers *.Cu *.Mask) (tstamp 2ba3dd8b-17af-4a37-9864-d278614aba02))
  (pad "8" thru_hole oval (at 2.54 7.62) (size 1.7 1.7) (drill 1) (layers *.Cu *.Mask) (tstamp ac20f66b-4418-4878-bae5-5a80cb827d1c))
  (pad "9" thru_hole oval (at 0 10.16) (size 1.7 1.7) (drill 1) (layers *.Cu *.Mask) (tstamp edb395a1-e900-40f7-818b-a9cb0a7c2544))
  (pad "10" thru_hole oval (at 2.54 10.16) (size 1.7 1.7) (drill 1) (layers *.Cu *.Mask) (tstamp 13fe91dd-0be1-4ec1-98c7-e5e5e495e324))
  (pad "11" thru_hole oval (at 0 12.7) (size 1.7 1.7) (drill 1) (layers *.Cu *.Mask) (tstamp ccaec705-7841-4beb-8b76-7a7cb5335084))
  (pad "12" thru_hole oval (at 2.54 12.7) (size 1.7 1.7) (drill 1) (layers *.Cu *.Mask) (tstamp 4b9de9be-1b18-422b-aa6f-7b61ee9f5352))
  (model "${KICADLIB}/model/connector/PinHeader_2x06_P2.54mm_Vertical.step"
    (offset (xyz 0 0 0))
    (scale (xyz 1 1 1))
    (rotate (xyz 0 0 0))
  )
)
