(footprint "CIT_J104D" (version 20211014) (generator pcbnew)
  (layer "F.Cu")
  (tedit 0)
  (attr through_hole)
  (fp_text reference "REF**" (at 0 -6 unlocked) (layer "F.SilkS")
    (effects (font (size 1 1) (thickness 0.15)))
    (tstamp 7d2eba81-aa80-4257-a5a7-9a6179da897e)
  )
  (fp_text value "CIT_J104D" (at 0 1 unlocked) (layer "F.Fab") hide
    (effects (font (size 1 1) (thickness 0.15)))
    (tstamp 6f5a9f10-1b2c-4916-b4e5-cb5bd0f851a0)
  )
  (fp_text user "^" (at -7.6 5.8 unlocked) (layer "B.SilkS")
    (effects (font (size 1 1) (thickness 0.15)) (justify mirror))
    (tstamp e84c1345-f09e-4367-a88c-c0057c80e52f)
  )
  (fp_text user "^" (at -7.6 5.8 unlocked) (layer "F.SilkS")
    (effects (font (size 1 1) (thickness 0.15)))
    (tstamp 605ef108-bf65-4b3c-b035-f1692fd7a098)
  )
  (fp_text user "${REFERENCE}" (at 0 0 unlocked) (layer "F.Fab")
    (effects (font (size 1 1) (thickness 0.15)))
    (tstamp bde3f73b-f869-498d-a8d7-18346cb7179e)
  )
  (fp_rect (start 11.46 4.985) (end -8.91 -4.985) (layer "F.SilkS") (width 0.1) (fill none) (tstamp 9c476165-300e-4e08-a354-4288b203c377))
  (fp_rect (start -9.1 -5.2) (end 11.7 5.2) (layer "F.CrtYd") (width 0.05) (fill none) (tstamp d5d0ab72-d292-46f1-9956-293c20275329))
  (fp_line (start 11.46 -4.98) (end 11.46 4.98) (layer "F.Fab") (width 0.1) (tstamp 6109efee-34d5-4820-b2f1-2e5974922f54))
  (fp_line (start -8.91 -4.98) (end 11.46 -4.98) (layer "F.Fab") (width 0.1) (tstamp 66cddf54-c141-4b9d-b300-069491227c2d))
  (fp_line (start -8.91 4.23) (end -8.91 -4.98) (layer "F.Fab") (width 0.1) (tstamp 836c1b72-6495-4f81-a125-58f0f7d787c2))
  (fp_line (start 11.46 4.98) (end -8.16 4.98) (layer "F.Fab") (width 0.1) (tstamp 98155800-78e7-48e2-b416-a5948d22b132))
  (fp_line (start -8.16 4.98) (end -8.91 4.23) (layer "F.Fab") (width 0.1) (tstamp f930fa91-6adf-4e04-b42b-e0932fc06543))
  (pad "1" thru_hole circle (at -7.62 3.82) (size 1.8 1.8) (drill 1) (layers *.Cu *.Mask) (remove_unused_layers) (keep_end_layers) (tstamp e2eaff9d-4c94-4311-bec0-a13146b760ca))
  (pad "3" thru_hole circle (at 0 3.81) (size 1.8 1.8) (drill 1) (layers *.Cu *.Mask) (remove_unused_layers) (keep_end_layers) (tstamp 62cf0a26-9096-4000-923a-60daf3aa23f8))
  (pad "4" thru_hole circle (at 5.08 3.81) (size 1.8 1.8) (drill 1) (layers *.Cu *.Mask) (remove_unused_layers) (keep_end_layers) (tstamp 9b86d498-b713-4140-97c2-940c95f43f16))
  (pad "5" thru_hole circle (at 10.16 3.81) (size 1.8 1.8) (drill 1) (layers *.Cu *.Mask) (remove_unused_layers) (keep_end_layers) (tstamp 897136b5-a5d5-4581-a6bf-48c25cde5ca5))
  (pad "8" thru_hole circle (at 10.16 -3.81) (size 1.8 1.8) (drill 1) (layers *.Cu *.Mask) (remove_unused_layers) (keep_end_layers) (tstamp e0fafb5a-7612-49f2-857e-07a48cf36c67))
  (pad "9" thru_hole circle (at 5.08 -3.81) (size 1.8 1.8) (drill 1) (layers *.Cu *.Mask) (remove_unused_layers) (keep_end_layers) (tstamp ba1ab41c-bcc1-4114-96ed-6de21e86cec1))
  (pad "10" thru_hole circle (at 0 -3.81) (size 1.8 1.8) (drill 1) (layers *.Cu *.Mask) (remove_unused_layers) (keep_end_layers) (tstamp 049a81eb-a1e0-4ed0-b066-8d01132f517e))
  (pad "12" thru_hole circle (at -7.62 -3.8) (size 1.8 1.8) (drill 1) (layers *.Cu *.Mask) (remove_unused_layers) (keep_end_layers) (tstamp efbd2f04-62a1-49d5-9d60-2e126a66fb46))
  (model "${KICADLIB}/model/mechanical/CTI_J104D.step"
    (offset (xyz -7.65 -3.8 0.2))
    (scale (xyz 1 1 1))
    (rotate (xyz 0 0 -90))
  )
)
