ISO-10303-21;
HEADER;
FILE_DESCRIPTION( ( 'Unknown' ), '1' );
FILE_NAME( 'I:/User_Groups_Only/17_EMC_Product_&_Development/Article_Master/eiCan/Assembly/As_SBRIE/Master_Data/01_CAD_drawing/1_Drawing/971xxxxx4/971xxx154/971100154/Released_Data/971100154.stp', 'Unknown', ( 'Unknown' ), ( 'Unknown' ), 'PSStep 19.0.9', 'Unknown', '  ' );
FILE_SCHEMA( ( 'AUTOMOTIVE_DESIGN { 1 0 10303 214 1 1 1 1 }' ) );
ENDSEC;
DATA;
#1 = MECHANICAL_DESIGN_GEOMETRIC_PRESENTATION_REPRESENTATION( ' ', ( #10, #11, #12, #13, #14, #15, #16, #17, #18, #19, #20, #21, #22, #23, #24, #25, #26, #27, #28, #29, #30, #31, #32, #33, #34, #35, #36, #37, #38, #39, #40 ), #6 );
#2 = PRODUCT_DEFINITION_CONTEXT( '', #41, 'design' );
#3 = APPLICATION_PROTOCOL_DEFINITION( 'international standard', 'automotive_design', 2001, #41 );
#4 = PRODUCT_CATEGORY_RELATIONSHIP( 'NONE', 'NONE', #42, #43 );
#5 = SHAPE_DEFINITION_REPRESENTATION( #44, #45 );
#6 =  ( GEOMETRIC_REPRESENTATION_CONTEXT( 3 )GLOBAL_UNCERTAINTY_ASSIGNED_CONTEXT( ( #48 ) )GLOBAL_UNIT_ASSIGNED_CONTEXT( ( #50, #51, #52 ) )REPRESENTATION_CONTEXT( 'NONE', 'WORKSPACE' ) );
#10 = STYLED_ITEM( '', ( #54 ), #55 );
#11 = STYLED_ITEM( '', ( #56 ), #57 );
#12 = STYLED_ITEM( '', ( #58 ), #59 );
#13 = STYLED_ITEM( '', ( #60 ), #61 );
#14 = STYLED_ITEM( '', ( #62 ), #63 );
#15 = STYLED_ITEM( '', ( #64 ), #65 );
#16 = STYLED_ITEM( '', ( #66 ), #67 );
#17 = STYLED_ITEM( '', ( #68 ), #69 );
#18 = STYLED_ITEM( '', ( #70 ), #71 );
#19 = STYLED_ITEM( '', ( #72 ), #73 );
#20 = STYLED_ITEM( '', ( #74 ), #75 );
#21 = STYLED_ITEM( '', ( #76 ), #77 );
#22 = STYLED_ITEM( '', ( #78 ), #79 );
#23 = STYLED_ITEM( '', ( #80 ), #81 );
#24 = STYLED_ITEM( '', ( #82 ), #83 );
#25 = STYLED_ITEM( '', ( #84 ), #85 );
#26 = STYLED_ITEM( '', ( #86 ), #87 );
#27 = STYLED_ITEM( '', ( #88 ), #89 );
#28 = STYLED_ITEM( '', ( #90 ), #91 );
#29 = STYLED_ITEM( '', ( #92 ), #93 );
#30 = STYLED_ITEM( '', ( #94 ), #95 );
#31 = STYLED_ITEM( '', ( #96 ), #97 );
#32 = STYLED_ITEM( '', ( #98 ), #99 );
#33 = STYLED_ITEM( '', ( #100 ), #101 );
#34 = STYLED_ITEM( '', ( #102 ), #103 );
#35 = STYLED_ITEM( '', ( #104 ), #105 );
#36 = STYLED_ITEM( '', ( #106 ), #107 );
#37 = STYLED_ITEM( '', ( #108 ), #109 );
#38 = STYLED_ITEM( '', ( #110 ), #111 );
#39 = STYLED_ITEM( '', ( #112 ), #113 );
#40 = STYLED_ITEM( '', ( #114 ), #115 );
#41 = APPLICATION_CONTEXT( 'core data for automotive mechanical design processes' );
#42 = PRODUCT_CATEGORY( 'part', 'NONE' );
#43 = PRODUCT_RELATED_PRODUCT_CATEGORY( 'detail', ' ', ( #116 ) );
#44 = PRODUCT_DEFINITION_SHAPE( 'NONE', 'NONE', #117 );
#45 = ADVANCED_BREP_SHAPE_REPRESENTATION( '1', ( #118, #119 ), #6 );
#48 = UNCERTAINTY_MEASURE_WITH_UNIT( LENGTH_MEASURE( 0.00100000000000000 ), #50, '', '' );
#50 =  ( CONVERSION_BASED_UNIT( 'MILLIMETRE', #122 )LENGTH_UNIT(  )NAMED_UNIT( #125 ) );
#51 =  ( NAMED_UNIT( #127 )PLANE_ANGLE_UNIT(  )SI_UNIT( $, .RADIAN. ) );
#52 =  ( NAMED_UNIT( #127 )SI_UNIT( $, .STERADIAN. )SOLID_ANGLE_UNIT(  ) );
#54 = PRESENTATION_STYLE_ASSIGNMENT( ( #133 ) );
#55 = ADVANCED_FACE( '', ( #134 ), #135, .T. );
#56 = PRESENTATION_STYLE_ASSIGNMENT( ( #136 ) );
#57 = ADVANCED_FACE( '', ( #137 ), #138, .F. );
#58 = PRESENTATION_STYLE_ASSIGNMENT( ( #139 ) );
#59 = ADVANCED_FACE( '', ( #140, #141 ), #142, .F. );
#60 = PRESENTATION_STYLE_ASSIGNMENT( ( #143 ) );
#61 = ADVANCED_FACE( '', ( #144 ), #145, .T. );
#62 = PRESENTATION_STYLE_ASSIGNMENT( ( #146 ) );
#63 = ADVANCED_FACE( '', ( #147, #148 ), #149, .T. );
#64 = PRESENTATION_STYLE_ASSIGNMENT( ( #150 ) );
#65 = ADVANCED_FACE( '', ( #151 ), #152, .T. );
#66 = PRESENTATION_STYLE_ASSIGNMENT( ( #153 ) );
#67 = ADVANCED_FACE( '', ( #154 ), #155, .F. );
#68 = PRESENTATION_STYLE_ASSIGNMENT( ( #156 ) );
#69 = ADVANCED_FACE( '', ( #157 ), #158, .F. );
#70 = PRESENTATION_STYLE_ASSIGNMENT( ( #159 ) );
#71 = ADVANCED_FACE( '', ( #160, #161 ), #162, .T. );
#72 = PRESENTATION_STYLE_ASSIGNMENT( ( #163 ) );
#73 = ADVANCED_FACE( '', ( #164, #165 ), #166, .F. );
#74 = PRESENTATION_STYLE_ASSIGNMENT( ( #167 ) );
#75 = ADVANCED_FACE( '', ( #168, #169 ), #170, .F. );
#76 = PRESENTATION_STYLE_ASSIGNMENT( ( #171 ) );
#77 = ADVANCED_FACE( '', ( #172 ), #173, .T. );
#78 = PRESENTATION_STYLE_ASSIGNMENT( ( #174 ) );
#79 = ADVANCED_FACE( '', ( #175 ), #176, .T. );
#80 = PRESENTATION_STYLE_ASSIGNMENT( ( #177 ) );
#81 = ADVANCED_FACE( '', ( #178 ), #179, .T. );
#82 = PRESENTATION_STYLE_ASSIGNMENT( ( #180 ) );
#83 = ADVANCED_FACE( '', ( #181 ), #182, .T. );
#84 = PRESENTATION_STYLE_ASSIGNMENT( ( #183 ) );
#85 = ADVANCED_FACE( '', ( #184 ), #185, .F. );
#86 = PRESENTATION_STYLE_ASSIGNMENT( ( #186 ) );
#87 = ADVANCED_FACE( '', ( #187, #188 ), #189, .F. );
#88 = PRESENTATION_STYLE_ASSIGNMENT( ( #190 ) );
#89 = ADVANCED_FACE( '', ( #191 ), #192, .T. );
#90 = PRESENTATION_STYLE_ASSIGNMENT( ( #193 ) );
#91 = ADVANCED_FACE( '', ( #194 ), #195, .F. );
#92 = PRESENTATION_STYLE_ASSIGNMENT( ( #196 ) );
#93 = ADVANCED_FACE( '', ( #197 ), #198, .T. );
#94 = PRESENTATION_STYLE_ASSIGNMENT( ( #199 ) );
#95 = ADVANCED_FACE( '', ( #200 ), #201, .T. );
#96 = PRESENTATION_STYLE_ASSIGNMENT( ( #202 ) );
#97 = ADVANCED_FACE( '', ( #203, #204 ), #205, .F. );
#98 = PRESENTATION_STYLE_ASSIGNMENT( ( #206 ) );
#99 = ADVANCED_FACE( '', ( #207 ), #208, .F. );
#100 = PRESENTATION_STYLE_ASSIGNMENT( ( #209 ) );
#101 = ADVANCED_FACE( '', ( #210, #211 ), #212, .T. );
#102 = PRESENTATION_STYLE_ASSIGNMENT( ( #213 ) );
#103 = ADVANCED_FACE( '', ( #214, #215 ), #216, .T. );
#104 = PRESENTATION_STYLE_ASSIGNMENT( ( #217 ) );
#105 = ADVANCED_FACE( '', ( #218 ), #219, .T. );
#106 = PRESENTATION_STYLE_ASSIGNMENT( ( #220 ) );
#107 = ADVANCED_FACE( '', ( #221 ), #222, .T. );
#108 = PRESENTATION_STYLE_ASSIGNMENT( ( #223 ) );
#109 = ADVANCED_FACE( '', ( #224 ), #225, .F. );
#110 = PRESENTATION_STYLE_ASSIGNMENT( ( #226 ) );
#111 = ADVANCED_FACE( '', ( #227, #228 ), #229, .T. );
#112 = PRESENTATION_STYLE_ASSIGNMENT( ( #230 ) );
#113 = ADVANCED_FACE( '', ( #231, #232 ), #233, .F. );
#114 = PRESENTATION_STYLE_ASSIGNMENT( ( #234 ) );
#115 = ADVANCED_FACE( '', ( #235, #236 ), #237, .F. );
#116 = PRODUCT( '1', '1', 'PART-1-DESC', ( #238 ) );
#117 = PRODUCT_DEFINITION( 'NONE', 'NONE', #239, #2 );
#118 = MANIFOLD_SOLID_BREP( '1', #240 );
#119 = AXIS2_PLACEMENT_3D( '', #241, #242, #243 );
#122 = LENGTH_MEASURE_WITH_UNIT( LENGTH_MEASURE( 1.00000000000000 ), #244 );
#125 = DIMENSIONAL_EXPONENTS( 1.00000000000000, 0.000000000000000, 0.000000000000000, 0.000000000000000, 0.000000000000000, 0.000000000000000, 0.000000000000000 );
#127 = DIMENSIONAL_EXPONENTS( 0.000000000000000, 0.000000000000000, 0.000000000000000, 0.000000000000000, 0.000000000000000, 0.000000000000000, 0.000000000000000 );
#133 = SURFACE_STYLE_USAGE( .BOTH., #245 );
#134 = FACE_OUTER_BOUND( '', #246, .T. );
#135 = CONICAL_SURFACE( '', #247, 4.00000000000000, 0.785398163400000 );
#136 = SURFACE_STYLE_USAGE( .BOTH., #248 );
#137 = FACE_OUTER_BOUND( '', #249, .T. );
#138 = PLANE( '', #250 );
#139 = SURFACE_STYLE_USAGE( .BOTH., #251 );
#140 = FACE_BOUND( '', #252, .T. );
#141 = FACE_OUTER_BOUND( '', #253, .T. );
#142 = CONICAL_SURFACE( '', #254, 1.30650000000000, 0.785398163400000 );
#143 = SURFACE_STYLE_USAGE( .BOTH., #255 );
#144 = FACE_OUTER_BOUND( '', #256, .T. );
#145 = CONICAL_SURFACE( '', #257, 4.00000000000000, 0.785398163400000 );
#146 = SURFACE_STYLE_USAGE( .BOTH., #258 );
#147 = FACE_BOUND( '', #259, .T. );
#148 = FACE_OUTER_BOUND( '', #260, .T. );
#149 = CONICAL_SURFACE( '', #261, 1.25000000000000, 0.523598775600000 );
#150 = SURFACE_STYLE_USAGE( .BOTH., #262 );
#151 = FACE_OUTER_BOUND( '', #263, .T. );
#152 = CONICAL_SURFACE( '', #264, 4.00000000000000, 0.785398163400000 );
#153 = SURFACE_STYLE_USAGE( .BOTH., #265 );
#154 = FACE_OUTER_BOUND( '', #266, .T. );
#155 = PLANE( '', #267 );
#156 = SURFACE_STYLE_USAGE( .BOTH., #268 );
#157 = FACE_OUTER_BOUND( '', #269, .T. );
#158 = PLANE( '', #270 );
#159 = SURFACE_STYLE_USAGE( .BOTH., #271 );
#160 = FACE_OUTER_BOUND( '', #272, .T. );
#161 = FACE_OUTER_BOUND( '', #273, .T. );
#162 = CYLINDRICAL_SURFACE( '', #274, 0.900000000000000 );
#163 = SURFACE_STYLE_USAGE( .BOTH., #275 );
#164 = FACE_OUTER_BOUND( '', #276, .T. );
#165 = FACE_BOUND( '', #277, .T. );
#166 = CONICAL_SURFACE( '', #278, 1.00650000000000, 1.02974425870000 );
#167 = SURFACE_STYLE_USAGE( .BOTH., #279 );
#168 = FACE_OUTER_BOUND( '', #280, .T. );
#169 = FACE_OUTER_BOUND( '', #281, .T. );
#170 = CYLINDRICAL_SURFACE( '', #282, 1.00650000000000 );
#171 = SURFACE_STYLE_USAGE( .BOTH., #283 );
#172 = FACE_OUTER_BOUND( '', #284, .T. );
#173 = CONICAL_SURFACE( '', #285, 4.00000000000000, 0.785398163400000 );
#174 = SURFACE_STYLE_USAGE( .BOTH., #286 );
#175 = FACE_OUTER_BOUND( '', #287, .T. );
#176 = CONICAL_SURFACE( '', #288, 4.00000000000000, 0.785398163400000 );
#177 = SURFACE_STYLE_USAGE( .BOTH., #289 );
#178 = FACE_OUTER_BOUND( '', #290, .T. );
#179 = CONICAL_SURFACE( '', #291, 4.00000000000000, 0.785398163400000 );
#180 = SURFACE_STYLE_USAGE( .BOTH., #292 );
#181 = FACE_OUTER_BOUND( '', #293, .T. );
#182 = CONICAL_SURFACE( '', #294, 4.00000000000000, 0.785398163400000 );
#183 = SURFACE_STYLE_USAGE( .BOTH., #295 );
#184 = FACE_OUTER_BOUND( '', #296, .T. );
#185 = PLANE( '', #297 );
#186 = SURFACE_STYLE_USAGE( .BOTH., #298 );
#187 = FACE_OUTER_BOUND( '', #299, .T. );
#188 = FACE_OUTER_BOUND( '', #300, .T. );
#189 = CYLINDRICAL_SURFACE( '', #301, 1.00650000000000 );
#190 = SURFACE_STYLE_USAGE( .BOTH., #302 );
#191 = FACE_OUTER_BOUND( '', #303, .T. );
#192 = CONICAL_SURFACE( '', #304, 4.00000000000000, 0.785398163400000 );
#193 = SURFACE_STYLE_USAGE( .BOTH., #305 );
#194 = FACE_OUTER_BOUND( '', #306, .T. );
#195 = PLANE( '', #307 );
#196 = SURFACE_STYLE_USAGE( .BOTH., #308 );
#197 = FACE_OUTER_BOUND( '', #309, .T. );
#198 = CONICAL_SURFACE( '', #310, 4.00000000000000, 0.785398163400000 );
#199 = SURFACE_STYLE_USAGE( .BOTH., #311 );
#200 = FACE_OUTER_BOUND( '', #312, .T. );
#201 = CONICAL_SURFACE( '', #313, 4.00000000000000, 0.785398163400000 );
#202 = SURFACE_STYLE_USAGE( .BOTH., #314 );
#203 = FACE_BOUND( '', #315, .T. );
#204 = FACE_OUTER_BOUND( '', #316, .T. );
#205 = PLANE( '', #317 );
#206 = SURFACE_STYLE_USAGE( .BOTH., #318 );
#207 = FACE_OUTER_BOUND( '', #319, .T. );
#208 = PLANE( '', #320 );
#209 = SURFACE_STYLE_USAGE( .BOTH., #321 );
#210 = FACE_BOUND( '', #322, .T. );
#211 = FACE_OUTER_BOUND( '', #323, .T. );
#212 = PLANE( '', #324 );
#213 = SURFACE_STYLE_USAGE( .BOTH., #325 );
#214 = FACE_OUTER_BOUND( '', #326, .T. );
#215 = FACE_OUTER_BOUND( '', #327, .T. );
#216 = CYLINDRICAL_SURFACE( '', #328, 1.25000000000000 );
#217 = SURFACE_STYLE_USAGE( .BOTH., #329 );
#218 = FACE_OUTER_BOUND( '', #330, .T. );
#219 = CONICAL_SURFACE( '', #331, 4.00000000000000, 0.785398163400000 );
#220 = SURFACE_STYLE_USAGE( .BOTH., #332 );
#221 = FACE_OUTER_BOUND( '', #333, .T. );
#222 = CONICAL_SURFACE( '', #334, 4.00000000000000, 0.785398163400000 );
#223 = SURFACE_STYLE_USAGE( .BOTH., #335 );
#224 = FACE_OUTER_BOUND( '', #336, .T. );
#225 = PLANE( '', #337 );
#226 = SURFACE_STYLE_USAGE( .BOTH., #338 );
#227 = FACE_BOUND( '', #339, .T. );
#228 = FACE_OUTER_BOUND( '', #340, .T. );
#229 = CONICAL_SURFACE( '', #341, 1.25000000000000, 0.785398163400000 );
#230 = SURFACE_STYLE_USAGE( .BOTH., #342 );
#231 = FACE_OUTER_BOUND( '', #343, .T. );
#232 = FACE_OUTER_BOUND( '', #344, .T. );
#233 = TOROIDAL_SURFACE( '', #345, 1.10000000000000, 0.200000000000000 );
#234 = SURFACE_STYLE_USAGE( .BOTH., #346 );
#235 = FACE_OUTER_BOUND( '', #347, .T. );
#236 = FACE_OUTER_BOUND( '', #348, .T. );
#237 = TOROIDAL_SURFACE( '', #349, 1.10000000000000, 0.200000000000000 );
#238 = PRODUCT_CONTEXT( '', #41, 'mechanical' );
#239 = PRODUCT_DEFINITION_FORMATION_WITH_SPECIFIED_SOURCE( ' ', 'NONE', #116, .NOT_KNOWN. );
#240 = CLOSED_SHELL( '', ( #61, #69, #99, #97, #101, #67, #103, #63, #71, #87, #59, #73, #75, #77, #79, #105, #81, #65, #89, #93, #95, #107, #83, #91, #109, #85, #57, #55, #111, #115, #113 ) );
#241 = CARTESIAN_POINT( '', ( 0.000000000000000, 0.000000000000000, 0.000000000000000 ) );
#242 = DIRECTION( '', ( 0.000000000000000, 0.000000000000000, 1.00000000000000 ) );
#243 = DIRECTION( '', ( 1.00000000000000, 0.000000000000000, 0.000000000000000 ) );
#244 =  ( LENGTH_UNIT(  )NAMED_UNIT( #125 )SI_UNIT( .MILLI., .METRE. ) );
#245 = SURFACE_SIDE_STYLE( '', ( #351 ) );
#246 = EDGE_LOOP( '', ( #352, #353, #354 ) );
#247 = AXIS2_PLACEMENT_3D( '', #355, #356, #357 );
#248 = SURFACE_SIDE_STYLE( '', ( #358 ) );
#249 = EDGE_LOOP( '', ( #359, #360, #361, #362, #363, #364 ) );
#250 = AXIS2_PLACEMENT_3D( '', #365, #366, #367 );
#251 = SURFACE_SIDE_STYLE( '', ( #368 ) );
#252 = EDGE_LOOP( '', ( #369 ) );
#253 = EDGE_LOOP( '', ( #370 ) );
#254 = AXIS2_PLACEMENT_3D( '', #371, #372, #373 );
#255 = SURFACE_SIDE_STYLE( '', ( #374 ) );
#256 = EDGE_LOOP( '', ( #375, #376, #377 ) );
#257 = AXIS2_PLACEMENT_3D( '', #378, #379, #380 );
#258 = SURFACE_SIDE_STYLE( '', ( #381 ) );
#259 = EDGE_LOOP( '', ( #382 ) );
#260 = EDGE_LOOP( '', ( #383 ) );
#261 = AXIS2_PLACEMENT_3D( '', #384, #385, #386 );
#262 = SURFACE_SIDE_STYLE( '', ( #387 ) );
#263 = EDGE_LOOP( '', ( #388, #389, #390 ) );
#264 = AXIS2_PLACEMENT_3D( '', #391, #392, #393 );
#265 = SURFACE_SIDE_STYLE( '', ( #394 ) );
#266 = EDGE_LOOP( '', ( #395 ) );
#267 = AXIS2_PLACEMENT_3D( '', #396, #397, #398 );
#268 = SURFACE_SIDE_STYLE( '', ( #399 ) );
#269 = EDGE_LOOP( '', ( #400, #401, #402, #403, #404, #405 ) );
#270 = AXIS2_PLACEMENT_3D( '', #406, #407, #408 );
#271 = SURFACE_SIDE_STYLE( '', ( #409 ) );
#272 = EDGE_LOOP( '', ( #410 ) );
#273 = EDGE_LOOP( '', ( #411 ) );
#274 = AXIS2_PLACEMENT_3D( '', #412, #413, #414 );
#275 = SURFACE_SIDE_STYLE( '', ( #415 ) );
#276 = EDGE_LOOP( '', ( #416 ) );
#277 = VERTEX_LOOP( '', #417 );
#278 = AXIS2_PLACEMENT_3D( '', #418, #419, #420 );
#279 = SURFACE_SIDE_STYLE( '', ( #421 ) );
#280 = EDGE_LOOP( '', ( #422 ) );
#281 = EDGE_LOOP( '', ( #423 ) );
#282 = AXIS2_PLACEMENT_3D( '', #424, #425, #426 );
#283 = SURFACE_SIDE_STYLE( '', ( #427 ) );
#284 = EDGE_LOOP( '', ( #428, #429, #430 ) );
#285 = AXIS2_PLACEMENT_3D( '', #431, #432, #433 );
#286 = SURFACE_SIDE_STYLE( '', ( #434 ) );
#287 = EDGE_LOOP( '', ( #435, #436, #437 ) );
#288 = AXIS2_PLACEMENT_3D( '', #438, #439, #440 );
#289 = SURFACE_SIDE_STYLE( '', ( #441 ) );
#290 = EDGE_LOOP( '', ( #442, #443, #444 ) );
#291 = AXIS2_PLACEMENT_3D( '', #445, #446, #447 );
#292 = SURFACE_SIDE_STYLE( '', ( #448 ) );
#293 = EDGE_LOOP( '', ( #449, #450, #451 ) );
#294 = AXIS2_PLACEMENT_3D( '', #452, #453, #454 );
#295 = SURFACE_SIDE_STYLE( '', ( #455 ) );
#296 = EDGE_LOOP( '', ( #456, #457, #458, #459, #460, #461 ) );
#297 = AXIS2_PLACEMENT_3D( '', #462, #463, #464 );
#298 = SURFACE_SIDE_STYLE( '', ( #465 ) );
#299 = EDGE_LOOP( '', ( #466 ) );
#300 = EDGE_LOOP( '', ( #467 ) );
#301 = AXIS2_PLACEMENT_3D( '', #468, #469, #470 );
#302 = SURFACE_SIDE_STYLE( '', ( #471 ) );
#303 = EDGE_LOOP( '', ( #472, #473, #474 ) );
#304 = AXIS2_PLACEMENT_3D( '', #475, #476, #477 );
#305 = SURFACE_SIDE_STYLE( '', ( #478 ) );
#306 = EDGE_LOOP( '', ( #479, #480, #481, #482, #483, #484 ) );
#307 = AXIS2_PLACEMENT_3D( '', #485, #486, #487 );
#308 = SURFACE_SIDE_STYLE( '', ( #488 ) );
#309 = EDGE_LOOP( '', ( #489, #490, #491 ) );
#310 = AXIS2_PLACEMENT_3D( '', #492, #493, #494 );
#311 = SURFACE_SIDE_STYLE( '', ( #495 ) );
#312 = EDGE_LOOP( '', ( #496, #497, #498 ) );
#313 = AXIS2_PLACEMENT_3D( '', #499, #500, #501 );
#314 = SURFACE_SIDE_STYLE( '', ( #502 ) );
#315 = EDGE_LOOP( '', ( #503 ) );
#316 = EDGE_LOOP( '', ( #504, #505, #506, #507, #508, #509 ) );
#317 = AXIS2_PLACEMENT_3D( '', #510, #511, #512 );
#318 = SURFACE_SIDE_STYLE( '', ( #513 ) );
#319 = EDGE_LOOP( '', ( #514, #515, #516, #517, #518, #519 ) );
#320 = AXIS2_PLACEMENT_3D( '', #520, #521, #522 );
#321 = SURFACE_SIDE_STYLE( '', ( #523 ) );
#322 = EDGE_LOOP( '', ( #524 ) );
#323 = EDGE_LOOP( '', ( #525, #526, #527, #528, #529, #530 ) );
#324 = AXIS2_PLACEMENT_3D( '', #531, #532, #533 );
#325 = SURFACE_SIDE_STYLE( '', ( #534 ) );
#326 = EDGE_LOOP( '', ( #535 ) );
#327 = EDGE_LOOP( '', ( #536 ) );
#328 = AXIS2_PLACEMENT_3D( '', #537, #538, #539 );
#329 = SURFACE_SIDE_STYLE( '', ( #540 ) );
#330 = EDGE_LOOP( '', ( #541, #542, #543 ) );
#331 = AXIS2_PLACEMENT_3D( '', #544, #545, #546 );
#332 = SURFACE_SIDE_STYLE( '', ( #547 ) );
#333 = EDGE_LOOP( '', ( #548, #549, #550 ) );
#334 = AXIS2_PLACEMENT_3D( '', #551, #552, #553 );
#335 = SURFACE_SIDE_STYLE( '', ( #554 ) );
#336 = EDGE_LOOP( '', ( #555, #556, #557, #558, #559, #560 ) );
#337 = AXIS2_PLACEMENT_3D( '', #561, #562, #563 );
#338 = SURFACE_SIDE_STYLE( '', ( #564 ) );
#339 = EDGE_LOOP( '', ( #565 ) );
#340 = EDGE_LOOP( '', ( #566 ) );
#341 = AXIS2_PLACEMENT_3D( '', #567, #568, #569 );
#342 = SURFACE_SIDE_STYLE( '', ( #570 ) );
#343 = EDGE_LOOP( '', ( #571 ) );
#344 = EDGE_LOOP( '', ( #572 ) );
#345 = AXIS2_PLACEMENT_3D( '', #573, #574, #575 );
#346 = SURFACE_SIDE_STYLE( '', ( #576 ) );
#347 = EDGE_LOOP( '', ( #577 ) );
#348 = EDGE_LOOP( '', ( #578 ) );
#349 = AXIS2_PLACEMENT_3D( '', #579, #580, #581 );
#351 = SURFACE_STYLE_FILL_AREA( #582 );
#352 = ORIENTED_EDGE( '', *, *, #583, .F. );
#353 = ORIENTED_EDGE( '', *, *, #584, .T. );
#354 = ORIENTED_EDGE( '', *, *, #585, .F. );
#355 = CARTESIAN_POINT( '', ( 0.000000000000000, 0.000000000000000, 8.50000000000000 ) );
#356 = DIRECTION( '', ( -0.000000000000000, 0.000000000000000, -1.00000000000000 ) );
#357 = DIRECTION( '', ( -1.00000000000000, 0.000000000000000, 0.000000000000000 ) );
#358 = SURFACE_STYLE_FILL_AREA( #586 );
#359 = ORIENTED_EDGE( '', *, *, #587, .F. );
#360 = ORIENTED_EDGE( '', *, *, #588, .T. );
#361 = ORIENTED_EDGE( '', *, *, #589, .T. );
#362 = ORIENTED_EDGE( '', *, *, #590, .T. );
#363 = ORIENTED_EDGE( '', *, *, #591, .F. );
#364 = ORIENTED_EDGE( '', *, *, #592, .F. );
#365 = CARTESIAN_POINT( '', ( 1.44337567297406, 2.50000000000000, 10.0000000000000 ) );
#366 = DIRECTION( '', ( 6.00925839494864E-016, -1.00000000000000, 0.000000000000000 ) );
#367 = DIRECTION( '', ( 1.00000000000000, 6.00925839494864E-016, 0.000000000000000 ) );
#368 = SURFACE_STYLE_FILL_AREA( #593 );
#369 = ORIENTED_EDGE( '', *, *, #594, .F. );
#370 = ORIENTED_EDGE( '', *, *, #595, .F. );
#371 = CARTESIAN_POINT( '', ( 1.70045855049156E-018, -3.67379742419326E-018, 0.000000000000000 ) );
#372 = DIRECTION( '', ( 0.000000000000000, -0.000000000000000, -1.00000000000000 ) );
#373 = DIRECTION( '', ( 0.500000000000001, -0.866025403784438, 0.000000000000000 ) );
#374 = SURFACE_STYLE_FILL_AREA( #596 );
#375 = ORIENTED_EDGE( '', *, *, #597, .F. );
#376 = ORIENTED_EDGE( '', *, *, #598, .T. );
#377 = ORIENTED_EDGE( '', *, *, #599, .F. );
#378 = CARTESIAN_POINT( '', ( 0.000000000000000, 0.000000000000000, 8.50000000000000 ) );
#379 = DIRECTION( '', ( -0.000000000000000, 0.000000000000000, -1.00000000000000 ) );
#380 = DIRECTION( '', ( -1.00000000000000, 0.000000000000000, 0.000000000000000 ) );
#381 = SURFACE_STYLE_FILL_AREA( #600 );
#382 = ORIENTED_EDGE( '', *, *, #601, .T. );
#383 = ORIENTED_EDGE( '', *, *, #602, .T. );
#384 = CARTESIAN_POINT( '', ( 0.000000000000000, 0.000000000000000, 11.1062177826491 ) );
#385 = DIRECTION( '', ( -0.000000000000000, -0.000000000000000, 1.00000000000000 ) );
#386 = DIRECTION( '', ( 1.00000000000000, 0.000000000000000, 0.000000000000000 ) );
#387 = SURFACE_STYLE_FILL_AREA( #603 );
#388 = ORIENTED_EDGE( '', *, *, #604, .T. );
#389 = ORIENTED_EDGE( '', *, *, #605, .T. );
#390 = ORIENTED_EDGE( '', *, *, #606, .T. );
#391 = CARTESIAN_POINT( '', ( 0.000000000000000, 0.000000000000000, 1.50000000000000 ) );
#392 = DIRECTION( '', ( -0.000000000000000, -0.000000000000000, 1.00000000000000 ) );
#393 = DIRECTION( '', ( 1.00000000000000, 0.000000000000000, 0.000000000000000 ) );
#394 = SURFACE_STYLE_FILL_AREA( #607 );
#395 = ORIENTED_EDGE( '', *, *, #608, .T. );
#396 = CARTESIAN_POINT( '', ( 0.000000000000000, 0.000000000000000, 16.0000000000000 ) );
#397 = DIRECTION( '', ( 0.000000000000000, 0.000000000000000, -1.00000000000000 ) );
#398 = DIRECTION( '', ( -1.00000000000000, 0.000000000000000, 0.000000000000000 ) );
#399 = SURFACE_STYLE_FILL_AREA( #609 );
#400 = ORIENTED_EDGE( '', *, *, #610, .F. );
#401 = ORIENTED_EDGE( '', *, *, #611, .T. );
#402 = ORIENTED_EDGE( '', *, *, #612, .T. );
#403 = ORIENTED_EDGE( '', *, *, #587, .T. );
#404 = ORIENTED_EDGE( '', *, *, #613, .F. );
#405 = ORIENTED_EDGE( '', *, *, #605, .F. );
#406 = CARTESIAN_POINT( '', ( -1.44337567297406, 2.50000000000000, 10.0000000000000 ) );
#407 = DIRECTION( '', ( 0.866025403784439, -0.500000000000000, 0.000000000000000 ) );
#408 = DIRECTION( '', ( 0.500000000000000, 0.866025403784439, 0.000000000000000 ) );
#409 = SURFACE_STYLE_FILL_AREA( #614 );
#410 = ORIENTED_EDGE( '', *, *, #615, .T. );
#411 = ORIENTED_EDGE( '', *, *, #616, .T. );
#412 = CARTESIAN_POINT( '', ( 0.000000000000000, 0.000000000000000, 0.000000000000000 ) );
#413 = DIRECTION( '', ( -0.000000000000000, -0.000000000000000, 1.00000000000000 ) );
#414 = DIRECTION( '', ( -1.00000000000000, 0.000000000000000, 0.000000000000000 ) );
#415 = SURFACE_STYLE_FILL_AREA( #617 );
#416 = ORIENTED_EDGE( '', *, *, #618, .F. );
#417 = VERTEX_POINT( '', #619 );
#418 = CARTESIAN_POINT( '', ( 1.70045855049156E-018, -3.67379742419326E-018, 6.50000000000000 ) );
#419 = DIRECTION( '', ( 0.000000000000000, -0.000000000000000, -1.00000000000000 ) );
#420 = DIRECTION( '', ( 0.000000000000000, -1.00000000000000, 0.000000000000000 ) );
#421 = SURFACE_STYLE_FILL_AREA( #620 );
#422 = ORIENTED_EDGE( '', *, *, #618, .T. );
#423 = ORIENTED_EDGE( '', *, *, #621, .T. );
#424 = CARTESIAN_POINT( '', ( 1.70045855049156E-018, -3.67379742419326E-018, 0.000000000000000 ) );
#425 = DIRECTION( '', ( -0.000000000000000, 0.000000000000000, -1.00000000000000 ) );
#426 = DIRECTION( '', ( 0.000000000000000, 1.00000000000000, 0.000000000000000 ) );
#427 = SURFACE_STYLE_FILL_AREA( #622 );
#428 = ORIENTED_EDGE( '', *, *, #623, .F. );
#429 = ORIENTED_EDGE( '', *, *, #624, .T. );
#430 = ORIENTED_EDGE( '', *, *, #625, .F. );
#431 = CARTESIAN_POINT( '', ( 0.000000000000000, 0.000000000000000, 8.50000000000000 ) );
#432 = DIRECTION( '', ( -0.000000000000000, 0.000000000000000, -1.00000000000000 ) );
#433 = DIRECTION( '', ( -1.00000000000000, 0.000000000000000, 0.000000000000000 ) );
#434 = SURFACE_STYLE_FILL_AREA( #626 );
#435 = ORIENTED_EDGE( '', *, *, #627, .T. );
#436 = ORIENTED_EDGE( '', *, *, #628, .F. );
#437 = ORIENTED_EDGE( '', *, *, #589, .F. );
#438 = CARTESIAN_POINT( '', ( 0.000000000000000, 0.000000000000000, 8.50000000000000 ) );
#439 = DIRECTION( '', ( -0.000000000000000, 0.000000000000000, -1.00000000000000 ) );
#440 = DIRECTION( '', ( -1.00000000000000, 0.000000000000000, 0.000000000000000 ) );
#441 = SURFACE_STYLE_FILL_AREA( #629 );
#442 = ORIENTED_EDGE( '', *, *, #630, .T. );
#443 = ORIENTED_EDGE( '', *, *, #611, .F. );
#444 = ORIENTED_EDGE( '', *, *, #631, .F. );
#445 = CARTESIAN_POINT( '', ( 0.000000000000000, 0.000000000000000, 8.50000000000000 ) );
#446 = DIRECTION( '', ( -0.000000000000000, 0.000000000000000, -1.00000000000000 ) );
#447 = DIRECTION( '', ( -1.00000000000000, 0.000000000000000, 0.000000000000000 ) );
#448 = SURFACE_STYLE_FILL_AREA( #632 );
#449 = ORIENTED_EDGE( '', *, *, #633, .T. );
#450 = ORIENTED_EDGE( '', *, *, #634, .T. );
#451 = ORIENTED_EDGE( '', *, *, #635, .T. );
#452 = CARTESIAN_POINT( '', ( 0.000000000000000, 0.000000000000000, 1.50000000000000 ) );
#453 = DIRECTION( '', ( -0.000000000000000, -0.000000000000000, 1.00000000000000 ) );
#454 = DIRECTION( '', ( 1.00000000000000, 0.000000000000000, 0.000000000000000 ) );
#455 = SURFACE_STYLE_FILL_AREA( #636 );
#456 = ORIENTED_EDGE( '', *, *, #637, .F. );
#457 = ORIENTED_EDGE( '', *, *, #599, .T. );
#458 = ORIENTED_EDGE( '', *, *, #631, .T. );
#459 = ORIENTED_EDGE( '', *, *, #610, .T. );
#460 = ORIENTED_EDGE( '', *, *, #604, .F. );
#461 = ORIENTED_EDGE( '', *, *, #638, .F. );
#462 = CARTESIAN_POINT( '', ( -2.88675134594813, 0.000000000000000, 10.0000000000000 ) );
#463 = DIRECTION( '', ( 0.866025403784439, 0.500000000000000, 0.000000000000000 ) );
#464 = DIRECTION( '', ( -0.500000000000000, 0.866025403784439, 0.000000000000000 ) );
#465 = SURFACE_STYLE_FILL_AREA( #639 );
#466 = ORIENTED_EDGE( '', *, *, #621, .F. );
#467 = ORIENTED_EDGE( '', *, *, #594, .T. );
#468 = CARTESIAN_POINT( '', ( 1.70045855049156E-018, -3.67379742419326E-018, 0.000000000000000 ) );
#469 = DIRECTION( '', ( -0.000000000000000, 0.000000000000000, -1.00000000000000 ) );
#470 = DIRECTION( '', ( 0.000000000000000, 1.00000000000000, 0.000000000000000 ) );
#471 = SURFACE_STYLE_FILL_AREA( #640 );
#472 = ORIENTED_EDGE( '', *, *, #638, .T. );
#473 = ORIENTED_EDGE( '', *, *, #641, .T. );
#474 = ORIENTED_EDGE( '', *, *, #642, .T. );
#475 = CARTESIAN_POINT( '', ( 0.000000000000000, 0.000000000000000, 1.50000000000000 ) );
#476 = DIRECTION( '', ( -0.000000000000000, -0.000000000000000, 1.00000000000000 ) );
#477 = DIRECTION( '', ( 1.00000000000000, 0.000000000000000, 0.000000000000000 ) );
#478 = SURFACE_STYLE_FILL_AREA( #643 );
#479 = ORIENTED_EDGE( '', *, *, #644, .F. );
#480 = ORIENTED_EDGE( '', *, *, #585, .T. );
#481 = ORIENTED_EDGE( '', *, *, #623, .T. );
#482 = ORIENTED_EDGE( '', *, *, #645, .T. );
#483 = ORIENTED_EDGE( '', *, *, #646, .F. );
#484 = ORIENTED_EDGE( '', *, *, #633, .F. );
#485 = CARTESIAN_POINT( '', ( 1.44337567297406, -2.50000000000000, 10.0000000000000 ) );
#486 = DIRECTION( '', ( -0.866025403784439, 0.500000000000000, 0.000000000000000 ) );
#487 = DIRECTION( '', ( -0.500000000000000, -0.866025403784439, 0.000000000000000 ) );
#488 = SURFACE_STYLE_FILL_AREA( #647 );
#489 = ORIENTED_EDGE( '', *, *, #613, .T. );
#490 = ORIENTED_EDGE( '', *, *, #592, .T. );
#491 = ORIENTED_EDGE( '', *, *, #648, .T. );
#492 = CARTESIAN_POINT( '', ( 0.000000000000000, 0.000000000000000, 1.50000000000000 ) );
#493 = DIRECTION( '', ( -0.000000000000000, -0.000000000000000, 1.00000000000000 ) );
#494 = DIRECTION( '', ( 1.00000000000000, 0.000000000000000, 0.000000000000000 ) );
#495 = SURFACE_STYLE_FILL_AREA( #649 );
#496 = ORIENTED_EDGE( '', *, *, #650, .T. );
#497 = ORIENTED_EDGE( '', *, *, #651, .T. );
#498 = ORIENTED_EDGE( '', *, *, #646, .T. );
#499 = CARTESIAN_POINT( '', ( 0.000000000000000, 0.000000000000000, 1.50000000000000 ) );
#500 = DIRECTION( '', ( -0.000000000000000, -0.000000000000000, 1.00000000000000 ) );
#501 = DIRECTION( '', ( 1.00000000000000, 0.000000000000000, 0.000000000000000 ) );
#502 = SURFACE_STYLE_FILL_AREA( #652 );
#503 = ORIENTED_EDGE( '', *, *, #595, .T. );
#504 = ORIENTED_EDGE( '', *, *, #653, .F. );
#505 = ORIENTED_EDGE( '', *, *, #634, .F. );
#506 = ORIENTED_EDGE( '', *, *, #651, .F. );
#507 = ORIENTED_EDGE( '', *, *, #641, .F. );
#508 = ORIENTED_EDGE( '', *, *, #606, .F. );
#509 = ORIENTED_EDGE( '', *, *, #648, .F. );
#510 = CARTESIAN_POINT( '', ( 0.000000000000000, 0.000000000000000, 0.000000000000000 ) );
#511 = DIRECTION( '', ( 0.000000000000000, 0.000000000000000, 1.00000000000000 ) );
#512 = DIRECTION( '', ( 1.00000000000000, 0.000000000000000, 0.000000000000000 ) );
#513 = SURFACE_STYLE_FILL_AREA( #654 );
#514 = ORIENTED_EDGE( '', *, *, #590, .F. );
#515 = ORIENTED_EDGE( '', *, *, #628, .T. );
#516 = ORIENTED_EDGE( '', *, *, #583, .T. );
#517 = ORIENTED_EDGE( '', *, *, #644, .T. );
#518 = ORIENTED_EDGE( '', *, *, #635, .F. );
#519 = ORIENTED_EDGE( '', *, *, #655, .F. );
#520 = CARTESIAN_POINT( '', ( 2.88675134594813, 0.000000000000000, 10.0000000000000 ) );
#521 = DIRECTION( '', ( -0.866025403784439, -0.500000000000000, 0.000000000000000 ) );
#522 = DIRECTION( '', ( 0.500000000000000, -0.866025403784439, 0.000000000000000 ) );
#523 = SURFACE_STYLE_FILL_AREA( #656 );
#524 = ORIENTED_EDGE( '', *, *, #657, .T. );
#525 = ORIENTED_EDGE( '', *, *, #624, .F. );
#526 = ORIENTED_EDGE( '', *, *, #584, .F. );
#527 = ORIENTED_EDGE( '', *, *, #627, .F. );
#528 = ORIENTED_EDGE( '', *, *, #658, .T. );
#529 = ORIENTED_EDGE( '', *, *, #630, .F. );
#530 = ORIENTED_EDGE( '', *, *, #598, .F. );
#531 = CARTESIAN_POINT( '', ( 0.000000000000000, 0.000000000000000, 10.0000000000000 ) );
#532 = DIRECTION( '', ( 0.000000000000000, 0.000000000000000, 1.00000000000000 ) );
#533 = DIRECTION( '', ( 1.00000000000000, 0.000000000000000, 0.000000000000000 ) );
#534 = SURFACE_STYLE_FILL_AREA( #659 );
#535 = ORIENTED_EDGE( '', *, *, #660, .T. );
#536 = ORIENTED_EDGE( '', *, *, #602, .F. );
#537 = CARTESIAN_POINT( '', ( 0.000000000000000, 0.000000000000000, 0.000000000000000 ) );
#538 = DIRECTION( '', ( -0.000000000000000, -0.000000000000000, 1.00000000000000 ) );
#539 = DIRECTION( '', ( -1.00000000000000, 0.000000000000000, 0.000000000000000 ) );
#540 = SURFACE_STYLE_FILL_AREA( #661 );
#541 = ORIENTED_EDGE( '', *, *, #658, .F. );
#542 = ORIENTED_EDGE( '', *, *, #588, .F. );
#543 = ORIENTED_EDGE( '', *, *, #612, .F. );
#544 = CARTESIAN_POINT( '', ( 0.000000000000000, 0.000000000000000, 8.50000000000000 ) );
#545 = DIRECTION( '', ( -0.000000000000000, 0.000000000000000, -1.00000000000000 ) );
#546 = DIRECTION( '', ( -1.00000000000000, 0.000000000000000, 0.000000000000000 ) );
#547 = SURFACE_STYLE_FILL_AREA( #662 );
#548 = ORIENTED_EDGE( '', *, *, #591, .T. );
#549 = ORIENTED_EDGE( '', *, *, #655, .T. );
#550 = ORIENTED_EDGE( '', *, *, #653, .T. );
#551 = CARTESIAN_POINT( '', ( 0.000000000000000, 0.000000000000000, 1.50000000000000 ) );
#552 = DIRECTION( '', ( -0.000000000000000, -0.000000000000000, 1.00000000000000 ) );
#553 = DIRECTION( '', ( 1.00000000000000, 0.000000000000000, 0.000000000000000 ) );
#554 = SURFACE_STYLE_FILL_AREA( #663 );
#555 = ORIENTED_EDGE( '', *, *, #645, .F. );
#556 = ORIENTED_EDGE( '', *, *, #625, .T. );
#557 = ORIENTED_EDGE( '', *, *, #597, .T. );
#558 = ORIENTED_EDGE( '', *, *, #637, .T. );
#559 = ORIENTED_EDGE( '', *, *, #642, .F. );
#560 = ORIENTED_EDGE( '', *, *, #650, .F. );
#561 = CARTESIAN_POINT( '', ( -1.44337567297406, -2.50000000000000, 10.0000000000000 ) );
#562 = DIRECTION( '', ( 9.01388759242295E-016, 1.00000000000000, 0.000000000000000 ) );
#563 = DIRECTION( '', ( -1.00000000000000, 9.01388759242295E-016, 0.000000000000000 ) );
#564 = SURFACE_STYLE_FILL_AREA( #664 );
#565 = ORIENTED_EDGE( '', *, *, #608, .F. );
#566 = ORIENTED_EDGE( '', *, *, #660, .F. );
#567 = CARTESIAN_POINT( '', ( 0.000000000000000, 0.000000000000000, 15.7000000000000 ) );
#568 = DIRECTION( '', ( -0.000000000000000, 0.000000000000000, -1.00000000000000 ) );
#569 = DIRECTION( '', ( -1.00000000000000, 0.000000000000000, 0.000000000000000 ) );
#570 = SURFACE_STYLE_FILL_AREA( #665 );
#571 = ORIENTED_EDGE( '', *, *, #616, .F. );
#572 = ORIENTED_EDGE( '', *, *, #657, .F. );
#573 = CARTESIAN_POINT( '', ( 0.000000000000000, 0.000000000000000, 10.2000000000000 ) );
#574 = DIRECTION( '', ( 0.000000000000000, 0.000000000000000, 1.00000000000000 ) );
#575 = DIRECTION( '', ( 1.00000000000000, 0.000000000000000, 0.000000000000000 ) );
#576 = SURFACE_STYLE_FILL_AREA( #666 );
#577 = ORIENTED_EDGE( '', *, *, #601, .F. );
#578 = ORIENTED_EDGE( '', *, *, #615, .F. );
#579 = CARTESIAN_POINT( '', ( 0.000000000000000, 0.000000000000000, 10.4464101615138 ) );
#580 = DIRECTION( '', ( 0.000000000000000, 0.000000000000000, -1.00000000000000 ) );
#581 = DIRECTION( '', ( -1.00000000000000, 0.000000000000000, 0.000000000000000 ) );
#582 = FILL_AREA_STYLE( '', ( #667 ) );
#583 = EDGE_CURVE( '', #668, #669, #670, .T. );
#584 = EDGE_CURVE( '', #668, #671, #672, .F. );
#585 = EDGE_CURVE( '', #669, #671, #673, .T. );
#586 = FILL_AREA_STYLE( '', ( #674 ) );
#587 = EDGE_CURVE( '', #675, #676, #677, .T. );
#588 = EDGE_CURVE( '', #675, #678, #679, .T. );
#589 = EDGE_CURVE( '', #678, #680, #681, .T. );
#590 = EDGE_CURVE( '', #680, #682, #683, .T. );
#591 = EDGE_CURVE( '', #684, #682, #685, .T. );
#592 = EDGE_CURVE( '', #676, #684, #686, .T. );
#593 = FILL_AREA_STYLE( '', ( #687 ) );
#594 = EDGE_CURVE( '', #688, #688, #689, .T. );
#595 = EDGE_CURVE( '', #690, #690, #691, .T. );
#596 = FILL_AREA_STYLE( '', ( #692 ) );
#597 = EDGE_CURVE( '', #693, #694, #695, .F. );
#598 = EDGE_CURVE( '', #693, #696, #697, .F. );
#599 = EDGE_CURVE( '', #694, #696, #698, .T. );
#600 = FILL_AREA_STYLE( '', ( #699 ) );
#601 = EDGE_CURVE( '', #700, #700, #701, .T. );
#602 = EDGE_CURVE( '', #702, #702, #703, .T. );
#603 = FILL_AREA_STYLE( '', ( #704 ) );
#604 = EDGE_CURVE( '', #705, #706, #707, .T. );
#605 = EDGE_CURVE( '', #706, #708, #709, .T. );
#606 = EDGE_CURVE( '', #708, #705, #710, .T. );
#607 = FILL_AREA_STYLE( '', ( #711 ) );
#608 = EDGE_CURVE( '', #712, #712, #713, .F. );
#609 = FILL_AREA_STYLE( '', ( #714 ) );
#610 = EDGE_CURVE( '', #715, #706, #716, .T. );
#611 = EDGE_CURVE( '', #715, #717, #718, .T. );
#612 = EDGE_CURVE( '', #717, #675, #719, .T. );
#613 = EDGE_CURVE( '', #708, #676, #720, .T. );
#614 = FILL_AREA_STYLE( '', ( #721 ) );
#615 = EDGE_CURVE( '', #722, #722, #723, .T. );
#616 = EDGE_CURVE( '', #724, #724, #725, .T. );
#617 = FILL_AREA_STYLE( '', ( #726 ) );
#618 = EDGE_CURVE( '', #727, #727, #728, .T. );
#619 = CARTESIAN_POINT( '', ( 1.70045855049156E-018, -3.67379742419326E-018, 7.10476621305124 ) );
#620 = FILL_AREA_STYLE( '', ( #729 ) );
#621 = EDGE_CURVE( '', #730, #730, #731, .T. );
#622 = FILL_AREA_STYLE( '', ( #732 ) );
#623 = EDGE_CURVE( '', #671, #733, #734, .T. );
#624 = EDGE_CURVE( '', #671, #693, #735, .F. );
#625 = EDGE_CURVE( '', #733, #693, #736, .F. );
#626 = FILL_AREA_STYLE( '', ( #737 ) );
#627 = EDGE_CURVE( '', #678, #668, #738, .F. );
#628 = EDGE_CURVE( '', #680, #668, #739, .T. );
#629 = FILL_AREA_STYLE( '', ( #740 ) );
#630 = EDGE_CURVE( '', #696, #717, #741, .F. );
#631 = EDGE_CURVE( '', #696, #715, #742, .T. );
#632 = FILL_AREA_STYLE( '', ( #743 ) );
#633 = EDGE_CURVE( '', #744, #745, #746, .T. );
#634 = EDGE_CURVE( '', #745, #747, #748, .T. );
#635 = EDGE_CURVE( '', #747, #744, #749, .T. );
#636 = FILL_AREA_STYLE( '', ( #750 ) );
#637 = EDGE_CURVE( '', #694, #751, #752, .T. );
#638 = EDGE_CURVE( '', #751, #705, #753, .T. );
#639 = FILL_AREA_STYLE( '', ( #754 ) );
#640 = FILL_AREA_STYLE( '', ( #755 ) );
#641 = EDGE_CURVE( '', #705, #756, #757, .T. );
#642 = EDGE_CURVE( '', #756, #751, #758, .F. );
#643 = FILL_AREA_STYLE( '', ( #759 ) );
#644 = EDGE_CURVE( '', #669, #744, #760, .T. );
#645 = EDGE_CURVE( '', #733, #761, #762, .T. );
#646 = EDGE_CURVE( '', #745, #761, #763, .T. );
#647 = FILL_AREA_STYLE( '', ( #764 ) );
#648 = EDGE_CURVE( '', #684, #708, #765, .T. );
#649 = FILL_AREA_STYLE( '', ( #766 ) );
#650 = EDGE_CURVE( '', #761, #756, #767, .F. );
#651 = EDGE_CURVE( '', #756, #745, #768, .T. );
#652 = FILL_AREA_STYLE( '', ( #769 ) );
#653 = EDGE_CURVE( '', #747, #684, #770, .T. );
#654 = FILL_AREA_STYLE( '', ( #771 ) );
#655 = EDGE_CURVE( '', #682, #747, #772, .T. );
#656 = FILL_AREA_STYLE( '', ( #773 ) );
#657 = EDGE_CURVE( '', #774, #774, #775, .F. );
#658 = EDGE_CURVE( '', #678, #717, #776, .T. );
#659 = FILL_AREA_STYLE( '', ( #777 ) );
#660 = EDGE_CURVE( '', #778, #778, #779, .T. );
#661 = FILL_AREA_STYLE( '', ( #780 ) );
#662 = FILL_AREA_STYLE( '', ( #781 ) );
#663 = FILL_AREA_STYLE( '', ( #782 ) );
#664 = FILL_AREA_STYLE( '', ( #783 ) );
#665 = FILL_AREA_STYLE( '', ( #784 ) );
#666 = FILL_AREA_STYLE( '', ( #785 ) );
#667 = FILL_AREA_STYLE_COLOUR( '', #786 );
#668 = VERTEX_POINT( '', #787 );
#669 = VERTEX_POINT( '', #788 );
#670 = B_SPLINE_CURVE_WITH_KNOTS( '', 3, ( #789, #790, #791, #792, #793, #794 ), .UNSPECIFIED., .F., .F., ( 4, 2, 4 ), ( 0.00149644370269910, 0.00223929648777399, 0.00298214927284888 ), .UNSPECIFIED. );
#671 = VERTEX_POINT( '', #795 );
#672 = CIRCLE( '', #796, 2.50000000000000 );
#673 = B_SPLINE_CURVE_WITH_KNOTS( '', 3, ( #797, #798, #799, #800, #801, #802, #803, #804 ), .UNSPECIFIED., .F., .F., ( 4, 2, 2, 4 ), ( 0.000000000000000, 0.000748349068371360, 0.00112239638553523, 0.00149644370269909 ), .UNSPECIFIED. );
#674 = FILL_AREA_STYLE_COLOUR( '', #805 );
#675 = VERTEX_POINT( '', #806 );
#676 = VERTEX_POINT( '', #807 );
#677 = LINE( '', #808, #809 );
#678 = VERTEX_POINT( '', #810 );
#679 = B_SPLINE_CURVE_WITH_KNOTS( '', 3, ( #811, #812, #813, #814, #815, #816, #817, #818 ), .UNSPECIFIED., .F., .F., ( 4, 2, 2, 4 ), ( 0.00261799200210253, 0.00336316564525919, 0.00373575246683752, 0.00410833928841585 ), .UNSPECIFIED. );
#680 = VERTEX_POINT( '', #819 );
#681 = B_SPLINE_CURVE_WITH_KNOTS( '', 3, ( #820, #821, #822, #823, #824, #825 ), .UNSPECIFIED., .F., .F., ( 4, 2, 4 ), ( 0.00410833928841585, 0.00485451509183645, 0.00560069089525706 ), .UNSPECIFIED. );
#682 = VERTEX_POINT( '', #826 );
#683 = LINE( '', #827, #828 );
#684 = VERTEX_POINT( '', #829 );
#685 = B_SPLINE_CURVE_WITH_KNOTS( '', 3, ( #830, #831, #832, #833, #834, #835 ), .UNSPECIFIED., .F., .F., ( 4, 2, 4 ), ( 0.00410833928841586, 0.00485451509183646, 0.00560069089525706 ), .UNSPECIFIED. );
#686 = B_SPLINE_CURVE_WITH_KNOTS( '', 3, ( #836, #837, #838, #839, #840, #841, #842, #843 ), .UNSPECIFIED., .F., .F., ( 4, 2, 2, 4 ), ( 0.00261799200210254, 0.00336316564525920, 0.00373575246683753, 0.00410833928841586 ), .UNSPECIFIED. );
#687 = FILL_AREA_STYLE_COLOUR( '', #844 );
#688 = VERTEX_POINT( '', #845 );
#689 = CIRCLE( '', #846, 1.00650000000000 );
#690 = VERTEX_POINT( '', #847 );
#691 = CIRCLE( '', #848, 1.30650000000000 );
#692 = FILL_AREA_STYLE_COLOUR( '', #849 );
#693 = VERTEX_POINT( '', #850 );
#694 = VERTEX_POINT( '', #851 );
#695 = B_SPLINE_CURVE_WITH_KNOTS( '', 3, ( #852, #853, #854, #855, #856, #857, #858, #859 ), .UNSPECIFIED., .F., .F., ( 4, 2, 2, 4 ), ( 0.00261799200249148, 0.00336316564564602, 0.00373575246722329, 0.00410833928880056 ), .UNSPECIFIED. );
#696 = VERTEX_POINT( '', #860 );
#697 = CIRCLE( '', #861, 2.50000000000000 );
#698 = B_SPLINE_CURVE_WITH_KNOTS( '', 3, ( #862, #863, #864, #865, #866, #867, #868, #869 ), .UNSPECIFIED., .F., .F., ( 4, 2, 2, 4 ), ( 0.000000000000000, 0.000748349068371359, 0.00112239638553523, 0.00149644370269909 ), .UNSPECIFIED. );
#699 = FILL_AREA_STYLE_COLOUR( '', #870 );
#700 = VERTEX_POINT( '', #871 );
#701 = CIRCLE( '', #872, 0.926794919200000 );
#702 = VERTEX_POINT( '', #873 );
#703 = CIRCLE( '', #874, 1.25000000000000 );
#704 = FILL_AREA_STYLE_COLOUR( '', #875 );
#705 = VERTEX_POINT( '', #876 );
#706 = VERTEX_POINT( '', #877 );
#707 = B_SPLINE_CURVE_WITH_KNOTS( '', 3, ( #878, #879, #880, #881, #882, #883 ), .UNSPECIFIED., .F., .F., ( 4, 2, 4 ), ( 0.00149644370269909, 0.00223929648777399, 0.00298214927284888 ), .UNSPECIFIED. );
#708 = VERTEX_POINT( '', #884 );
#709 = B_SPLINE_CURVE_WITH_KNOTS( '', 3, ( #885, #886, #887, #888, #889, #890, #891, #892 ), .UNSPECIFIED., .F., .F., ( 4, 2, 2, 4 ), ( 0.000000000000000, 0.000748349068371360, 0.00112239638553523, 0.00149644370269910 ), .UNSPECIFIED. );
#710 = CIRCLE( '', #893, 2.50000000000000 );
#711 = FILL_AREA_STYLE_COLOUR( '', #894 );
#712 = VERTEX_POINT( '', #895 );
#713 = CIRCLE( '', #896, 0.950000000000000 );
#714 = FILL_AREA_STYLE_COLOUR( '', #897 );
#715 = VERTEX_POINT( '', #898 );
#716 = LINE( '', #899, #900 );
#717 = VERTEX_POINT( '', #901 );
#718 = B_SPLINE_CURVE_WITH_KNOTS( '', 3, ( #902, #903, #904, #905, #906, #907, #908, #909 ), .UNSPECIFIED., .F., .F., ( 4, 2, 2, 4 ), ( 0.000000000000000, 0.000748349068371360, 0.00112239638553523, 0.00149644370269909 ), .UNSPECIFIED. );
#719 = B_SPLINE_CURVE_WITH_KNOTS( '', 3, ( #910, #911, #912, #913, #914, #915 ), .UNSPECIFIED., .F., .F., ( 4, 2, 4 ), ( 0.00149644370269909, 0.00223929648777399, 0.00298214927284888 ), .UNSPECIFIED. );
#720 = B_SPLINE_CURVE_WITH_KNOTS( '', 3, ( #916, #917, #918, #919, #920, #921 ), .UNSPECIFIED., .F., .F., ( 4, 2, 4 ), ( 0.00149644370269910, 0.00223929648777399, 0.00298214927284888 ), .UNSPECIFIED. );
#721 = FILL_AREA_STYLE_COLOUR( '', #922 );
#722 = VERTEX_POINT( '', #923 );
#723 = CIRCLE( '', #924, 0.900000000000000 );
#724 = VERTEX_POINT( '', #925 );
#725 = CIRCLE( '', #926, 0.900000000000000 );
#726 = FILL_AREA_STYLE_COLOUR( '', #927 );
#727 = VERTEX_POINT( '', #928 );
#728 = CIRCLE( '', #929, 1.00650000000000 );
#729 = FILL_AREA_STYLE_COLOUR( '', #930 );
#730 = VERTEX_POINT( '', #931 );
#731 = CIRCLE( '', #932, 1.00650000000000 );
#732 = FILL_AREA_STYLE_COLOUR( '', #933 );
#733 = VERTEX_POINT( '', #934 );
#734 = B_SPLINE_CURVE_WITH_KNOTS( '', 3, ( #935, #936, #937, #938, #939, #940 ), .UNSPECIFIED., .F., .F., ( 4, 2, 4 ), ( 0.00149644370269909, 0.00223929648777399, 0.00298214927284888 ), .UNSPECIFIED. );
#735 = CIRCLE( '', #941, 2.50000000000000 );
#736 = B_SPLINE_CURVE_WITH_KNOTS( '', 3, ( #942, #943, #944, #945, #946, #947 ), .UNSPECIFIED., .F., .F., ( 4, 2, 4 ), ( 0.00410833928880056, 0.00485451509222113, 0.00560069089564170 ), .UNSPECIFIED. );
#737 = FILL_AREA_STYLE_COLOUR( '', #948 );
#738 = CIRCLE( '', #949, 2.50000000000000 );
#739 = B_SPLINE_CURVE_WITH_KNOTS( '', 3, ( #950, #951, #952, #953, #954, #955, #956, #957 ), .UNSPECIFIED., .F., .F., ( 4, 2, 2, 4 ), ( 0.000000000000000, 0.000748349068371360, 0.00112239638553523, 0.00149644370269910 ), .UNSPECIFIED. );
#740 = FILL_AREA_STYLE_COLOUR( '', #958 );
#741 = CIRCLE( '', #959, 2.50000000000000 );
#742 = B_SPLINE_CURVE_WITH_KNOTS( '', 3, ( #960, #961, #962, #963, #964, #965 ), .UNSPECIFIED., .F., .F., ( 4, 2, 4 ), ( 0.00149644370269909, 0.00223929648777399, 0.00298214927284888 ), .UNSPECIFIED. );
#743 = FILL_AREA_STYLE_COLOUR( '', #966 );
#744 = VERTEX_POINT( '', #967 );
#745 = VERTEX_POINT( '', #968 );
#746 = B_SPLINE_CURVE_WITH_KNOTS( '', 3, ( #969, #970, #971, #972, #973, #974, #975, #976 ), .UNSPECIFIED., .F., .F., ( 4, 2, 2, 4 ), ( 0.000000000000000, 0.000748349068371360, 0.00112239638553523, 0.00149644370269909 ), .UNSPECIFIED. );
#747 = VERTEX_POINT( '', #977 );
#748 = CIRCLE( '', #978, 2.50000000000000 );
#749 = B_SPLINE_CURVE_WITH_KNOTS( '', 3, ( #979, #980, #981, #982, #983, #984 ), .UNSPECIFIED., .F., .F., ( 4, 2, 4 ), ( 0.00149644370269910, 0.00223929648777399, 0.00298214927284888 ), .UNSPECIFIED. );
#750 = FILL_AREA_STYLE_COLOUR( '', #985 );
#751 = VERTEX_POINT( '', #986 );
#752 = LINE( '', #987, #988 );
#753 = B_SPLINE_CURVE_WITH_KNOTS( '', 3, ( #989, #990, #991, #992, #993, #994, #995, #996 ), .UNSPECIFIED., .F., .F., ( 4, 2, 2, 4 ), ( 0.000000000000000, 0.000748349068371360, 0.00112239638553523, 0.00149644370269909 ), .UNSPECIFIED. );
#754 = FILL_AREA_STYLE_COLOUR( '', #997 );
#755 = FILL_AREA_STYLE_COLOUR( '', #998 );
#756 = VERTEX_POINT( '', #999 );
#757 = CIRCLE( '', #1000, 2.50000000000000 );
#758 = B_SPLINE_CURVE_WITH_KNOTS( '', 3, ( #1001, #1002, #1003, #1004, #1005, #1006, #1007, #1008 ), .UNSPECIFIED., .F., .F., ( 4, 2, 2, 4 ), ( 0.00261799200249148, 0.00336316564564602, 0.00373575246722329, 0.00410833928880056 ), .UNSPECIFIED. );
#759 = FILL_AREA_STYLE_COLOUR( '', #1009 );
#760 = LINE( '', #1010, #1011 );
#761 = VERTEX_POINT( '', #1012 );
#762 = LINE( '', #1013, #1014 );
#763 = B_SPLINE_CURVE_WITH_KNOTS( '', 3, ( #1015, #1016, #1017, #1018, #1019, #1020 ), .UNSPECIFIED., .F., .F., ( 4, 2, 4 ), ( 0.00149644370269909, 0.00223929648777399, 0.00298214927284888 ), .UNSPECIFIED. );
#764 = FILL_AREA_STYLE_COLOUR( '', #1021 );
#765 = CIRCLE( '', #1022, 2.50000000000000 );
#766 = FILL_AREA_STYLE_COLOUR( '', #1023 );
#767 = B_SPLINE_CURVE_WITH_KNOTS( '', 3, ( #1024, #1025, #1026, #1027, #1028, #1029 ), .UNSPECIFIED., .F., .F., ( 4, 2, 4 ), ( 0.00410833928880056, 0.00485451509222113, 0.00560069089564170 ), .UNSPECIFIED. );
#768 = CIRCLE( '', #1030, 2.50000000000000 );
#769 = FILL_AREA_STYLE_COLOUR( '', #1031 );
#770 = CIRCLE( '', #1032, 2.50000000000000 );
#771 = FILL_AREA_STYLE_COLOUR( '', #1033 );
#772 = B_SPLINE_CURVE_WITH_KNOTS( '', 3, ( #1034, #1035, #1036, #1037, #1038, #1039, #1040, #1041 ), .UNSPECIFIED., .F., .F., ( 4, 2, 2, 4 ), ( 0.000000000000000, 0.000748349068371360, 0.00112239638553523, 0.00149644370269910 ), .UNSPECIFIED. );
#773 = FILL_AREA_STYLE_COLOUR( '', #1042 );
#774 = VERTEX_POINT( '', #1043 );
#775 = CIRCLE( '', #1044, 1.10000000000000 );
#776 = CIRCLE( '', #1045, 2.50000000000000 );
#777 = FILL_AREA_STYLE_COLOUR( '', #1046 );
#778 = VERTEX_POINT( '', #1047 );
#779 = CIRCLE( '', #1048, 1.25000000000000 );
#780 = FILL_AREA_STYLE_COLOUR( '', #1049 );
#781 = FILL_AREA_STYLE_COLOUR( '', #1050 );
#782 = FILL_AREA_STYLE_COLOUR( '', #1051 );
#783 = FILL_AREA_STYLE_COLOUR( '', #1052 );
#784 = FILL_AREA_STYLE_COLOUR( '', #1053 );
#785 = FILL_AREA_STYLE_COLOUR( '', #1054 );
#786 = COLOUR_RGB( '', 0.643137276200000, 0.678431391700000, 0.698039233700000 );
#787 = CARTESIAN_POINT( '', ( 2.16506350946110, 1.25000000000000, 10.0000000000000 ) );
#788 = CARTESIAN_POINT( '', ( 2.88675134594813, 0.000000000000000, 9.61324865405187 ) );
#789 = CARTESIAN_POINT( '', ( 2.16506350946110, 1.25000000000000, 10.0000000000000 ) );
#790 = CARTESIAN_POINT( '', ( 2.29059391528639, 1.03257495921585, 10.0000000000000 ) );
#791 = CARTESIAN_POINT( '', ( 2.41399003288466, 0.818846614078905, 9.96161168292550 ) );
#792 = CARTESIAN_POINT( '', ( 2.65735846609847, 0.397320122794157, 9.82325292765123 ) );
#793 = CARTESIAN_POINT( '', ( 2.77371166169353, 0.195790476400516, 9.72628833830682 ) );
#794 = CARTESIAN_POINT( '', ( 2.88675134594819, -9.92856847541737E-014, 9.61324865405216 ) );
#795 = CARTESIAN_POINT( '', ( 2.16506350946110, -1.25000000000000, 10.0000000000000 ) );
#796 = AXIS2_PLACEMENT_3D( '', #1055, #1056, #1057 );
#797 = CARTESIAN_POINT( '', ( 2.88675134594813, 1.47756426844059E-015, 9.61324865405187 ) );
#798 = CARTESIAN_POINT( '', ( 2.77358094760903, -0.196016879836124, 9.72641905239097 ) );
#799 = CARTESIAN_POINT( '', ( 2.65784903196763, -0.396470437784298, 9.82258480794738 ) );
#800 = CARTESIAN_POINT( '', ( 2.47801040966807, -0.707960068770324, 9.92540420534347 ) );
#801 = CARTESIAN_POINT( '', ( 2.41701303692007, -0.813610617498092, 9.95269917269237 ) );
#802 = CARTESIAN_POINT( '', ( 2.29242557742328, -1.02940242733246, 9.99007736520080 ) );
#803 = CARTESIAN_POINT( '', ( 2.22827160730340, -1.14052036308734, 10.0000000000000 ) );
#804 = CARTESIAN_POINT( '', ( 2.16506350946110, -1.25000000000000, 10.0000000000000 ) );
#805 = COLOUR_RGB( '', 0.643137276200000, 0.678431391700000, 0.698039233700000 );
#806 = CARTESIAN_POINT( '', ( -1.44337567297406, 2.50000000000000, 9.61324865405187 ) );
#807 = CARTESIAN_POINT( '', ( -1.44337567297406, 2.50000000000000, 0.386751345948127 ) );
#808 = CARTESIAN_POINT( '', ( -1.44337567297406, 2.50000000000000, 10.0000000000000 ) );
#809 = VECTOR( '', #1058, 1000.00000000000 );
#810 = CARTESIAN_POINT( '', ( 0.000000000000000, 2.50000000000000, 10.0000000000000 ) );
#811 = CARTESIAN_POINT( '', ( -1.44337567297419, 2.50000000000000, 9.61324865405206 ) );
#812 = CARTESIAN_POINT( '', ( -1.21953337248009, 2.50000000000000, 9.72516980429912 ) );
#813 = CARTESIAN_POINT( '', ( -0.983960628961855, 2.50000000000000, 9.82323945337663 ) );
#814 = CARTESIAN_POINT( '', ( -0.623240845508722, 2.50000000000000, 9.92606404942478 ) );
#815 = CARTESIAN_POINT( '', ( -0.501341881852272, 2.50000000000000, 9.95317128852615 ) );
#816 = CARTESIAN_POINT( '', ( -0.253557421167116, 2.50000000000000, 9.99016252141353 ) );
#817 = CARTESIAN_POINT( '', ( -0.126557823862618, 2.50000000000000, 10.0000000000000 ) );
#818 = CARTESIAN_POINT( '', ( 2.37014919857811E-015, 2.50000000000000, 10.0000000000000 ) );
#819 = CARTESIAN_POINT( '', ( 1.44337567297406, 2.50000000000000, 9.61324865405187 ) );
#820 = CARTESIAN_POINT( '', ( 2.37014919857811E-015, 2.50000000000000, 10.0000000000000 ) );
#821 = CARTESIAN_POINT( '', ( 0.253456054886263, 2.50000000000000, 10.0000000000000 ) );
#822 = CARTESIAN_POINT( '', ( 0.500503235887508, 2.50000000000000, 9.96097863093010 ) );
#823 = CARTESIAN_POINT( '', ( 0.984767116902989, 2.50000000000000, 9.82308156680239 ) );
#824 = CARTESIAN_POINT( '', ( 1.21984948309400, 2.50000000000000, 9.72501174899191 ) );
#825 = CARTESIAN_POINT( '', ( 1.44337567297407, 2.50000000000000, 9.61324865405187 ) );
#826 = CARTESIAN_POINT( '', ( 1.44337567297406, 2.50000000000000, 0.386751345948128 ) );
#827 = CARTESIAN_POINT( '', ( 1.44337567297406, 2.50000000000000, 10.0000000000000 ) );
#828 = VECTOR( '', #1059, 1000.00000000000 );
#829 = CARTESIAN_POINT( '', ( 0.000000000000000, 2.50000000000000, 0.000000000000000 ) );
#830 = CARTESIAN_POINT( '', ( 2.00466787182405E-015, 2.50000000000000, -1.42431299097317E-014 ) );
#831 = CARTESIAN_POINT( '', ( 0.253456054886262, 2.50000000000000, -1.38743996760254E-014 ) );
#832 = CARTESIAN_POINT( '', ( 0.500503235887507, 2.50000000000000, 0.0390213690698979 ) );
#833 = CARTESIAN_POINT( '', ( 0.984767116902988, 2.50000000000000, 0.176918433197608 ) );
#834 = CARTESIAN_POINT( '', ( 1.21984948309400, 2.50000000000000, 0.274988251008097 ) );
#835 = CARTESIAN_POINT( '', ( 1.44337567297406, 2.50000000000000, 0.386751345948128 ) );
#836 = CARTESIAN_POINT( '', ( -1.44337567297419, 2.50000000000000, 0.386751345947940 ) );
#837 = CARTESIAN_POINT( '', ( -1.21953337248009, 2.50000000000000, 0.274830195700882 ) );
#838 = CARTESIAN_POINT( '', ( -0.983960628961853, 2.50000000000000, 0.176760546623370 ) );
#839 = CARTESIAN_POINT( '', ( -0.623240845508720, 2.50000000000000, 0.0739359505752140 ) );
#840 = CARTESIAN_POINT( '', ( -0.501341881852270, 2.50000000000000, 0.0468287114738482 ) );
#841 = CARTESIAN_POINT( '', ( -0.253557421167115, 2.50000000000000, 0.00983747858646915 ) );
#842 = CARTESIAN_POINT( '', ( -0.126557823862619, 2.50000000000000, -1.44237005423199E-014 ) );
#843 = CARTESIAN_POINT( '', ( 2.17327676382253E-015, 2.50000000000000, -1.42431299097317E-014 ) );
#844 = COLOUR_RGB( '', 0.643137276200000, 0.678431391700000, 0.698039233700000 );
#845 = CARTESIAN_POINT( '', ( -1.00650000000000, -3.67379742419326E-018, 0.300000000000000 ) );
#846 = AXIS2_PLACEMENT_3D( '', #1060, #1061, #1062 );
#847 = CARTESIAN_POINT( '', ( 0.653250000000000, -1.13146219004437, 0.000000000000000 ) );
#848 = AXIS2_PLACEMENT_3D( '', #1063, #1064, #1065 );
#849 = COLOUR_RGB( '', 0.643137276200000, 0.678431391700000, 0.698039233700000 );
#850 = CARTESIAN_POINT( '', ( -2.25347189810574E-015, -2.50000000000000, 10.0000000000000 ) );
#851 = CARTESIAN_POINT( '', ( -1.44337567297407, -2.50000000000000, 9.61324865405187 ) );
#852 = CARTESIAN_POINT( '', ( -1.44337567297419, -2.50000000000000, 9.61324865405206 ) );
#853 = CARTESIAN_POINT( '', ( -1.21953337248029, -2.50000000000000, 9.72516980429901 ) );
#854 = CARTESIAN_POINT( '', ( -0.983960628962555, -2.50000000000000, 9.82323945337635 ) );
#855 = CARTESIAN_POINT( '', ( -0.623240845509584, -2.50000000000000, 9.92606404942457 ) );
#856 = CARTESIAN_POINT( '', ( -0.501341881853028, -2.50000000000000, 9.95317128852602 ) );
#857 = CARTESIAN_POINT( '', ( -0.253557421167239, -2.50000000000000, 9.99016252141353 ) );
#858 = CARTESIAN_POINT( '', ( -0.126557823861557, -2.50000000000000, 10.0000000000000 ) );
#859 = CARTESIAN_POINT( '', ( 3.95384112693010E-016, -2.50000000000000, 10.0000000000000 ) );
#860 = CARTESIAN_POINT( '', ( -2.16506350946110, -1.25000000000000, 10.0000000000000 ) );
#861 = AXIS2_PLACEMENT_3D( '', #1066, #1067, #1068 );
#862 = CARTESIAN_POINT( '', ( -1.44337567297407, -2.50000000000000, 9.61324865405187 ) );
#863 = CARTESIAN_POINT( '', ( -1.55654607131316, -2.30398312016387, 9.72641905239097 ) );
#864 = CARTESIAN_POINT( '', ( -1.67227798695456, -2.10352956221570, 9.82258480794738 ) );
#865 = CARTESIAN_POINT( '', ( -1.85211660925412, -1.79203993122967, 9.92540420534346 ) );
#866 = CARTESIAN_POINT( '', ( -1.91311398200213, -1.68638938250191, 9.95269917269237 ) );
#867 = CARTESIAN_POINT( '', ( -2.03770144149892, -1.47059757266754, 9.99007736520080 ) );
#868 = CARTESIAN_POINT( '', ( -2.10185541161879, -1.35947963691266, 10.0000000000000 ) );
#869 = CARTESIAN_POINT( '', ( -2.16506350946110, -1.25000000000000, 10.0000000000000 ) );
#870 = COLOUR_RGB( '', 0.643137276200000, 0.678431391700000, 0.698039233700000 );
#871 = CARTESIAN_POINT( '', ( 0.926794919243111, 0.000000000000000, 10.5464101615138 ) );
#872 = AXIS2_PLACEMENT_3D( '', #1069, #1070, #1071 );
#873 = CARTESIAN_POINT( '', ( -1.25000000000000, 0.000000000000000, 11.1062177826491 ) );
#874 = AXIS2_PLACEMENT_3D( '', #1072, #1073, #1074 );
#875 = COLOUR_RGB( '', 0.643137276200000, 0.678431391700000, 0.698039233700000 );
#876 = CARTESIAN_POINT( '', ( -2.16506350946110, -1.25000000000000, 0.000000000000000 ) );
#877 = CARTESIAN_POINT( '', ( -2.88675134594813, -2.61188288397757E-017, 0.386751345948129 ) );
#878 = CARTESIAN_POINT( '', ( -2.16506350946110, -1.25000000000000, 9.58711614118699E-016 ) );
#879 = CARTESIAN_POINT( '', ( -2.29059391528639, -1.03257495921585, 1.02152173438869E-015 ) );
#880 = CARTESIAN_POINT( '', ( -2.41399003288466, -0.818846614078905, 0.0383883170744956 ) );
#881 = CARTESIAN_POINT( '', ( -2.65735846609847, -0.397320122794157, 0.176747072348765 ) );
#882 = CARTESIAN_POINT( '', ( -2.77371166169353, -0.195790476400516, 0.273711661693177 ) );
#883 = CARTESIAN_POINT( '', ( -2.88675134594819, 9.91073992080277E-014, 0.386751345947843 ) );
#884 = CARTESIAN_POINT( '', ( -2.16506350946110, 1.25000000000000, 0.000000000000000 ) );
#885 = CARTESIAN_POINT( '', ( -2.88675134594813, -1.35711484072071E-015, 0.386751345948128 ) );
#886 = CARTESIAN_POINT( '', ( -2.77358094760903, 0.196016879836124, 0.273580947609031 ) );
#887 = CARTESIAN_POINT( '', ( -2.65784903196763, 0.396470437784298, 0.177415192052618 ) );
#888 = CARTESIAN_POINT( '', ( -2.47801040966808, 0.707960068770324, 0.0745957946565363 ) );
#889 = CARTESIAN_POINT( '', ( -2.41701303692007, 0.813610617498092, 0.0473008273076281 ) );
#890 = CARTESIAN_POINT( '', ( -2.29242557742328, 1.02940242733246, 0.00992263479919748 ) );
#891 = CARTESIAN_POINT( '', ( -2.22827160730340, 1.14052036308734, -9.08442835930237E-016 ) );
#892 = CARTESIAN_POINT( '', ( -2.16506350946110, 1.25000000000000, -9.60597711936059E-016 ) );
#893 = AXIS2_PLACEMENT_3D( '', #1075, #1076, #1077 );
#894 = COLOUR_RGB( '', 0.643137276200000, 0.678431391700000, 0.698039233700000 );
#895 = CARTESIAN_POINT( '', ( -0.950000000000000, 0.000000000000000, 16.0000000000000 ) );
#896 = AXIS2_PLACEMENT_3D( '', #1078, #1079, #1080 );
#897 = COLOUR_RGB( '', 0.643137276200000, 0.678431391700000, 0.698039233700000 );
#898 = CARTESIAN_POINT( '', ( -2.88675134594813, -4.63541626241652E-016, 9.61324865405187 ) );
#899 = CARTESIAN_POINT( '', ( -2.88675134594813, 0.000000000000000, 10.0000000000000 ) );
#900 = VECTOR( '', #1081, 1000.00000000000 );
#901 = CARTESIAN_POINT( '', ( -2.16506350946110, 1.25000000000000, 10.0000000000000 ) );
#902 = CARTESIAN_POINT( '', ( -2.88675134594813, -1.91183945494142E-015, 9.61324865405187 ) );
#903 = CARTESIAN_POINT( '', ( -2.77358094760903, 0.196016879836124, 9.72641905239097 ) );
#904 = CARTESIAN_POINT( '', ( -2.65784903196763, 0.396470437784298, 9.82258480794738 ) );
#905 = CARTESIAN_POINT( '', ( -2.47801040966807, 0.707960068770324, 9.92540420534346 ) );
#906 = CARTESIAN_POINT( '', ( -2.41701303692007, 0.813610617498092, 9.95269917269237 ) );
#907 = CARTESIAN_POINT( '', ( -2.29242557742328, 1.02940242733246, 9.99007736520081 ) );
#908 = CARTESIAN_POINT( '', ( -2.22827160730340, 1.14052036308734, 10.0000000000000 ) );
#909 = CARTESIAN_POINT( '', ( -2.16506350946110, 1.25000000000000, 10.0000000000000 ) );
#910 = CARTESIAN_POINT( '', ( -2.16506350946110, 1.25000000000000, 10.0000000000000 ) );
#911 = CARTESIAN_POINT( '', ( -2.03953310363580, 1.46742504078415, 10.0000000000000 ) );
#912 = CARTESIAN_POINT( '', ( -1.91613698603753, 1.68115338592109, 9.96161168292551 ) );
#913 = CARTESIAN_POINT( '', ( -1.67276855282373, 2.10267987720584, 9.82325292765124 ) );
#914 = CARTESIAN_POINT( '', ( -1.55641535722867, 2.30420952359949, 9.72628833830682 ) );
#915 = CARTESIAN_POINT( '', ( -1.44337567297401, 2.50000000000010, 9.61324865405216 ) );
#916 = CARTESIAN_POINT( '', ( -2.16506350946110, 1.25000000000000, -9.60597711936059E-016 ) );
#917 = CARTESIAN_POINT( '', ( -2.03953310363580, 1.46742504078415, -1.05201492048984E-015 ) );
#918 = CARTESIAN_POINT( '', ( -1.91613698603753, 1.68115338592109, 0.0383883170744935 ) );
#919 = CARTESIAN_POINT( '', ( -1.67276855282373, 2.10267987720584, 0.176747072348763 ) );
#920 = CARTESIAN_POINT( '', ( -1.55641535722867, 2.30420952359948, 0.273711661693175 ) );
#921 = CARTESIAN_POINT( '', ( -1.44337567297401, 2.50000000000010, 0.386751345947842 ) );
#922 = COLOUR_RGB( '', 0.643137276200000, 0.678431391700000, 0.698039233700000 );
#923 = CARTESIAN_POINT( '', ( -0.900000000000000, 0.000000000000000, 10.4464101615138 ) );
#924 = AXIS2_PLACEMENT_3D( '', #1082, #1083, #1084 );
#925 = CARTESIAN_POINT( '', ( 0.900000000000000, 0.000000000000000, 10.2000000000000 ) );
#926 = AXIS2_PLACEMENT_3D( '', #1085, #1086, #1087 );
#927 = COLOUR_RGB( '', 0.643137276200000, 0.678431391700000, 0.698039233700000 );
#928 = CARTESIAN_POINT( '', ( 1.70045855049156E-018, -1.00650000000000, 6.50000000000000 ) );
#929 = AXIS2_PLACEMENT_3D( '', #1088, #1089, #1090 );
#930 = COLOUR_RGB( '', 0.643137276200000, 0.678431391700000, 0.698039233700000 );
#931 = CARTESIAN_POINT( '', ( 1.70045855049156E-018, 1.00650000000000, 5.00000000000000 ) );
#932 = AXIS2_PLACEMENT_3D( '', #1091, #1092, #1093 );
#933 = COLOUR_RGB( '', 0.643137276200000, 0.678431391700000, 0.698039233700000 );
#934 = CARTESIAN_POINT( '', ( 1.44337567297406, -2.50000000000000, 9.61324865405187 ) );
#935 = CARTESIAN_POINT( '', ( 2.16506350946110, -1.25000000000000, 10.0000000000000 ) );
#936 = CARTESIAN_POINT( '', ( 2.03953310363580, -1.46742504078415, 10.0000000000000 ) );
#937 = CARTESIAN_POINT( '', ( 1.91613698603753, -1.68115338592109, 9.96161168292551 ) );
#938 = CARTESIAN_POINT( '', ( 1.67276855282373, -2.10267987720584, 9.82325292765124 ) );
#939 = CARTESIAN_POINT( '', ( 1.55641535722867, -2.30420952359949, 9.72628833830682 ) );
#940 = CARTESIAN_POINT( '', ( 1.44337567297401, -2.50000000000010, 9.61324865405216 ) );
#941 = AXIS2_PLACEMENT_3D( '', #1094, #1095, #1096 );
#942 = CARTESIAN_POINT( '', ( 3.95384112693010E-016, -2.50000000000000, 10.0000000000000 ) );
#943 = CARTESIAN_POINT( '', ( 0.253456054884838, -2.50000000000000, 10.0000000000000 ) );
#944 = CARTESIAN_POINT( '', ( 0.500503235886345, -2.50000000000000, 9.96097863093045 ) );
#945 = CARTESIAN_POINT( '', ( 0.984767116904594, -2.50000000000000, 9.82308156680191 ) );
#946 = CARTESIAN_POINT( '', ( 1.21984948309415, -2.50000000000000, 9.72501174899183 ) );
#947 = CARTESIAN_POINT( '', ( 1.44337567297406, -2.50000000000000, 9.61324865405187 ) );
#948 = COLOUR_RGB( '', 0.643137276200000, 0.678431391700000, 0.698039233700000 );
#949 = AXIS2_PLACEMENT_3D( '', #1097, #1098, #1099 );
#950 = CARTESIAN_POINT( '', ( 1.44337567297407, 2.50000000000000, 9.61324865405187 ) );
#951 = CARTESIAN_POINT( '', ( 1.55654607131316, 2.30398312016387, 9.72641905239097 ) );
#952 = CARTESIAN_POINT( '', ( 1.67227798695456, 2.10352956221570, 9.82258480794738 ) );
#953 = CARTESIAN_POINT( '', ( 1.85211660925412, 1.79203993122967, 9.92540420534347 ) );
#954 = CARTESIAN_POINT( '', ( 1.91311398200213, 1.68638938250191, 9.95269917269237 ) );
#955 = CARTESIAN_POINT( '', ( 2.03770144149892, 1.47059757266754, 9.99007736520080 ) );
#956 = CARTESIAN_POINT( '', ( 2.10185541161879, 1.35947963691266, 10.0000000000000 ) );
#957 = CARTESIAN_POINT( '', ( 2.16506350946110, 1.25000000000000, 10.0000000000000 ) );
#958 = COLOUR_RGB( '', 0.643137276200000, 0.678431391700000, 0.698039233700000 );
#959 = AXIS2_PLACEMENT_3D( '', #1100, #1101, #1102 );
#960 = CARTESIAN_POINT( '', ( -2.16506350946110, -1.25000000000000, 10.0000000000000 ) );
#961 = CARTESIAN_POINT( '', ( -2.29059391528639, -1.03257495921585, 10.0000000000000 ) );
#962 = CARTESIAN_POINT( '', ( -2.41399003288466, -0.818846614078905, 9.96161168292550 ) );
#963 = CARTESIAN_POINT( '', ( -2.65735846609847, -0.397320122794157, 9.82325292765123 ) );
#964 = CARTESIAN_POINT( '', ( -2.77371166169353, -0.195790476400516, 9.72628833830682 ) );
#965 = CARTESIAN_POINT( '', ( -2.88675134594819, 9.88655551715647E-014, 9.61324865405216 ) );
#966 = COLOUR_RGB( '', 0.643137276200000, 0.678431391700000, 0.698039233700000 );
#967 = CARTESIAN_POINT( '', ( 2.88675134594813, 1.51921250651660E-016, 0.386751345948129 ) );
#968 = CARTESIAN_POINT( '', ( 2.16506350946110, -1.25000000000000, 0.000000000000000 ) );
#969 = CARTESIAN_POINT( '', ( 2.88675134594813, 1.41331528487301E-015, 0.386751345948128 ) );
#970 = CARTESIAN_POINT( '', ( 2.77358094760903, -0.196016879836124, 0.273580947609031 ) );
#971 = CARTESIAN_POINT( '', ( 2.65784903196763, -0.396470437784297, 0.177415192052618 ) );
#972 = CARTESIAN_POINT( '', ( 2.47801040966808, -0.707960068770324, 0.0745957946565360 ) );
#973 = CARTESIAN_POINT( '', ( 2.41701303692007, -0.813610617498091, 0.0473008273076282 ) );
#974 = CARTESIAN_POINT( '', ( 2.29242557742328, -1.02940242733246, 0.00992263479919757 ) );
#975 = CARTESIAN_POINT( '', ( 2.22827160730340, -1.14052036308734, -1.10241338085147E-015 ) );
#976 = CARTESIAN_POINT( '', ( 2.16506350946110, -1.25000000000000, -1.15206107242062E-015 ) );
#977 = CARTESIAN_POINT( '', ( 2.16506350946110, 1.25000000000000, 0.000000000000000 ) );
#978 = AXIS2_PLACEMENT_3D( '', #1103, #1104, #1105 );
#979 = CARTESIAN_POINT( '', ( 2.16506350946110, 1.25000000000000, 1.07478871150378E-015 ) );
#980 = CARTESIAN_POINT( '', ( 2.29059391528639, 1.03257495921585, 1.19685755447033E-015 ) );
#981 = CARTESIAN_POINT( '', ( 2.41399003288466, 0.818846614078905, 0.0383883170744954 ) );
#982 = CARTESIAN_POINT( '', ( 2.65735846609847, 0.397320122794157, 0.176747072348765 ) );
#983 = CARTESIAN_POINT( '', ( 2.77371166169353, 0.195790476400516, 0.273711661693177 ) );
#984 = CARTESIAN_POINT( '', ( 2.88675134594819, -9.91752069251514E-014, 0.386751345947843 ) );
#985 = COLOUR_RGB( '', 0.643137276200000, 0.678431391700000, 0.698039233700000 );
#986 = CARTESIAN_POINT( '', ( -1.44337567297407, -2.50000000000000, 0.386751345948126 ) );
#987 = CARTESIAN_POINT( '', ( -1.44337567297406, -2.50000000000000, 10.0000000000000 ) );
#988 = VECTOR( '', #1106, 1000.00000000000 );
#989 = CARTESIAN_POINT( '', ( -1.44337567297407, -2.50000000000000, 0.386751345948129 ) );
#990 = CARTESIAN_POINT( '', ( -1.55654607131316, -2.30398312016387, 0.273580947609032 ) );
#991 = CARTESIAN_POINT( '', ( -1.67227798695456, -2.10352956221570, 0.177415192052619 ) );
#992 = CARTESIAN_POINT( '', ( -1.85211660925412, -1.79203993122967, 0.0745957946565374 ) );
#993 = CARTESIAN_POINT( '', ( -1.91311398200213, -1.68638938250191, 0.0473008273076292 ) );
#994 = CARTESIAN_POINT( '', ( -2.03770144149892, -1.47059757266754, 0.00992263479919877 ) );
#995 = CARTESIAN_POINT( '', ( -2.10185541161879, -1.35947963691266, 9.32159758453358E-016 ) );
#996 = CARTESIAN_POINT( '', ( -2.16506350946110, -1.25000000000000, 9.58711614118699E-016 ) );
#997 = COLOUR_RGB( '', 0.184313729400000, 0.749019622800000, 0.580392181900000 );
#998 = COLOUR_RGB( '', 0.643137276200000, 0.678431391700000, 0.698039233700000 );
#999 = CARTESIAN_POINT( '', ( -2.25347189810574E-015, -2.50000000000000, 0.000000000000000 ) );
#1000 = AXIS2_PLACEMENT_3D( '', #1107, #1108, #1109 );
#1001 = CARTESIAN_POINT( '', ( -1.44337567297419, -2.50000000000000, 0.386751345947942 ) );
#1002 = CARTESIAN_POINT( '', ( -1.21953337248029, -2.50000000000000, 0.274830195700984 ) );
#1003 = CARTESIAN_POINT( '', ( -0.983960628962553, -2.50000000000000, 0.176760546623639 ) );
#1004 = CARTESIAN_POINT( '', ( -0.623240845509583, -2.50000000000000, 0.0739359505754271 ) );
#1005 = CARTESIAN_POINT( '', ( -0.501341881853027, -2.50000000000000, 0.0468287114739846 ) );
#1006 = CARTESIAN_POINT( '', ( -0.253557421167240, -2.50000000000000, 0.00983747858646898 ) );
#1007 = CARTESIAN_POINT( '', ( -0.126557823861557, -2.50000000000000, -1.21574638919410E-014 ) );
#1008 = CARTESIAN_POINT( '', ( 2.77488969967409E-016, -2.50000000000000, -1.20356460371061E-014 ) );
#1009 = COLOUR_RGB( '', 0.643137276200000, 0.678431391700000, 0.698039233700000 );
#1010 = CARTESIAN_POINT( '', ( 2.88675134594813, 0.000000000000000, 10.0000000000000 ) );
#1011 = VECTOR( '', #1110, 1000.00000000000 );
#1012 = CARTESIAN_POINT( '', ( 1.44337567297407, -2.50000000000000, 0.386751345948128 ) );
#1013 = CARTESIAN_POINT( '', ( 1.44337567297406, -2.50000000000000, 10.0000000000000 ) );
#1014 = VECTOR( '', #1111, 1000.00000000000 );
#1015 = CARTESIAN_POINT( '', ( 2.16506350946110, -1.25000000000000, -1.15206107242062E-015 ) );
#1016 = CARTESIAN_POINT( '', ( 2.03953310363580, -1.46742504078415, -1.24259733362206E-015 ) );
#1017 = CARTESIAN_POINT( '', ( 1.91613698603753, -1.68115338592109, 0.0383883170744935 ) );
#1018 = CARTESIAN_POINT( '', ( 1.67276855282373, -2.10267987720584, 0.176747072348763 ) );
#1019 = CARTESIAN_POINT( '', ( 1.55641535722867, -2.30420952359948, 0.273711661693175 ) );
#1020 = CARTESIAN_POINT( '', ( 1.44337567297401, -2.50000000000010, 0.386751345947842 ) );
#1021 = COLOUR_RGB( '', 0.643137276200000, 0.678431391700000, 0.698039233700000 );
#1022 = AXIS2_PLACEMENT_3D( '', #1112, #1113, #1114 );
#1023 = COLOUR_RGB( '', 0.643137276200000, 0.678431391700000, 0.698039233700000 );
#1024 = CARTESIAN_POINT( '', ( 1.08880077970342E-016, -2.50000000000000, -1.20356460371061E-014 ) );
#1025 = CARTESIAN_POINT( '', ( 0.253456054884838, -2.50000000000000, -1.17932397246216E-014 ) );
#1026 = CARTESIAN_POINT( '', ( 0.500503235886346, -2.50000000000000, 0.0390213690695502 ) );
#1027 = CARTESIAN_POINT( '', ( 0.984767116904594, -2.50000000000000, 0.176918433198087 ) );
#1028 = CARTESIAN_POINT( '', ( 1.21984948309415, -2.50000000000000, 0.274988251008171 ) );
#1029 = CARTESIAN_POINT( '', ( 1.44337567297406, -2.50000000000000, 0.386751345948131 ) );
#1030 = AXIS2_PLACEMENT_3D( '', #1115, #1116, #1117 );
#1031 = COLOUR_RGB( '', 0.643137276200000, 0.678431391700000, 0.698039233700000 );
#1032 = AXIS2_PLACEMENT_3D( '', #1118, #1119, #1120 );
#1033 = COLOUR_RGB( '', 0.643137276200000, 0.678431391700000, 0.698039233700000 );
#1034 = CARTESIAN_POINT( '', ( 1.44337567297407, 2.50000000000000, 0.386751345948130 ) );
#1035 = CARTESIAN_POINT( '', ( 1.55654607131316, 2.30398312016387, 0.273580947609032 ) );
#1036 = CARTESIAN_POINT( '', ( 1.67227798695456, 2.10352956221570, 0.177415192052619 ) );
#1037 = CARTESIAN_POINT( '', ( 1.85211660925412, 1.79203993122967, 0.0745957946565374 ) );
#1038 = CARTESIAN_POINT( '', ( 1.91311398200213, 1.68638938250191, 0.0473008273076292 ) );
#1039 = CARTESIAN_POINT( '', ( 2.03770144149892, 1.47059757266754, 0.00992263479919875 ) );
#1040 = CARTESIAN_POINT( '', ( 2.10185541161879, 1.35947963691266, 1.01549838898599E-015 ) );
#1041 = CARTESIAN_POINT( '', ( 2.16506350946110, 1.25000000000000, 1.07478871150378E-015 ) );
#1042 = COLOUR_RGB( '', 0.643137276200000, 0.678431391700000, 0.698039233700000 );
#1043 = CARTESIAN_POINT( '', ( 1.10000000000000, 0.000000000000000, 10.0000000000000 ) );
#1044 = AXIS2_PLACEMENT_3D( '', #1121, #1122, #1123 );
#1045 = AXIS2_PLACEMENT_3D( '', #1124, #1125, #1126 );
#1046 = COLOUR_RGB( '', 0.184313729400000, 0.749019622800000, 0.580392181900000 );
#1047 = CARTESIAN_POINT( '', ( -1.25000000000000, 0.000000000000000, 15.7000000000000 ) );
#1048 = AXIS2_PLACEMENT_3D( '', #1127, #1128, #1129 );
#1049 = COLOUR_RGB( '', 0.643137276200000, 0.678431391700000, 0.698039233700000 );
#1050 = COLOUR_RGB( '', 0.643137276200000, 0.678431391700000, 0.698039233700000 );
#1051 = COLOUR_RGB( '', 0.643137276200000, 0.678431391700000, 0.698039233700000 );
#1052 = COLOUR_RGB( '', 0.643137276200000, 0.678431391700000, 0.698039233700000 );
#1053 = COLOUR_RGB( '', 0.643137276200000, 0.678431391700000, 0.698039233700000 );
#1054 = COLOUR_RGB( '', 0.643137276200000, 0.678431391700000, 0.698039233700000 );
#1055 = CARTESIAN_POINT( '', ( 0.000000000000000, 0.000000000000000, 10.0000000000000 ) );
#1056 = DIRECTION( '', ( 0.000000000000000, 0.000000000000000, 1.00000000000000 ) );
#1057 = DIRECTION( '', ( 1.00000000000000, 0.000000000000000, 0.000000000000000 ) );
#1058 = DIRECTION( '', ( 0.000000000000000, 0.000000000000000, -1.00000000000000 ) );
#1059 = DIRECTION( '', ( 0.000000000000000, 0.000000000000000, -1.00000000000000 ) );
#1060 = CARTESIAN_POINT( '', ( 1.70045855049156E-018, -3.67379742419326E-018, 0.300000000000000 ) );
#1061 = DIRECTION( '', ( 0.000000000000000, 0.000000000000000, -1.00000000000000 ) );
#1062 = DIRECTION( '', ( -1.00000000000000, 0.000000000000000, 0.000000000000000 ) );
#1063 = CARTESIAN_POINT( '', ( 1.70045855049156E-018, -3.67379742419326E-018, 0.000000000000000 ) );
#1064 = DIRECTION( '', ( 0.000000000000000, 0.000000000000000, 1.00000000000000 ) );
#1065 = DIRECTION( '', ( 0.500000000000001, -0.866025403784438, 0.000000000000000 ) );
#1066 = CARTESIAN_POINT( '', ( 0.000000000000000, 0.000000000000000, 10.0000000000000 ) );
#1067 = DIRECTION( '', ( 0.000000000000000, 0.000000000000000, 1.00000000000000 ) );
#1068 = DIRECTION( '', ( 1.00000000000000, 0.000000000000000, 0.000000000000000 ) );
#1069 = CARTESIAN_POINT( '', ( 0.000000000000000, 0.000000000000000, 10.5464101615138 ) );
#1070 = DIRECTION( '', ( 0.000000000000000, 0.000000000000000, 1.00000000000000 ) );
#1071 = DIRECTION( '', ( 1.00000000000000, 0.000000000000000, 0.000000000000000 ) );
#1072 = CARTESIAN_POINT( '', ( 0.000000000000000, 0.000000000000000, 11.1062177826491 ) );
#1073 = DIRECTION( '', ( 0.000000000000000, 0.000000000000000, -1.00000000000000 ) );
#1074 = DIRECTION( '', ( -1.00000000000000, 0.000000000000000, 0.000000000000000 ) );
#1075 = CARTESIAN_POINT( '', ( 0.000000000000000, 0.000000000000000, 0.000000000000000 ) );
#1076 = DIRECTION( '', ( 0.000000000000000, 0.000000000000000, 1.00000000000000 ) );
#1077 = DIRECTION( '', ( 1.00000000000000, 0.000000000000000, 0.000000000000000 ) );
#1078 = CARTESIAN_POINT( '', ( 0.000000000000000, 0.000000000000000, 16.0000000000000 ) );
#1079 = DIRECTION( '', ( 0.000000000000000, 0.000000000000000, -1.00000000000000 ) );
#1080 = DIRECTION( '', ( -1.00000000000000, 0.000000000000000, 0.000000000000000 ) );
#1081 = DIRECTION( '', ( 0.000000000000000, 0.000000000000000, -1.00000000000000 ) );
#1082 = CARTESIAN_POINT( '', ( 0.000000000000000, 0.000000000000000, 10.4464101615138 ) );
#1083 = DIRECTION( '', ( 0.000000000000000, 0.000000000000000, -1.00000000000000 ) );
#1084 = DIRECTION( '', ( -1.00000000000000, 0.000000000000000, 0.000000000000000 ) );
#1085 = CARTESIAN_POINT( '', ( 0.000000000000000, 0.000000000000000, 10.2000000000000 ) );
#1086 = DIRECTION( '', ( 0.000000000000000, 0.000000000000000, 1.00000000000000 ) );
#1087 = DIRECTION( '', ( 1.00000000000000, 0.000000000000000, 0.000000000000000 ) );
#1088 = CARTESIAN_POINT( '', ( 1.70045855049156E-018, -3.67379742419326E-018, 6.50000000000000 ) );
#1089 = DIRECTION( '', ( 0.000000000000000, 0.000000000000000, 1.00000000000000 ) );
#1090 = DIRECTION( '', ( 0.000000000000000, -1.00000000000000, 0.000000000000000 ) );
#1091 = CARTESIAN_POINT( '', ( 1.70045855049156E-018, -3.67379742419326E-018, 5.00000000000000 ) );
#1092 = DIRECTION( '', ( 0.000000000000000, 0.000000000000000, -1.00000000000000 ) );
#1093 = DIRECTION( '', ( 0.000000000000000, 1.00000000000000, 0.000000000000000 ) );
#1094 = CARTESIAN_POINT( '', ( 0.000000000000000, 0.000000000000000, 10.0000000000000 ) );
#1095 = DIRECTION( '', ( 0.000000000000000, 0.000000000000000, 1.00000000000000 ) );
#1096 = DIRECTION( '', ( 1.00000000000000, 0.000000000000000, 0.000000000000000 ) );
#1097 = CARTESIAN_POINT( '', ( 0.000000000000000, 0.000000000000000, 10.0000000000000 ) );
#1098 = DIRECTION( '', ( 0.000000000000000, 0.000000000000000, 1.00000000000000 ) );
#1099 = DIRECTION( '', ( 1.00000000000000, 0.000000000000000, 0.000000000000000 ) );
#1100 = CARTESIAN_POINT( '', ( 0.000000000000000, 0.000000000000000, 10.0000000000000 ) );
#1101 = DIRECTION( '', ( 0.000000000000000, 0.000000000000000, 1.00000000000000 ) );
#1102 = DIRECTION( '', ( 1.00000000000000, 0.000000000000000, 0.000000000000000 ) );
#1103 = CARTESIAN_POINT( '', ( 0.000000000000000, 0.000000000000000, 0.000000000000000 ) );
#1104 = DIRECTION( '', ( 0.000000000000000, 0.000000000000000, 1.00000000000000 ) );
#1105 = DIRECTION( '', ( 1.00000000000000, 0.000000000000000, 0.000000000000000 ) );
#1106 = DIRECTION( '', ( 0.000000000000000, 0.000000000000000, -1.00000000000000 ) );
#1107 = CARTESIAN_POINT( '', ( 0.000000000000000, 0.000000000000000, 0.000000000000000 ) );
#1108 = DIRECTION( '', ( 0.000000000000000, 0.000000000000000, 1.00000000000000 ) );
#1109 = DIRECTION( '', ( 1.00000000000000, 0.000000000000000, 0.000000000000000 ) );
#1110 = DIRECTION( '', ( 0.000000000000000, 0.000000000000000, -1.00000000000000 ) );
#1111 = DIRECTION( '', ( 0.000000000000000, 0.000000000000000, -1.00000000000000 ) );
#1112 = CARTESIAN_POINT( '', ( 0.000000000000000, 0.000000000000000, 0.000000000000000 ) );
#1113 = DIRECTION( '', ( 0.000000000000000, 0.000000000000000, 1.00000000000000 ) );
#1114 = DIRECTION( '', ( 1.00000000000000, 0.000000000000000, 0.000000000000000 ) );
#1115 = CARTESIAN_POINT( '', ( 0.000000000000000, 0.000000000000000, 0.000000000000000 ) );
#1116 = DIRECTION( '', ( 0.000000000000000, 0.000000000000000, 1.00000000000000 ) );
#1117 = DIRECTION( '', ( 1.00000000000000, 0.000000000000000, 0.000000000000000 ) );
#1118 = CARTESIAN_POINT( '', ( 0.000000000000000, 0.000000000000000, 0.000000000000000 ) );
#1119 = DIRECTION( '', ( 0.000000000000000, 0.000000000000000, 1.00000000000000 ) );
#1120 = DIRECTION( '', ( 1.00000000000000, 0.000000000000000, 0.000000000000000 ) );
#1121 = CARTESIAN_POINT( '', ( 0.000000000000000, 0.000000000000000, 10.0000000000000 ) );
#1122 = DIRECTION( '', ( 0.000000000000000, 0.000000000000000, 1.00000000000000 ) );
#1123 = DIRECTION( '', ( 1.00000000000000, 0.000000000000000, 0.000000000000000 ) );
#1124 = CARTESIAN_POINT( '', ( 0.000000000000000, 0.000000000000000, 10.0000000000000 ) );
#1125 = DIRECTION( '', ( 0.000000000000000, 0.000000000000000, 1.00000000000000 ) );
#1126 = DIRECTION( '', ( 1.00000000000000, 0.000000000000000, 0.000000000000000 ) );
#1127 = CARTESIAN_POINT( '', ( 0.000000000000000, 0.000000000000000, 15.7000000000000 ) );
#1128 = DIRECTION( '', ( 0.000000000000000, 0.000000000000000, -1.00000000000000 ) );
#1129 = DIRECTION( '', ( -1.00000000000000, 0.000000000000000, 0.000000000000000 ) );
ENDSEC;
END-ISO-10303-21;
