(footprint "HDR2X4_100mil_edge" (version 20221018) (generator pcbnew)
  (layer "F.Cu")
  (attr smd)
  (fp_text reference "REF**" (at 0 -5.08) (layer "F.SilkS")
      (effects (font (size 1 1) (thickness 0.15)))
    (tstamp 3a560bb8-02f9-42a4-9452-7ec38021b0bb)
  )
  (fp_text value "HDR2X4_100mil_edge" (at 0 -5.08) (layer "F.Fab")
      (effects (font (size 1 1) (thickness 0.15)))
    (tstamp 60a2d316-564c-4e42-a1fc-e160f08e4eaf)
  )
  (fp_text user "^" (at -3.83 -4.77 180 unlocked) (layer "F.SilkS")
      (effects (font (size 1 1) (thickness 0.15)))
    (tstamp 3bf414da-bdc7-47ae-aa31-9ed76fedb21b)
  )
  (fp_line (start -5.08 0) (end 5.08 0)
    (stroke (width 0.1) (type solid)) (layer "F.SilkS") (tstamp 24a4eb4c-fd2a-476e-aeed-5a7fae2a1a67))
  (fp_rect (start -5.4 0.25) (end 5.4 -4.25)
    (stroke (width 0.05) (type default)) (fill none) (layer "F.CrtYd") (tstamp c04cad4d-b89c-46dd-8459-7193375126c5))
  (pad "1" smd roundrect (at -3.81 -2.54) (size 1.5 3) (layers "F.Cu" "F.Paste" "F.Mask") (roundrect_rratio 0.03333333333) (tstamp eee3f8ef-f8e1-4d1a-90e0-cfb6daa54f48))
  (pad "2" smd roundrect (at -3.81 -2.54) (size 1.5 3) (layers "B.Cu" "B.Paste" "B.Mask") (roundrect_rratio 0.03333333333) (tstamp 005f297a-3a56-4ee9-975a-80a3d5ad00bf))
  (pad "3" smd roundrect (at -1.27 -2.54) (size 1.5 3) (layers "F.Cu" "F.Paste" "F.Mask") (roundrect_rratio 0.03333333333) (tstamp ca67ae54-cd70-4f23-b839-6dc65d9eca5e))
  (pad "4" smd roundrect (at -1.27 -2.54) (size 1.5 3) (layers "B.Cu" "B.Paste" "B.Mask") (roundrect_rratio 0.03333333333) (tstamp c8c74f5f-dd9e-4f05-bbeb-57424f18ee90))
  (pad "5" smd roundrect (at 1.27 -2.54) (size 1.5 3) (layers "F.Cu" "F.Paste" "F.Mask") (roundrect_rratio 0.03333333333) (tstamp a65a6fe9-4f34-4528-9c35-af06d68411e0))
  (pad "6" smd roundrect (at 1.27 -2.54) (size 1.5 3) (layers "B.Cu" "B.Paste" "B.Mask") (roundrect_rratio 0.03333333333) (tstamp 2ed35c18-93dc-4721-b349-779762551b56))
  (pad "7" smd roundrect (at 3.81 -2.54) (size 1.5 3) (layers "F.Cu" "F.Paste" "F.Mask") (roundrect_rratio 0.03333333333) (tstamp 9d026b0f-d544-4ac2-bbba-b9583d927811))
  (pad "8" smd roundrect (at 3.81 -2.54) (size 1.5 3) (layers "B.Cu" "B.Paste" "B.Mask") (roundrect_rratio 0.03333333333) (tstamp a3cde3b8-efa6-4dc4-8f18-73637b66734a))
  (model "${KICADLIB}/model/connector/PinHeader_2x04_P2.54mm_Vertical.step"
    (offset (xyz -3.75 0 -2))
    (scale (xyz 1 1 1))
    (rotate (xyz -90 90 0))
  )
)
