(module APP_PP45_RD&BK (layer F.Cu) (tedit 5CDDEF43)
  (fp_text reference REF** (at 0 7.5) (layer F.SilkS)
    (effects (font (size 1 1) (thickness 0.15)))
  )
  (fp_text value APP_PP45_RD&BK (at 0 -3) (layer F.Fab) hide
    (effects (font (size 1 1) (thickness 0.15)))
  )
  (fp_line (start -8.5 -2) (end 0 -2) (layer F.SilkS) (width 0.1))
  (fp_line (start 0 -2) (end 0 6.5) (layer F.SilkS) (width 0.1))
  (fp_line (start 0 6.5) (end -8.5 6.5) (layer F.SilkS) (width 0.1))
  (fp_line (start -8.5 6.5) (end -8.5 -2) (layer F.SilkS) (width 0.1))
  (fp_line (start 8 6.5) (end 0 6.5) (layer F.SilkS) (width 0.1))
  (fp_line (start 0 -2) (end 8 -2) (layer F.SilkS) (width 0.1))
  (fp_line (start 8 -2) (end 8 6.5) (layer F.SilkS) (width 0.1))
  (fp_line (start 0 6.5) (end 0 -2) (layer F.SilkS) (width 0.1))
  (fp_text user + (at 4 3.25) (layer B.SilkS)
    (effects (font (size 3 3) (thickness 0.5)) (justify mirror))
  )
  (fp_text user - (at -4 3.25) (layer B.SilkS)
    (effects (font (size 3 3) (thickness 0.5)) (justify mirror))
  )
  (pad 1 thru_hole oval (at -4 0.25 90) (size 2.5 6.46) (drill oval 1.27 5.23) (layers *.Cu *.Mask))
  (pad 2 thru_hole oval (at 4 0.25 90) (size 2.5 6.46) (drill oval 1.27 5.23) (layers *.Cu *.Mask))
  (model ${KICADLIB}/model/connector/APP_PP45-RED-PCB.step
    (offset (xyz -0.5 -48.85 0))
    (scale (xyz 1 1 1))
    (rotate (xyz 0 90 0))
  )
  (model ${KICADLIB}/model/connector/APP_PP45-BLACK-PCB.step
    (offset (xyz -8.5 -48.85 0))
    (scale (xyz 1 1 1))
    (rotate (xyz 0 90 0))
  )
)
