ISO-10303-21;
HEADER;
FILE_DESCRIPTION (( 'STEP AP203' ),
    '1' );
FILE_NAME ('91100A120_Zinc-Plated Steel Oversized Washer.STEP',
    '2021-09-09T21:39:59',
    ( 'Administrator' ),
    ( 'Managed by Terraform' ),
    'SwSTEP 2.0',
    'SolidWorks 2017',
    '' );
FILE_SCHEMA (( 'CONFIG_CONTROL_DESIGN' ));
ENDSEC;

DATA;
#1 = ORIENTED_EDGE ( 'NONE', *, *, #103, .F. ) ;
#2 = EDGE_CURVE ( 'NONE', #41, #38, #183, .T. ) ;
#3 = VERTEX_POINT ( 'NONE', #60 ) ;
#4 = CIRCLE ( 'NONE', #131, 4.499999999999997300 ) ;
#5 = CALENDAR_DATE ( 2021, 9, 9 ) ;
#6 = AXIS2_PLACEMENT_3D ( 'NONE', #206, #14, #77 ) ;
#7 = CARTESIAN_POINT ( 'NONE',  ( 0.0000000000000000000, 0.0000000000000000000, 0.4000000000000000200 ) ) ;
#8 = DIRECTION ( 'NONE',  ( 1.000000000000000000, 0.0000000000000000000, 0.0000000000000000000 ) ) ;
#9 = CARTESIAN_POINT ( 'NONE',  ( -1.600000000000001000, 0.0000000000000000000, 0.4000000000000000200 ) ) ;
#10 = DIRECTION ( 'NONE',  ( 1.000000000000000000, 0.0000000000000000000, 0.0000000000000000000 ) ) ;
#11 = VECTOR ( 'NONE', #171, 1000.000000000000000 ) ;
#12 = APPROVAL_ROLE ( '' ) ;
#13 = EDGE_CURVE ( 'NONE', #89, #150, #191, .T. ) ;
#14 = DIRECTION ( 'NONE',  ( 0.0000000000000000000, 0.0000000000000000000, 1.000000000000000000 ) ) ;
#15 = LINE ( 'NONE', #238, #100 ) ;
#16 = APPROVAL_STATUS ( 'not_yet_approved' ) ;
#17 =( LENGTH_UNIT ( ) NAMED_UNIT ( * ) SI_UNIT ( .MILLI., .METRE. ) );
#18 = CC_DESIGN_PERSON_AND_ORGANIZATION_ASSIGNMENT ( #72, #200, ( #54 ) ) ;
#19 = FACE_BOUND ( 'NONE', #91, .T. ) ;
#20 = VERTEX_POINT ( 'NONE', #218 ) ;
#21 = EDGE_CURVE ( 'NONE', #165, #150, #15, .T. ) ;
#22 = CYLINDRICAL_SURFACE ( 'NONE', #85, 4.499999999999997300 ) ;
#23 = AXIS2_PLACEMENT_3D ( 'NONE', #224, #105, #163 ) ;
#24 = PERSON_AND_ORGANIZATION ( #58, #48 ) ;
#25 = LINE ( 'NONE', #71, #214 ) ;
#26 = SHAPE_DEFINITION_REPRESENTATION ( #240, #109 ) ;
#27 = DATE_AND_TIME ( #129, #127 ) ;
#28 = CARTESIAN_POINT ( 'NONE',  ( 4.499999999999997300, 5.510910596163085600E-016, 0.4000000000000000200 ) ) ;
#29 = CARTESIAN_POINT ( 'NONE',  ( 0.0000000000000000000, 0.0000000000000000000, 0.4000000000000000200 ) ) ;
#30 = VERTEX_POINT ( 'NONE', #9 ) ;
#31 = AXIS2_PLACEMENT_3D ( 'NONE', #236, #234, #153 ) ;
#32 = CARTESIAN_POINT ( 'NONE',  ( 1.600000000000001000, 1.959434878635766200E-016, -0.4000000000000000200 ) ) ;
#33 = APPROVAL_ROLE ( '' ) ;
#34 = AXIS2_PLACEMENT_3D ( 'NONE', #29, #45, #196 ) ;
#35 = ORIENTED_EDGE ( 'NONE', *, *, #169, .F. ) ;
#36 = EDGE_CURVE ( 'NONE', #38, #41, #160, .T. ) ;
#37 = CALENDAR_DATE ( 2021, 9, 9 ) ;
#38 = VERTEX_POINT ( 'NONE', #156 ) ;
#39 = ADVANCED_FACE ( 'NONE', ( #79, #19 ), #199, .T. ) ;
#40 = FACE_BOUND ( 'NONE', #248, .T. ) ;
#41 = VERTEX_POINT ( 'NONE', #235 ) ;
#42 = PRODUCT ( '91100A120_Zinc-Plated Steel Oversized Washer', '91100A120_Zinc-Plated Steel Oversized Washer', '', ( #207 ) ) ;
#43 = EDGE_LOOP ( 'NONE', ( #245, #65, #203, #118 ) ) ;
#44 =( GEOMETRIC_REPRESENTATION_CONTEXT ( 3 ) GLOBAL_UNCERTAINTY_ASSIGNED_CONTEXT ( ( #193 ) ) GLOBAL_UNIT_ASSIGNED_CONTEXT ( ( #17, #223, #242 ) ) REPRESENTATION_CONTEXT ( 'NONE', 'WORKASPACE' ) );
#45 = DIRECTION ( 'NONE',  ( 0.0000000000000000000, 0.0000000000000000000, 1.000000000000000000 ) ) ;
#46 = DIRECTION ( 'NONE',  ( -1.000000000000000000, 0.0000000000000000000, 0.0000000000000000000 ) ) ;
#47 = ORIENTED_EDGE ( 'NONE', *, *, #36, .F. ) ;
#48 = ORGANIZATION ( 'UNSPECIFIED', 'UNSPECIFIED', '' ) ;
#49 = SECURITY_CLASSIFICATION ( '', '', #202 ) ;
#50 = APPLICATION_PROTOCOL_DEFINITION ( 'international standard', 'config_control_design', 1994, #102 ) ;
#51 = CC_DESIGN_PERSON_AND_ORGANIZATION_ASSIGNMENT ( #176, #101, ( #49 ) ) ;
#52 = DATE_AND_TIME ( #106, #155 ) ;
#53 = ORIENTED_EDGE ( 'NONE', *, *, #167, .T. ) ;
#54 = PRODUCT_DEFINITION_FORMATION_WITH_SPECIFIED_SOURCE ( 'ANY', '', #42, .NOT_KNOWN. ) ;
#55 = CIRCLE ( 'NONE', #122, 1.600000000000001000 ) ;
#56 = LOCAL_TIME ( 16, 39, 59.00000000000000000, #215 ) ;
#57 = CC_DESIGN_PERSON_AND_ORGANIZATION_ASSIGNMENT ( #181, #63, ( #42 ) ) ;
#58 = PERSON ( 'UNSPECIFIED', 'UNSPECIFIED', 'UNSPECIFIED', ('UNSPECIFIED'), ('UNSPECIFIED'), ('UNSPECIFIED') ) ;
#59 = CARTESIAN_POINT ( 'NONE',  ( 0.0000000000000000000, 0.0000000000000000000, 0.4000000000000000200 ) ) ;
#60 = CARTESIAN_POINT ( 'NONE',  ( 4.499999999999997300, 5.510910596163085600E-016, -0.4000000000000000200 ) ) ;
#61 = PERSON_AND_ORGANIZATION ( #58, #48 ) ;
#62 = ORIENTED_EDGE ( 'NONE', *, *, #232, .T. ) ;
#63 = PERSON_AND_ORGANIZATION_ROLE ( 'design_owner' ) ;
#64 = PERSON_AND_ORGANIZATION_ROLE ( 'creator' ) ;
#65 = ORIENTED_EDGE ( 'NONE', *, *, #21, .T. ) ;
#66 = APPLICATION_CONTEXT ( 'configuration controlled 3d designs of mechanical parts and assemblies' ) ;
#67 = ADVANCED_FACE ( 'NONE', ( #80 ), #22, .T. ) ;
#68 = LOCAL_TIME ( 16, 39, 59.00000000000000000, #201 ) ;
#69 = APPROVAL_PERSON_ORGANIZATION ( #86, #185, #33 ) ;
#70 = CC_DESIGN_DATE_AND_TIME_ASSIGNMENT ( #145, #180, ( #249 ) ) ;
#71 = CARTESIAN_POINT ( 'NONE',  ( -1.600000000000001000, 0.0000000000000000000, 0.4000000000000000200 ) ) ;
#72 = PERSON_AND_ORGANIZATION ( #58, #48 ) ;
#73 = DIRECTION ( 'NONE',  ( -1.000000000000000000, 0.0000000000000000000, 0.0000000000000000000 ) ) ;
#74 = EDGE_LOOP ( 'NONE', ( #170, #219 ) ) ;
#75 = DIRECTION ( 'NONE',  ( -0.0000000000000000000, -0.0000000000000000000, -1.000000000000000000 ) ) ;
#76 = AXIS2_PLACEMENT_3D ( 'NONE', #92, #94, #220 ) ;
#77 = DIRECTION ( 'NONE',  ( 1.000000000000000000, 0.0000000000000000000, 0.0000000000000000000 ) ) ;
#78 = CARTESIAN_POINT ( 'NONE',  ( 0.0000000000000000000, 0.0000000000000000000, 0.0000000000000000000 ) ) ;
#79 = FACE_OUTER_BOUND ( 'NONE', #172, .T. ) ;
#80 = FACE_OUTER_BOUND ( 'NONE', #124, .T. ) ;
#81 = CARTESIAN_POINT ( 'NONE',  ( 0.0000000000000000000, 0.0000000000000000000, -0.4000000000000000200 ) ) ;
#82 = CYLINDRICAL_SURFACE ( 'NONE', #152, 4.499999999999997300 ) ;
#83 = EDGE_CURVE ( 'NONE', #30, #89, #25, .T. ) ;
#84 = PERSON_AND_ORGANIZATION ( #58, #48 ) ;
#85 = AXIS2_PLACEMENT_3D ( 'NONE', #119, #138, #73 ) ;
#86 = PERSON_AND_ORGANIZATION ( #58, #48 ) ;
#87 = ORIENTED_EDGE ( 'NONE', *, *, #216, .F. ) ;
#88 = PERSON_AND_ORGANIZATION ( #58, #48 ) ;
#89 = VERTEX_POINT ( 'NONE', #177 ) ;
#90 = DATE_AND_TIME ( #5, #56 ) ;
#91 = EDGE_LOOP ( 'NONE', ( #87, #1 ) ) ;
#92 = CARTESIAN_POINT ( 'NONE',  ( 0.0000000000000000000, 0.0000000000000000000, 0.4000000000000000200 ) ) ;
#93 = DIRECTION ( 'NONE',  ( 0.0000000000000000000, 0.0000000000000000000, 1.000000000000000000 ) ) ;
#94 = DIRECTION ( 'NONE',  ( 0.0000000000000000000, 0.0000000000000000000, 1.000000000000000000 ) ) ;
#95 = ORIENTED_EDGE ( 'NONE', *, *, #232, .F. ) ;
#96 = DIRECTION ( 'NONE',  ( 0.0000000000000000000, 0.0000000000000000000, 1.000000000000000000 ) ) ;
#97 = CC_DESIGN_APPROVAL ( #185, ( #49 ) ) ;
#98 = DIRECTION ( 'NONE',  ( 1.000000000000000000, 0.0000000000000000000, 0.0000000000000000000 ) ) ;
#99 = CARTESIAN_POINT ( 'NONE',  ( 0.0000000000000000000, 0.0000000000000000000, 0.4000000000000000200 ) ) ;
#100 = VECTOR ( 'NONE', #175, 1000.000000000000000 ) ;
#101 = PERSON_AND_ORGANIZATION_ROLE ( 'classification_officer' ) ;
#102 = APPLICATION_CONTEXT ( 'configuration controlled 3d designs of mechanical parts and assemblies' ) ;
#103 = EDGE_CURVE ( 'NONE', #165, #30, #55, .T. ) ;
#104 = AXIS2_PLACEMENT_3D ( 'NONE', #7, #195, #173 ) ;
#105 = DIRECTION ( 'NONE',  ( 0.0000000000000000000, 0.0000000000000000000, 1.000000000000000000 ) ) ;
#106 = CALENDAR_DATE ( 2021, 9, 9 ) ;
#107 = APPROVAL_DATE_TIME ( #27, #185 ) ;
#108 = ORIENTED_EDGE ( 'NONE', *, *, #169, .T. ) ;
#109 = ADVANCED_BREP_SHAPE_REPRESENTATION ( '91100A120_Zinc-Plated Steel Oversized Washer', ( #230, #217 ), #44 ) ;
#110 = CIRCLE ( 'NONE', #6, 1.600000000000001000 ) ;
#111 = CC_DESIGN_APPROVAL ( #209, ( #54 ) ) ;
#112 = COORDINATED_UNIVERSAL_TIME_OFFSET ( 6, 0, .BEHIND. ) ;
#113 = ORIENTED_EDGE ( 'NONE', *, *, #36, .T. ) ;
#114 = APPROVAL_PERSON_ORGANIZATION ( #88, #229, #246 ) ;
#115 = AXIS2_PLACEMENT_3D ( 'NONE', #99, #179, #184 ) ;
#116 = CARTESIAN_POINT ( 'NONE',  ( 0.0000000000000000000, 0.0000000000000000000, -0.4000000000000000200 ) ) ;
#117 = APPROVAL_PERSON_ORGANIZATION ( #61, #209, #12 ) ;
#118 = ORIENTED_EDGE ( 'NONE', *, *, #83, .F. ) ;
#119 = CARTESIAN_POINT ( 'NONE',  ( 0.0000000000000000000, 0.0000000000000000000, 0.4000000000000000200 ) ) ;
#120 = PERSON_AND_ORGANIZATION_ROLE ( 'creator' ) ;
#121 = APPLICATION_PROTOCOL_DEFINITION ( 'international standard', 'config_control_design', 1994, #66 ) ;
#122 = AXIS2_PLACEMENT_3D ( 'NONE', #59, #93, #8 ) ;
#123 = DATE_TIME_ROLE ( 'classification_date' ) ;
#124 = EDGE_LOOP ( 'NONE', ( #226, #233, #53, #95 ) ) ;
#125 = CARTESIAN_POINT ( 'NONE',  ( 0.0000000000000000000, 0.0000000000000000000, -0.4000000000000000200 ) ) ;
#126 = CIRCLE ( 'NONE', #178, 1.600000000000001000 ) ;
#127 = LOCAL_TIME ( 16, 39, 59.00000000000000000, #190 ) ;
#128 = ADVANCED_FACE ( 'NONE', ( #166 ), #158, .F. ) ;
#129 = CALENDAR_DATE ( 2021, 9, 9 ) ;
#130 = ORIENTED_EDGE ( 'NONE', *, *, #2, .T. ) ;
#131 = AXIS2_PLACEMENT_3D ( 'NONE', #125, #182, #247 ) ;
#132 = LINE ( 'NONE', #164, #227 ) ;
#133 = CC_DESIGN_PERSON_AND_ORGANIZATION_ASSIGNMENT ( #84, #64, ( #54 ) ) ;
#134 = APPROVAL_DATE_TIME ( #228, #229 ) ;
#135 = CIRCLE ( 'NONE', #143, 4.499999999999997300 ) ;
#136 = DIRECTION ( 'NONE',  ( -0.0000000000000000000, -0.0000000000000000000, -1.000000000000000000 ) ) ;
#137 = APPROVAL_DATE_TIME ( #52, #209 ) ;
#138 = DIRECTION ( 'NONE',  ( -0.0000000000000000000, -0.0000000000000000000, -1.000000000000000000 ) ) ;
#139 = ORIENTED_EDGE ( 'NONE', *, *, #186, .T. ) ;
#140 = DIRECTION ( 'NONE',  ( 0.0000000000000000000, 0.0000000000000000000, 1.000000000000000000 ) ) ;
#141 = EDGE_CURVE ( 'NONE', #41, #3, #174, .T. ) ;
#142 = DIRECTION ( 'NONE',  ( 1.000000000000000000, 0.0000000000000000000, 0.0000000000000000000 ) ) ;
#143 = AXIS2_PLACEMENT_3D ( 'NONE', #241, #140, #142 ) ;
#144 = DIRECTION ( 'NONE',  ( 1.000000000000000000, 0.0000000000000000000, 0.0000000000000000000 ) ) ;
#145 = DATE_AND_TIME ( #189, #68 ) ;
#146 = EDGE_LOOP ( 'NONE', ( #157, #148, #194, #35 ) ) ;
#147 = CC_DESIGN_DATE_AND_TIME_ASSIGNMENT ( #90, #123, ( #49 ) ) ;
#148 = ORIENTED_EDGE ( 'NONE', *, *, #103, .T. ) ;
#149 = LOCAL_TIME ( 16, 39, 59.00000000000000000, #243 ) ;
#150 = VERTEX_POINT ( 'NONE', #32 ) ;
#151 = FACE_OUTER_BOUND ( 'NONE', #198, .T. ) ;
#152 = AXIS2_PLACEMENT_3D ( 'NONE', #154, #136, #46 ) ;
#153 = DIRECTION ( 'NONE',  ( -1.000000000000000000, 0.0000000000000000000, 0.0000000000000000000 ) ) ;
#154 = CARTESIAN_POINT ( 'NONE',  ( 0.0000000000000000000, 0.0000000000000000000, 0.4000000000000000200 ) ) ;
#155 = LOCAL_TIME ( 16, 39, 59.00000000000000000, #112 ) ;
#156 = CARTESIAN_POINT ( 'NONE',  ( -4.499999999999997300, 0.0000000000000000000, 0.4000000000000000200 ) ) ;
#157 = ORIENTED_EDGE ( 'NONE', *, *, #21, .F. ) ;
#158 = CYLINDRICAL_SURFACE ( 'NONE', #31, 1.600000000000001000 ) ;
#159 = DIRECTION ( 'NONE',  ( 0.0000000000000000000, 0.0000000000000000000, 1.000000000000000000 ) ) ;
#160 = CIRCLE ( 'NONE', #34, 4.499999999999997300 ) ;
#161 = DESIGN_CONTEXT ( 'detailed design', #102, 'design' ) ;
#162 = PRODUCT_RELATED_PRODUCT_CATEGORY ( 'detail', '', ( #42 ) ) ;
#163 = DIRECTION ( 'NONE',  ( 1.000000000000000000, 0.0000000000000000000, -0.0000000000000000000 ) ) ;
#164 = CARTESIAN_POINT ( 'NONE',  ( -4.499999999999997300, 0.0000000000000000000, 0.4000000000000000200 ) ) ;
#165 = VERTEX_POINT ( 'NONE', #197 ) ;
#166 = FACE_OUTER_BOUND ( 'NONE', #43, .T. ) ;
#167 = EDGE_CURVE ( 'NONE', #3, #20, #4, .T. ) ;
#168 = ADVANCED_FACE ( 'NONE', ( #151 ), #82, .T. ) ;
#169 = EDGE_CURVE ( 'NONE', #150, #89, #126, .T. ) ;
#170 = ORIENTED_EDGE ( 'NONE', *, *, #186, .F. ) ;
#171 = DIRECTION ( 'NONE',  ( -0.0000000000000000000, -0.0000000000000000000, -1.000000000000000000 ) ) ;
#172 = EDGE_LOOP ( 'NONE', ( #113, #130 ) ) ;
#173 = DIRECTION ( 'NONE',  ( 1.000000000000000000, 0.0000000000000000000, 0.0000000000000000000 ) ) ;
#174 = LINE ( 'NONE', #28, #11 ) ;
#175 = DIRECTION ( 'NONE',  ( -0.0000000000000000000, -0.0000000000000000000, -1.000000000000000000 ) ) ;
#176 = PERSON_AND_ORGANIZATION ( #58, #48 ) ;
#177 = CARTESIAN_POINT ( 'NONE',  ( -1.600000000000001000, 0.0000000000000000000, -0.4000000000000000200 ) ) ;
#178 = AXIS2_PLACEMENT_3D ( 'NONE', #81, #225, #98 ) ;
#179 = DIRECTION ( 'NONE',  ( -0.0000000000000000000, -0.0000000000000000000, -1.000000000000000000 ) ) ;
#180 = DATE_TIME_ROLE ( 'creation_date' ) ;
#181 = PERSON_AND_ORGANIZATION ( #58, #48 ) ;
#182 = DIRECTION ( 'NONE',  ( 0.0000000000000000000, 0.0000000000000000000, 1.000000000000000000 ) ) ;
#183 = CIRCLE ( 'NONE', #104, 4.499999999999997300 ) ;
#184 = DIRECTION ( 'NONE',  ( -1.000000000000000000, 0.0000000000000000000, 0.0000000000000000000 ) ) ;
#185 = APPROVAL ( #16, 'UNSPECIFIED' ) ;
#186 = EDGE_CURVE ( 'NONE', #20, #3, #135, .T. ) ;
#187 = DIRECTION ( 'NONE',  ( -0.0000000000000000000, -0.0000000000000000000, -1.000000000000000000 ) ) ;
#188 = CYLINDRICAL_SURFACE ( 'NONE', #115, 1.600000000000001000 ) ;
#189 = CALENDAR_DATE ( 2021, 9, 9 ) ;
#190 = COORDINATED_UNIVERSAL_TIME_OFFSET ( 6, 0, .BEHIND. ) ;
#191 = CIRCLE ( 'NONE', #222, 1.600000000000001000 ) ;
#192 = FACE_OUTER_BOUND ( 'NONE', #146, .T. ) ;
#193 = UNCERTAINTY_MEASURE_WITH_UNIT (LENGTH_MEASURE( 1.000000000000000100E-005 ), #17, 'distance_accuracy_value', 'NONE');
#194 = ORIENTED_EDGE ( 'NONE', *, *, #83, .T. ) ;
#195 = DIRECTION ( 'NONE',  ( 0.0000000000000000000, 0.0000000000000000000, 1.000000000000000000 ) ) ;
#196 = DIRECTION ( 'NONE',  ( 1.000000000000000000, 0.0000000000000000000, 0.0000000000000000000 ) ) ;
#197 = CARTESIAN_POINT ( 'NONE',  ( 1.600000000000001000, 1.959434878635766200E-016, 0.4000000000000000200 ) ) ;
#198 = EDGE_LOOP ( 'NONE', ( #231, #47, #62, #139 ) ) ;
#199 = PLANE ( 'NONE',  #76 ) ;
#200 = PERSON_AND_ORGANIZATION_ROLE ( 'design_supplier' ) ;
#201 = COORDINATED_UNIVERSAL_TIME_OFFSET ( 6, 0, .BEHIND. ) ;
#202 = SECURITY_CLASSIFICATION_LEVEL ( 'unclassified' ) ;
#203 = ORIENTED_EDGE ( 'NONE', *, *, #13, .F. ) ;
#204 = CC_DESIGN_PERSON_AND_ORGANIZATION_ASSIGNMENT ( #24, #120, ( #249 ) ) ;
#205 = APPROVAL_STATUS ( 'not_yet_approved' ) ;
#206 = CARTESIAN_POINT ( 'NONE',  ( 0.0000000000000000000, 0.0000000000000000000, 0.4000000000000000200 ) ) ;
#207 = MECHANICAL_CONTEXT ( 'NONE', #66, 'mechanical' ) ;
#208 = ADVANCED_FACE ( 'NONE', ( #237, #40 ), #221, .F. ) ;
#209 = APPROVAL ( #205, 'UNSPECIFIED' ) ;
#210 = ADVANCED_FACE ( 'NONE', ( #192 ), #188, .F. ) ;
#211 = CLOSED_SHELL ( 'NONE', ( #128, #67, #39, #208, #168, #210 ) ) ;
#212 = CC_DESIGN_APPROVAL ( #229, ( #249 ) ) ;
#213 = ORIENTED_EDGE ( 'NONE', *, *, #13, .T. ) ;
#214 = VECTOR ( 'NONE', #75, 1000.000000000000000 ) ;
#215 = COORDINATED_UNIVERSAL_TIME_OFFSET ( 6, 0, .BEHIND. ) ;
#216 = EDGE_CURVE ( 'NONE', #30, #165, #110, .T. ) ;
#217 = AXIS2_PLACEMENT_3D ( 'NONE', #78, #159, #144 ) ;
#218 = CARTESIAN_POINT ( 'NONE',  ( -4.499999999999997300, 0.0000000000000000000, -0.4000000000000000200 ) ) ;
#219 = ORIENTED_EDGE ( 'NONE', *, *, #167, .F. ) ;
#220 = DIRECTION ( 'NONE',  ( 1.000000000000000000, 0.0000000000000000000, -0.0000000000000000000 ) ) ;
#221 = PLANE ( 'NONE',  #23 ) ;
#222 = AXIS2_PLACEMENT_3D ( 'NONE', #116, #96, #10 ) ;
#223 =( NAMED_UNIT ( * ) PLANE_ANGLE_UNIT ( ) SI_UNIT ( $, .RADIAN. ) );
#224 = CARTESIAN_POINT ( 'NONE',  ( 0.0000000000000000000, 0.0000000000000000000, -0.4000000000000000200 ) ) ;
#225 = DIRECTION ( 'NONE',  ( 0.0000000000000000000, 0.0000000000000000000, 1.000000000000000000 ) ) ;
#226 = ORIENTED_EDGE ( 'NONE', *, *, #2, .F. ) ;
#227 = VECTOR ( 'NONE', #187, 1000.000000000000000 ) ;
#228 = DATE_AND_TIME ( #37, #149 ) ;
#229 = APPROVAL ( #239, 'UNSPECIFIED' ) ;
#230 = MANIFOLD_SOLID_BREP ( 'Boss-Extrude1', #211 ) ;
#231 = ORIENTED_EDGE ( 'NONE', *, *, #141, .F. ) ;
#232 = EDGE_CURVE ( 'NONE', #38, #20, #132, .T. ) ;
#233 = ORIENTED_EDGE ( 'NONE', *, *, #141, .T. ) ;
#234 = DIRECTION ( 'NONE',  ( -0.0000000000000000000, -0.0000000000000000000, -1.000000000000000000 ) ) ;
#235 = CARTESIAN_POINT ( 'NONE',  ( 4.499999999999997300, 5.510910596163085600E-016, 0.4000000000000000200 ) ) ;
#236 = CARTESIAN_POINT ( 'NONE',  ( 0.0000000000000000000, 0.0000000000000000000, 0.4000000000000000200 ) ) ;
#237 = FACE_OUTER_BOUND ( 'NONE', #74, .T. ) ;
#238 = CARTESIAN_POINT ( 'NONE',  ( 1.600000000000001000, 1.959434878635766200E-016, 0.4000000000000000200 ) ) ;
#239 = APPROVAL_STATUS ( 'not_yet_approved' ) ;
#240 = PRODUCT_DEFINITION_SHAPE ( 'NONE', 'NONE',  #249 ) ;
#241 = CARTESIAN_POINT ( 'NONE',  ( 0.0000000000000000000, 0.0000000000000000000, -0.4000000000000000200 ) ) ;
#242 =( NAMED_UNIT ( * ) SI_UNIT ( $, .STERADIAN. ) SOLID_ANGLE_UNIT ( ) );
#243 = COORDINATED_UNIVERSAL_TIME_OFFSET ( 6, 0, .BEHIND. ) ;
#244 = CC_DESIGN_SECURITY_CLASSIFICATION ( #49, ( #54 ) ) ;
#245 = ORIENTED_EDGE ( 'NONE', *, *, #216, .T. ) ;
#246 = APPROVAL_ROLE ( '' ) ;
#247 = DIRECTION ( 'NONE',  ( 1.000000000000000000, 0.0000000000000000000, 0.0000000000000000000 ) ) ;
#248 = EDGE_LOOP ( 'NONE', ( #213, #108 ) ) ;
#249 = PRODUCT_DEFINITION ( 'UNKNOWN', '', #54, #161 ) ;
ENDSEC;
END-ISO-10303-21;
