(footprint "Panasonic_AV4544" (version 20221018) (generator pcbnew)
  (layer "F.Cu")
  (attr smd)
  (fp_text reference "REF**" (at 0 3.825) (layer "F.SilkS")
      (effects (font (size 1 1) (thickness 0.15)))
    (tstamp d46e344c-185a-4302-92c4-543882434ad3)
  )
  (fp_text value "AV4544" (at 0 -1.625) (layer "F.Fab") hide
      (effects (font (size 1 1) (thickness 0.15)))
    (tstamp 02e4c51b-7094-4091-8ab7-e1bb698c7b10)
  )
  (fp_text user "^" (at -2.55 3.8 unlocked) (layer "B.SilkS")
      (effects (font (size 1 1) (thickness 0.15)) (justify mirror))
    (tstamp 0fc94fc0-292f-4b31-a737-27c03307c7a3)
  )
  (fp_text user "^" (at -2.54 3.8 unlocked) (layer "F.SilkS")
      (effects (font (size 1 1) (thickness 0.15)))
    (tstamp 6599bbad-eee8-4f15-8856-3d58d172bcaf)
  )
  (fp_text user "${REFERENCE}" (at 0 0 unlocked) (layer "F.Fab")
      (effects (font (size 1 1) (thickness 0.15)))
    (tstamp 0c825418-41e9-47c6-a02c-678a11d4784e)
  )
  (fp_rect (start -3.75 -3.3) (end 3.75 0.5)
    (stroke (width 0.1) (type default)) (fill none) (layer "F.SilkS") (tstamp 3f1f5b7e-ae7d-44ec-bcfa-137ce2beba9c))
  (fp_rect (start -4 -6.9) (end 4 3.05)
    (stroke (width 0.05) (type solid)) (fill none) (layer "F.CrtYd") (tstamp d03c338e-38ea-4b2c-93ce-0c561a768da4))
  (fp_circle (center 1.4 -6.2) (end 2 -6.2)
    (stroke (width 0.1) (type default)) (fill none) (layer "F.Fab") (tstamp 973462b7-d93c-4165-99ff-b5cfe26d5c2d))
  (fp_circle (center 2.32 -4.3) (end 2.92 -4.3)
    (stroke (width 0.1) (type default)) (fill none) (layer "F.Fab") (tstamp d4b35c05-cd43-4e21-aff2-3db4ef3d5069))
  (fp_poly
    (pts
      (xy -3.75 2.5)
      (xy 3.75 2.5)
      (xy 3.75 -3.3)
      (xy -3.2 -3.3)
      (xy -3.75 -2.725)
    )

    (stroke (width 0.1) (type solid)) (fill none) (layer "F.Fab") (tstamp 8f692e8f-971b-41ea-a958-586eb7bfa2a5))
  (pad "1" thru_hole circle (at -2.54 2) (size 1.7 1.7) (drill 1) (layers "*.Cu" "*.Mask") (remove_unused_layers) (keep_end_layers) (tstamp 63531829-828f-4b6f-a6db-f6558bc3a8e0))
  (pad "2" thru_hole circle (at 0 2) (size 1.7 1.7) (drill 1) (layers "*.Cu" "*.Mask") (remove_unused_layers) (keep_end_layers) (tstamp b0eb3e94-c445-49e2-9d6f-5c696e67ddb9))
  (pad "3" thru_hole circle (at 2.54 2) (size 1.7 1.7) (drill 1) (layers "*.Cu" "*.Mask") (remove_unused_layers) (keep_end_layers) (tstamp 26e1c575-60d2-4ad7-be20-c1a557e37c23))
  (model "${KICADLIB}/model/mechanical/Limit-switch_Panasonic_AV4544.step"
    (offset (xyz 0 0 1.25))
    (scale (xyz 1 1 1))
    (rotate (xyz 0 0 0))
  )
)
