(footprint "RESC6432" (version 20221018) (generator pcbnew)
  (layer "F.Cu")
  (descr "Resistor SMD 6432 metric (2512 imperial)")
  (tags "resistor")
  (attr smd)
  (fp_text reference "REF**" (at 0 4.2 unlocked) (layer "F.SilkS")
      (effects (font (size 1 1) (thickness 0.15)))
    (tstamp e2ddc9ab-5a77-4199-af8b-849b164617fa)
  )
  (fp_text value "RESC6432" (at 0 -4 unlocked) (layer "F.Fab") hide
      (effects (font (size 1 1) (thickness 0.15)))
    (tstamp 51a050ec-4e07-4f93-ac76-53115c66d750)
  )
  (fp_text user "${REFERENCE}" (at 0 0 90 unlocked) (layer "F.Fab")
      (effects (font (size 1 1) (thickness 0.15)))
    (tstamp a382bc5b-0569-48c4-901a-bb769babcd86)
  )
  (fp_line (start -1 -3.2) (end 1 -3.2)
    (stroke (width 0.1) (type solid)) (layer "F.SilkS") (tstamp 2feeba18-46de-4c25-83f1-403690ea0818))
  (fp_line (start -1 3.2) (end 1 3.2)
    (stroke (width 0.1) (type solid)) (layer "F.SilkS") (tstamp 5cd6a709-aef8-473f-80ec-ead91b922189))
  (fp_line (start -2.2 -3.4) (end 2.2 -3.4)
    (stroke (width 0.05) (type solid)) (layer "F.CrtYd") (tstamp 070ac5fa-cb5c-4b4a-b2d1-9316ea3df299))
  (fp_line (start -2.2 3.4) (end -2.2 -3.4)
    (stroke (width 0.05) (type solid)) (layer "F.CrtYd") (tstamp 24c6dd5c-6dbb-4cf4-bf52-55bfcc5fcbc5))
  (fp_line (start 2.2 -3.4) (end 2.2 3.4)
    (stroke (width 0.05) (type solid)) (layer "F.CrtYd") (tstamp 1b39dc8b-14f9-40b9-a4b3-1ccc3f2c2213))
  (fp_line (start 2.2 3.4) (end -2.2 3.4)
    (stroke (width 0.05) (type solid)) (layer "F.CrtYd") (tstamp 83725639-2d7b-4bec-8e1c-39c204192e05))
  (fp_poly
    (pts
      (xy 1.6 -3.2)
      (xy 1.6 3.2)
      (xy -1.6 3.2)
      (xy -1.6 -2.95)
      (xy -1.35 -3.2)
    )

    (stroke (width 0.1) (type solid)) (fill none) (layer "F.Fab") (tstamp 657542ba-fabb-4ea8-9f9a-52099e7c908b))
  (pad "" smd roundrect (at -1.6 -2.4) (size 1 1.8) (layers "F.Paste") (roundrect_rratio 0.05) (tstamp 53f2a325-b87c-4fa3-be1a-1290ed15e796))
  (pad "" smd roundrect (at -1.6 0) (size 1 2) (layers "F.Paste") (roundrect_rratio 0.05) (tstamp 59334932-18e2-45f5-8a3f-0a2ef4cd410b))
  (pad "" smd roundrect (at -1.6 2.4) (size 1 1.8) (layers "F.Paste") (roundrect_rratio 0.05) (tstamp b739068b-b824-4f04-a1fc-00a7a939e933))
  (pad "" smd roundrect (at 1.6 -2.4) (size 1 1.8) (layers "F.Paste") (roundrect_rratio 0.05) (tstamp b688d8ab-6b23-4576-83e5-5bd5103a7425))
  (pad "" smd roundrect (at 1.6 0) (size 1 2) (layers "F.Paste") (roundrect_rratio 0.05) (tstamp 913910b0-7bb9-4e44-b1b3-296735698446))
  (pad "" smd roundrect (at 1.6 2.4) (size 1 1.8) (layers "F.Paste") (roundrect_rratio 0.05) (tstamp 36631ffe-4ec1-4175-869b-3b83bb3a646b))
  (pad "1" smd roundrect (at -1.6 0) (size 1 6.6) (layers "F.Cu" "F.Mask") (roundrect_rratio 0.05) (tstamp 400b6584-2da4-4e58-81e5-5600cadcf906))
  (pad "2" smd roundrect (at 1.6 0) (size 1 6.6) (layers "F.Cu" "F.Mask") (roundrect_rratio 0.05) (tstamp cff14c49-fc0c-4a1a-adaf-9b11ffad3494))
  (model "${KICADLIB}/model/passive/RESC6432.stp"
    (offset (xyz 0 0 0.1))
    (scale (xyz 1 1 1))
    (rotate (xyz 0 0 0))
  )
)
