(footprint "PinHeader_2x04_P2.54mm_Horizontal" (version 20210722) (generator pcbnew) (layer "F.Cu")
  (tedit 6116C8B0)
  (descr "Through hole angled pin header, 2x04, 2.54mm pitch, 6mm pin length, double rows")
  (tags "Through hole angled pin header THT 2x04 2.54mm double row")
  (attr through_hole)
  (fp_text reference "REF**" (at 5.655 -2.27) (layer "F.SilkS")
    (effects (font (size 1 1) (thickness 0.15)))
    (tstamp 2c691420-22df-4a74-a797-7f84b63eb341)
  )
  (fp_text value "PinHeader_2x04_P2.54mm_Horizontal" (at 5.655 9.89) (layer "F.Fab") hide
    (effects (font (size 1 1) (thickness 0.15)))
    (tstamp ce0e1bfc-7a74-478c-95db-ba5f5d83844f)
  )
  (fp_text user "${REFERENCE}" (at 5.31 3.81 90) (layer "F.Fab")
    (effects (font (size 1 1) (thickness 0.15)))
    (tstamp 2414849b-8639-451b-9706-029d19859b9c)
  )
  (fp_line (start 1.042929 8) (end 1.497071 8) (layer "F.SilkS") (width 0.12) (tstamp 02a98904-0f35-4438-aceb-e9488e69029a))
  (fp_line (start 1.11 0.38) (end 1.497071 0.38) (layer "F.SilkS") (width 0.12) (tstamp 045a354f-d97d-4c10-8c40-6285f10ba65b))
  (fp_line (start 6.64 -0.08) (end 12.64 -0.08) (layer "F.SilkS") (width 0.12) (tstamp 09a96aa9-2233-4cd5-abf2-9c578e209cc6))
  (fp_line (start 1.11 -0.38) (end 1.497071 -0.38) (layer "F.SilkS") (width 0.12) (tstamp 0c48207b-b753-41c9-b3de-0bbfd6b7950a))
  (fp_line (start 3.582929 4.7) (end 3.98 4.7) (layer "F.SilkS") (width 0.12) (tstamp 104d1aec-bc19-456b-ab08-86466e1ecef8))
  (fp_line (start 12.64 2.16) (end 12.64 2.92) (layer "F.SilkS") (width 0.12) (tstamp 1c63926f-2465-4bd6-89eb-11d510380f6a))
  (fp_line (start 1.042929 4.7) (end 1.497071 4.7) (layer "F.SilkS") (width 0.12) (tstamp 1fcb5c6a-2f61-4d00-97aa-07cc54852532))
  (fp_line (start 3.98 -1.33) (end 3.98 8.95) (layer "F.SilkS") (width 0.12) (tstamp 28730f7b-1b87-4662-8a2a-5d0ccad1c3da))
  (fp_line (start 3.582929 2.16) (end 3.98 2.16) (layer "F.SilkS") (width 0.12) (tstamp 2e9e25d7-392d-4bc1-8820-0a6552dcce40))
  (fp_line (start 6.64 4.7) (end 12.64 4.7) (layer "F.SilkS") (width 0.12) (tstamp 36cb6d16-2f85-4af2-bc67-83517f77c593))
  (fp_line (start 1.042929 2.16) (end 1.497071 2.16) (layer "F.SilkS") (width 0.12) (tstamp 37764c4b-a8c4-416b-ab9c-e230862fbbd1))
  (fp_line (start 6.64 -1.33) (end 3.98 -1.33) (layer "F.SilkS") (width 0.12) (tstamp 37fadf1b-7e05-4092-9aba-ef0055620d6c))
  (fp_line (start -1.27 0) (end -1.27 -1.27) (layer "F.SilkS") (width 0.12) (tstamp 4622228f-26aa-4000-93a3-8a70a0cd6787))
  (fp_line (start 12.64 5.46) (end 6.64 5.46) (layer "F.SilkS") (width 0.12) (tstamp 51e9f82a-7f52-41ee-9ec7-deb61fc4548a))
  (fp_line (start 6.64 7.24) (end 12.64 7.24) (layer "F.SilkS") (width 0.12) (tstamp 53cb7df1-97f2-4aff-b994-b97ca75c5fce))
  (fp_line (start 12.64 4.7) (end 12.64 5.46) (layer "F.SilkS") (width 0.12) (tstamp 5d1ba3bb-a857-49d8-93fb-37e75d61d9a6))
  (fp_line (start 3.98 8.95) (end 6.64 8.95) (layer "F.SilkS") (width 0.12) (tstamp 6235c051-d1e0-40c0-914d-f543c12bb0e4))
  (fp_line (start 3.582929 0.38) (end 3.98 0.38) (layer "F.SilkS") (width 0.12) (tstamp 6c4564f5-ab0f-4db7-8600-b4e675ef7ce2))
  (fp_line (start 3.582929 7.24) (end 3.98 7.24) (layer "F.SilkS") (width 0.12) (tstamp 772b730a-535e-4c8f-aca6-99331a15883e))
  (fp_line (start 12.64 7.24) (end 12.64 8) (layer "F.SilkS") (width 0.12) (tstamp 791b2be2-fe01-4150-a142-36bff46077b5))
  (fp_line (start 3.98 3.81) (end 6.64 3.81) (layer "F.SilkS") (width 0.12) (tstamp 7c8cf6ec-ada4-4d74-80b9-6486583cc16f))
  (fp_line (start 6.64 -0.2) (end 12.64 -0.2) (layer "F.SilkS") (width 0.12) (tstamp 7f856be9-bdb9-4c13-ae68-8854d0b9d4d1))
  (fp_line (start 6.64 0.16) (end 12.64 0.16) (layer "F.SilkS") (width 0.12) (tstamp 7f8fa880-fab1-49d7-8749-5612349835aa))
  (fp_line (start 3.582929 -0.38) (end 3.98 -0.38) (layer "F.SilkS") (width 0.12) (tstamp 7f950857-c3a3-4be4-b837-40d584cc72fa))
  (fp_line (start 6.64 0.28) (end 12.64 0.28) (layer "F.SilkS") (width 0.12) (tstamp 8240feed-e7ea-477f-80c8-af4819c4a159))
  (fp_line (start 6.64 -0.32) (end 12.64 -0.32) (layer "F.SilkS") (width 0.12) (tstamp 99f5fe1d-772d-471a-ad07-68d31717ce4d))
  (fp_line (start 12.64 2.92) (end 6.64 2.92) (layer "F.SilkS") (width 0.12) (tstamp 9cb7f965-77aa-42c3-acc2-ac6d4f668f19))
  (fp_line (start 12.64 -0.38) (end 12.64 0.38) (layer "F.SilkS") (width 0.12) (tstamp 9cbb5bbe-e8ea-474a-81f9-617c61991df4))
  (fp_line (start 1.042929 2.92) (end 1.497071 2.92) (layer "F.SilkS") (width 0.12) (tstamp a1d13b82-40bb-4cbd-95cb-be389b8f9c7c))
  (fp_line (start 6.64 0.04) (end 12.64 0.04) (layer "F.SilkS") (width 0.12) (tstamp a2316630-c200-4f67-a78f-adfe13c50f57))
  (fp_line (start 3.98 6.35) (end 6.64 6.35) (layer "F.SilkS") (width 0.12) (tstamp a9074b79-20f8-4185-9200-b011f6b14f2a))
  (fp_line (start 3.582929 2.92) (end 3.98 2.92) (layer "F.SilkS") (width 0.12) (tstamp ad54abd0-c19c-4e37-8f84-545593989b40))
  (fp_line (start 6.64 8.95) (end 6.64 -1.33) (layer "F.SilkS") (width 0.12) (tstamp ae25ddfe-5ec8-450b-a3be-0914d804fa28))
  (fp_line (start 3.582929 8) (end 3.98 8) (layer "F.SilkS") (width 0.12) (tstamp ae712c90-76ff-4c7e-ba2e-86e43a7037f7))
  (fp_line (start 6.64 2.16) (end 12.64 2.16) (layer "F.SilkS") (width 0.12) (tstamp c05fec99-0a2a-4f8e-b60e-5554f5f820e8))
  (fp_line (start 3.582929 5.46) (end 3.98 5.46) (layer "F.SilkS") (width 0.12) (tstamp c5575b7f-321e-452f-9c9b-910ba149aeef))
  (fp_line (start 12.64 0.38) (end 6.64 0.38) (layer "F.SilkS") (width 0.12) (tstamp c9a326a8-447a-4439-ab8c-2117a7329378))
  (fp_line (start 1.042929 5.46) (end 1.497071 5.46) (layer "F.SilkS") (width 0.12) (tstamp ca95336a-aa7c-4594-8e31-2a3dab80f236))
  (fp_line (start -1.27 -1.27) (end 0 -1.27) (layer "F.SilkS") (width 0.12) (tstamp cc65d123-389a-4ea0-ba46-c74657d317d1))
  (fp_line (start 6.64 -0.38) (end 12.64 -0.38) (layer "F.SilkS") (width 0.12) (tstamp ce506981-7791-4e70-a2c7-a3aac0e36bba))
  (fp_line (start 3.98 1.27) (end 6.64 1.27) (layer "F.SilkS") (width 0.12) (tstamp dbe94d50-136e-4248-ab49-194618906836))
  (fp_line (start 12.64 8) (end 6.64 8) (layer "F.SilkS") (width 0.12) (tstamp de047893-c42b-4b71-9901-eb612cd14770))
  (fp_line (start 1.042929 7.24) (end 1.497071 7.24) (layer "F.SilkS") (width 0.12) (tstamp fa8bc290-58b7-4b42-b711-b4833d034167))
  (fp_line (start -1.8 -1.8) (end -1.8 9.4) (layer "F.CrtYd") (width 0.05) (tstamp 51f05764-dcba-4e81-8f3f-349ecc99347e))
  (fp_line (start -1.8 9.4) (end 13.1 9.4) (layer "F.CrtYd") (width 0.05) (tstamp 548d7832-d4c7-4b6c-bc78-353afb7a993f))
  (fp_line (start 13.1 -1.8) (end -1.8 -1.8) (layer "F.CrtYd") (width 0.05) (tstamp 66e2312f-7c75-44e1-ba3b-f2b6587d7b5d))
  (fp_line (start 13.1 9.4) (end 13.1 -1.8) (layer "F.CrtYd") (width 0.05) (tstamp fa8b7294-1556-456b-a81a-0b3e4db864a9))
  (fp_line (start 6.58 4.76) (end 12.58 4.76) (layer "F.Fab") (width 0.1) (tstamp 12fca74e-8a0e-42b8-9af7-5c9745da6f0f))
  (fp_line (start -0.32 2.22) (end -0.32 2.86) (layer "F.Fab") (width 0.1) (tstamp 1322cba6-4aab-444a-8bcc-0d6436ba4b9c))
  (fp_line (start 6.58 -1.27) (end 6.58 8.89) (layer "F.Fab") (width 0.1) (tstamp 2b11b8f1-cb9c-4d32-b367-40d0ff1bbdf6))
  (fp_line (start -0.32 4.76) (end 4.04 4.76) (layer "F.Fab") (width 0.1) (tstamp 348f607d-319d-42f3-b289-d4d4458f6be4))
  (fp_line (start 6.58 -0.32) (end 12.58 -0.32) (layer "F.Fab") (width 0.1) (tstamp 3e59ba9b-c17a-41f8-ba06-70c74b058cfd))
  (fp_line (start 12.58 -0.32) (end 12.58 0.32) (layer "F.Fab") (width 0.1) (tstamp 41cb5458-44b8-4236-958b-2c235bfca32f))
  (fp_line (start -0.32 4.76) (end -0.32 5.4) (layer "F.Fab") (width 0.1) (tstamp 4d8ae128-2f0a-46c1-8d81-a34ac1209238))
  (fp_line (start 6.58 8.89) (end 4.04 8.89) (layer "F.Fab") (width 0.1) (tstamp 573826e4-0ad1-4887-a79e-2894962f43d8))
  (fp_line (start 4.04 8.89) (end 4.04 -0.635) (layer "F.Fab") (width 0.1) (tstamp 64595a98-b7a4-48bc-b0f1-a710e8e84fc7))
  (fp_line (start -0.32 7.3) (end 4.04 7.3) (layer "F.Fab") (width 0.1) (tstamp 651e8ca1-9136-4363-aa9f-4e56ed5ffa63))
  (fp_line (start 12.58 7.3) (end 12.58 7.94) (layer "F.Fab") (width 0.1) (tstamp 68efbfbf-43c1-4e58-971f-5f74ef4335c9))
  (fp_line (start 12.58 4.76) (end 12.58 5.4) (layer "F.Fab") (width 0.1) (tstamp 70c5efd2-46e9-40a3-8a77-52b6baf23097))
  (fp_line (start -0.32 2.22) (end 4.04 2.22) (layer "F.Fab") (width 0.1) (tstamp 72809dfa-6f24-40df-a68e-b8886da8ccad))
  (fp_line (start -0.32 -0.32) (end -0.32 0.32) (layer "F.Fab") (width 0.1) (tstamp 84e5c49d-b54f-4014-a69d-4e17fa518d57))
  (fp_line (start 6.58 2.86) (end 12.58 2.86) (layer "F.Fab") (width 0.1) (tstamp 8b02f459-f10c-4c7f-8c5c-37260ab4a8fd))
  (fp_line (start 12.58 2.22) (end 12.58 2.86) (layer "F.Fab") (width 0.1) (tstamp 8bd97c47-fc59-401c-863f-1af9b736dbe0))
  (fp_line (start -0.32 0.32) (end 4.04 0.32) (layer "F.Fab") (width 0.1) (tstamp 8d4744fc-91e5-4915-8d87-215c38abf9c9))
  (fp_line (start -0.32 2.86) (end 4.04 2.86) (layer "F.Fab") (width 0.1) (tstamp 8f407bf0-6755-4576-a531-5cdb01152553))
  (fp_line (start -0.32 -0.32) (end 4.04 -0.32) (layer "F.Fab") (width 0.1) (tstamp 94083255-eeaf-45d0-b8e9-9b2af619fe3a))
  (fp_line (start 6.58 0.32) (end 12.58 0.32) (layer "F.Fab") (width 0.1) (tstamp 94800779-3ace-4418-b7c5-355e805f867b))
  (fp_line (start 4.04 -0.635) (end 4.675 -1.27) (layer "F.Fab") (width 0.1) (tstamp a74d2b43-ba33-4000-8820-99d38d4e8f56))
  (fp_line (start 6.58 7.94) (end 12.58 7.94) (layer "F.Fab") (width 0.1) (tstamp a9e9227d-7645-44fe-8664-cff61a904781))
  (fp_line (start 6.58 2.22) (end 12.58 2.22) (layer "F.Fab") (width 0.1) (tstamp afc5485b-99cf-4b04-97cd-b334c4ff7aac))
  (fp_line (start 6.58 5.4) (end 12.58 5.4) (layer "F.Fab") (width 0.1) (tstamp bb1b71c1-0b38-4d73-bb59-119e90ace976))
  (fp_line (start -0.32 7.3) (end -0.32 7.94) (layer "F.Fab") (width 0.1) (tstamp d704f1cc-f776-459a-9d36-a48c90742e7a))
  (fp_line (start 6.58 7.3) (end 12.58 7.3) (layer "F.Fab") (width 0.1) (tstamp d7cb31f5-6076-4828-b292-7240b8dc3220))
  (fp_line (start -0.32 7.94) (end 4.04 7.94) (layer "F.Fab") (width 0.1) (tstamp df8d95c8-a8ac-427c-be0d-e406ef1229e2))
  (fp_line (start 4.675 -1.27) (end 6.58 -1.27) (layer "F.Fab") (width 0.1) (tstamp e97e1243-7a28-4f2f-ae2d-f22d0785dba1))
  (fp_line (start -0.32 5.4) (end 4.04 5.4) (layer "F.Fab") (width 0.1) (tstamp eeab0712-0b16-4817-b168-733a8c5e76db))
  (pad "1" thru_hole rect (at 0 0) (size 1.7 1.7) (drill 1) (layers *.Cu *.Mask) (tstamp eb18fdaf-9678-4aa3-80b0-e73f625f9efa))
  (pad "2" thru_hole oval (at 2.54 0) (size 1.7 1.7) (drill 1) (layers *.Cu *.Mask) (tstamp c0bc4522-c995-44ba-ad5d-3eaf708654a1))
  (pad "3" thru_hole oval (at 0 2.54) (size 1.7 1.7) (drill 1) (layers *.Cu *.Mask) (tstamp 07449538-86c0-471c-a2f9-4742ce13a91c))
  (pad "4" thru_hole oval (at 2.54 2.54) (size 1.7 1.7) (drill 1) (layers *.Cu *.Mask) (tstamp ee90234b-13df-4c21-8936-68d8b71b93f9))
  (pad "5" thru_hole oval (at 0 5.08) (size 1.7 1.7) (drill 1) (layers *.Cu *.Mask) (tstamp c2934d1c-c004-49a3-8ccb-5a8144627751))
  (pad "6" thru_hole oval (at 2.54 5.08) (size 1.7 1.7) (drill 1) (layers *.Cu *.Mask) (tstamp 0cf1e6b9-49a3-4ba9-b1b0-cd94097eff6e))
  (pad "7" thru_hole oval (at 0 7.62) (size 1.7 1.7) (drill 1) (layers *.Cu *.Mask) (tstamp b0acaf86-13fd-4de6-98c2-792f496460de))
  (pad "8" thru_hole oval (at 2.54 7.62) (size 1.7 1.7) (drill 1) (layers *.Cu *.Mask) (tstamp 65101af6-e6a9-4e26-8530-1e17d88565e5))
  (model "${KICADLIB}/model/connector/PinHeader_2x04_P2.54mm_Horizontal.step"
    (offset (xyz 0 0 0))
    (scale (xyz 1 1 1))
    (rotate (xyz 0 0 0))
  )
)
