(footprint "ACM1211" (version 20210424) (generator pcbnew) (layer "F.Cu")
  (tedit 60BF88BF)
  (attr through_hole)
  (fp_text reference "REF**" (at 0 5.9 unlocked) (layer "F.SilkS")
    (effects (font (size 1 1) (thickness 0.15)))
    (tstamp 41f65cea-6381-4c3c-adce-2e3a25147641)
  )
  (fp_text value "ACM1211" (at 0 5.9 unlocked) (layer "F.Fab") hide
    (effects (font (size 1 1) (thickness 0.15)))
    (tstamp d0cec3a8-f59a-454c-b2bd-a9544b9f1d99)
  )
  (fp_text user "^" (at -6.5 -4.8 180 unlocked) (layer "F.SilkS")
    (effects (font (size 1 1) (thickness 0.15)))
    (tstamp e3b1ad8e-d12d-4b7b-8f3f-72613a32791e)
  )
  (fp_text user "${REFERENCE}" (at 0 0.1 unlocked) (layer "F.Fab")
    (effects (font (size 1 1) (thickness 0.15)))
    (tstamp 73fdbb96-7c78-4b76-a0a0-02458bcd970d)
  )
  (fp_line (start -3.5 -5) (end 3.5 -5) (layer "F.SilkS") (width 0.1) (tstamp 0fe09203-bdf5-4847-98ee-3d274ffa8996))
  (fp_line (start 3.5 -5.5) (end 6 -5.5) (layer "F.SilkS") (width 0.1) (tstamp 12e0d942-1355-4d31-888e-51172b26ad61))
  (fp_line (start 3.5 -5) (end 3.5 -5.5) (layer "F.SilkS") (width 0.1) (tstamp 30670a6e-e7dc-417e-ab6e-10ab30389fe0))
  (fp_line (start -6 -4) (end -6 -5.5) (layer "F.SilkS") (width 0.1) (tstamp 3a738122-397e-4cb4-8e15-846b43205726))
  (fp_line (start -3.502998 5.511437) (end -6.002998 5.511437) (layer "F.SilkS") (width 0.1) (tstamp 4da9cffe-0c51-4133-a09d-51eaf47fd513))
  (fp_line (start 3.5 5.1) (end -3.5 5.1) (layer "F.SilkS") (width 0.1) (tstamp 67e2860b-2da6-4290-abe1-b4893190664b))
  (fp_line (start -6 -1.2) (end -6 1.2) (layer "F.SilkS") (width 0.1) (tstamp 73b3e0c8-bac8-40b1-bdc4-1e01f233c658))
  (fp_line (start -3.5 -5) (end -3.5 -5.5) (layer "F.SilkS") (width 0.1) (tstamp 7a5cd7c7-574b-4e16-8e54-21f4eb1010f7))
  (fp_line (start -6 -5.5) (end -3.5 -5.5) (layer "F.SilkS") (width 0.1) (tstamp 8f46b6af-1c33-4028-b79a-6fc88e7b3f51))
  (fp_line (start 6 5.5) (end 3.5 5.5) (layer "F.SilkS") (width 0.1) (tstamp 975930f3-3a23-4f9c-86e7-67f3adca1b91))
  (fp_line (start 6 -1.2) (end 6 1.2) (layer "F.SilkS") (width 0.1) (tstamp a03332af-f190-4ed4-af7a-744c46e68c21))
  (fp_line (start -6 5.5) (end -6 4) (layer "F.SilkS") (width 0.1) (tstamp a7c2626e-b0b9-4983-bae4-7a6ec2b5f5a7))
  (fp_line (start 6 4) (end 6 5.5) (layer "F.SilkS") (width 0.1) (tstamp adff02af-481c-483b-91c3-3ae06b92eaf8))
  (fp_line (start 3.5 5.1) (end 3.5 5.5) (layer "F.SilkS") (width 0.1) (tstamp c911404d-1b0d-431b-b31d-5b55857fd2f6))
  (fp_line (start 6 -5.5) (end 6 -4) (layer "F.SilkS") (width 0.1) (tstamp dcd0c878-e75e-481f-aa6b-66bc2a9d0f63))
  (fp_line (start -3.502998 5.111437) (end -3.502998 5.511437) (layer "F.SilkS") (width 0.1) (tstamp dd92e3d3-f843-4b00-b80a-3907926221ae))
  (fp_rect (start 7.2 -5.7) (end -7.2 5.8) (layer "F.CrtYd") (width 0.05) (fill none) (tstamp fcd88377-c7e0-4f0d-a986-33e4edc5c57b))
  (fp_line (start -3.5 -5.5) (end -5.5 -5.5) (layer "F.Fab") (width 0.1) (tstamp 1b0a67cf-b99c-4f9d-ae3f-c77b26de25c5))
  (fp_line (start -3.5 5.5) (end -3.5 5.1) (layer "F.Fab") (width 0.1) (tstamp 27d2fa09-1778-496a-ad8a-11527d2cd908))
  (fp_line (start 3.5 5.1) (end 3.5 5.5) (layer "F.Fab") (width 0.1) (tstamp 365a33b8-a9e5-4c7f-8c0a-137aea6f4c52))
  (fp_line (start 6 5.5) (end 6 -5.5) (layer "F.Fab") (width 0.1) (tstamp 37c69ca3-3036-4f47-8d00-75b6d5cb1f1c))
  (fp_line (start -3.5 -5) (end -3.5 -5.5) (layer "F.Fab") (width 0.1) (tstamp 5ddaf19d-f606-4dcd-b662-9631cc629a72))
  (fp_line (start -6 5.5) (end -3.5 5.5) (layer "F.Fab") (width 0.1) (tstamp 60a67c43-32ce-4dc7-88c4-0a18645a94ac))
  (fp_line (start -5.5 -5.5) (end -6 -5) (layer "F.Fab") (width 0.1) (tstamp 65584fe4-cd8a-4e05-a4cf-afc54a78696d))
  (fp_line (start -6 -5) (end -6 5.5) (layer "F.Fab") (width 0.1) (tstamp 68f73a75-b713-4362-8e47-b1e704bb1b0e))
  (fp_line (start 6 -5.5) (end 3.5 -5.5) (layer "F.Fab") (width 0.1) (tstamp 7b05eccc-b763-4639-a1ad-34b815b1377a))
  (fp_line (start 3.5 -5.5) (end 3.5 -5) (layer "F.Fab") (width 0.1) (tstamp 992dba20-ceba-4205-aedc-311977b958d5))
  (fp_line (start 3.5 -5) (end -3.5 -5) (layer "F.Fab") (width 0.1) (tstamp b59c2476-13a4-4c02-9822-fd6e6066c111))
  (fp_line (start -3.5 5.1) (end 3.5 5.1) (layer "F.Fab") (width 0.1) (tstamp d45b9783-81df-4cc7-9d5b-8fa59e83e372))
  (fp_line (start 3.5 5.5) (end 6 5.5) (layer "F.Fab") (width 0.1) (tstamp d869f86f-cfc6-40f1-8da1-a0be0046a2a0))
  (pad "1" smd rect (at -5.35 -2.6) (size 3.3 2.7) (layers "F.Cu" "F.Paste" "F.Mask") (tstamp 965e2a17-8fc2-4e9b-9a77-50876fa22733))
  (pad "2" smd rect (at -5.35 2.6) (size 3.3 2.7) (layers "F.Cu" "F.Paste" "F.Mask") (tstamp 968468d5-d2e1-4f81-b7f7-e251e4165594))
  (pad "3" smd rect (at 5.35 2.6) (size 3.3 2.7) (layers "F.Cu" "F.Paste" "F.Mask") (tstamp a23d8cef-9930-4a3a-8cd3-e81ba0e311ef))
  (pad "4" smd rect (at 5.35 -2.6) (size 3.3 2.7) (layers "F.Cu" "F.Paste" "F.Mask") (tstamp 1a97a00b-2371-478d-89c9-4f689c6dd64e))
  (zone (net 0) (net_name "") (layer "F.Cu") (tstamp 41c2f267-9135-4c8b-9df3-b913591edb9c) (hatch edge 0.508)
    (connect_pads (clearance 0))
    (min_thickness 0.254)
    (keepout (tracks allowed) (vias allowed) (pads allowed ) (copperpour not_allowed) (footprints allowed))
    (fill (thermal_gap 0.508) (thermal_bridge_width 0.508))
    (polygon
      (pts
        (xy 6 5.5)
        (xy -6 5.5)
        (xy -6 -5.5)
        (xy 6 -5.5)
      )
    )
  )
  (model "${KICADLIB}/model/passive/TDK_ACM1211.step"
    (offset (xyz -0.75 -1.4 -10.1))
    (scale (xyz 1 1 1))
    (rotate (xyz 0 0 90))
  )
)
