(module "PowerPAK-1212-8" (layer F.Cu) (tedit 5EBB00FB)
  (attr smd)
  (fp_text reference "REF**" (at 0 -2.6) (layer F.SilkS)
    (effects (font (size 1 1) (thickness 0.15)))
  )
  (fp_text value "PowerPAK-1212-8" (at 0 -2.7) (layer F.Fab) hide
    (effects (font (size 1 1) (thickness 0.15)))
  )
  (fp_text user "^" (at -2.7 -1 270 unlocked) (layer F.SilkS)
    (effects (font (size 1 1) (thickness 0.15)))
  )
  (fp_line (start -0.3 1.65) (end -1.65 1.65) (layer F.SilkS) (width 0.1))
  (fp_line (start 1.65 1.65) (end 0.2 1.65) (layer F.SilkS) (width 0.1))
  (fp_line (start -1.65 -1.65) (end -0.3 -1.65) (layer F.SilkS) (width 0.1))
  (fp_line (start 1.65 -1.65) (end 0.2 -1.65) (layer F.SilkS) (width 0.1))
  (fp_line (start -1.65 1.65) (end -1.65 1.2) (layer F.SilkS) (width 0.1))
  (fp_line (start 1.65 1.65) (end 1.65 1.2) (layer F.SilkS) (width 0.1))
  (fp_line (start 1.65 -1.65) (end 1.65 -1.2) (layer F.SilkS) (width 0.1))
  (fp_line (start -1.65 -1.65) (end -1.65 -1.2) (layer F.SilkS) (width 0.1))
  (fp_text user "${REFERENCE}" (at -0.05 0 unlocked) (layer F.Fab)
    (effects (font (size 0.6 0.6) (thickness 0.1)))
  )
  (fp_line (start 1.65 -1.65) (end 1.65 1.65) (layer F.Fab) (width 0.1))
  (fp_line (start 1.65 1.65) (end -1.65 1.65) (layer F.Fab) (width 0.1))
  (fp_line (start -1.65 1.65) (end -1.65 -1.2) (layer F.Fab) (width 0.1))
  (fp_line (start -1.65 -1.2) (end -1.2 -1.65) (layer F.Fab) (width 0.1))
  (fp_line (start -1.2 -1.65) (end 1.65 -1.65) (layer F.Fab) (width 0.1))
  (pad "1" smd rect (at -1.65 -0.975) (size 0.6 0.35) (layers "F.Cu" "F.Paste" "F.Mask") (tstamp c40b1e5a-4e71-4b7f-aefc-8e76d2cbaf02))
  (pad "2" smd rect (at -1.65 -0.325) (size 0.6 0.35) (layers "F.Cu" "F.Paste" "F.Mask") (tstamp f3c6d59d-12e6-4dfc-af73-d57866ba4dc9))
  (pad "3" smd rect (at -1.65 0.325) (size 0.6 0.35) (layers "F.Cu" "F.Paste" "F.Mask") (tstamp 2e130995-0845-4757-9ae3-0797e9534363))
  (pad "4" smd rect (at -1.65 0.975) (size 0.6 0.35) (layers "F.Cu" "F.Paste" "F.Mask") (tstamp 2afd0078-989a-4e79-8686-cf6039ee0d41))
  (pad "5" smd rect (at 1.65 0.975) (size 0.6 0.35) (layers "F.Cu" "F.Paste" "F.Mask") (tstamp da5f57cd-ade1-42ab-b60d-670c2c452dae))
  (pad "6" smd rect (at 1.65 0.325) (size 0.6 0.35) (layers "F.Cu" "F.Paste" "F.Mask") (tstamp fa656774-9f44-48e5-a94e-1f081bc96056))
  (pad "7" smd rect (at 1.65 -0.325) (size 0.6 0.35) (layers "F.Cu" "F.Paste" "F.Mask") (tstamp 01064d59-9661-4bac-a2b1-e524c9aef0c7))
  (pad "8" smd rect (at 1.65 -0.975) (size 0.6 0.35) (layers "F.Cu" "F.Paste" "F.Mask") (tstamp 5846a408-21f0-45f4-88ac-576043b87351))
  (pad "8" smd rect (at 0.55 0) (size 1.6 2.11) (layers "F.Cu" "F.Paste" "F.Mask") (tstamp cfc1bc75-7be8-4a92-bbe0-1b03797146e1))
  (pad "8" smd rect (at -0.05 -1.45) (size 0.4 0.8) (layers "F.Cu" "F.Paste" "F.Mask") (tstamp 4c96b4b5-d03d-4128-9d93-2610f44c2b52))
  (pad "8" smd rect (at -0.05 1.45) (size 0.4 0.8) (layers "F.Cu" "F.Paste" "F.Mask") (tstamp 9549bb7f-d5b2-4077-847f-0824824f62fc))
  (model "${KICADLIB}/model/SO/PowerPAK-1212-8-Single.step"
    (offset (xyz 0 0 0.11))
    (scale (xyz 1 1 1))
    (rotate (xyz -90 0 90))
  )
)
