(footprint "Molex_0428788410" (version 20211014) (generator pcbnew)
  (layer "F.Cu")
  (tedit 5CD86A80)
  (attr through_hole)
  (fp_text reference "REF**" (at 0 8) (layer "F.SilkS")
    (effects (font (size 1 1) (thickness 0.15)))
    (tstamp b174051e-07c4-4233-ade3-da5efcab9fa3)
  )
  (fp_text value "Molex_0428788410" (at 0 0) (layer "F.Fab") hide
    (effects (font (size 1 1) (thickness 0.15)))
    (tstamp 00b3ea01-867d-4999-86c0-b6b6ea8e7f91)
  )
  (fp_text user "^" (at 4.5 2.25 180 unlocked) (layer "B.SilkS")
    (effects (font (size 1 1) (thickness 0.15)) (justify mirror))
    (tstamp efe73ca7-daf9-4c55-abaf-43e0528ff8d3)
  )
  (fp_text user "^" (at 4.75 8 unlocked) (layer "F.SilkS")
    (effects (font (size 1 1) (thickness 0.15)))
    (tstamp 16442aa3-ca71-4b6e-99dc-82a2d26c1080)
  )
  (fp_text user "${REFERENCE}" (at 0 0 unlocked) (layer "F.Fab")
    (effects (font (size 1 1) (thickness 0.15)))
    (tstamp 679b9015-3465-4d42-96d3-c5119fb5aa7c)
  )
  (fp_line (start 7.62 6.985) (end 7.62 -8.89) (layer "F.SilkS") (width 0.1) (tstamp 28892f53-3a59-477a-b33d-a2290871d403))
  (fp_line (start 7.62 6.985) (end 3.81 6.985) (layer "F.SilkS") (width 0.1) (tstamp 52deccc6-037d-46c6-81e0-97d4b188fe8c))
  (fp_line (start 7.62 -8.89) (end -7.62 -8.89) (layer "F.SilkS") (width 0.1) (tstamp 806d1c4f-9ef4-45ea-8060-d6e1421cf5a6))
  (fp_line (start -7.62 -8.89) (end -7.62 6.985) (layer "F.SilkS") (width 0.1) (tstamp c65ab6f7-9dc7-4e91-ae1c-363a5a49b49b))
  (fp_line (start -7.62 6.985) (end -5.08 6.985) (layer "F.SilkS") (width 0.1) (tstamp e91a8a3e-e104-49f0-b6f0-5d5f305554fb))
  (fp_rect (start -8 -9.25) (end 8 7.25) (layer "F.CrtYd") (width 0.05) (fill none) (tstamp 4e174f33-616b-4d50-8271-cf447908bd6c))
  (fp_poly (pts
      (xy 7.6 3.1)
      (xy 6.9 3.8)
      (xy 7.6 4.4)
      (xy 7.6 7)
      (xy -7.6 7)
      (xy -7.6 -8.9)
      (xy 7.6 -8.9)
    ) (layer "F.Fab") (width 0.1) (fill none) (tstamp 7cb41e33-07af-455f-b674-37ab73708098))
  (pad "" thru_hole circle (at -5.715 -2.54) (size 3.2512 3.2512) (drill 3.2512) (layers *.Cu *.Mask) (tstamp 09dd184b-5fd0-487c-a4ad-dc644d6723f0))
  (pad "" thru_hole circle (at 5.715 -2.54) (size 3.2512 3.2512) (drill 3.2512) (layers *.Cu *.Mask) (tstamp 4dd9b998-5714-4ff9-aa0d-8d532be0908b))
  (pad "1" thru_hole circle (at 4.445 3.81) (size 1.4 1.4) (drill 0.9) (layers *.Cu *.Mask) (remove_unused_layers) (keep_end_layers) (tstamp 028313f8-3d7e-4182-ae5e-8ba8dbcb3be7))
  (pad "2" thru_hole circle (at 3.175 6.35) (size 1.4 1.4) (drill 0.9) (layers *.Cu *.Mask) (remove_unused_layers) (keep_end_layers) (tstamp aa27af9b-d2de-47ce-9b9f-7fec5e12006c))
  (pad "3" thru_hole circle (at 1.905 3.81) (size 1.4 1.4) (drill 0.9) (layers *.Cu *.Mask) (remove_unused_layers) (keep_end_layers) (tstamp 81ab5d08-f5ce-46f0-8160-8edd937d864c))
  (pad "4" thru_hole circle (at 0.635 6.35) (size 1.4 1.4) (drill 0.9) (layers *.Cu *.Mask) (remove_unused_layers) (keep_end_layers) (tstamp b93c7111-79db-48e9-a625-525129b2a68f))
  (pad "5" thru_hole circle (at -0.635 3.81) (size 1.4 1.4) (drill 0.9) (layers *.Cu *.Mask) (remove_unused_layers) (keep_end_layers) (tstamp 667e2f6d-d9ba-4262-8f33-f1dc6cc193d9))
  (pad "6" thru_hole circle (at -1.905 6.35) (size 1.4 1.4) (drill 0.9) (layers *.Cu *.Mask) (remove_unused_layers) (keep_end_layers) (tstamp 70eba71d-be86-40d4-80f6-dcea7382d1c5))
  (pad "7" thru_hole circle (at -3.175 3.81) (size 1.4 1.4) (drill 0.9) (layers *.Cu *.Mask) (remove_unused_layers) (keep_end_layers) (tstamp 4f91eccd-f1e8-483b-b949-6939c5033ff3))
  (pad "8" thru_hole circle (at -4.445 6.35) (size 1.4 1.4) (drill 0.9) (layers *.Cu *.Mask) (remove_unused_layers) (keep_end_layers) (tstamp f81f8488-156d-4a05-a0d3-9d1c89ee0a0a))
  (model "${KICADLIB}/model/connector/Molex_0428788410.stp"
    (offset (xyz 0 1.18 6.5))
    (scale (xyz 1 1 1))
    (rotate (xyz -90 0 90))
  )
)
