(footprint "ANT_antenova_A10340" (version 20211014) (generator pcbnew)
  (layer "F.Cu")
  (tedit 61CF4141)
  (attr smd)
  (fp_text reference "REF**" (at 0 4.75 unlocked) (layer "F.SilkS")
    (effects (font (size 1 1) (thickness 0.15)))
    (tstamp bb1363d0-cd8e-49b7-96e1-06b2b6c1070d)
  )
  (fp_text value "ANT_antenova_A10340" (at 0 -0.5 unlocked) (layer "F.Fab") hide
    (effects (font (size 1 1) (thickness 0.15)))
    (tstamp 1a8b8c54-4759-4f95-aba2-6ae17966ff82)
  )
  (fp_text user "${REFERENCE}" (at 0 0 unlocked) (layer "F.Fab")
    (effects (font (size 1 1) (thickness 0.15)))
    (tstamp fca67b54-96bc-4934-9f82-dd005a10f484)
  )
  (fp_line (start -13.5 -3.95) (end 13.5 -3.95) (layer "F.SilkS") (width 0.12) (tstamp 061f5f35-9320-4f3a-ab86-86386debdb93))
  (fp_line (start 13.5 3.95) (end -13.5 3.95) (layer "F.SilkS") (width 0.12) (tstamp 81d4865f-90df-4efe-8cb8-cbc3f84f951d))
  (fp_line (start -13.5 3.95) (end -13.5 -3.95) (layer "F.SilkS") (width 0.12) (tstamp b79e4595-b9d3-455b-972b-078bcb26ef45))
  (fp_line (start 13.5 -3.95) (end 13.5 3.95) (layer "F.SilkS") (width 0.12) (tstamp ed37f243-02fa-4423-a614-3b11c00fcfef))
  (fp_line (start 15.5 4.45) (end 15.5 -4.55) (layer "Eco1.User") (width 0.12) (tstamp 7efba98d-8d11-427d-b80d-2d5bc3404e9f))
  (fp_line (start 13.7 4.15) (end 13.7 -4.15) (layer "F.CrtYd") (width 0.12) (tstamp 11af591c-d28d-4893-aef5-a8713e84e316))
  (fp_line (start 13.7 -4.15) (end -13.65 -4.15) (layer "F.CrtYd") (width 0.12) (tstamp 7f6707c2-ea54-4df7-a21b-ed737b5137ff))
  (fp_line (start -13.65 -4.15) (end -13.65 4.15) (layer "F.CrtYd") (width 0.12) (tstamp 8dad7519-5577-48f8-9668-384bf2c9f4cb))
  (fp_line (start -13.65 4.15) (end 13.7 4.15) (layer "F.CrtYd") (width 0.12) (tstamp d4ef5d41-3d6b-484f-9e85-6a9fd47b5d8f))
  (fp_line (start -13.5 3.95) (end -13.5 -3.95) (layer "F.Fab") (width 0.1) (tstamp 071086fb-183d-4f7a-9d4c-9813f50be6ac))
  (fp_line (start 13.5 0.5) (end 13.5 3.95) (layer "F.Fab") (width 0.1) (tstamp 2e81e593-80f5-45d1-8f6e-392720515eba))
  (fp_line (start 13.5 -0.5) (end 13 0) (layer "F.Fab") (width 0.1) (tstamp 5286ad59-2b3a-4148-ab62-f5164ec5943e))
  (fp_line (start 13 0) (end 13.5 0.5) (layer "F.Fab") (width 0.1) (tstamp 995e01e1-f0e9-407c-ad20-c3af602a65bc))
  (fp_line (start 13.5 -3.95) (end 13.5 -0.5) (layer "F.Fab") (width 0.1) (tstamp ab64cacb-591f-4c4a-a30d-ead46bd91506))
  (fp_line (start -13.5 -3.95) (end 13.5 -3.95) (layer "F.Fab") (width 0.1) (tstamp c638f76f-0f66-411a-b38b-3a7641040320))
  (fp_line (start 13.5 3.95) (end -13.5 3.95) (layer "F.Fab") (width 0.1) (tstamp e16a87ba-ac5d-448e-a008-78318d5e6af3))
  (pad "1" smd rect (at 12.75 0 90) (size 2.5 1) (layers "F.Cu" "F.Paste" "F.Mask") (tstamp 04e0d62f-bc17-436c-becd-f10c9ea41b46))
  (pad "2" smd rect (at 0.2 -3 90) (size 1.5 1.5) (layers "F.Cu" "F.Paste" "F.Mask") (tstamp 30d014e0-7437-444f-a9fd-c92678da426a))
  (pad "2" smd rect (at -12.55 3 90) (size 1.5 1.5) (layers "F.Cu" "F.Paste" "F.Mask") (tstamp 5d6edf4f-0aed-4025-a51a-605d023a49b6))
  (pad "2" smd rect (at 0.2 3 90) (size 1.5 1.5) (layers "F.Cu" "F.Paste" "F.Mask") (tstamp d2d75b82-7bbf-4a4a-aa46-8310d63ebc32))
  (pad "2" smd rect (at -12.55 -3 90) (size 1.5 1.5) (layers "F.Cu" "F.Paste" "F.Mask") (tstamp fe74f04f-02a4-4739-8da4-dd97ea4aaffd))
  (model "${KICADLIB}/model/RF/antenova_A10340.step"
    (offset (xyz -157.9 137.35 3.3))
    (scale (xyz 1 1 1))
    (rotate (xyz 0 0 90))
  )
)
