(footprint "SOIC127P600X150-8" (version 20221018) (generator pcbnew)
  (layer "F.Cu")
  (descr "SOIC 1.27mm pitch 3.9x4.9mm body 8pin")
  (attr smd)
  (fp_text reference "REF**" (at -3.23 0 90) (layer "F.SilkS")
      (effects (font (size 1 1) (thickness 0.15)))
    (tstamp 93fa9e84-3463-45dc-aba7-8d3d7a205019)
  )
  (fp_text value "SOIC127P600X150-8" (at 0.01 -4.47) (layer "F.Fab") hide
      (effects (font (size 1 1) (thickness 0.15)))
    (tstamp 3f7c41fc-352c-47cc-aca2-b6331f501daa)
  )
  (fp_text user "^" (at -2.95 3.35 270 unlocked) (layer "F.SilkS")
      (effects (font (size 1 1) (thickness 0.15)))
    (tstamp e29e55b0-37d7-49de-8500-fda938849b2b)
  )
  (fp_text user "${REFERENCE}" (at 0 0 unlocked) (layer "F.Fab")
      (effects (font (size 1 1) (thickness 0.15)))
    (tstamp 5dbb6648-13ac-4aa8-ab49-3bc5c2d67ed9)
  )
  (fp_line (start -2.45 -1.95) (end -2.3 -1.95)
    (stroke (width 0.1) (type solid)) (layer "F.SilkS") (tstamp 2a636d50-e905-444e-957f-583271688d88))
  (fp_line (start -2.45 1.95) (end -2.45 -1.95)
    (stroke (width 0.1) (type solid)) (layer "F.SilkS") (tstamp 3fb63695-7bb2-4dbc-975e-55a2447c21a1))
  (fp_line (start -2.45 1.95) (end -2.3 1.95)
    (stroke (width 0.1) (type solid)) (layer "F.SilkS") (tstamp b6b17843-c9f6-436a-9ffa-4ceb27069f84))
  (fp_line (start -1.52 -1.95) (end -1.02 -1.95)
    (stroke (width 0.1) (type solid)) (layer "F.SilkS") (tstamp 68270e3c-4b81-4934-9c54-252947ddb157))
  (fp_line (start -1.52 1.95) (end -1.02 1.95)
    (stroke (width 0.1) (type solid)) (layer "F.SilkS") (tstamp c31a4da3-005a-4930-b2e6-91f5b24efc13))
  (fp_line (start -0.25 -1.95) (end 0.25 -1.95)
    (stroke (width 0.1) (type solid)) (layer "F.SilkS") (tstamp 99a4a267-d633-4ebe-9fd7-4903527b1f6e))
  (fp_line (start -0.25 1.95) (end 0.25 1.95)
    (stroke (width 0.1) (type solid)) (layer "F.SilkS") (tstamp 9bff30b5-5082-4479-a3ee-20ce846fd4a1))
  (fp_line (start 1.02 -1.95) (end 1.52 -1.95)
    (stroke (width 0.1) (type solid)) (layer "F.SilkS") (tstamp 46b6fbe9-d981-426d-b870-2735fdf6c1ba))
  (fp_line (start 1.02 1.95) (end 1.52 1.95)
    (stroke (width 0.1) (type solid)) (layer "F.SilkS") (tstamp 7a584457-6765-463f-b60e-b9d41ab6c3d1))
  (fp_line (start 2.45 -1.95) (end 2.3 -1.95)
    (stroke (width 0.1) (type solid)) (layer "F.SilkS") (tstamp d33d894f-ca42-4be8-8e1c-91629177e2d6))
  (fp_line (start 2.45 -1.95) (end 2.45 1.95)
    (stroke (width 0.1) (type solid)) (layer "F.SilkS") (tstamp cbbcfc24-e4c3-4376-a6e5-5391523313f0))
  (fp_line (start 2.45 1.95) (end 2.3 1.95)
    (stroke (width 0.1) (type solid)) (layer "F.SilkS") (tstamp 6c7c49bc-a88b-449c-8314-89db478dfa9a))
  (fp_rect (start -2.65 -3.8) (end 2.65 3.8)
    (stroke (width 0.05) (type default)) (fill none) (layer "F.CrtYd") (tstamp a0717048-4516-4a7e-8189-2b5bf492987f))
  (fp_poly
    (pts
      (xy 2.45 1.95)
      (xy 2.45 -1.95)
      (xy -2.45 -1.95)
      (xy -2.45 1.45)
      (xy -1.95 1.95)
    )

    (stroke (width 0.1) (type solid)) (fill none) (layer "F.Fab") (tstamp 2b2c9c5d-c814-446e-afef-67d633fed0a4))
  (pad "1" smd roundrect (at -1.905 2.8) (size 0.6 1.8) (layers "F.Cu" "F.Paste" "F.Mask") (roundrect_rratio 0.08333333333) (tstamp a3fb3697-8799-41b4-8a99-4d0d35d8db65))
  (pad "2" smd roundrect (at -0.635 2.8) (size 0.6 1.8) (layers "F.Cu" "F.Paste" "F.Mask") (roundrect_rratio 0.08333333333) (tstamp b26e22a2-6497-4de4-a485-19e9e70cd536))
  (pad "3" smd roundrect (at 0.635 2.8) (size 0.6 1.8) (layers "F.Cu" "F.Paste" "F.Mask") (roundrect_rratio 0.08333333333) (tstamp cf6a0624-d4eb-4480-81d3-b3c42cbc019a))
  (pad "4" smd roundrect (at 1.905 2.8) (size 0.6 1.8) (layers "F.Cu" "F.Paste" "F.Mask") (roundrect_rratio 0.08333333333) (tstamp ddd27236-2b89-4bf7-892a-3907902883f7))
  (pad "5" smd roundrect (at 1.905 -2.8) (size 0.6 1.8) (layers "F.Cu" "F.Paste" "F.Mask") (roundrect_rratio 0.08333333333) (tstamp f1642d2e-70c7-4a69-b878-bf56dc1a2ca7))
  (pad "6" smd roundrect (at 0.635 -2.8) (size 0.6 1.8) (layers "F.Cu" "F.Paste" "F.Mask") (roundrect_rratio 0.08333333333) (tstamp 1c5f4251-1f93-4f5a-989d-d20ace7abaef))
  (pad "7" smd roundrect (at -0.635 -2.8) (size 0.6 1.8) (layers "F.Cu" "F.Paste" "F.Mask") (roundrect_rratio 0.08333333333) (tstamp 8dc50212-4c52-4eb1-9fbb-d3dbe4862cc0))
  (pad "8" smd roundrect (at -1.905 -2.8) (size 0.6 1.8) (layers "F.Cu" "F.Paste" "F.Mask") (roundrect_rratio 0.08333333333) (tstamp 40c43b20-e76e-4e76-8042-987e867c910b))
  (model "${KICADLIB}/model/SO/SOIC127P600X150-8.step"
    (offset (xyz 0 0 0))
    (scale (xyz 1 1 1))
    (rotate (xyz 0 0 -90))
  )
  (model "${KICADLIB}/model/SO/SOIC127P528X150-8.step" hide
    (offset (xyz 0 0 0))
    (scale (xyz 1 1 1))
    (rotate (xyz 0 0 -90))
  )
)
