(footprint "CNCTech_3221-20-0300-00" (version 20221018) (generator pcbnew)
  (layer "F.Cu")
  (attr smd)
  (fp_text reference "REF**" (at 0 -3.78 unlocked) (layer "F.SilkS")
      (effects (font (size 1 1) (thickness 0.15)))
    (tstamp 76d13809-795d-42fb-8a09-3bd94fc9d2eb)
  )
  (fp_text value "CNCTech_3221-20-0300-00" (at 0 1 unlocked) (layer "F.Fab") hide
      (effects (font (size 1 1) (thickness 0.15)))
    (tstamp 337cd80b-854b-4475-aa16-c60307fb7a74)
  )
  (fp_text user "^" (at -5.7 3.87 unlocked) (layer "F.SilkS")
      (effects (font (size 1 1) (thickness 0.15)))
    (tstamp f00fc3df-8d7d-47bc-8c59-1e819bb77860)
  )
  (fp_text user "${REFERENCE}" (at 0 0 unlocked) (layer "F.Fab")
      (effects (font (size 1 1) (thickness 0.15)))
    (tstamp 5c42e475-8b90-4206-9613-f66a396cac31)
  )
  (fp_line (start -9.53 -2.5) (end -9.53 2.5)
    (stroke (width 0.1) (type solid)) (layer "F.SilkS") (tstamp 1a36c6d6-d7da-4c2c-ab24-e45f9906405d))
  (fp_line (start -9.53 2.5) (end -6.13 2.5)
    (stroke (width 0.1) (type solid)) (layer "F.SilkS") (tstamp 8db16aed-1790-4c8a-96b4-75f10d32b246))
  (fp_line (start -6.13 -2.5) (end -9.53 -2.5)
    (stroke (width 0.1) (type solid)) (layer "F.SilkS") (tstamp 5a76a22b-7d92-4214-9882-0b2dca6489ab))
  (fp_line (start 6.13 2.5) (end 9.53 2.5)
    (stroke (width 0.1) (type solid)) (layer "F.SilkS") (tstamp efbd7e93-c352-4a01-a11b-26d070424c7f))
  (fp_line (start 9.53 -2.5) (end 6.13 -2.5)
    (stroke (width 0.1) (type solid)) (layer "F.SilkS") (tstamp b4df625f-072e-4704-980f-797ce8e7f0df))
  (fp_line (start 9.53 2.5) (end 9.53 -2.5)
    (stroke (width 0.1) (type solid)) (layer "F.SilkS") (tstamp 9e8e30be-83fe-4169-b1e9-b3e1e3dee5f3))
  (fp_rect (start -9.67 -3.3) (end 9.7 3.31)
    (stroke (width 0.05) (type solid)) (fill none) (layer "F.CrtYd") (tstamp 56421731-7c05-4153-99e2-a143b479a0a3))
  (fp_line (start -9.525 -2.5) (end -9.525 1.5)
    (stroke (width 0.1) (type solid)) (layer "F.Fab") (tstamp 6f5f5a8f-b702-4800-b251-69fc749a219f))
  (fp_line (start -9.525 -2.5) (end 9.53 -2.5)
    (stroke (width 0.1) (type solid)) (layer "F.Fab") (tstamp 31f0e2c7-5454-48de-910d-007cdd34c7ba))
  (fp_line (start -8.525 2.5) (end -9.525 1.5)
    (stroke (width 0.1) (type solid)) (layer "F.Fab") (tstamp 5edefcd3-3cf4-48a4-a88a-ffa0f02ee05b))
  (fp_line (start 9.53 -2.5) (end 9.53 2.5)
    (stroke (width 0.1) (type solid)) (layer "F.Fab") (tstamp a1c18ea9-65d9-4153-a3c1-c00473fe246e))
  (fp_line (start 9.53 2.5) (end -8.525 2.5)
    (stroke (width 0.1) (type solid)) (layer "F.Fab") (tstamp 77496538-4f5e-41a0-b0e3-a912ec0d19a5))
  (pad "1" smd roundrect (at -5.71 1.88) (size 0.65 2.5) (layers "F.Cu" "F.Paste" "F.Mask") (roundrect_rratio 0.07692307692) (tstamp 84ef28c1-8d08-4000-b34c-d7cad4e4abaa))
  (pad "2" smd roundrect (at -5.71 -1.9) (size 0.65 2.5) (layers "F.Cu" "F.Paste" "F.Mask") (roundrect_rratio 0.07692307692) (tstamp 5715f28d-fd0f-454d-bf64-77669b8cceb0))
  (pad "3" smd roundrect (at -4.44 1.88) (size 0.65 2.5) (layers "F.Cu" "F.Paste" "F.Mask") (roundrect_rratio 0.07692307692) (tstamp ac3a8e76-0a5c-4689-8d5b-b4cacdee18f5))
  (pad "4" smd roundrect (at -4.44 -1.9) (size 0.65 2.5) (layers "F.Cu" "F.Paste" "F.Mask") (roundrect_rratio 0.07692307692) (tstamp c79828d4-bf2d-40ea-9c52-0090e4953b65))
  (pad "5" smd roundrect (at -3.17 1.88) (size 0.65 2.5) (layers "F.Cu" "F.Paste" "F.Mask") (roundrect_rratio 0.07692307692) (tstamp 5cec5ff8-1526-4ed9-a109-7c6bebd66cd5))
  (pad "6" smd roundrect (at -3.17 -1.9) (size 0.65 2.5) (layers "F.Cu" "F.Paste" "F.Mask") (roundrect_rratio 0.07692307692) (tstamp 355230e5-05cc-43c0-8909-3d56f5f91ade))
  (pad "7" smd roundrect (at -1.9 1.88) (size 0.65 2.5) (layers "F.Cu" "F.Paste" "F.Mask") (roundrect_rratio 0.07692307692) (tstamp f10b78d2-d0bf-4de5-9a79-4c096a3fb27a))
  (pad "8" smd roundrect (at -1.9 -1.9) (size 0.65 2.5) (layers "F.Cu" "F.Paste" "F.Mask") (roundrect_rratio 0.07692307692) (tstamp a0ce643c-3b09-4937-a03c-b3a36e7e4133))
  (pad "9" smd roundrect (at -0.63 1.88) (size 0.65 2.5) (layers "F.Cu" "F.Paste" "F.Mask") (roundrect_rratio 0.07692307692) (tstamp e206d2ae-dd8c-4091-8d63-932d3ff4c26c))
  (pad "10" smd roundrect (at -0.63 -1.9) (size 0.65 2.5) (layers "F.Cu" "F.Paste" "F.Mask") (roundrect_rratio 0.07692307692) (tstamp fbf12fc7-8e45-49e1-b51e-e5424d120072))
  (pad "11" smd roundrect (at 0.64 1.88) (size 0.65 2.5) (layers "F.Cu" "F.Paste" "F.Mask") (roundrect_rratio 0.07692307692) (tstamp 9ef9e87a-e70e-4b54-899b-e9a85afe4f3c))
  (pad "12" smd roundrect (at 0.64 -1.9) (size 0.65 2.5) (layers "F.Cu" "F.Paste" "F.Mask") (roundrect_rratio 0.07692307692) (tstamp 0d08c649-db6e-4cd6-9e78-a56f3915ac8e))
  (pad "13" smd roundrect (at 1.91 1.88) (size 0.65 2.5) (layers "F.Cu" "F.Paste" "F.Mask") (roundrect_rratio 0.07692307692) (tstamp 31c904b5-7be0-4b6a-a250-f0fea3e512f9))
  (pad "14" smd roundrect (at 1.91 -1.9) (size 0.65 2.5) (layers "F.Cu" "F.Paste" "F.Mask") (roundrect_rratio 0.07692307692) (tstamp ebcc638c-183e-453e-a3a7-d80f8c5b531f))
  (pad "15" smd roundrect (at 3.18 1.88) (size 0.65 2.5) (layers "F.Cu" "F.Paste" "F.Mask") (roundrect_rratio 0.07692307692) (tstamp 0a52933d-a264-4053-a659-118084e220e6))
  (pad "16" smd roundrect (at 3.18 -1.9) (size 0.65 2.5) (layers "F.Cu" "F.Paste" "F.Mask") (roundrect_rratio 0.07692307692) (tstamp 58bf7423-fac1-43ee-9d9b-aa70990c73db))
  (pad "17" smd roundrect (at 4.45 1.88) (size 0.65 2.5) (layers "F.Cu" "F.Paste" "F.Mask") (roundrect_rratio 0.07692307692) (tstamp 18842ec2-6c34-4f57-966b-7ea6f30a21fb))
  (pad "18" smd roundrect (at 4.45 -1.9) (size 0.65 2.5) (layers "F.Cu" "F.Paste" "F.Mask") (roundrect_rratio 0.07692307692) (tstamp 9fe217b6-520c-490b-9900-edcdc972493f))
  (pad "19" smd roundrect (at 5.72 1.88) (size 0.65 2.5) (layers "F.Cu" "F.Paste" "F.Mask") (roundrect_rratio 0.07692307692) (tstamp 2ae4ca65-00a9-418c-b45e-adf8295f843d))
  (pad "20" smd roundrect (at 5.72 -1.9) (size 0.65 2.5) (layers "F.Cu" "F.Paste" "F.Mask") (roundrect_rratio 0.07692307692) (tstamp 404cc440-04f2-44cb-b1d2-cf9baf5f8cef))
  (model "${KICADLIB}/model/connector/CNCTech_3221-20-0300-00.step"
    (offset (xyz -0.25 -0.1 2.6))
    (scale (xyz 1 1 1))
    (rotate (xyz 180 0 -90))
  )
  (model "${KICADLIB}/model/connector/CNCTech_3230-20-0103-00.step"
    (offset (xyz -4.25 0 13.65))
    (scale (xyz 1 1 1))
    (rotate (xyz 180 0 0))
  )
)
