(footprint "Amphenol_SFW15R-1STE1LF" (version 20211014) (generator pcbnew)
  (layer "F.Cu")
  (tedit 63DC110D)
  (attr smd)
  (fp_text reference "REF**" (at 0 -2.45) (layer "F.SilkS")
    (effects (font (size 1 1) (thickness 0.15)))
    (tstamp 39f54f16-64ea-46bd-891e-d348036efa62)
  )
  (fp_text value "AMPHENOL_SFW15R-1STE1LF" (at 0.025 7.375) (layer "F.Fab") hide
    (effects (font (size 1 1) (thickness 0.15)))
    (tstamp 86506f8d-4688-4342-b586-82d8e01f84e8)
  )
  (fp_text user "^" (at -7.025 -2.05 180 unlocked) (layer "F.SilkS")
    (effects (font (size 1 1) (thickness 0.15)))
    (tstamp ff16cf36-5668-43f0-aac9-aacb9ae6561b)
  )
  (fp_text user "${REFERENCE}" (at 0 3.65 unlocked) (layer "F.Fab")
    (effects (font (size 1 1) (thickness 0.15)))
    (tstamp c31d763d-e594-474d-9e53-e40ab9a3bf54)
  )
  (fp_line (start -10.4 4.8) (end -9.8 4.8) (layer "F.SilkS") (width 0.1) (tstamp 15e623ae-f8b3-429e-8d9c-855d07b8fe07))
  (fp_line (start -10.4 6) (end -10.4 4.8) (layer "F.SilkS") (width 0.1) (tstamp 716df457-ca47-46e7-89c4-aa788cfd51aa))
  (fp_line (start 9.8 0.5) (end 8.946 0.5) (layer "F.SilkS") (width 0.1) (tstamp 865effd3-d1de-4ebd-95b2-da900445ecfc))
  (fp_line (start -9.8 4.8) (end -9.8 0.5) (layer "F.SilkS") (width 0.1) (tstamp ccb0f543-76fb-4cb6-8707-fbdf1ea902f2))
  (fp_line (start 9.8 0.5) (end 9.8 4.8) (layer "F.SilkS") (width 0.1) (tstamp d96d99cf-8dfb-401e-8385-3605e8c18e0e))
  (fp_line (start 9.8 4.8) (end 10.4 4.8) (layer "F.SilkS") (width 0.1) (tstamp e50ea64c-0d8e-43f0-9aab-272306e6ac67))
  (fp_line (start -9.8 0.5) (end -8.946 0.5) (layer "F.SilkS") (width 0.1) (tstamp f59ad2f5-be03-420b-820b-62ac2990893a))
  (fp_line (start 10.4 4.8) (end 10.4 6) (layer "F.SilkS") (width 0.1) (tstamp fc76721f-a1fd-4ac0-b796-7d83b47cae2c))
  (fp_line (start 10.4 6) (end -10.4 6) (layer "F.SilkS") (width 0.1) (tstamp feee13a8-851e-4a0d-a763-471f3d4dc001))
  (fp_line (start 10.65 6.25) (end -10.65 6.25) (layer "F.CrtYd") (width 0.05) (tstamp 33cf283c-8eb6-4584-9138-3afaee37fa50))
  (fp_line (start -10.65 6.25) (end -10.65 4.55) (layer "F.CrtYd") (width 0.05) (tstamp 76d54887-c6d5-4080-9335-1f1006dd3df2))
  (fp_line (start -10.65 4.55) (end -10.65 -1.25) (layer "F.CrtYd") (width 0.05) (tstamp 787d24f8-741c-487b-8872-6870fa98c5b3))
  (fp_line (start -10.65 -1.25) (end 10.65 -1.25) (layer "F.CrtYd") (width 0.05) (tstamp 9e3611fb-c608-486c-bd4d-0a7508669868))
  (fp_line (start 10.65 -1.25) (end 10.65 6.25) (layer "F.CrtYd") (width 0.05) (tstamp cc847e75-9218-4879-b06c-bfbeccb2d633))
  (fp_line (start -10.4 4.8) (end -9.8 4.8) (layer "F.Fab") (width 0.1) (tstamp 8e2da9f6-c263-4c2a-bdd6-2a5c82d35db5))
  (fp_line (start 10.4 4.8) (end 10.4 6) (layer "F.Fab") (width 0.1) (tstamp af983160-31a6-4250-b28f-b7bba5a7b5f4))
  (fp_line (start 9.8 4.8) (end 10.4 4.8) (layer "F.Fab") (width 0.1) (tstamp b186a949-b58a-444e-9961-453eef011260))
  (fp_line (start -9.8 4.8) (end -9.8 0.5) (layer "F.Fab") (width 0.1) (tstamp b49123c4-7855-4619-a6d5-708bc52d0f4d))
  (fp_line (start 10.4 6) (end -10.4 6) (layer "F.Fab") (width 0.1) (tstamp c91d96bb-0c5c-4173-ac02-d99d76eca90f))
  (fp_line (start -10.4 6) (end -10.4 4.8) (layer "F.Fab") (width 0.1) (tstamp cf81d360-0475-4a07-a52b-87d403e22504))
  (fp_line (start 9.8 0.5) (end 9.8 4.8) (layer "F.Fab") (width 0.1) (tstamp f33221e5-d6f8-415b-afae-57e0deea55e7))
  (fp_line (start -9.8 0.5) (end 9.8 0.5) (layer "F.Fab") (width 0.1) (tstamp f3396c30-2126-4661-a874-153bf925b33e))
  (pad "1" smd rect (at -7 0) (size 0.6 2) (layers "F.Cu" "F.Paste" "F.Mask") (tstamp 975d1f2b-d6ef-4465-b0b0-a4ff500baf68))
  (pad "2" smd rect (at -6 0) (size 0.6 2) (layers "F.Cu" "F.Paste" "F.Mask") (tstamp ae92a845-705c-4d8d-a80a-4f49dd7ba6bf))
  (pad "3" smd rect (at -5 0) (size 0.6 2) (layers "F.Cu" "F.Paste" "F.Mask") (tstamp e993768c-2ff5-4bb0-bdc1-e67c2c8f87bd))
  (pad "4" smd rect (at -4 0) (size 0.6 2) (layers "F.Cu" "F.Paste" "F.Mask") (tstamp a17ab2eb-2db5-4ec9-abf0-22158b5a0f29))
  (pad "5" smd rect (at -3 0) (size 0.6 2) (layers "F.Cu" "F.Paste" "F.Mask") (tstamp ced4392c-4331-46af-853c-17e6a1b749e5))
  (pad "6" smd rect (at -2 0) (size 0.6 2) (layers "F.Cu" "F.Paste" "F.Mask") (tstamp 8a47bbb2-66ff-4656-a003-243bbb8096e1))
  (pad "7" smd rect (at -1 0) (size 0.6 2) (layers "F.Cu" "F.Paste" "F.Mask") (tstamp 6e9b0fc4-9d4d-41c1-9159-393284cf558e))
  (pad "8" smd rect (at 0 0) (size 0.6 2) (layers "F.Cu" "F.Paste" "F.Mask") (tstamp 4671ab20-7870-43d8-8da0-48f797378989))
  (pad "9" smd rect (at 1 0) (size 0.6 2) (layers "F.Cu" "F.Paste" "F.Mask") (tstamp 79e0fa76-7af2-46ee-9728-4e9bb02ba955))
  (pad "10" smd rect (at 2 0) (size 0.6 2) (layers "F.Cu" "F.Paste" "F.Mask") (tstamp 3b8597a5-136d-4cbb-bbdb-26c918eb50d5))
  (pad "11" smd rect (at 3 0) (size 0.6 2) (layers "F.Cu" "F.Paste" "F.Mask") (tstamp 87f551e4-1607-4223-8a47-7249b81cea46))
  (pad "12" smd rect (at 4 0) (size 0.6 2) (layers "F.Cu" "F.Paste" "F.Mask") (tstamp 9bcd1a06-0735-4fea-b202-8d3cb5b498d9))
  (pad "13" smd rect (at 5 0) (size 0.6 2) (layers "F.Cu" "F.Paste" "F.Mask") (tstamp 93668029-fe67-4dd0-a8be-9209b88e88bb))
  (pad "14" smd rect (at 6 0) (size 0.6 2) (layers "F.Cu" "F.Paste" "F.Mask") (tstamp c9fd73bb-7dd3-428f-ae3c-bb4a1f73d8a6))
  (pad "15" smd rect (at 7 0) (size 0.6 2) (layers "F.Cu" "F.Paste" "F.Mask") (tstamp 3b640ce6-0c18-416a-82ac-5ecbf9ae173a))
  (pad "S1" smd rect (at -8 2.1) (size 0.7 4.2) (layers "F.Cu" "F.Paste" "F.Mask") (tstamp 5f679aee-83b6-4ced-ac93-e5a7223e596b))
  (pad "S2" smd rect (at 8 2.1) (size 0.7 4.2) (layers "F.Cu" "F.Paste" "F.Mask") (tstamp 6829082f-2cd6-4094-b9af-5e2e621f12ce))
  (model "${KICADLIB}/model/connector/Amphenol_SFW15R-1STE1LF.step"
    (offset (xyz 17.3 -6 2.5))
    (scale (xyz 1 1 1))
    (rotate (xyz 90 0 180))
  )
)
