ISO-10303-21;
HEADER;
FILE_DESCRIPTION (( 'STEP AP203' ),
    '1' );
FILE_NAME ('LFB012CTP.STEP',
    '2016-05-31T22:27:43',
    ( '' ),
    ( '' ),
    'SwSTEP 2.0',
    'SolidWorks 2014',
    '' );
FILE_SCHEMA (( 'CONFIG_CONTROL_DESIGN' ));
ENDSEC;

DATA;
#1 = ADVANCED_FACE ( 'NONE', ( #63, #364 ), #130, .T. ) ;
#2 = CYLINDRICAL_SURFACE ( 'NONE', #405, 0.06500000000000000200 ) ;
#3 = CC_DESIGN_PERSON_AND_ORGANIZATION_ASSIGNMENT ( #110, #263, ( #383 ) ) ;
#4 = DIRECTION ( 'NONE',  ( -1.000000000000000000, -0.0000000000000000000, -0.0000000000000000000 ) ) ;
#5 =( GEOMETRIC_REPRESENTATION_CONTEXT ( 3 ) GLOBAL_UNCERTAINTY_ASSIGNED_CONTEXT ( ( #357 ) ) GLOBAL_UNIT_ASSIGNED_CONTEXT ( ( #127, #333, #93 ) ) REPRESENTATION_CONTEXT ( 'NONE', 'WORKASPACE' ) );
#6 = ORIENTED_EDGE ( 'NONE', *, *, #159, .T. ) ;
#7 = CYLINDRICAL_SURFACE ( 'NONE', #319, 0.06099999999999999200 ) ;
#8 = CARTESIAN_POINT ( 'NONE',  ( 0.0000000000000000000, 0.0000000000000000000, 0.06500000000000000200 ) ) ;
#9 = AXIS2_PLACEMENT_3D ( 'NONE', #160, #313, #311 ) ;
#10 = DIRECTION ( 'NONE',  ( -1.000000000000000000, -0.0000000000000000000, -0.0000000000000000000 ) ) ;
#11 = CARTESIAN_POINT ( 'NONE',  ( 0.01499999999999999400, 0.0000000000000000000, 0.0000000000000000000 ) ) ;
#12 = PERSON_AND_ORGANIZATION_ROLE ( 'design_supplier' ) ;
#13 = APPLICATION_CONTEXT ( 'configuration controlled 3d designs of mechanical parts and assemblies' ) ;
#14 = VERTEX_POINT ( 'NONE', #239 ) ;
#15 = DIRECTION ( 'NONE',  ( 0.0000000000000000000, 0.0000000000000000000, -1.000000000000000000 ) ) ;
#16 = AXIS2_PLACEMENT_3D ( 'NONE', #434, #370, #26 ) ;
#17 = SPHERICAL_SURFACE ( 'NONE', #430, 0.1483333333333333400 ) ;
#18 = CARTESIAN_POINT ( 'NONE',  ( 0.0000000000000000000, 6.858022075225178200E-018, -0.05600000000000000800 ) ) ;
#19 = AXIS2_PLACEMENT_3D ( 'NONE', #302, #177, #341 ) ;
#20 = DIRECTION ( 'NONE',  ( -0.0000000000000000000, 0.0000000000000000000, -1.000000000000000000 ) ) ;
#21 = VECTOR ( 'NONE', #301, 39.37007874015748100 ) ;
#22 = AXIS2_PLACEMENT_3D ( 'NONE', #69, #201, #136 ) ;
#23 = LOCAL_TIME ( 15, 27, 43.00000000000000000, #121 ) ;
#24 = DIRECTION ( 'NONE',  ( 0.0000000000000000000, 0.0000000000000000000, 1.000000000000000000 ) ) ;
#25 = AXIS2_PLACEMENT_3D ( 'NONE', #65, #400, #100 ) ;
#26 = DIRECTION ( 'NONE',  ( 0.0000000000000000000, 0.0000000000000000000, -1.000000000000000000 ) ) ;
#27 = ORIENTED_EDGE ( 'NONE', *, *, #148, .F. ) ;
#28 = ORIENTED_EDGE ( 'NONE', *, *, #196, .T. ) ;
#29 = CIRCLE ( 'NONE', #284, 0.05100000000000001100 ) ;
#30 = DIRECTION ( 'NONE',  ( 0.0000000000000000000, 0.0000000000000000000, 1.000000000000000000 ) ) ;
#31 = PRODUCT_DEFINITION ( 'UNKNOWN', '', #383, #258 ) ;
#32 = ORIENTED_EDGE ( 'NONE', *, *, #150, .T. ) ;
#33 = DIRECTION ( 'NONE',  ( -1.000000000000000000, -0.0000000000000000000, -0.0000000000000000000 ) ) ;
#34 = LINE ( 'NONE', #268, #286 ) ;
#35 = AXIS2_PLACEMENT_3D ( 'NONE', #118, #269, #202 ) ;
#36 = EDGE_LOOP ( 'NONE', ( #82, #359, #335 ) ) ;
#37 = CARTESIAN_POINT ( 'NONE',  ( -0.06500000000000000200, 0.0000000000000000000, -0.06099999999999999200 ) ) ;
#38 = AXIS2_PLACEMENT_3D ( 'NONE', #396, #205, #24 ) ;
#39 = CALENDAR_DATE ( 2016, 31, 5 ) ;
#40 = CARTESIAN_POINT ( 'NONE',  ( 0.0000000000000000000, 0.0000000000000000000, 0.0000000000000000000 ) ) ;
#41 = ORIENTED_EDGE ( 'NONE', *, *, #120, .T. ) ;
#42 = CARTESIAN_POINT ( 'NONE',  ( -0.06500000000000000200, 0.0000000000000000000, -0.06100000000000001300 ) ) ;
#43 = ORIENTED_EDGE ( 'NONE', *, *, #148, .T. ) ;
#44 = DIRECTION ( 'NONE',  ( -1.000000000000000000, 0.0000000000000000000, 0.0000000000000000000 ) ) ;
#45 = CIRCLE ( 'NONE', #393, 0.06099999999999999200 ) ;
#46 = ADVANCED_FACE ( 'NONE', ( #403 ), #394, .T. ) ;
#47 = AXIS2_PLACEMENT_3D ( 'NONE', #236, #339, #243 ) ;
#48 = LINE ( 'NONE', #175, #235 ) ;
#49 = AXIS2_PLACEMENT_3D ( 'NONE', #206, #401, #433 ) ;
#50 = DIRECTION ( 'NONE',  ( 0.0000000000000000000, 0.0000000000000000000, 1.000000000000000000 ) ) ;
#51 = CARTESIAN_POINT ( 'NONE',  ( -0.1183333333333333300, 0.0000000000000000000, 0.0000000000000000000 ) ) ;
#52 = DATE_AND_TIME ( #145, #237 ) ;
#53 = ORIENTED_EDGE ( 'NONE', *, *, #164, .F. ) ;
#54 = DIRECTION ( 'NONE',  ( 0.0000000000000000000, 0.0000000000000000000, -1.000000000000000000 ) ) ;
#55 = DIRECTION ( 'NONE',  ( -1.000000000000000000, 0.0000000000000000000, 0.0000000000000000000 ) ) ;
#56 = APPROVAL_ROLE ( '' ) ;
#57 = APPROVAL_DATE_TIME ( #149, #210 ) ;
#58 = EDGE_CURVE ( 'NONE', #422, #310, #48, .T. ) ;
#59 = ORIENTED_EDGE ( 'NONE', *, *, #125, .F. ) ;
#60 = APPLICATION_PROTOCOL_DEFINITION ( 'international standard', 'config_control_design', 1994, #13 ) ;
#61 = VECTOR ( 'NONE', #158, 39.37007874015748100 ) ;
#62 = DIRECTION ( 'NONE',  ( 0.0000000000000000000, 0.0000000000000000000, 1.000000000000000000 ) ) ;
#63 = FACE_OUTER_BOUND ( 'NONE', #354, .T. ) ;
#64 = APPROVAL ( #362, 'UNSPECIFIED' ) ;
#65 = CARTESIAN_POINT ( 'NONE',  ( -0.06500000000000000200, 0.0000000000000000000, 0.0000000000000000000 ) ) ;
#66 = PERSON_AND_ORGANIZATION ( #328, #247 ) ;
#67 = EDGE_CURVE ( 'NONE', #137, #422, #317, .T. ) ;
#68 = EDGE_LOOP ( 'NONE', ( #41, #186, #246, #172, #43 ) ) ;
#69 = CARTESIAN_POINT ( 'NONE',  ( 0.0000000000000000000, 0.0000000000000000000, 0.0000000000000000000 ) ) ;
#70 = APPROVAL_PERSON_ORGANIZATION ( #165, #210, #361 ) ;
#71 = LINE ( 'NONE', #119, #410 ) ;
#72 = EDGE_LOOP ( 'NONE', ( #336, #6, #53, #411 ) ) ;
#73 = EDGE_CURVE ( 'NONE', #74, #168, #306, .T. ) ;
#74 = VERTEX_POINT ( 'NONE', #173 ) ;
#75 = EDGE_LOOP ( 'NONE', ( #408, #32, #27, #340 ) ) ;
#76 = AXIS2_PLACEMENT_3D ( 'NONE', #308, #376, #78 ) ;
#77 = ORIENTED_EDGE ( 'NONE', *, *, #191, .T. ) ;
#78 = DIRECTION ( 'NONE',  ( 0.0000000000000000000, 1.000000000000000000, 0.0000000000000000000 ) ) ;
#79 = EDGE_CURVE ( 'NONE', #14, #168, #221, .T. ) ;
#80 = COORDINATED_UNIVERSAL_TIME_OFFSET ( 8, 0, .BEHIND. ) ;
#81 = EDGE_CURVE ( 'NONE', #74, #14, #131, .T. ) ;
#82 = ORIENTED_EDGE ( 'NONE', *, *, #81, .F. ) ;
#83 = ORIENTED_EDGE ( 'NONE', *, *, #112, .T. ) ;
#84 = ORIENTED_EDGE ( 'NONE', *, *, #194, .F. ) ;
#85 = ADVANCED_FACE ( 'NONE', ( #384 ), #116, .T. ) ;
#86 = CC_DESIGN_APPROVAL ( #64, ( #31 ) ) ;
#87 = AXIS2_PLACEMENT_3D ( 'NONE', #152, #146, #360 ) ;
#88 = EDGE_LOOP ( 'NONE', ( #253, #389 ) ) ;
#89 = EDGE_CURVE ( 'NONE', #310, #101, #213, .T. ) ;
#90 = DIRECTION ( 'NONE',  ( 0.0000000000000000000, 0.0000000000000000000, 1.000000000000000000 ) ) ;
#91 = DIRECTION ( 'NONE',  ( 1.000000000000000000, 0.0000000000000000000, 0.0000000000000000000 ) ) ;
#92 = DATE_TIME_ROLE ( 'creation_date' ) ;
#93 =( NAMED_UNIT ( * ) SI_UNIT ( $, .STERADIAN. ) SOLID_ANGLE_UNIT ( ) );
#94 = EDGE_LOOP ( 'NONE', ( #155, #257, #344, #281 ) ) ;
#95 = EDGE_CURVE ( 'NONE', #137, #101, #141, .T. ) ;
#96 = FACE_OUTER_BOUND ( 'NONE', #330, .T. ) ;
#97 = AXIS2_PLACEMENT_3D ( 'NONE', #190, #222, #325 ) ;
#98 = ORIENTED_EDGE ( 'NONE', *, *, #99, .T. ) ;
#99 = EDGE_CURVE ( 'NONE', #238, #379, #34, .T. ) ;
#100 = DIRECTION ( 'NONE',  ( 0.0000000000000000000, 0.0000000000000000000, 1.000000000000000000 ) ) ;
#101 = VERTEX_POINT ( 'NONE', #349 ) ;
#102 = CARTESIAN_POINT ( 'NONE',  ( -0.2179247006990068000, -2.561107494060246800E-017, 0.0000000000000000000 ) ) ;
#103 = FACE_OUTER_BOUND ( 'NONE', #68, .T. ) ;
#104 = CC_DESIGN_PERSON_AND_ORGANIZATION_ASSIGNMENT ( #309, #331, ( #31 ) ) ;
#105 = DIRECTION ( 'NONE',  ( 0.0000000000000000000, 0.0000000000000000000, 1.000000000000000000 ) ) ;
#106 = AXIS2_PLACEMENT_3D ( 'NONE', #185, #358, #274 ) ;
#107 = SPHERICAL_SURFACE ( 'NONE', #76, 0.1483333333333333400 ) ;
#108 = EDGE_CURVE ( 'NONE', #238, #228, #375, .T. ) ;
#109 = CARTESIAN_POINT ( 'NONE',  ( 0.0000000000000000000, 0.0000000000000000000, 0.06500000000000000200 ) ) ;
#110 = PERSON_AND_ORGANIZATION ( #328, #247 ) ;
#111 = EDGE_LOOP ( 'NONE', ( #59, #209, #192, #138, #245 ) ) ;
#112 = EDGE_CURVE ( 'NONE', #379, #124, #203, .T. ) ;
#113 = FACE_OUTER_BOUND ( 'NONE', #147, .T. ) ;
#114 = ADVANCED_FACE ( 'NONE', ( #299 ), #107, .T. ) ;
#115 = EDGE_CURVE ( 'NONE', #228, #124, #279, .T. ) ;
#116 = CYLINDRICAL_SURFACE ( 'NONE', #49, 0.06099999999999999200 ) ;
#117 = CARTESIAN_POINT ( 'NONE',  ( 0.01499999999999999400, 0.0000000000000000000, 0.0000000000000000000 ) ) ;
#118 = CARTESIAN_POINT ( 'NONE',  ( 0.0000000000000000000, 0.0000000000000000000, 0.0000000000000000000 ) ) ;
#119 = CARTESIAN_POINT ( 'NONE',  ( 0.0000000000000000000, 7.960204194457796700E-018, -0.06500000000000000200 ) ) ;
#120 = EDGE_CURVE ( 'NONE', #345, #183, #251, .T. ) ;
#121 = COORDINATED_UNIVERSAL_TIME_OFFSET ( 8, 0, .BEHIND. ) ;
#122 = DIRECTION ( 'NONE',  ( 0.0000000000000000000, 1.000000000000000000, 0.0000000000000000000 ) ) ;
#123 = APPROVAL_ROLE ( '' ) ;
#124 = VERTEX_POINT ( 'NONE', #374 ) ;
#125 = EDGE_CURVE ( 'NONE', #183, #178, #71, .T. ) ;
#126 = ORIENTED_EDGE ( 'NONE', *, *, #73, .F. ) ;
#127 =( CONVERSION_BASED_UNIT ( 'INCH', #270 ) LENGTH_UNIT ( ) NAMED_UNIT ( #320 ) );
#128 = SPHERICAL_SURFACE ( 'NONE', #87, 0.1060000000000000000 ) ;
#129 = DIRECTION ( 'NONE',  ( 1.000000000000000000, 0.0000000000000000000, 0.0000000000000000000 ) ) ;
#130 = PLANE ( 'NONE',  #38 ) ;
#131 = CIRCLE ( 'NONE', #16, 0.05100000000000001100 ) ;
#132 = CC_DESIGN_DATE_AND_TIME_ASSIGNMENT ( #388, #92, ( #31 ) ) ;
#133 = AXIS2_PLACEMENT_3D ( 'NONE', #415, #289, #50 ) ;
#134 = EDGE_CURVE ( 'NONE', #326, #178, #167, .T. ) ;
#135 = LOCAL_TIME ( 15, 27, 43.00000000000000000, #225 ) ;
#136 = DIRECTION ( 'NONE',  ( 0.0000000000000000000, 0.0000000000000000000, 1.000000000000000000 ) ) ;
#137 = VERTEX_POINT ( 'NONE', #189 ) ;
#138 = ORIENTED_EDGE ( 'NONE', *, *, #143, .T. ) ;
#139 = CIRCLE ( 'NONE', #355, 0.06500000000000000200 ) ;
#140 = DIRECTION ( 'NONE',  ( 0.0000000000000000000, 1.000000000000000000, 0.0000000000000000000 ) ) ;
#141 = LINE ( 'NONE', #18, #21 ) ;
#142 = CARTESIAN_POINT ( 'NONE',  ( -0.06500000000000000200, 0.0000000000000000000, 0.0000000000000000000 ) ) ;
#143 = EDGE_CURVE ( 'NONE', #417, #326, #151, .T. ) ;
#144 = DIRECTION ( 'NONE',  ( 0.0000000000000000000, 0.0000000000000000000, 1.000000000000000000 ) ) ;
#145 = CALENDAR_DATE ( 2016, 31, 5 ) ;
#146 = DIRECTION ( 'NONE',  ( 0.0000000000000000000, -0.0000000000000000000, 1.000000000000000000 ) ) ;
#147 = EDGE_LOOP ( 'NONE', ( #126, #179, #432 ) ) ;
#148 = EDGE_CURVE ( 'NONE', #417, #345, #242, .T. ) ;
#149 = DATE_AND_TIME ( #240, #329 ) ;
#150 = EDGE_CURVE ( 'NONE', #378, #345, #402, .T. ) ;
#151 = LINE ( 'NONE', #109, #61 ) ;
#152 = CARTESIAN_POINT ( 'NONE',  ( -0.2179247006990068000, -2.561107494060246800E-017, 0.0000000000000000000 ) ) ;
#153 = ADVANCED_FACE ( 'NONE', ( #332 ), #314, .F. ) ;
#154 = ORIENTED_EDGE ( 'NONE', *, *, #81, .T. ) ;
#155 = ORIENTED_EDGE ( 'NONE', *, *, #99, .F. ) ;
#156 = CARTESIAN_POINT ( 'NONE',  ( -0.06500000000000000200, 0.0000000000000000000, 0.0000000000000000000 ) ) ;
#157 = AXIS2_PLACEMENT_3D ( 'NONE', #391, #62, #230 ) ;
#158 = DIRECTION ( 'NONE',  ( -1.000000000000000000, -0.0000000000000000000, -0.0000000000000000000 ) ) ;
#159 = EDGE_CURVE ( 'NONE', #378, #197, #343, .T. ) ;
#160 = CARTESIAN_POINT ( 'NONE',  ( -0.06500000000000000200, 0.0000000000000000000, 0.0000000000000000000 ) ) ;
#161 = PERSON_AND_ORGANIZATION ( #328, #247 ) ;
#162 = EDGE_LOOP ( 'NONE', ( #28, #154 ) ) ;
#163 = CARTESIAN_POINT ( 'NONE',  ( 0.03000000000000000600, 9.082797093676203900E-018, 0.0000000000000000000 ) ) ;
#164 = EDGE_CURVE ( 'NONE', #183, #197, #139, .T. ) ;
#165 = PERSON_AND_ORGANIZATION ( #328, #247 ) ;
#166 = APPLICATION_PROTOCOL_DEFINITION ( 'international standard', 'config_control_design', 1994, #390 ) ;
#167 = CIRCLE ( 'NONE', #97, 0.06500000000000000200 ) ;
#168 = VERTEX_POINT ( 'NONE', #248 ) ;
#169 = CARTESIAN_POINT ( 'NONE',  ( 0.0000000000000000000, 7.470345474798853400E-018, 0.06099999999999999200 ) ) ;
#170 = EDGE_LOOP ( 'NONE', ( #271, #98, #83, #440 ) ) ;
#171 = EDGE_CURVE ( 'NONE', #178, #326, #231, .T. ) ;
#172 = ORIENTED_EDGE ( 'NONE', *, *, #143, .F. ) ;
#173 = CARTESIAN_POINT ( 'NONE',  ( -0.1250000000000000000, -0.05100000000000003100, 6.245698675651502200E-018 ) ) ;
#174 = PERSON_AND_ORGANIZATION ( #328, #247 ) ;
#175 = CARTESIAN_POINT ( 'NONE',  ( 0.0000000000000000000, 0.0000000000000000000, 0.05600000000000000800 ) ) ;
#176 = EDGE_CURVE ( 'NONE', #124, #379, #45, .T. ) ;
#177 = DIRECTION ( 'NONE',  ( 0.0000000000000000000, 0.0000000000000000000, -1.000000000000000000 ) ) ;
#178 = VERTEX_POINT ( 'NONE', #321 ) ;
#179 = ORIENTED_EDGE ( 'NONE', *, *, #196, .F. ) ;
#180 = DIRECTION ( 'NONE',  ( -1.000000000000000000, -0.0000000000000000000, -0.0000000000000000000 ) ) ;
#181 = CC_DESIGN_PERSON_AND_ORGANIZATION_ASSIGNMENT ( #161, #195, ( #227 ) ) ;
#182 = EDGE_CURVE ( 'NONE', #197, #417, #303, .T. ) ;
#183 = VERTEX_POINT ( 'NONE', #350 ) ;
#184 = CARTESIAN_POINT ( 'NONE',  ( 0.01499999999999999400, 0.0000000000000000000, 0.0000000000000000000 ) ) ;
#185 = CARTESIAN_POINT ( 'NONE',  ( 0.0000000000000000000, 0.0000000000000000000, 0.0000000000000000000 ) ) ;
#186 = ORIENTED_EDGE ( 'NONE', *, *, #125, .T. ) ;
#187 = EDGE_LOOP ( 'NONE', ( #264, #439, #294, #351 ) ) ;
#188 = ADVANCED_FACE ( 'NONE', ( #392 ), #296, .T. ) ;
#189 = CARTESIAN_POINT ( 'NONE',  ( -0.06500000000000000200, 6.858022075225178200E-018, -0.05600000000000000800 ) ) ;
#190 = CARTESIAN_POINT ( 'NONE',  ( 0.0000000000000000000, 0.0000000000000000000, 0.0000000000000000000 ) ) ;
#191 = EDGE_CURVE ( 'NONE', #228, #238, #381, .T. ) ;
#192 = ORIENTED_EDGE ( 'NONE', *, *, #182, .T. ) ;
#193 = CARTESIAN_POINT ( 'NONE',  ( 0.01499999999999998600, 0.06500000000000001600, 0.0000000000000000000 ) ) ;
#194 = EDGE_CURVE ( 'NONE', #422, #137, #219, .T. ) ;
#195 = PERSON_AND_ORGANIZATION_ROLE ( 'design_owner' ) ;
#196 = EDGE_CURVE ( 'NONE', #14, #74, #29, .T. ) ;
#197 = VERTEX_POINT ( 'NONE', #285 ) ;
#198 = CARTESIAN_POINT ( 'NONE',  ( -0.06500000000000000200, 0.0000000000000000000, 0.05600000000000000800 ) ) ;
#199 = CARTESIAN_POINT ( 'NONE',  ( -0.1250000000000000000, 0.0000000000000000000, 0.05600000000000000800 ) ) ;
#200 = FACE_OUTER_BOUND ( 'NONE', #187, .T. ) ;
#201 = DIRECTION ( 'NONE',  ( -1.000000000000000000, -0.0000000000000000000, -0.0000000000000000000 ) ) ;
#202 = DIRECTION ( 'NONE',  ( 0.0000000000000000000, 0.0000000000000000000, 1.000000000000000000 ) ) ;
#203 = CIRCLE ( 'NONE', #224, 0.06099999999999999200 ) ;
#204 = AXIS2_PLACEMENT_3D ( 'NONE', #386, #10, #105 ) ;
#205 = DIRECTION ( 'NONE',  ( -1.000000000000000000, 0.0000000000000000000, 0.0000000000000000000 ) ) ;
#206 = CARTESIAN_POINT ( 'NONE',  ( -0.06500000000000000200, 0.0000000000000000000, 0.0000000000000000000 ) ) ;
#207 = APPROVAL_DATE_TIME ( #292, #404 ) ;
#208 = DIRECTION ( 'NONE',  ( 0.0000000000000000000, 0.0000000000000000000, 1.000000000000000000 ) ) ;
#209 = ORIENTED_EDGE ( 'NONE', *, *, #164, .T. ) ;
#210 = APPROVAL ( #420, 'UNSPECIFIED' ) ;
#211 = DIRECTION ( 'NONE',  ( 1.000000000000000000, 0.0000000000000000000, 0.0000000000000000000 ) ) ;
#212 = CIRCLE ( 'NONE', #133, 0.05600000000000000800 ) ;
#213 = CIRCLE ( 'NONE', #406, 0.05600000000000000800 ) ;
#214 = DIRECTION ( 'NONE',  ( -0.0000000000000000000, 0.0000000000000000000, 1.000000000000000000 ) ) ;
#215 = EDGE_CURVE ( 'NONE', #101, #310, #212, .T. ) ;
#216 = CARTESIAN_POINT ( 'NONE',  ( -0.1183333333333333300, 0.0000000000000000000, 0.0000000000000000000 ) ) ;
#217 = APPROVAL_PERSON_ORGANIZATION ( #300, #404, #56 ) ;
#218 = ADVANCED_FACE ( 'NONE', ( #113 ), #128, .F. ) ;
#219 = CIRCLE ( 'NONE', #244, 0.05600000000000000800 ) ;
#220 = AXIS2_PLACEMENT_3D ( 'NONE', #184, #180, #280 ) ;
#221 = CIRCLE ( 'NONE', #19, 0.1060000000000000100 ) ;
#222 = DIRECTION ( 'NONE',  ( -1.000000000000000000, -0.0000000000000000000, -0.0000000000000000000 ) ) ;
#223 = CARTESIAN_POINT ( 'NONE',  ( 0.0000000000000000000, 0.0000000000000000000, 0.0000000000000000000 ) ) ;
#224 = AXIS2_PLACEMENT_3D ( 'NONE', #40, #44, #307 ) ;
#225 = COORDINATED_UNIVERSAL_TIME_OFFSET ( 8, 0, .BEHIND. ) ;
#226 = DIRECTION ( 'NONE',  ( 0.0000000000000000000, 0.0000000000000000000, -1.000000000000000000 ) ) ;
#227 = PRODUCT ( 'LFB012CTP', 'LFB012CTP', '', ( #423 ) ) ;
#228 = VERTEX_POINT ( 'NONE', #42 ) ;
#229 = SECURITY_CLASSIFICATION_LEVEL ( 'unclassified' ) ;
#230 = DIRECTION ( 'NONE',  ( 1.000000000000000000, 0.0000000000000000000, 0.0000000000000000000 ) ) ;
#231 = CIRCLE ( 'NONE', #373, 0.06500000000000000200 ) ;
#232 = PRODUCT_DEFINITION_SHAPE ( 'NONE', 'NONE',  #31 ) ;
#233 = CC_DESIGN_APPROVAL ( #210, ( #316 ) ) ;
#234 = DIRECTION ( 'NONE',  ( 1.000000000000000000, -0.0000000000000000000, -0.0000000000000000000 ) ) ;
#235 = VECTOR ( 'NONE', #431, 39.37007874015748100 ) ;
#236 = CARTESIAN_POINT ( 'NONE',  ( -0.2179247006990068000, -2.561107494060246800E-017, 0.0000000000000000000 ) ) ;
#237 = LOCAL_TIME ( 15, 27, 43.00000000000000000, #323 ) ;
#238 = VERTEX_POINT ( 'NONE', #327 ) ;
#239 = CARTESIAN_POINT ( 'NONE',  ( -0.1250000000000000000, 0.05100000000000001100, 0.0000000000000000000 ) ) ;
#240 = CALENDAR_DATE ( 2016, 31, 5 ) ;
#241 = DIRECTION ( 'NONE',  ( -1.000000000000000000, -0.0000000000000000000, -0.0000000000000000000 ) ) ;
#242 = CIRCLE ( 'NONE', #414, 0.06500000000000000200 ) ;
#243 = DIRECTION ( 'NONE',  ( 0.0000000000000000000, -1.000000000000000000, 1.224646799147353500E-016 ) ) ;
#244 = AXIS2_PLACEMENT_3D ( 'NONE', #156, #291, #144 ) ;
#245 = ORIENTED_EDGE ( 'NONE', *, *, #171, .F. ) ;
#246 = ORIENTED_EDGE ( 'NONE', *, *, #134, .F. ) ;
#247 = ORGANIZATION ( 'UNSPECIFIED', 'UNSPECIFIED', '' ) ;
#248 = CARTESIAN_POINT ( 'NONE',  ( -0.1119247006990068100, -1.912044690512149800E-017, 0.0000000000000000000 ) ) ;
#249 = ORIENTED_EDGE ( 'NONE', *, *, #58, .T. ) ;
#250 = DATE_AND_TIME ( #342, #419 ) ;
#251 = CIRCLE ( 'NONE', #204, 0.06500000000000000200 ) ;
#252 = ORIENTED_EDGE ( 'NONE', *, *, #95, .F. ) ;
#253 = ORIENTED_EDGE ( 'NONE', *, *, #89, .T. ) ;
#254 = CC_DESIGN_SECURITY_CLASSIFICATION ( #316, ( #383 ) ) ;
#255 = ADVANCED_FACE ( 'NONE', ( #103 ), #2, .T. ) ;
#256 = DIRECTION ( 'NONE',  ( 0.0000000000000000000, 0.0000000000000000000, -1.000000000000000000 ) ) ;
#257 = ORIENTED_EDGE ( 'NONE', *, *, #191, .F. ) ;
#258 = DESIGN_CONTEXT ( 'detailed design', #390, 'design' ) ;
#259 = DIRECTION ( 'NONE',  ( -1.000000000000000000, 0.0000000000000000000, 0.0000000000000000000 ) ) ;
#260 = PLANE ( 'NONE',  #368 ) ;
#261 = PERSON_AND_ORGANIZATION ( #328, #247 ) ;
#262 = DIRECTION ( 'NONE',  ( -1.000000000000000000, -0.0000000000000000000, -0.0000000000000000000 ) ) ;
#263 = PERSON_AND_ORGANIZATION_ROLE ( 'creator' ) ;
#264 = ORIENTED_EDGE ( 'NONE', *, *, #67, .F. ) ;
#265 = CARTESIAN_POINT ( 'NONE',  ( -0.1250000000000000000, -1.530808498934191500E-017, 0.0000000000000000000 ) ) ;
#266 = CLOSED_SHELL ( 'NONE', ( #282, #153, #382, #255, #315, #353, #114, #188, #85, #1, #218, #412, #46 ) ) ;
#267 = AXIS2_PLACEMENT_3D ( 'NONE', #142, #259, #416 ) ;
#268 = CARTESIAN_POINT ( 'NONE',  ( -0.06500000000000000200, 7.470345474798853400E-018, 0.06099999999999999200 ) ) ;
#269 = DIRECTION ( 'NONE',  ( -1.000000000000000000, -0.0000000000000000000, -0.0000000000000000000 ) ) ;
#270 = LENGTH_MEASURE_WITH_UNIT ( LENGTH_MEASURE( 0.02539999999999999900 ), #363 );
#271 = ORIENTED_EDGE ( 'NONE', *, *, #108, .F. ) ;
#272 = ORIENTED_EDGE ( 'NONE', *, *, #194, .T. ) ;
#273 = PRODUCT_RELATED_PRODUCT_CATEGORY ( 'detail', '', ( #227 ) ) ;
#274 = DIRECTION ( 'NONE',  ( 0.0000000000000000000, 0.0000000000000000000, 1.000000000000000000 ) ) ;
#275 = CYLINDRICAL_SURFACE ( 'NONE', #35, 0.05600000000000000800 ) ;
#276 = DIRECTION ( 'NONE',  ( 0.0000000000000000000, 0.0000000000000000000, 1.000000000000000000 ) ) ;
#277 = ADVANCED_BREP_SHAPE_REPRESENTATION ( 'LFB012CTP', ( #429, #157 ), #5 ) ;
#278 = ORIENTED_EDGE ( 'NONE', *, *, #171, .T. ) ;
#279 = LINE ( 'NONE', #37, #421 ) ;
#280 = DIRECTION ( 'NONE',  ( 0.0000000000000000000, 0.0000000000000000000, 1.000000000000000000 ) ) ;
#281 = ORIENTED_EDGE ( 'NONE', *, *, #176, .T. ) ;
#282 = ADVANCED_FACE ( 'NONE', ( #200 ), #275, .T. ) ;
#283 = FACE_OUTER_BOUND ( 'NONE', #72, .T. ) ;
#284 = AXIS2_PLACEMENT_3D ( 'NONE', #436, #304, #256 ) ;
#285 = CARTESIAN_POINT ( 'NONE',  ( 0.01499999999999998600, -0.06500000000000001600, -7.960204194457798300E-018 ) ) ;
#286 = VECTOR ( 'NONE', #234, 39.37007874015748100 ) ;
#287 = DIRECTION ( 'NONE',  ( 0.0000000000000000000, -0.0000000000000000000, 1.000000000000000000 ) ) ;
#288 = CARTESIAN_POINT ( 'NONE',  ( 0.0000000000000000000, 0.0000000000000000000, 0.0000000000000000000 ) ) ;
#289 = DIRECTION ( 'NONE',  ( -1.000000000000000000, -0.0000000000000000000, -0.0000000000000000000 ) ) ;
#290 = DATE_TIME_ROLE ( 'classification_date' ) ;
#291 = DIRECTION ( 'NONE',  ( 1.000000000000000000, -0.0000000000000000000, -0.0000000000000000000 ) ) ;
#292 = DATE_AND_TIME ( #377, #23 ) ;
#293 = APPROVAL_STATUS ( 'not_yet_approved' ) ;
#294 = ORIENTED_EDGE ( 'NONE', *, *, #89, .F. ) ;
#295 = PLANE ( 'NONE',  #348 ) ;
#296 = CYLINDRICAL_SURFACE ( 'NONE', #106, 0.06500000000000000200 ) ;
#297 = CC_DESIGN_PERSON_AND_ORGANIZATION_ASSIGNMENT ( #261, #12, ( #383 ) ) ;
#298 = CARTESIAN_POINT ( 'NONE',  ( -0.1250000000000000000, 0.0000000000000000000, 0.0000000000000000000 ) ) ;
#299 = FACE_OUTER_BOUND ( 'NONE', #75, .T. ) ;
#300 = PERSON_AND_ORGANIZATION ( #328, #247 ) ;
#301 = DIRECTION ( 'NONE',  ( -1.000000000000000000, -0.0000000000000000000, -0.0000000000000000000 ) ) ;
#302 = CARTESIAN_POINT ( 'NONE',  ( -0.2179247006990068000, -2.561107494060246800E-017, 0.0000000000000000000 ) ) ;
#303 = CIRCLE ( 'NONE', #220, 0.06500000000000000200 ) ;
#304 = DIRECTION ( 'NONE',  ( 1.000000000000000000, -0.0000000000000000000, -0.0000000000000000000 ) ) ;
#305 = AXIS2_PLACEMENT_3D ( 'NONE', #51, #322, #318 ) ;
#306 = CIRCLE ( 'NONE', #47, 0.1059999999999999700 ) ;
#307 = DIRECTION ( 'NONE',  ( 0.0000000000000000000, 0.0000000000000000000, 1.000000000000000000 ) ) ;
#308 = CARTESIAN_POINT ( 'NONE',  ( -0.1183333333333333300, 0.0000000000000000000, 0.0000000000000000000 ) ) ;
#309 = PERSON_AND_ORGANIZATION ( #328, #247 ) ;
#310 = VERTEX_POINT ( 'NONE', #199 ) ;
#311 = DIRECTION ( 'NONE',  ( 0.0000000000000000000, 0.0000000000000000000, 1.000000000000000000 ) ) ;
#312 = DIRECTION ( 'NONE',  ( 0.0000000000000000000, 0.0000000000000000000, 1.000000000000000000 ) ) ;
#313 = DIRECTION ( 'NONE',  ( -1.000000000000000000, 0.0000000000000000000, 0.0000000000000000000 ) ) ;
#314 = SPHERICAL_SURFACE ( 'NONE', #337, 0.1060000000000000000 ) ;
#315 = ADVANCED_FACE ( 'NONE', ( #283 ), #17, .T. ) ;
#316 = SECURITY_CLASSIFICATION ( '', '', #229 ) ;
#317 = CIRCLE ( 'NONE', #25, 0.05600000000000000800 ) ;
#318 = DIRECTION ( 'NONE',  ( 0.0000000000000000000, 1.000000000000000000, 1.224646799147353200E-016 ) ) ;
#319 = AXIS2_PLACEMENT_3D ( 'NONE', #418, #365, #226 ) ;
#320 = DIMENSIONAL_EXPONENTS ( 1.000000000000000000, 0.0000000000000000000, 0.0000000000000000000, 0.0000000000000000000, 0.0000000000000000000, 0.0000000000000000000, 0.0000000000000000000 ) ;
#321 = CARTESIAN_POINT ( 'NONE',  ( 0.0000000000000000000, 7.960204194457796700E-018, -0.06500000000000000200 ) ) ;
#322 = DIRECTION ( 'NONE',  ( 0.0000000000000000000, 1.224646799147353200E-016, -1.000000000000000000 ) ) ;
#323 = COORDINATED_UNIVERSAL_TIME_OFFSET ( 8, 0, .BEHIND. ) ;
#324 = DIRECTION ( 'NONE',  ( -1.000000000000000000, -0.0000000000000000000, -0.0000000000000000000 ) ) ;
#325 = DIRECTION ( 'NONE',  ( 0.0000000000000000000, 0.0000000000000000000, 1.000000000000000000 ) ) ;
#326 = VERTEX_POINT ( 'NONE', #8 ) ;
#327 = CARTESIAN_POINT ( 'NONE',  ( -0.06500000000000000200, 7.470345474798855000E-018, 0.06100000000000001300 ) ) ;
#328 = PERSON ( 'UNSPECIFIED', 'UNSPECIFIED', 'UNSPECIFIED', ('UNSPECIFIED'), ('UNSPECIFIED'), ('UNSPECIFIED') ) ;
#329 = LOCAL_TIME ( 15, 27, 43.00000000000000000, #409 ) ;
#330 = EDGE_LOOP ( 'NONE', ( #413, #278 ) ) ;
#331 = PERSON_AND_ORGANIZATION_ROLE ( 'creator' ) ;
#332 = FACE_OUTER_BOUND ( 'NONE', #36, .T. ) ;
#333 =( NAMED_UNIT ( * ) PLANE_ANGLE_UNIT ( ) SI_UNIT ( $, .RADIAN. ) );
#334 = CARTESIAN_POINT ( 'NONE',  ( 0.01499999999999999400, 0.0000000000000000000, 0.06500000000000000200 ) ) ;
#335 = ORIENTED_EDGE ( 'NONE', *, *, #79, .F. ) ;
#336 = ORIENTED_EDGE ( 'NONE', *, *, #150, .F. ) ;
#337 = AXIS2_PLACEMENT_3D ( 'NONE', #102, #287, #140 ) ;
#338 = SHAPE_DEFINITION_REPRESENTATION ( #232, #277 ) ;
#339 = DIRECTION ( 'NONE',  ( 0.0000000000000000000, 1.224646799147353200E-016, 1.000000000000000000 ) ) ;
#340 = ORIENTED_EDGE ( 'NONE', *, *, #182, .F. ) ;
#341 = DIRECTION ( 'NONE',  ( -1.000000000000000000, 0.0000000000000000000, 0.0000000000000000000 ) ) ;
#342 = CALENDAR_DATE ( 2016, 31, 5 ) ;
#343 = CIRCLE ( 'NONE', #305, 0.1483333333333333400 ) ;
#344 = ORIENTED_EDGE ( 'NONE', *, *, #115, .T. ) ;
#345 = VERTEX_POINT ( 'NONE', #193 ) ;
#346 = CC_DESIGN_PERSON_AND_ORGANIZATION_ASSIGNMENT ( #174, #387, ( #316 ) ) ;
#347 = CARTESIAN_POINT ( 'NONE',  ( 0.0000000000000000000, 0.0000000000000000000, 0.0000000000000000000 ) ) ;
#348 = AXIS2_PLACEMENT_3D ( 'NONE', #265, #129, #15 ) ;
#349 = CARTESIAN_POINT ( 'NONE',  ( -0.1250000000000000000, 6.858022075225178200E-018, -0.05600000000000000800 ) ) ;
#350 = CARTESIAN_POINT ( 'NONE',  ( 0.01499999999999999400, 7.960204194457796700E-018, -0.06500000000000000200 ) ) ;
#351 = ORIENTED_EDGE ( 'NONE', *, *, #58, .F. ) ;
#352 = EDGE_LOOP ( 'NONE', ( #252, #84, #249, #424 ) ) ;
#353 = ADVANCED_FACE ( 'NONE', ( #96, #372 ), #260, .F. ) ;
#354 = EDGE_LOOP ( 'NONE', ( #77, #397 ) ) ;
#355 = AXIS2_PLACEMENT_3D ( 'NONE', #117, #380, #312 ) ;
#356 = FACE_BOUND ( 'NONE', #162, .T. ) ;
#357 = UNCERTAINTY_MEASURE_WITH_UNIT (LENGTH_MEASURE( 1.000000000000000100E-005 ), #127, 'distance_accuracy_value', 'NONE');
#358 = DIRECTION ( 'NONE',  ( -1.000000000000000000, -0.0000000000000000000, -0.0000000000000000000 ) ) ;
#359 = ORIENTED_EDGE ( 'NONE', *, *, #73, .T. ) ;
#360 = DIRECTION ( 'NONE',  ( 0.0000000000000000000, 1.000000000000000000, 0.0000000000000000000 ) ) ;
#361 = APPROVAL_ROLE ( '' ) ;
#362 = APPROVAL_STATUS ( 'not_yet_approved' ) ;
#363 =( LENGTH_UNIT ( ) NAMED_UNIT ( * ) SI_UNIT ( $, .METRE. ) );
#364 = FACE_BOUND ( 'NONE', #371, .T. ) ;
#365 = DIRECTION ( 'NONE',  ( 1.000000000000000000, -0.0000000000000000000, -0.0000000000000000000 ) ) ;
#366 = CC_DESIGN_DATE_AND_TIME_ASSIGNMENT ( #250, #290, ( #316 ) ) ;
#367 = CARTESIAN_POINT ( 'NONE',  ( 0.0000000000000000000, 0.0000000000000000000, 0.0000000000000000000 ) ) ;
#368 = AXIS2_PLACEMENT_3D ( 'NONE', #367, #91, #54 ) ;
#369 = FACE_OUTER_BOUND ( 'NONE', #170, .T. ) ;
#370 = DIRECTION ( 'NONE',  ( 1.000000000000000000, -0.0000000000000000000, -0.0000000000000000000 ) ) ;
#371 = EDGE_LOOP ( 'NONE', ( #272, #399 ) ) ;
#372 = FACE_BOUND ( 'NONE', #426, .T. ) ;
#373 = AXIS2_PLACEMENT_3D ( 'NONE', #347, #33, #90 ) ;
#374 = CARTESIAN_POINT ( 'NONE',  ( 0.0000000000000000000, 0.0000000000000000000, -0.06099999999999999200 ) ) ;
#375 = CIRCLE ( 'NONE', #9, 0.06100000000000001300 ) ;
#376 = DIRECTION ( 'NONE',  ( -0.0000000000000000000, 0.0000000000000000000, -1.000000000000000000 ) ) ;
#377 = CALENDAR_DATE ( 2016, 31, 5 ) ;
#378 = VERTEX_POINT ( 'NONE', #163 ) ;
#379 = VERTEX_POINT ( 'NONE', #169 ) ;
#380 = DIRECTION ( 'NONE',  ( -1.000000000000000000, -0.0000000000000000000, -0.0000000000000000000 ) ) ;
#381 = CIRCLE ( 'NONE', #267, 0.06100000000000001300 ) ;
#382 = ADVANCED_FACE ( 'NONE', ( #369 ), #7, .T. ) ;
#383 = PRODUCT_DEFINITION_FORMATION_WITH_SPECIFIED_SOURCE ( 'ANY', '', #227, .NOT_KNOWN. ) ;
#384 = FACE_OUTER_BOUND ( 'NONE', #94, .T. ) ;
#385 = DIRECTION ( 'NONE',  ( 1.000000000000000000, -0.0000000000000000000, -0.0000000000000000000 ) ) ;
#386 = CARTESIAN_POINT ( 'NONE',  ( 0.01499999999999999400, 0.0000000000000000000, 0.0000000000000000000 ) ) ;
#387 = PERSON_AND_ORGANIZATION_ROLE ( 'classification_officer' ) ;
#388 = DATE_AND_TIME ( #39, #135 ) ;
#389 = ORIENTED_EDGE ( 'NONE', *, *, #215, .T. ) ;
#390 = APPLICATION_CONTEXT ( 'configuration controlled 3d designs of mechanical parts and assemblies' ) ;
#391 = CARTESIAN_POINT ( 'NONE',  ( 0.0000000000000000000, 0.0000000000000000000, 0.0000000000000000000 ) ) ;
#392 = FACE_OUTER_BOUND ( 'NONE', #111, .T. ) ;
#393 = AXIS2_PLACEMENT_3D ( 'NONE', #223, #55, #276 ) ;
#394 = CYLINDRICAL_SURFACE ( 'NONE', #22, 0.05600000000000000800 ) ;
#395 = CARTESIAN_POINT ( 'NONE',  ( -0.1183333333333333300, 0.0000000000000000000, 0.0000000000000000000 ) ) ;
#396 = CARTESIAN_POINT ( 'NONE',  ( -0.06500000000000000200, 0.0000000000000000000, 0.0000000000000000000 ) ) ;
#397 = ORIENTED_EDGE ( 'NONE', *, *, #108, .T. ) ;
#398 = APPROVAL_DATE_TIME ( #52, #64 ) ;
#399 = ORIENTED_EDGE ( 'NONE', *, *, #67, .T. ) ;
#400 = DIRECTION ( 'NONE',  ( 1.000000000000000000, -0.0000000000000000000, -0.0000000000000000000 ) ) ;
#401 = DIRECTION ( 'NONE',  ( 1.000000000000000000, -0.0000000000000000000, -0.0000000000000000000 ) ) ;
#402 = CIRCLE ( 'NONE', #438, 0.1483333333333333400 ) ;
#403 = FACE_OUTER_BOUND ( 'NONE', #352, .T. ) ;
#404 = APPROVAL ( #293, 'UNSPECIFIED' ) ;
#405 = AXIS2_PLACEMENT_3D ( 'NONE', #288, #324, #427 ) ;
#406 = AXIS2_PLACEMENT_3D ( 'NONE', #298, #241, #208 ) ;
#407 = APPROVAL_PERSON_ORGANIZATION ( #66, #64, #123 ) ;
#408 = ORIENTED_EDGE ( 'NONE', *, *, #159, .F. ) ;
#409 = COORDINATED_UNIVERSAL_TIME_OFFSET ( 8, 0, .BEHIND. ) ;
#410 = VECTOR ( 'NONE', #4, 39.37007874015748100 ) ;
#411 = ORIENTED_EDGE ( 'NONE', *, *, #120, .F. ) ;
#412 = ADVANCED_FACE ( 'NONE', ( #356, #437 ), #295, .F. ) ;
#413 = ORIENTED_EDGE ( 'NONE', *, *, #134, .T. ) ;
#414 = AXIS2_PLACEMENT_3D ( 'NONE', #11, #262, #30 ) ;
#415 = CARTESIAN_POINT ( 'NONE',  ( -0.1250000000000000000, 0.0000000000000000000, 0.0000000000000000000 ) ) ;
#416 = DIRECTION ( 'NONE',  ( 0.0000000000000000000, 0.0000000000000000000, 1.000000000000000000 ) ) ;
#417 = VERTEX_POINT ( 'NONE', #334 ) ;
#418 = CARTESIAN_POINT ( 'NONE',  ( -0.06500000000000000200, 0.0000000000000000000, 0.0000000000000000000 ) ) ;
#419 = LOCAL_TIME ( 15, 27, 43.00000000000000000, #80 ) ;
#420 = APPROVAL_STATUS ( 'not_yet_approved' ) ;
#421 = VECTOR ( 'NONE', #385, 39.37007874015748100 ) ;
#422 = VERTEX_POINT ( 'NONE', #198 ) ;
#423 = MECHANICAL_CONTEXT ( 'NONE', #13, 'mechanical' ) ;
#424 = ORIENTED_EDGE ( 'NONE', *, *, #215, .F. ) ;
#425 = ORIENTED_EDGE ( 'NONE', *, *, #176, .F. ) ;
#426 = EDGE_LOOP ( 'NONE', ( #425, #435 ) ) ;
#427 = DIRECTION ( 'NONE',  ( 0.0000000000000000000, 0.0000000000000000000, 1.000000000000000000 ) ) ;
#428 = CC_DESIGN_APPROVAL ( #404, ( #383 ) ) ;
#429 = MANIFOLD_SOLID_BREP ( 'Generic', #266 ) ;
#430 = AXIS2_PLACEMENT_3D ( 'NONE', #395, #20, #122 ) ;
#431 = DIRECTION ( 'NONE',  ( -1.000000000000000000, -0.0000000000000000000, -0.0000000000000000000 ) ) ;
#432 = ORIENTED_EDGE ( 'NONE', *, *, #79, .T. ) ;
#433 = DIRECTION ( 'NONE',  ( 0.0000000000000000000, 0.0000000000000000000, -1.000000000000000000 ) ) ;
#434 = CARTESIAN_POINT ( 'NONE',  ( -0.1250000000000000000, 0.0000000000000000000, 0.0000000000000000000 ) ) ;
#435 = ORIENTED_EDGE ( 'NONE', *, *, #112, .F. ) ;
#436 = CARTESIAN_POINT ( 'NONE',  ( -0.1250000000000000000, 0.0000000000000000000, 0.0000000000000000000 ) ) ;
#437 = FACE_OUTER_BOUND ( 'NONE', #88, .T. ) ;
#438 = AXIS2_PLACEMENT_3D ( 'NONE', #216, #214, #211 ) ;
#439 = ORIENTED_EDGE ( 'NONE', *, *, #95, .T. ) ;
#440 = ORIENTED_EDGE ( 'NONE', *, *, #115, .F. ) ;
ENDSEC;
END-ISO-10303-21;
