(footprint "RESC1608" (version 20221018) (generator pcbnew)
  (layer "F.Cu")
  (descr "Resistor SMD 1608 metric (0603 imperial)")
  (tags "resistor")
  (attr smd)
  (fp_text reference "REF**" (at 0 -1.4) (layer "F.SilkS")
      (effects (font (size 1 1) (thickness 0.15)))
    (tstamp 768eda28-88b7-40e1-856f-e0927bf6a6a2)
  )
  (fp_text value "RESC1608" (at 0 1.5) (layer "F.Fab") hide
      (effects (font (size 1 1) (thickness 0.15)))
    (tstamp df331016-8d85-4023-a92b-f4a06c4084e8)
  )
  (fp_text user "${REFERENCE}" (at 0 0) (layer "F.Fab")
      (effects (font (size 0.5 0.5) (thickness 0.1)))
    (tstamp cfed1a8a-704c-416c-8a1c-a6aae2107559)
  )
  (fp_line (start -0.4 -0.4) (end 0.4 -0.4)
    (stroke (width 0.1) (type solid)) (layer "F.SilkS") (tstamp bcd64936-0347-4839-9954-efe2e424a948))
  (fp_line (start 0.4 0.4) (end -0.4 0.4)
    (stroke (width 0.1) (type solid)) (layer "F.SilkS") (tstamp bb3ec0a9-75c1-44ef-9e6f-87d460fcc8d5))
  (fp_rect (start 1.1 -0.55) (end -1.1 0.55)
    (stroke (width 0.05) (type default)) (fill none) (layer "F.CrtYd") (tstamp ecc9388e-f9ae-4791-8769-d538c9238593))
  (fp_poly
    (pts
      (xy 0.8 -0.4)
      (xy 0.8 0.4)
      (xy -0.8 0.4)
      (xy -0.8 -0.2)
      (xy -0.6 -0.4)
    )

    (stroke (width 0.1) (type solid)) (fill none) (layer "F.Fab") (tstamp f0dfb6c6-f562-4c56-8aa4-d0eb7806519c))
  (pad "1" smd roundrect (at -0.75 0) (size 0.5 0.9) (layers "F.Cu" "F.Paste" "F.Mask") (roundrect_rratio 0.1) (tstamp d8121630-1c7e-46ea-be95-c119c2da5d39))
  (pad "2" smd roundrect (at 0.75 0) (size 0.5 0.9) (layers "F.Cu" "F.Paste" "F.Mask") (roundrect_rratio 0.1) (tstamp 3a6ae502-3b47-4a67-a8e0-9978a4880624))
  (model "${KICADLIB}/model/passive/RESC1608.step"
    (offset (xyz 0 0 0))
    (scale (xyz 1 1 1))
    (rotate (xyz 0 0 0))
  )
)
