(footprint "LGA50P300X250-14" (version 20221018) (generator pcbnew)
  (layer "F.Cu")
  (attr smd)
  (fp_text reference "REF**" (at 0 -2.05 unlocked) (layer "F.SilkS")
      (effects (font (size 1 1) (thickness 0.15)))
    (tstamp e2a114ed-0511-453f-bdb7-f8782c20a9e9)
  )
  (fp_text value "LGA50P300X250-14" (at 0 1 unlocked) (layer "F.Fab") hide
      (effects (font (size 1 1) (thickness 0.15)))
    (tstamp a118255b-c2b1-4dab-a146-e2a6d16c0d4b)
  )
  (fp_text user "^" (at -2.4 -0.75 -90 unlocked) (layer "F.SilkS")
      (effects (font (size 1 1) (thickness 0.15)))
    (tstamp b8716c7a-c044-486d-81ae-da7a2e5eb3fa)
  )
  (fp_text user "${REFERENCE}" (at 0 0 unlocked) (layer "F.Fab")
      (effects (font (size 0.5 0.5) (thickness 0.125)))
    (tstamp 85d0de0a-94e4-409c-8135-03a675985dfd)
  )
  (fp_line (start -1.5 -1.25) (end -1.5 -1)
    (stroke (width 0.1) (type default)) (layer "F.SilkS") (tstamp ee866a82-8d75-40bc-a3ee-9c9cc459f704))
  (fp_line (start -1.5 -0.474999) (end -1.5 -0.524999)
    (stroke (width 0.1) (type default)) (layer "F.SilkS") (tstamp 71ad9c95-84e5-48df-b95f-41c5574568d4))
  (fp_line (start -1.5 0.025001) (end -1.5 -0.024999)
    (stroke (width 0.1) (type default)) (layer "F.SilkS") (tstamp 92f32b43-93a1-47c7-8113-18413b54d460))
  (fp_line (start -1.5 0.525) (end -1.5 0.475001)
    (stroke (width 0.1) (type default)) (layer "F.SilkS") (tstamp 9176a642-a66b-46ef-9b16-8e3d22f65c78))
  (fp_line (start -1.5 1.25) (end -1.5 1)
    (stroke (width 0.1) (type default)) (layer "F.SilkS") (tstamp dc013be2-0280-4997-9ea0-42ca3471e02b))
  (fp_line (start -0.75 -1.25) (end -1.5 -1.25)
    (stroke (width 0.1) (type default)) (layer "F.SilkS") (tstamp 82ed8b03-7f98-43e8-804e-dc4f998daa68))
  (fp_line (start -0.75 1.25) (end -1.5 1.25)
    (stroke (width 0.1) (type default)) (layer "F.SilkS") (tstamp 56885410-b4aa-4f98-9a2f-bcead96c0973))
  (fp_line (start -0.275 -1.25) (end -0.225 -1.25)
    (stroke (width 0.1) (type default)) (layer "F.SilkS") (tstamp 73861a08-5db1-44a0-aa7d-a24ab648e223))
  (fp_line (start -0.275 1.25) (end -0.225 1.25)
    (stroke (width 0.1) (type default)) (layer "F.SilkS") (tstamp cbdc0b70-faf6-4a1b-933a-fe503e90c35a))
  (fp_line (start 0.225 -1.25) (end 0.275 -1.25)
    (stroke (width 0.1) (type default)) (layer "F.SilkS") (tstamp c60c3a0a-145a-44b5-97a7-cb44fadc3ef6))
  (fp_line (start 0.225 1.25) (end 0.275 1.25)
    (stroke (width 0.1) (type default)) (layer "F.SilkS") (tstamp 5403a34b-b558-44e0-b106-d59b1fcb033c))
  (fp_line (start 0.75 -1.25) (end 1.5 -1.25)
    (stroke (width 0.1) (type default)) (layer "F.SilkS") (tstamp 151edd9d-8903-4d9d-94b0-229ad5d6de7d))
  (fp_line (start 1.5 -1.25) (end 1.5 -1)
    (stroke (width 0.1) (type default)) (layer "F.SilkS") (tstamp 317a241e-f5c7-4f46-b468-226cddcb6b18))
  (fp_line (start 1.5 -0.475) (end 1.5 -0.525)
    (stroke (width 0.1) (type default)) (layer "F.SilkS") (tstamp 530c215e-c42c-406a-b74f-ad1fe3b1c4bc))
  (fp_line (start 1.5 0.025) (end 1.5 -0.025)
    (stroke (width 0.1) (type default)) (layer "F.SilkS") (tstamp 1bef4132-bd7f-4f5e-9f4a-93efaf5cd2b6))
  (fp_line (start 1.5 0.524999) (end 1.5 0.475)
    (stroke (width 0.1) (type default)) (layer "F.SilkS") (tstamp 88b34354-8ae4-4fad-b82e-675d729d59fe))
  (fp_line (start 1.5 1) (end 1.5 1.25)
    (stroke (width 0.1) (type default)) (layer "F.SilkS") (tstamp a97a3ebe-7959-4e79-9634-bedb3f57b18e))
  (fp_line (start 1.5 1.25) (end 0.75 1.25)
    (stroke (width 0.1) (type default)) (layer "F.SilkS") (tstamp 7b8f6352-76b0-4eeb-bab5-d07d76827069))
  (fp_rect (start -1.7 -1.45) (end 1.7 1.45)
    (stroke (width 0.05) (type default)) (fill none) (layer "F.CrtYd") (tstamp 983ffb43-7532-4ab5-8682-a7efbcca62a2))
  (fp_poly
    (pts
      (xy -1.5 1.25)
      (xy 1.5 1.25)
      (xy 1.5 -1.25)
      (xy -1 -1.25)
      (xy -1.5 -0.75)
    )

    (stroke (width 0.1) (type solid)) (fill none) (layer "F.Fab") (tstamp 15619a43-5b02-4097-bb82-750a53bff5a9))
  (pad "1" smd roundrect (at -1.27 -0.75) (size 0.7 0.3) (layers "F.Cu" "F.Paste" "F.Mask") (roundrect_rratio 0.1666666667)
    (thermal_bridge_angle 45) (tstamp 1d0e60d1-0956-4171-8878-42769ec1bf7f))
  (pad "2" smd roundrect (at -1.27 -0.25) (size 0.7 0.3) (layers "F.Cu" "F.Paste" "F.Mask") (roundrect_rratio 0.1666666667)
    (thermal_bridge_angle 45) (tstamp 1f30b5a5-e96d-4cd0-bc35-6e7db4e2fe42))
  (pad "3" smd roundrect (at -1.27 0.25) (size 0.7 0.3) (layers "F.Cu" "F.Paste" "F.Mask") (roundrect_rratio 0.1666666667)
    (thermal_bridge_angle 45) (tstamp 5a3a846b-cbf7-4fad-86cf-004223d49db1))
  (pad "4" smd roundrect (at -1.27 0.75) (size 0.7 0.3) (layers "F.Cu" "F.Paste" "F.Mask") (roundrect_rratio 0.1666666667)
    (thermal_bridge_angle 45) (tstamp 8190487f-dfa6-4f31-ab98-248ba216b54c))
  (pad "5" smd roundrect (at -0.5 1.02 90) (size 0.7 0.3) (layers "F.Cu" "F.Paste" "F.Mask") (roundrect_rratio 0.1666666667)
    (thermal_bridge_angle 45) (tstamp f44d3b42-f337-49bd-b1c4-607bfbbb1786))
  (pad "6" smd roundrect (at 0 1.02 90) (size 0.7 0.3) (layers "F.Cu" "F.Paste" "F.Mask") (roundrect_rratio 0.1666666667)
    (thermal_bridge_angle 45) (tstamp a0d84e29-057c-40be-9794-e3e2fa0d68f6))
  (pad "7" smd roundrect (at 0.5 1.02 90) (size 0.7 0.3) (layers "F.Cu" "F.Paste" "F.Mask") (roundrect_rratio 0.1666666667)
    (thermal_bridge_angle 45) (tstamp c101809a-619e-4840-98c4-5e5881ab12a7))
  (pad "8" smd roundrect (at 1.27 0.75) (size 0.7 0.3) (layers "F.Cu" "F.Paste" "F.Mask") (roundrect_rratio 0.1666666667)
    (thermal_bridge_angle 45) (tstamp 3dd71d93-b85a-47a9-8e1c-c6f11a9789ed))
  (pad "9" smd roundrect (at 1.27 0.25) (size 0.7 0.3) (layers "F.Cu" "F.Paste" "F.Mask") (roundrect_rratio 0.1666666667)
    (thermal_bridge_angle 45) (tstamp a431719e-306e-4385-91b1-9bef382cac98))
  (pad "10" smd roundrect (at 1.27 -0.25) (size 0.7 0.3) (layers "F.Cu" "F.Paste" "F.Mask") (roundrect_rratio 0.1666666667)
    (thermal_bridge_angle 45) (tstamp 74cf572b-2381-4bd0-91f5-2d564ba8791b))
  (pad "11" smd roundrect (at 1.26 -0.75) (size 0.7 0.3) (layers "F.Cu" "F.Paste" "F.Mask") (roundrect_rratio 0.1666666667)
    (thermal_bridge_angle 45) (tstamp 04c1abdc-1fd6-4a34-a52c-bad2bb136d82))
  (pad "12" smd roundrect (at 0.5 -1.02 90) (size 0.7 0.3) (layers "F.Cu" "F.Paste" "F.Mask") (roundrect_rratio 0.1666666667)
    (thermal_bridge_angle 45) (tstamp 44c3ffa8-7b40-41a4-9807-2ecd78f0adcc))
  (pad "13" smd roundrect (at 0 -1.02 90) (size 0.7 0.3) (layers "F.Cu" "F.Paste" "F.Mask") (roundrect_rratio 0.1666666667)
    (thermal_bridge_angle 45) (tstamp 406bc2ca-e346-4fdc-9348-973b2e6d6455))
  (pad "14" smd roundrect (at -0.5 -1.02 90) (size 0.7 0.3) (layers "F.Cu" "F.Paste" "F.Mask") (roundrect_rratio 0.1666666667)
    (thermal_bridge_angle 45) (tstamp 6d1196df-cd8e-4267-b35b-9a16a886eee8))
  (model ":KICADLIB:model/QFN/LGA50P300X250-14.step"
    (offset (xyz 0 0 0))
    (scale (xyz 1 1 1))
    (rotate (xyz 0 0 0))
  )
)
