(module "CAPPR250-600X1250" (layer F.Cu) (tedit 5EBAD562)
  (descr "CP, Radial series, Radial, pin pitch=2.50mm, , diameter=6.3mm, Electrolytic Capacitor")
  (tags "CP Radial series Radial pin pitch 2.50mm  diameter 6.3mm Electrolytic Capacitor")
  (fp_text reference "REF**" (at 0 -4.1) (layer F.SilkS)
    (effects (font (size 1 1) (thickness 0.15)))
  )
  (fp_text value "CAPPR250-600X1250" (at 0 4.15) (layer F.Fab) hide
    (effects (font (size 1 1) (thickness 0.15)))
  )
  (fp_text user "${REFERENCE}" (at 0 0) (layer F.Fab)
    (effects (font (size 1 1) (thickness 0.15)))
  )
  (fp_line (start -3.185241 -2.154) (end -3.185241 -1.524) (layer F.SilkS) (width 0.12))
  (fp_line (start -3.500241 -1.839) (end -2.870241 -1.839) (layer F.SilkS) (width 0.12))
  (fp_line (start 3.241 -0.402) (end 3.241 0.402) (layer F.SilkS) (width 0.12))
  (fp_line (start 3.201 -0.633) (end 3.201 0.633) (layer F.SilkS) (width 0.12))
  (fp_line (start 3.161 -0.802) (end 3.161 0.802) (layer F.SilkS) (width 0.12))
  (fp_line (start 3.121 -0.94) (end 3.121 0.94) (layer F.SilkS) (width 0.12))
  (fp_line (start 3.081 -1.059) (end 3.081 1.059) (layer F.SilkS) (width 0.12))
  (fp_line (start 3.041 -1.165) (end 3.041 1.165) (layer F.SilkS) (width 0.12))
  (fp_line (start 3.001 -1.262) (end 3.001 1.262) (layer F.SilkS) (width 0.12))
  (fp_line (start 2.961 -1.35) (end 2.961 1.35) (layer F.SilkS) (width 0.12))
  (fp_line (start 2.921 -1.432) (end 2.921 1.432) (layer F.SilkS) (width 0.12))
  (fp_line (start 2.881 -1.509) (end 2.881 1.509) (layer F.SilkS) (width 0.12))
  (fp_line (start 2.841 -1.581) (end 2.841 1.581) (layer F.SilkS) (width 0.12))
  (fp_line (start 2.801 -1.65) (end 2.801 1.65) (layer F.SilkS) (width 0.12))
  (fp_line (start 2.761 -1.714) (end 2.761 1.714) (layer F.SilkS) (width 0.12))
  (fp_line (start 2.721 -1.776) (end 2.721 1.776) (layer F.SilkS) (width 0.12))
  (fp_line (start 2.681 -1.834) (end 2.681 1.834) (layer F.SilkS) (width 0.12))
  (fp_line (start 2.641 -1.89) (end 2.641 1.89) (layer F.SilkS) (width 0.12))
  (fp_line (start 2.601 -1.944) (end 2.601 1.944) (layer F.SilkS) (width 0.12))
  (fp_line (start 2.561 -1.995) (end 2.561 1.995) (layer F.SilkS) (width 0.12))
  (fp_line (start 2.521 -2.044) (end 2.521 2.044) (layer F.SilkS) (width 0.12))
  (fp_line (start 2.481 -2.092) (end 2.481 2.092) (layer F.SilkS) (width 0.12))
  (fp_line (start 2.441 -2.137) (end 2.441 2.137) (layer F.SilkS) (width 0.12))
  (fp_line (start 2.401 -2.182) (end 2.401 2.182) (layer F.SilkS) (width 0.12))
  (fp_line (start 2.361 -2.224) (end 2.361 2.224) (layer F.SilkS) (width 0.12))
  (fp_line (start 2.321 -2.265) (end 2.321 2.265) (layer F.SilkS) (width 0.12))
  (fp_line (start 2.281 1.04) (end 2.281 2.305) (layer F.SilkS) (width 0.12))
  (fp_line (start 2.281 -2.305) (end 2.281 -1.04) (layer F.SilkS) (width 0.12))
  (fp_line (start 2.241 1.04) (end 2.241 2.343) (layer F.SilkS) (width 0.12))
  (fp_line (start 2.241 -2.343) (end 2.241 -1.04) (layer F.SilkS) (width 0.12))
  (fp_line (start 2.201 1.04) (end 2.201 2.38) (layer F.SilkS) (width 0.12))
  (fp_line (start 2.201 -2.38) (end 2.201 -1.04) (layer F.SilkS) (width 0.12))
  (fp_line (start 2.161 1.04) (end 2.161 2.416) (layer F.SilkS) (width 0.12))
  (fp_line (start 2.161 -2.416) (end 2.161 -1.04) (layer F.SilkS) (width 0.12))
  (fp_line (start 2.121 1.04) (end 2.121 2.45) (layer F.SilkS) (width 0.12))
  (fp_line (start 2.121 -2.45) (end 2.121 -1.04) (layer F.SilkS) (width 0.12))
  (fp_line (start 2.081 1.04) (end 2.081 2.484) (layer F.SilkS) (width 0.12))
  (fp_line (start 2.081 -2.484) (end 2.081 -1.04) (layer F.SilkS) (width 0.12))
  (fp_line (start 2.041 1.04) (end 2.041 2.516) (layer F.SilkS) (width 0.12))
  (fp_line (start 2.041 -2.516) (end 2.041 -1.04) (layer F.SilkS) (width 0.12))
  (fp_line (start 2.001 1.04) (end 2.001 2.548) (layer F.SilkS) (width 0.12))
  (fp_line (start 2.001 -2.548) (end 2.001 -1.04) (layer F.SilkS) (width 0.12))
  (fp_line (start 1.961 1.04) (end 1.961 2.578) (layer F.SilkS) (width 0.12))
  (fp_line (start 1.961 -2.578) (end 1.961 -1.04) (layer F.SilkS) (width 0.12))
  (fp_line (start 1.921 1.04) (end 1.921 2.607) (layer F.SilkS) (width 0.12))
  (fp_line (start 1.921 -2.607) (end 1.921 -1.04) (layer F.SilkS) (width 0.12))
  (fp_line (start 1.881 1.04) (end 1.881 2.636) (layer F.SilkS) (width 0.12))
  (fp_line (start 1.881 -2.636) (end 1.881 -1.04) (layer F.SilkS) (width 0.12))
  (fp_line (start 1.841 1.04) (end 1.841 2.664) (layer F.SilkS) (width 0.12))
  (fp_line (start 1.841 -2.664) (end 1.841 -1.04) (layer F.SilkS) (width 0.12))
  (fp_line (start 1.801 1.04) (end 1.801 2.69) (layer F.SilkS) (width 0.12))
  (fp_line (start 1.801 -2.69) (end 1.801 -1.04) (layer F.SilkS) (width 0.12))
  (fp_line (start 1.761 1.04) (end 1.761 2.716) (layer F.SilkS) (width 0.12))
  (fp_line (start 1.761 -2.716) (end 1.761 -1.04) (layer F.SilkS) (width 0.12))
  (fp_line (start 1.721 1.04) (end 1.721 2.742) (layer F.SilkS) (width 0.12))
  (fp_line (start 1.721 -2.742) (end 1.721 -1.04) (layer F.SilkS) (width 0.12))
  (fp_line (start 1.681 1.04) (end 1.681 2.766) (layer F.SilkS) (width 0.12))
  (fp_line (start 1.681 -2.766) (end 1.681 -1.04) (layer F.SilkS) (width 0.12))
  (fp_line (start 1.641 1.04) (end 1.641 2.79) (layer F.SilkS) (width 0.12))
  (fp_line (start 1.641 -2.79) (end 1.641 -1.04) (layer F.SilkS) (width 0.12))
  (fp_line (start 1.601 1.04) (end 1.601 2.812) (layer F.SilkS) (width 0.12))
  (fp_line (start 1.601 -2.812) (end 1.601 -1.04) (layer F.SilkS) (width 0.12))
  (fp_line (start 1.561 1.04) (end 1.561 2.834) (layer F.SilkS) (width 0.12))
  (fp_line (start 1.561 -2.834) (end 1.561 -1.04) (layer F.SilkS) (width 0.12))
  (fp_line (start 1.521 1.04) (end 1.521 2.856) (layer F.SilkS) (width 0.12))
  (fp_line (start 1.521 -2.856) (end 1.521 -1.04) (layer F.SilkS) (width 0.12))
  (fp_line (start 1.481 1.04) (end 1.481 2.876) (layer F.SilkS) (width 0.12))
  (fp_line (start 1.481 -2.876) (end 1.481 -1.04) (layer F.SilkS) (width 0.12))
  (fp_line (start 1.441 1.04) (end 1.441 2.896) (layer F.SilkS) (width 0.12))
  (fp_line (start 1.441 -2.896) (end 1.441 -1.04) (layer F.SilkS) (width 0.12))
  (fp_line (start 1.401 1.04) (end 1.401 2.916) (layer F.SilkS) (width 0.12))
  (fp_line (start 1.401 -2.916) (end 1.401 -1.04) (layer F.SilkS) (width 0.12))
  (fp_line (start 1.361 1.04) (end 1.361 2.934) (layer F.SilkS) (width 0.12))
  (fp_line (start 1.361 -2.934) (end 1.361 -1.04) (layer F.SilkS) (width 0.12))
  (fp_line (start 1.321 1.04) (end 1.321 2.952) (layer F.SilkS) (width 0.12))
  (fp_line (start 1.321 -2.952) (end 1.321 -1.04) (layer F.SilkS) (width 0.12))
  (fp_line (start 1.281 1.04) (end 1.281 2.97) (layer F.SilkS) (width 0.12))
  (fp_line (start 1.281 -2.97) (end 1.281 -1.04) (layer F.SilkS) (width 0.12))
  (fp_line (start 1.241 1.04) (end 1.241 2.986) (layer F.SilkS) (width 0.12))
  (fp_line (start 1.241 -2.986) (end 1.241 -1.04) (layer F.SilkS) (width 0.12))
  (fp_line (start 1.201 1.04) (end 1.201 3.002) (layer F.SilkS) (width 0.12))
  (fp_line (start 1.201 -3.002) (end 1.201 -1.04) (layer F.SilkS) (width 0.12))
  (fp_line (start 1.161 1.04) (end 1.161 3.018) (layer F.SilkS) (width 0.12))
  (fp_line (start 1.161 -3.018) (end 1.161 -1.04) (layer F.SilkS) (width 0.12))
  (fp_line (start 1.121 1.04) (end 1.121 3.033) (layer F.SilkS) (width 0.12))
  (fp_line (start 1.121 -3.033) (end 1.121 -1.04) (layer F.SilkS) (width 0.12))
  (fp_line (start 1.081 1.04) (end 1.081 3.047) (layer F.SilkS) (width 0.12))
  (fp_line (start 1.081 -3.047) (end 1.081 -1.04) (layer F.SilkS) (width 0.12))
  (fp_line (start 1.041 1.04) (end 1.041 3.061) (layer F.SilkS) (width 0.12))
  (fp_line (start 1.041 -3.061) (end 1.041 -1.04) (layer F.SilkS) (width 0.12))
  (fp_line (start 1.001 1.04) (end 1.001 3.074) (layer F.SilkS) (width 0.12))
  (fp_line (start 1.001 -3.074) (end 1.001 -1.04) (layer F.SilkS) (width 0.12))
  (fp_line (start 0.961 1.04) (end 0.961 3.086) (layer F.SilkS) (width 0.12))
  (fp_line (start 0.961 -3.086) (end 0.961 -1.04) (layer F.SilkS) (width 0.12))
  (fp_line (start 0.921 1.04) (end 0.921 3.098) (layer F.SilkS) (width 0.12))
  (fp_line (start 0.921 -3.098) (end 0.921 -1.04) (layer F.SilkS) (width 0.12))
  (fp_line (start 0.881 1.04) (end 0.881 3.11) (layer F.SilkS) (width 0.12))
  (fp_line (start 0.881 -3.11) (end 0.881 -1.04) (layer F.SilkS) (width 0.12))
  (fp_line (start 0.841 1.04) (end 0.841 3.121) (layer F.SilkS) (width 0.12))
  (fp_line (start 0.841 -3.121) (end 0.841 -1.04) (layer F.SilkS) (width 0.12))
  (fp_line (start 0.801 1.04) (end 0.801 3.131) (layer F.SilkS) (width 0.12))
  (fp_line (start 0.801 -3.131) (end 0.801 -1.04) (layer F.SilkS) (width 0.12))
  (fp_line (start 0.761 1.04) (end 0.761 3.141) (layer F.SilkS) (width 0.12))
  (fp_line (start 0.761 -3.141) (end 0.761 -1.04) (layer F.SilkS) (width 0.12))
  (fp_line (start 0.721 1.04) (end 0.721 3.15) (layer F.SilkS) (width 0.12))
  (fp_line (start 0.721 -3.15) (end 0.721 -1.04) (layer F.SilkS) (width 0.12))
  (fp_line (start 0.68 1.04) (end 0.68 3.159) (layer F.SilkS) (width 0.12))
  (fp_line (start 0.68 -3.159) (end 0.68 -1.04) (layer F.SilkS) (width 0.12))
  (fp_line (start 0.64 1.04) (end 0.64 3.167) (layer F.SilkS) (width 0.12))
  (fp_line (start 0.64 -3.167) (end 0.64 -1.04) (layer F.SilkS) (width 0.12))
  (fp_line (start 0.6 1.04) (end 0.6 3.175) (layer F.SilkS) (width 0.12))
  (fp_line (start 0.6 -3.175) (end 0.6 -1.04) (layer F.SilkS) (width 0.12))
  (fp_line (start 0.56 1.04) (end 0.56 3.182) (layer F.SilkS) (width 0.12))
  (fp_line (start 0.56 -3.182) (end 0.56 -1.04) (layer F.SilkS) (width 0.12))
  (fp_line (start 0.52 1.04) (end 0.52 3.189) (layer F.SilkS) (width 0.12))
  (fp_line (start 0.52 -3.189) (end 0.52 -1.04) (layer F.SilkS) (width 0.12))
  (fp_line (start 0.48 1.04) (end 0.48 3.195) (layer F.SilkS) (width 0.12))
  (fp_line (start 0.48 -3.195) (end 0.48 -1.04) (layer F.SilkS) (width 0.12))
  (fp_line (start 0.44 1.04) (end 0.44 3.201) (layer F.SilkS) (width 0.12))
  (fp_line (start 0.44 -3.201) (end 0.44 -1.04) (layer F.SilkS) (width 0.12))
  (fp_line (start 0.4 1.04) (end 0.4 3.206) (layer F.SilkS) (width 0.12))
  (fp_line (start 0.4 -3.206) (end 0.4 -1.04) (layer F.SilkS) (width 0.12))
  (fp_line (start 0.36 1.04) (end 0.36 3.211) (layer F.SilkS) (width 0.12))
  (fp_line (start 0.36 -3.211) (end 0.36 -1.04) (layer F.SilkS) (width 0.12))
  (fp_line (start 0.32 1.04) (end 0.32 3.215) (layer F.SilkS) (width 0.12))
  (fp_line (start 0.32 -3.215) (end 0.32 -1.04) (layer F.SilkS) (width 0.12))
  (fp_line (start 0.28 1.04) (end 0.28 3.218) (layer F.SilkS) (width 0.12))
  (fp_line (start 0.28 -3.218) (end 0.28 -1.04) (layer F.SilkS) (width 0.12))
  (fp_line (start 0.24 1.04) (end 0.24 3.222) (layer F.SilkS) (width 0.12))
  (fp_line (start 0.24 -3.222) (end 0.24 -1.04) (layer F.SilkS) (width 0.12))
  (fp_line (start 0.2 -3.224) (end 0.2 3.224) (layer F.SilkS) (width 0.12))
  (fp_line (start 0.16 -3.227) (end 0.16 3.227) (layer F.SilkS) (width 0.12))
  (fp_line (start 0.12 -3.228) (end 0.12 3.228) (layer F.SilkS) (width 0.12))
  (fp_line (start 0.08 -3.23) (end 0.08 3.23) (layer F.SilkS) (width 0.12))
  (fp_line (start 0.04 -3.23) (end 0.04 3.23) (layer F.SilkS) (width 0.12))
  (fp_line (start 0 -3.23) (end 0 3.23) (layer F.SilkS) (width 0.12))
  (fp_line (start -2.378972 -1.6885) (end -2.378972 -1.0585) (layer F.Fab) (width 0.1))
  (fp_line (start -2.693972 -1.3735) (end -2.063972 -1.3735) (layer F.Fab) (width 0.1))
  (fp_circle (center 0 0) (end 3.4 0) (layer F.CrtYd) (width 0.05))
  (fp_circle (center 0 0) (end 3.27 0) (layer F.SilkS) (width 0.12))
  (fp_circle (center 0 0) (end 3.15 0) (layer F.Fab) (width 0.1))
  (pad "1" thru_hole rect (at -1.25 0) (size 1.6 1.6) (drill 0.8) (layers *.Cu *.Mask) (tstamp ed9f9299-2c9f-4239-b4d5-7cb56197df0f))
  (pad "2" thru_hole circle (at 1.25 0) (size 1.6 1.6) (drill 0.8) (layers *.Cu *.Mask) (tstamp 2e6c6007-04a7-48e9-8d30-cc73939001ee))
  (model "${KICADLIB}/model/passive/CAPPR250-600X1250.step"
    (offset (xyz 0 0 12.6))
    (scale (xyz 1 1 1))
    (rotate (xyz 90 -90 0))
  )
)
