(footprint "PinHeader_1x03_P2.54mm_Horizontal" (version 20210722) (generator pcbnew) (layer "F.Cu")
  (tedit 6116C4DD)
  (descr "Through hole angled pin header, 1x03, 2.54mm pitch, 6mm pin length, single row")
  (tags "Through hole angled pin header THT 1x03 2.54mm single row")
  (attr through_hole)
  (fp_text reference "REF**" (at -1.75 -0.04 270) (layer "F.SilkS")
    (effects (font (size 1 1) (thickness 0.15)))
    (tstamp ee15095e-1767-4101-a749-8b5e176b613d)
  )
  (fp_text value "PinHeader_1x03_P2.54mm_Horizontal" (at 4.385 4.81) (layer "F.Fab") hide
    (effects (font (size 1 1) (thickness 0.15)))
    (tstamp 5b434254-3d9c-4219-92fd-11f7a8232994)
  )
  (fp_text user "^" (at -1.75 -2.54 270 unlocked) (layer "F.SilkS")
    (effects (font (size 1 1) (thickness 0.15)))
    (tstamp a84183d3-d9de-468d-abb3-a4c8afbe5364)
  )
  (fp_text user "${REFERENCE}" (at 2.77 0 90) (layer "F.Fab")
    (effects (font (size 1 1) (thickness 0.15)))
    (tstamp 74b06a46-b461-4b4b-a4ab-893b1c996d01)
  )
  (fp_line (start 10.1 2.16) (end 10.1 2.92) (layer "F.SilkS") (width 0.12) (tstamp 18c6d1f2-7f5a-4c6c-9728-a892baedb259))
  (fp_line (start 10.1 2.92) (end 4.1 2.92) (layer "F.SilkS") (width 0.12) (tstamp 1a3fb7ee-9e23-40a7-8e3a-6c4a267b51d9))
  (fp_line (start 10.1 -0.38) (end 10.1 0.38) (layer "F.SilkS") (width 0.12) (tstamp 392a9f18-28f5-44a2-9778-8f9fd8ed4ecb))
  (fp_line (start 1.042929 2.92) (end 1.44 2.92) (layer "F.SilkS") (width 0.12) (tstamp 3b47e5aa-e07b-4b76-b023-a929ed3a34c4))
  (fp_line (start 10.1 -2.92) (end 10.1 -2.16) (layer "F.SilkS") (width 0.12) (tstamp 40ac8e58-8825-4f02-b7f0-be432b199399))
  (fp_line (start 4.1 -3.87) (end 1.44 -3.87) (layer "F.SilkS") (width 0.12) (tstamp 56f32558-a90a-49f4-a0cb-7443d5311d69))
  (fp_line (start 10.1 0.38) (end 4.1 0.38) (layer "F.SilkS") (width 0.12) (tstamp 5c9f0311-5bc9-4a21-b0ef-c5cf3c1ea72f))
  (fp_line (start 4.1 -0.38) (end 10.1 -0.38) (layer "F.SilkS") (width 0.12) (tstamp 61c7b14d-f039-44b2-9f0f-e68ede462df0))
  (fp_line (start 4.1 -2.62) (end 10.1 -2.62) (layer "F.SilkS") (width 0.12) (tstamp 6848915e-cb7f-48e3-bf7f-3cda1376fc3a))
  (fp_line (start 10.1 -2.16) (end 4.1 -2.16) (layer "F.SilkS") (width 0.12) (tstamp 77b44efb-0045-4ab2-b678-012df35ce6d5))
  (fp_line (start 4.1 2.16) (end 10.1 2.16) (layer "F.SilkS") (width 0.12) (tstamp 8076e8cd-5ce1-4497-877d-909774817378))
  (fp_line (start 4.1 -2.92) (end 10.1 -2.92) (layer "F.SilkS") (width 0.12) (tstamp 915d0254-f292-4fb0-ba92-687532fc6832))
  (fp_line (start 1.042929 2.16) (end 1.44 2.16) (layer "F.SilkS") (width 0.12) (tstamp 931fd4bf-8f6a-4398-aa65-e171f9897f0b))
  (fp_line (start 4.1 -2.5) (end 10.1 -2.5) (layer "F.SilkS") (width 0.12) (tstamp 99a600d6-a884-4954-831f-97b8a8204454))
  (fp_line (start 1.042929 0.38) (end 1.44 0.38) (layer "F.SilkS") (width 0.12) (tstamp 9a7078ce-b0ad-485b-b161-4a0dd305f281))
  (fp_line (start 1.11 -2.16) (end 1.44 -2.16) (layer "F.SilkS") (width 0.12) (tstamp 9cdb0d45-50d1-4099-94dd-42a4857e765c))
  (fp_line (start 1.44 -3.87) (end 1.44 3.87) (layer "F.SilkS") (width 0.12) (tstamp 9f0f9041-7e59-4b50-85ee-f3a649d07716))
  (fp_line (start 1.042929 -0.38) (end 1.44 -0.38) (layer "F.SilkS") (width 0.12) (tstamp a9cf588b-fa4a-410b-ae5c-8609cfa4309e))
  (fp_line (start 1.44 -1.27) (end 4.1 -1.27) (layer "F.SilkS") (width 0.12) (tstamp ba36dd09-7e7e-420a-8a14-312a9ae63da7))
  (fp_line (start 4.1 -2.26) (end 10.1 -2.26) (layer "F.SilkS") (width 0.12) (tstamp c3336fd1-204f-45a3-a555-0296df70dfc1))
  (fp_line (start 4.1 3.87) (end 4.1 -3.87) (layer "F.SilkS") (width 0.12) (tstamp c4e6e39a-713b-4e4d-ae58-8e68671f6568))
  (fp_line (start 4.1 -2.74) (end 10.1 -2.74) (layer "F.SilkS") (width 0.12) (tstamp c51a287c-ed9d-4d6e-9f32-849ecf7644bd))
  (fp_line (start 4.1 -2.86) (end 10.1 -2.86) (layer "F.SilkS") (width 0.12) (tstamp c6e12eae-0887-4241-891a-411edcd94c59))
  (fp_line (start 1.44 3.87) (end 4.1 3.87) (layer "F.SilkS") (width 0.12) (tstamp d9186c75-d7d1-4235-b032-5f8a27e1ca7c))
  (fp_line (start 1.44 1.27) (end 4.1 1.27) (layer "F.SilkS") (width 0.12) (tstamp dcc801d8-44c4-4955-9949-a0524c429878))
  (fp_line (start 1.11 -2.92) (end 1.44 -2.92) (layer "F.SilkS") (width 0.12) (tstamp e6aa08db-344d-4fa6-aa42-e0d2f81bfd7d))
  (fp_line (start 4.1 -2.38) (end 10.1 -2.38) (layer "F.SilkS") (width 0.12) (tstamp e7e21fab-d75a-4215-a736-b45858afad81))
  (fp_line (start 10.55 -4.34) (end -1.8 -4.34) (layer "F.CrtYd") (width 0.05) (tstamp 37975a2f-b777-4489-9b24-5f250cbadf42))
  (fp_line (start 10.55 4.31) (end 10.55 -4.34) (layer "F.CrtYd") (width 0.05) (tstamp 9005bdbd-5d0b-424f-bcbb-6604d4582257))
  (fp_line (start -1.8 4.31) (end 10.55 4.31) (layer "F.CrtYd") (width 0.05) (tstamp a33422da-39a1-483f-b1e3-ecfa2e5f836e))
  (fp_line (start -1.8 -4.34) (end -1.8 4.31) (layer "F.CrtYd") (width 0.05) (tstamp aa645895-ca4b-4de8-910f-5882824eb96b))
  (fp_line (start -0.32 -0.32) (end -0.32 0.32) (layer "F.Fab") (width 0.1) (tstamp 10d939d7-a9eb-4e5f-98e2-49038ba51833))
  (fp_line (start 4.04 2.86) (end 10.04 2.86) (layer "F.Fab") (width 0.1) (tstamp 1e562e8d-f8dd-46c3-a7e1-2b3adacf8d2c))
  (fp_line (start 4.04 3.81) (end 1.5 3.81) (layer "F.Fab") (width 0.1) (tstamp 1fca9ffe-bc5e-467a-a87a-bcde8aa312c4))
  (fp_line (start 10.04 -0.32) (end 10.04 0.32) (layer "F.Fab") (width 0.1) (tstamp 2a447dcc-214e-4bef-83af-5e337f16d032))
  (fp_line (start 10.04 -2.86) (end 10.04 -2.22) (layer "F.Fab") (width 0.1) (tstamp 3ea354ec-014f-47bd-9ecd-765c25c503e6))
  (fp_line (start 2.135 -3.81) (end 4.04 -3.81) (layer "F.Fab") (width 0.1) (tstamp 4c2fe8b4-7ba1-408a-bdcf-59084b706de7))
  (fp_line (start 4.04 -3.81) (end 4.04 3.81) (layer "F.Fab") (width 0.1) (tstamp 71c78e20-b521-47d7-9e37-3317b98ff36d))
  (fp_line (start 4.04 -0.32) (end 10.04 -0.32) (layer "F.Fab") (width 0.1) (tstamp 7423ab2a-2e5b-434f-90b7-3f2ad2ae3dec))
  (fp_line (start -0.32 -2.22) (end 1.5 -2.22) (layer "F.Fab") (width 0.1) (tstamp 796c8751-c94e-4bda-a8e7-13ed1544bd7a))
  (fp_line (start -0.32 -0.32) (end 1.5 -0.32) (layer "F.Fab") (width 0.1) (tstamp 95024269-02e7-44ce-be53-0433133265b5))
  (fp_line (start -0.32 2.86) (end 1.5 2.86) (layer "F.Fab") (width 0.1) (tstamp a0f16dd7-d8d4-41be-80a6-2afc4d906d42))
  (fp_line (start -0.32 2.22) (end -0.32 2.86) (layer "F.Fab") (width 0.1) (tstamp a7fb5640-f8ff-4267-939f-f72c98c3b8be))
  (fp_line (start 10.04 2.22) (end 10.04 2.86) (layer "F.Fab") (width 0.1) (tstamp aa0b783c-d711-45e0-bc8e-541d469b4459))
  (fp_line (start -0.32 -2.86) (end -0.32 -2.22) (layer "F.Fab") (width 0.1) (tstamp bbc29be1-aa60-499a-bfed-c8f66b5ff630))
  (fp_line (start -0.32 -2.86) (end 1.5 -2.86) (layer "F.Fab") (width 0.1) (tstamp c27500c1-9126-412d-b0ef-109d40bf604d))
  (fp_line (start 4.04 -2.86) (end 10.04 -2.86) (layer "F.Fab") (width 0.1) (tstamp c44211ec-946f-460b-ba9f-90b590fd3ba2))
  (fp_line (start -0.32 2.22) (end 1.5 2.22) (layer "F.Fab") (width 0.1) (tstamp cb068ac6-672a-43a1-bb2a-be4b17325b30))
  (fp_line (start 4.04 0.32) (end 10.04 0.32) (layer "F.Fab") (width 0.1) (tstamp cbf06438-7eac-48f9-8ec8-6a0454dcb72e))
  (fp_line (start 4.04 2.22) (end 10.04 2.22) (layer "F.Fab") (width 0.1) (tstamp e46e7fa4-f297-4666-83d2-bdd272271627))
  (fp_line (start 1.5 3.81) (end 1.5 -3.175) (layer "F.Fab") (width 0.1) (tstamp e712882c-0b86-4b9f-9a95-2d748bff6ff4))
  (fp_line (start -0.32 0.32) (end 1.5 0.32) (layer "F.Fab") (width 0.1) (tstamp eef24566-4dd6-4246-80a0-c74716f02f55))
  (fp_line (start 1.5 -3.175) (end 2.135 -3.81) (layer "F.Fab") (width 0.1) (tstamp f2c07e13-e26a-4b71-99cf-6e2bf39147df))
  (fp_line (start 4.04 -2.22) (end 10.04 -2.22) (layer "F.Fab") (width 0.1) (tstamp f7def1de-d24e-4ea2-b09b-5c5607c9a542))
  (pad "1" thru_hole rect (at 0 -2.54) (size 1.7 1.7) (drill 1) (layers *.Cu *.Mask) (tstamp aaced0e3-5385-4c44-bea1-420283887bb3))
  (pad "2" thru_hole oval (at 0 0) (size 1.7 1.7) (drill 1) (layers *.Cu *.Mask) (tstamp 1fb8d1e0-8e9d-482d-af86-3403801f1ffb))
  (pad "3" thru_hole oval (at 0 2.54) (size 1.7 1.7) (drill 1) (layers *.Cu *.Mask) (tstamp e9bc31ed-df08-437c-af1f-1fbb10c0fead))
  (model "${KICADLIB}/model/connector/PinHeader_1x03_P2.54mm_Horizontal.step"
    (offset (xyz 0 2.54 0))
    (scale (xyz 1 1 1))
    (rotate (xyz 0 0 0))
  )
)
