(footprint "QFN40P200X170-12" (version 20210424) (generator pcbnew) (layer "F.Cu")
  (tedit 60B8E200)
  (fp_text reference "REF**" (at 0 -1.95 unlocked) (layer "F.SilkS")
    (effects (font (size 1 1) (thickness 0.15)))
    (tstamp f54eb775-cd6d-45c3-a448-1f8970819d61)
  )
  (fp_text value "QFN40P200X170-12" (at 0 1 unlocked) (layer "F.Fab") hide
    (effects (font (size 1 1) (thickness 0.15)))
    (tstamp b59010ad-4042-490e-8195-2cf4b4eebd8d)
  )
  (fp_text user "^" (at -1.8 -0.95 270 unlocked) (layer "F.SilkS")
    (effects (font (size 1 1) (thickness 0.15)))
    (tstamp 9a213b16-81b6-4bdb-82a7-8d0aff7b0070)
  )
  (fp_text user "${REFERENCE}" (at 0.05 0.05 90 unlocked) (layer "F.Fab")
    (effects (font (size 0.4 0.4) (thickness 0.05)))
    (tstamp 2e06436e-ef13-4a9d-a295-6877f99dc257)
  )
  (fp_line (start -0.2 1) (end -0.85 1) (layer "F.SilkS") (width 0.1) (tstamp 26968264-145a-4949-8ef4-3c238912f708))
  (fp_line (start 0.85 1) (end 0.2 1) (layer "F.SilkS") (width 0.1) (tstamp 6478b276-da79-453f-b689-d7aaf7e79a76))
  (fp_line (start 0.85 -1) (end 0.2 -1) (layer "F.SilkS") (width 0.1) (tstamp 787c6f01-1068-4921-bd9b-1af341772e97))
  (fp_line (start -1.15 1.25) (end -1.15 -1.25) (layer "F.CrtYd") (width 0.05) (tstamp 705b6ff0-0fc6-4ead-93e7-b6d35dda883b))
  (fp_line (start 1.15 1.25) (end -1.15 1.25) (layer "F.CrtYd") (width 0.05) (tstamp 8e37e297-85af-4b99-85d9-1451e49b3f2a))
  (fp_line (start 1.15 -1.25) (end 1.15 1.25) (layer "F.CrtYd") (width 0.05) (tstamp ce407beb-5e17-49b5-b5a4-8e1ed1eea1f9))
  (fp_line (start -1.15 -1.25) (end 1.15 -1.25) (layer "F.CrtYd") (width 0.05) (tstamp e7521bf2-f158-456c-8e5c-5d211249c26f))
  (fp_line (start -0.85 1) (end -0.85 -0.65) (layer "F.Fab") (width 0.1) (tstamp 490167e1-be51-42a5-b15e-cdf32e4d31ed))
  (fp_line (start 0.85 -1) (end 0.85 1) (layer "F.Fab") (width 0.1) (tstamp 65fc0913-38d0-49bb-8ff2-cbcff329f487))
  (fp_line (start -0.5 -1) (end 0.85 -1) (layer "F.Fab") (width 0.1) (tstamp 9633af44-dd22-4056-8849-c64d745ef6ae))
  (fp_line (start -0.85 -0.65) (end -0.5 -1) (layer "F.Fab") (width 0.1) (tstamp a5107759-5e57-4301-ab7b-528a545a7739))
  (fp_line (start 0.85 1) (end -0.85 1) (layer "F.Fab") (width 0.1) (tstamp da1eaff0-549e-456b-9376-7ddbb474a392))
  (pad "1" smd rect (at -0.7 -0.95 270) (size 0.32 0.68) (layers "F.Cu" "F.Paste" "F.Mask") (tstamp 1840292c-3e02-43e8-ac85-471bd9c1dad4))
  (pad "2" smd rect (at -0.7 -0.4 90) (size 0.22 0.68) (layers "F.Cu" "F.Paste" "F.Mask") (tstamp 8cb8baf5-a3af-40a5-a906-2c6ac1c277ff))
  (pad "3" smd rect (at -0.7 0 90) (size 0.22 0.68) (layers "F.Cu" "F.Paste" "F.Mask") (tstamp 0a16436f-f77d-49f5-b643-70564a541556))
  (pad "4" smd rect (at -0.7 0.4 90) (size 0.22 0.68) (layers "F.Cu" "F.Paste" "F.Mask") (tstamp 77cc3e2b-25b3-4629-9615-c50ba3dcc92f))
  (pad "5" smd rect (at -0.7 0.8 90) (size 0.22 0.68) (layers "F.Cu" "F.Paste" "F.Mask") (tstamp 967f066d-f7d5-4cac-8e32-53b03ec63aaf))
  (pad "6" smd rect (at 0 0.85 180) (size 0.22 0.68) (layers "F.Cu" "F.Paste" "F.Mask") (tstamp 904c4464-edee-4481-b223-12e6657e4d75))
  (pad "7" smd rect (at 0.7 0.8 90) (size 0.22 0.68) (layers "F.Cu" "F.Paste" "F.Mask") (tstamp a46c7112-5abb-4f0b-aaaf-7c726bdb8171))
  (pad "8" smd rect (at 0.7 0.4 90) (size 0.22 0.68) (layers "F.Cu" "F.Paste" "F.Mask") (tstamp 55773708-7ed1-47d1-a3c3-ed34f71247ff))
  (pad "9" smd rect (at 0.7 0 90) (size 0.22 0.68) (layers "F.Cu" "F.Paste" "F.Mask") (tstamp 65763712-d824-4049-a871-317df5b37f2d))
  (pad "10" smd rect (at 0.7 -0.4 90) (size 0.22 0.68) (layers "F.Cu" "F.Paste" "F.Mask") (tstamp 45abaa0a-72de-4151-aab8-3738a5d90cca))
  (pad "11" smd rect (at 0.7 -0.8 90) (size 0.22 0.68) (layers "F.Cu" "F.Paste" "F.Mask") (tstamp a57ff07c-8a04-4cba-bdee-c7f1680ea947))
  (pad "12" smd rect (at 0 -0.85 180) (size 0.22 0.68) (layers "F.Cu" "F.Paste" "F.Mask") (tstamp 5f05173f-adef-4cc0-9f23-4001f0dd5f09))
  (model "${KICADLIB}/model/QFN/QFN40P200X170-12.step"
    (offset (xyz 0 0 0.05))
    (scale (xyz 1 1 1))
    (rotate (xyz 0 0 0))
  )
)
