(module "Bosch_MEMS_2500umSqr" (layer F.Cu) (tedit 5E55AC2F)
  (attr smd)
  (fp_text reference "REF**" (at 0 -2) (layer F.SilkS)
    (effects (font (size 1 1) (thickness 0.15)))
  )
  (fp_text value "Bosch_MEMS_2500umSqr" (at 0 2.425) (layer F.Fab) hide
    (effects (font (size 1 1) (thickness 0.15)))
  )
  (fp_line (start 1.5 -0.975) (end 1.6 -0.875) (layer F.SilkS) (width 0.1))
  (fp_line (start 1.5 -0.975) (end 1.6 -1.075) (layer F.SilkS) (width 0.1))
  (fp_line (start -1.25 0.575) (end -1.25 0.725) (layer F.SilkS) (width 0.1))
  (fp_line (start -1.25 -0.075) (end -1.25 0.075) (layer F.SilkS) (width 0.1))
  (fp_line (start 1.25 -0.575) (end 1.25 -0.725) (layer F.SilkS) (width 0.1))
  (fp_line (start 1.25 0.075) (end 1.25 -0.075) (layer F.SilkS) (width 0.1))
  (fp_line (start 1.25 0.725) (end 1.25 0.575) (layer F.SilkS) (width 0.1))
  (fp_line (start -1.25 -0.725) (end -1.25 -0.575) (layer F.SilkS) (width 0.1))
  (fp_line (start 1.25 -1.25) (end -1.25 -1.25) (layer F.SilkS) (width 0.1))
  (fp_line (start -1.25 1.25) (end 1.25 1.25) (layer F.SilkS) (width 0.1))
  (pad "8" smd rect (at -1.1 -0.975) (size 0.65 0.35) (layers "F.Cu" "F.Paste" "F.Mask"))
  (pad "7" smd rect (at -1.1 -0.325) (size 0.65 0.35) (layers "F.Cu" "F.Paste" "F.Mask"))
  (pad "6" smd rect (at -1.1 0.325) (size 0.65 0.35) (layers "F.Cu" "F.Paste" "F.Mask"))
  (pad "5" smd rect (at -1.1 0.975) (size 0.65 0.35) (layers "F.Cu" "F.Paste" "F.Mask"))
  (pad "4" smd rect (at 1.1 0.975) (size 0.65 0.35) (layers "F.Cu" "F.Paste" "F.Mask"))
  (pad "3" smd rect (at 1.1 0.325) (size 0.65 0.35) (layers "F.Cu" "F.Paste" "F.Mask"))
  (pad "2" smd rect (at 1.1 -0.325) (size 0.65 0.35) (layers "F.Cu" "F.Paste" "F.Mask"))
  (pad "1" smd rect (at 1.1 -0.975) (size 0.65 0.35) (layers "F.Cu" "F.Paste" "F.Mask"))
  (model "${KICADLIB}/model/other/Bosch_MEMS_2500umSqr.step"
    (at (xyz 0 0 0))
    (scale (xyz 1 1 1))
    (rotate (xyz 0 0 90))
  )
)
