(module "TT_EN11-VSM" (layer F.Cu) (tedit 5EBB031C)
  (fp_text reference "REF**" (at 0 -4.1 180 unlocked) (layer F.SilkS)
    (effects (font (size 1 1) (thickness 0.15)))
  )
  (fp_text value "TT_EN11-VSM" (at 0 4 unlocked) (layer F.Fab) hide
    (effects (font (size 1 1) (thickness 0.15)))
  )
  (fp_line (start -5.8 0) (end -5.8 2.7) (layer F.SilkS) (width 0.12))
  (fp_line (start -5.8 2.7) (end 5.8 2.7) (layer F.SilkS) (width 0.12))
  (fp_line (start 5.8 0) (end 5.8 2.7) (layer F.SilkS) (width 0.12))
  (fp_line (start -8.4 -4) (end -8.4 3) (layer F.CrtYd) (width 0.12))
  (fp_line (start -8.4 3) (end 8.4 3) (layer F.CrtYd) (width 0.12))
  (fp_line (start 8.4 3) (end 8.4 -4) (layer F.CrtYd) (width 0.12))
  (fp_line (start 8.4 -4) (end -8.4 -4) (layer F.CrtYd) (width 0.12))
  (fp_text user "${REFERENCE}" (at 0 0 unlocked) (layer F.Fab)
    (effects (font (size 1 1) (thickness 0.15)))
  )
  (fp_line (start 5.8 2.7) (end -5.8 2.7) (layer F.Fab) (width 0.1))
  (fp_line (start -5.8 2.7) (end -5.8 -3) (layer F.Fab) (width 0.1))
  (fp_line (start -5.8 -3) (end 4 -3) (layer F.Fab) (width 0.1))
  (fp_line (start 4 -3) (end 5.8 -1.2) (layer F.Fab) (width 0.1))
  (fp_line (start 5.8 -1.2) (end 5.8 2.7) (layer F.Fab) (width 0.1))
  (pad "A" thru_hole circle (at -2.5 0) (size 2 2) (drill 1.1) (layers *.Cu *.Mask) (tstamp c8df3a42-dc0b-43e2-9973-8fa5c6717c23))
  (pad "C" thru_hole circle (at 0 0) (size 2 2) (drill 1.1) (layers *.Cu *.Mask) (tstamp 98eb54f5-79e7-4e0f-908c-0be67e88e43e))
  (pad "B" thru_hole circle (at 2.5 0) (size 2 2) (drill 1.1) (layers *.Cu *.Mask) (tstamp ac05665e-a4ff-4b11-8970-74be0e58b278))
  (pad "1" thru_hole circle (at 2.5 -2.5) (size 2 2) (drill 1.1) (layers *.Cu *.Mask) (tstamp 703805be-4a4a-4810-a055-95316315a3ab))
  (pad "2" thru_hole circle (at -2.5 -2.5) (size 2 2) (drill 1.1) (layers *.Cu *.Mask) (tstamp 09cdc3a3-1805-4572-81aa-e0d90d3eb438))
  (pad "" thru_hole circle (at -6.45 -1.7) (size 3.2 3.2) (drill 2.2) (layers *.Cu *.Mask) (tstamp e39cba89-ccf5-4b1f-8ad0-c6990597d666))
  (pad "" thru_hole circle (at 6.45 -1.7) (size 3.2 3.2) (drill 2.2) (layers *.Cu *.Mask) (tstamp 31b31404-f82d-4549-8b55-bdf906b01dee))
  (model "${KICADLIB}/model/mechanical/TT_EN11-VSM.STP"
    (offset (xyz 5.85 -0.6 13.8))
    (scale (xyz 1 1 1))
    (rotate (xyz 0 0 180))
  )
)
