ISO-10303-21;
HEADER;
FILE_DESCRIPTION(('FreeCAD Model'),'2;1');
FILE_NAME(
  'D:/Project/lib/KiCADLib/model/mechanical/PBUS-PWRTAPterminal.step',
  '2019-05-14T21:18:05',('Author'),(''),
  'Open CASCADE STEP processor 7.2','FreeCAD','Unknown');
FILE_SCHEMA(('AUTOMOTIVE_DESIGN { 1 0 10303 214 1 1 1 1 }'));
ENDSEC;
DATA;
#1 = APPLICATION_PROTOCOL_DEFINITION('international standard',
  'automotive_design',2000,#2);
#2 = APPLICATION_CONTEXT(
  'core data for automotive mechanical design processes');
#3 = SHAPE_DEFINITION_REPRESENTATION(#4,#10);
#4 = PRODUCT_DEFINITION_SHAPE('','',#5);
#5 = PRODUCT_DEFINITION('design','',#6,#9);
#6 = PRODUCT_DEFINITION_FORMATION('','',#7);
#7 = PRODUCT('Body','Body','',(#8));
#8 = PRODUCT_CONTEXT('',#2,'mechanical');
#9 = PRODUCT_DEFINITION_CONTEXT('part definition',#2,'design');
#10 = ADVANCED_BREP_SHAPE_REPRESENTATION('',(#11,#15),#1361);
#11 = AXIS2_PLACEMENT_3D('',#12,#13,#14);
#12 = CARTESIAN_POINT('',(0.E+000,0.E+000,0.E+000));
#13 = DIRECTION('',(0.E+000,0.E+000,1.));
#14 = DIRECTION('',(1.,0.E+000,-0.E+000));
#15 = MANIFOLD_SOLID_BREP('',#16);
#16 = CLOSED_SHELL('',(#17,#168,#244,#328,#477,#504,#869,#907,#934,#961,
    #1295,#1299,#1357));
#17 = ADVANCED_FACE('',(#18,#137),#32,.T.);
#18 = FACE_BOUND('',#19,.T.);
#19 = EDGE_LOOP('',(#20,#55,#83,#111));
#20 = ORIENTED_EDGE('',*,*,#21,.T.);
#21 = EDGE_CURVE('',#22,#24,#26,.T.);
#22 = VERTEX_POINT('',#23);
#23 = CARTESIAN_POINT('',(-5.,15.,0.E+000));
#24 = VERTEX_POINT('',#25);
#25 = CARTESIAN_POINT('',(-5.,15.,10.));
#26 = SURFACE_CURVE('',#27,(#31,#43),.PCURVE_S1.);
#27 = LINE('',#28,#29);
#28 = CARTESIAN_POINT('',(-5.,15.,0.E+000));
#29 = VECTOR('',#30,1.);
#30 = DIRECTION('',(0.E+000,0.E+000,1.));
#31 = PCURVE('',#32,#37);
#32 = PLANE('',#33);
#33 = AXIS2_PLACEMENT_3D('',#34,#35,#36);
#34 = CARTESIAN_POINT('',(-5.,15.,0.E+000));
#35 = DIRECTION('',(0.E+000,1.,0.E+000));
#36 = DIRECTION('',(1.,0.E+000,0.E+000));
#37 = DEFINITIONAL_REPRESENTATION('',(#38),#42);
#38 = LINE('',#39,#40);
#39 = CARTESIAN_POINT('',(0.E+000,0.E+000));
#40 = VECTOR('',#41,1.);
#41 = DIRECTION('',(0.E+000,-1.));
#42 = ( GEOMETRIC_REPRESENTATION_CONTEXT(2) 
PARAMETRIC_REPRESENTATION_CONTEXT() REPRESENTATION_CONTEXT('2D SPACE',''
  ) );
#43 = PCURVE('',#44,#49);
#44 = PLANE('',#45);
#45 = AXIS2_PLACEMENT_3D('',#46,#47,#48);
#46 = CARTESIAN_POINT('',(-5.,-15.,0.E+000));
#47 = DIRECTION('',(-1.,0.E+000,0.E+000));
#48 = DIRECTION('',(0.E+000,1.,0.E+000));
#49 = DEFINITIONAL_REPRESENTATION('',(#50),#54);
#50 = LINE('',#51,#52);
#51 = CARTESIAN_POINT('',(30.,0.E+000));
#52 = VECTOR('',#53,1.);
#53 = DIRECTION('',(0.E+000,-1.));
#54 = ( GEOMETRIC_REPRESENTATION_CONTEXT(2) 
PARAMETRIC_REPRESENTATION_CONTEXT() REPRESENTATION_CONTEXT('2D SPACE',''
  ) );
#55 = ORIENTED_EDGE('',*,*,#56,.T.);
#56 = EDGE_CURVE('',#24,#57,#59,.T.);
#57 = VERTEX_POINT('',#58);
#58 = CARTESIAN_POINT('',(5.,15.,10.));
#59 = SURFACE_CURVE('',#60,(#64,#71),.PCURVE_S1.);
#60 = LINE('',#61,#62);
#61 = CARTESIAN_POINT('',(-5.,15.,10.));
#62 = VECTOR('',#63,1.);
#63 = DIRECTION('',(1.,0.E+000,0.E+000));
#64 = PCURVE('',#32,#65);
#65 = DEFINITIONAL_REPRESENTATION('',(#66),#70);
#66 = LINE('',#67,#68);
#67 = CARTESIAN_POINT('',(0.E+000,-10.));
#68 = VECTOR('',#69,1.);
#69 = DIRECTION('',(1.,0.E+000));
#70 = ( GEOMETRIC_REPRESENTATION_CONTEXT(2) 
PARAMETRIC_REPRESENTATION_CONTEXT() REPRESENTATION_CONTEXT('2D SPACE',''
  ) );
#71 = PCURVE('',#72,#77);
#72 = PLANE('',#73);
#73 = AXIS2_PLACEMENT_3D('',#74,#75,#76);
#74 = CARTESIAN_POINT('',(0.E+000,0.E+000,10.));
#75 = DIRECTION('',(-0.E+000,-0.E+000,-1.));
#76 = DIRECTION('',(-1.,0.E+000,0.E+000));
#77 = DEFINITIONAL_REPRESENTATION('',(#78),#82);
#78 = LINE('',#79,#80);
#79 = CARTESIAN_POINT('',(5.,15.));
#80 = VECTOR('',#81,1.);
#81 = DIRECTION('',(-1.,0.E+000));
#82 = ( GEOMETRIC_REPRESENTATION_CONTEXT(2) 
PARAMETRIC_REPRESENTATION_CONTEXT() REPRESENTATION_CONTEXT('2D SPACE',''
  ) );
#83 = ORIENTED_EDGE('',*,*,#84,.F.);
#84 = EDGE_CURVE('',#85,#57,#87,.T.);
#85 = VERTEX_POINT('',#86);
#86 = CARTESIAN_POINT('',(5.,15.,0.E+000));
#87 = SURFACE_CURVE('',#88,(#92,#99),.PCURVE_S1.);
#88 = LINE('',#89,#90);
#89 = CARTESIAN_POINT('',(5.,15.,0.E+000));
#90 = VECTOR('',#91,1.);
#91 = DIRECTION('',(0.E+000,0.E+000,1.));
#92 = PCURVE('',#32,#93);
#93 = DEFINITIONAL_REPRESENTATION('',(#94),#98);
#94 = LINE('',#95,#96);
#95 = CARTESIAN_POINT('',(10.,0.E+000));
#96 = VECTOR('',#97,1.);
#97 = DIRECTION('',(0.E+000,-1.));
#98 = ( GEOMETRIC_REPRESENTATION_CONTEXT(2) 
PARAMETRIC_REPRESENTATION_CONTEXT() REPRESENTATION_CONTEXT('2D SPACE',''
  ) );
#99 = PCURVE('',#100,#105);
#100 = PLANE('',#101);
#101 = AXIS2_PLACEMENT_3D('',#102,#103,#104);
#102 = CARTESIAN_POINT('',(5.,15.,0.E+000));
#103 = DIRECTION('',(1.,0.E+000,0.E+000));
#104 = DIRECTION('',(0.E+000,-1.,0.E+000));
#105 = DEFINITIONAL_REPRESENTATION('',(#106),#110);
#106 = LINE('',#107,#108);
#107 = CARTESIAN_POINT('',(0.E+000,0.E+000));
#108 = VECTOR('',#109,1.);
#109 = DIRECTION('',(0.E+000,-1.));
#110 = ( GEOMETRIC_REPRESENTATION_CONTEXT(2) 
PARAMETRIC_REPRESENTATION_CONTEXT() REPRESENTATION_CONTEXT('2D SPACE',''
  ) );
#111 = ORIENTED_EDGE('',*,*,#112,.F.);
#112 = EDGE_CURVE('',#22,#85,#113,.T.);
#113 = SURFACE_CURVE('',#114,(#118,#125),.PCURVE_S1.);
#114 = LINE('',#115,#116);
#115 = CARTESIAN_POINT('',(-5.,15.,0.E+000));
#116 = VECTOR('',#117,1.);
#117 = DIRECTION('',(1.,0.E+000,0.E+000));
#118 = PCURVE('',#32,#119);
#119 = DEFINITIONAL_REPRESENTATION('',(#120),#124);
#120 = LINE('',#121,#122);
#121 = CARTESIAN_POINT('',(0.E+000,0.E+000));
#122 = VECTOR('',#123,1.);
#123 = DIRECTION('',(1.,0.E+000));
#124 = ( GEOMETRIC_REPRESENTATION_CONTEXT(2) 
PARAMETRIC_REPRESENTATION_CONTEXT() REPRESENTATION_CONTEXT('2D SPACE',''
  ) );
#125 = PCURVE('',#126,#131);
#126 = PLANE('',#127);
#127 = AXIS2_PLACEMENT_3D('',#128,#129,#130);
#128 = CARTESIAN_POINT('',(0.E+000,0.E+000,0.E+000));
#129 = DIRECTION('',(-0.E+000,-0.E+000,-1.));
#130 = DIRECTION('',(-1.,0.E+000,0.E+000));
#131 = DEFINITIONAL_REPRESENTATION('',(#132),#136);
#132 = LINE('',#133,#134);
#133 = CARTESIAN_POINT('',(5.,15.));
#134 = VECTOR('',#135,1.);
#135 = DIRECTION('',(-1.,0.E+000));
#136 = ( GEOMETRIC_REPRESENTATION_CONTEXT(2) 
PARAMETRIC_REPRESENTATION_CONTEXT() REPRESENTATION_CONTEXT('2D SPACE',''
  ) );
#137 = FACE_BOUND('',#138,.T.);
#138 = EDGE_LOOP('',(#139));
#139 = ORIENTED_EDGE('',*,*,#140,.F.);
#140 = EDGE_CURVE('',#141,#141,#143,.T.);
#141 = VERTEX_POINT('',#142);
#142 = CARTESIAN_POINT('',(-3.,15.,5.));
#143 = SURFACE_CURVE('',#144,(#149,#156),.PCURVE_S1.);
#144 = CIRCLE('',#145,3.);
#145 = AXIS2_PLACEMENT_3D('',#146,#147,#148);
#146 = CARTESIAN_POINT('',(0.E+000,15.,5.));
#147 = DIRECTION('',(0.E+000,1.,-0.E+000));
#148 = DIRECTION('',(-1.,0.E+000,0.E+000));
#149 = PCURVE('',#32,#150);
#150 = DEFINITIONAL_REPRESENTATION('',(#151),#155);
#151 = CIRCLE('',#152,3.);
#152 = AXIS2_PLACEMENT_2D('',#153,#154);
#153 = CARTESIAN_POINT('',(5.,-5.));
#154 = DIRECTION('',(-1.,0.E+000));
#155 = ( GEOMETRIC_REPRESENTATION_CONTEXT(2) 
PARAMETRIC_REPRESENTATION_CONTEXT() REPRESENTATION_CONTEXT('2D SPACE',''
  ) );
#156 = PCURVE('',#157,#162);
#157 = CYLINDRICAL_SURFACE('',#158,3.);
#158 = AXIS2_PLACEMENT_3D('',#159,#160,#161);
#159 = CARTESIAN_POINT('',(0.E+000,15.,5.));
#160 = DIRECTION('',(0.E+000,1.,-2.2E-016));
#161 = DIRECTION('',(-1.,0.E+000,0.E+000));
#162 = DEFINITIONAL_REPRESENTATION('',(#163),#167);
#163 = LINE('',#164,#165);
#164 = CARTESIAN_POINT('',(0.E+000,0.E+000));
#165 = VECTOR('',#166,1.);
#166 = DIRECTION('',(1.,0.E+000));
#167 = ( GEOMETRIC_REPRESENTATION_CONTEXT(2) 
PARAMETRIC_REPRESENTATION_CONTEXT() REPRESENTATION_CONTEXT('2D SPACE',''
  ) );
#168 = ADVANCED_FACE('',(#169),#44,.T.);
#169 = FACE_BOUND('',#170,.T.);
#170 = EDGE_LOOP('',(#171,#201,#222,#223));
#171 = ORIENTED_EDGE('',*,*,#172,.T.);
#172 = EDGE_CURVE('',#173,#175,#177,.T.);
#173 = VERTEX_POINT('',#174);
#174 = CARTESIAN_POINT('',(-5.,-15.,0.E+000));
#175 = VERTEX_POINT('',#176);
#176 = CARTESIAN_POINT('',(-5.,-15.,10.));
#177 = SURFACE_CURVE('',#178,(#182,#189),.PCURVE_S1.);
#178 = LINE('',#179,#180);
#179 = CARTESIAN_POINT('',(-5.,-15.,0.E+000));
#180 = VECTOR('',#181,1.);
#181 = DIRECTION('',(0.E+000,0.E+000,1.));
#182 = PCURVE('',#44,#183);
#183 = DEFINITIONAL_REPRESENTATION('',(#184),#188);
#184 = LINE('',#185,#186);
#185 = CARTESIAN_POINT('',(0.E+000,0.E+000));
#186 = VECTOR('',#187,1.);
#187 = DIRECTION('',(0.E+000,-1.));
#188 = ( GEOMETRIC_REPRESENTATION_CONTEXT(2) 
PARAMETRIC_REPRESENTATION_CONTEXT() REPRESENTATION_CONTEXT('2D SPACE',''
  ) );
#189 = PCURVE('',#190,#195);
#190 = PLANE('',#191);
#191 = AXIS2_PLACEMENT_3D('',#192,#193,#194);
#192 = CARTESIAN_POINT('',(5.,-15.,0.E+000));
#193 = DIRECTION('',(0.E+000,-1.,0.E+000));
#194 = DIRECTION('',(-1.,0.E+000,0.E+000));
#195 = DEFINITIONAL_REPRESENTATION('',(#196),#200);
#196 = LINE('',#197,#198);
#197 = CARTESIAN_POINT('',(10.,0.E+000));
#198 = VECTOR('',#199,1.);
#199 = DIRECTION('',(0.E+000,-1.));
#200 = ( GEOMETRIC_REPRESENTATION_CONTEXT(2) 
PARAMETRIC_REPRESENTATION_CONTEXT() REPRESENTATION_CONTEXT('2D SPACE',''
  ) );
#201 = ORIENTED_EDGE('',*,*,#202,.T.);
#202 = EDGE_CURVE('',#175,#24,#203,.T.);
#203 = SURFACE_CURVE('',#204,(#208,#215),.PCURVE_S1.);
#204 = LINE('',#205,#206);
#205 = CARTESIAN_POINT('',(-5.,-15.,10.));
#206 = VECTOR('',#207,1.);
#207 = DIRECTION('',(0.E+000,1.,0.E+000));
#208 = PCURVE('',#44,#209);
#209 = DEFINITIONAL_REPRESENTATION('',(#210),#214);
#210 = LINE('',#211,#212);
#211 = CARTESIAN_POINT('',(0.E+000,-10.));
#212 = VECTOR('',#213,1.);
#213 = DIRECTION('',(1.,0.E+000));
#214 = ( GEOMETRIC_REPRESENTATION_CONTEXT(2) 
PARAMETRIC_REPRESENTATION_CONTEXT() REPRESENTATION_CONTEXT('2D SPACE',''
  ) );
#215 = PCURVE('',#72,#216);
#216 = DEFINITIONAL_REPRESENTATION('',(#217),#221);
#217 = LINE('',#218,#219);
#218 = CARTESIAN_POINT('',(5.,-15.));
#219 = VECTOR('',#220,1.);
#220 = DIRECTION('',(0.E+000,1.));
#221 = ( GEOMETRIC_REPRESENTATION_CONTEXT(2) 
PARAMETRIC_REPRESENTATION_CONTEXT() REPRESENTATION_CONTEXT('2D SPACE',''
  ) );
#222 = ORIENTED_EDGE('',*,*,#21,.F.);
#223 = ORIENTED_EDGE('',*,*,#224,.F.);
#224 = EDGE_CURVE('',#173,#22,#225,.T.);
#225 = SURFACE_CURVE('',#226,(#230,#237),.PCURVE_S1.);
#226 = LINE('',#227,#228);
#227 = CARTESIAN_POINT('',(-5.,-15.,0.E+000));
#228 = VECTOR('',#229,1.);
#229 = DIRECTION('',(0.E+000,1.,0.E+000));
#230 = PCURVE('',#44,#231);
#231 = DEFINITIONAL_REPRESENTATION('',(#232),#236);
#232 = LINE('',#233,#234);
#233 = CARTESIAN_POINT('',(0.E+000,0.E+000));
#234 = VECTOR('',#235,1.);
#235 = DIRECTION('',(1.,0.E+000));
#236 = ( GEOMETRIC_REPRESENTATION_CONTEXT(2) 
PARAMETRIC_REPRESENTATION_CONTEXT() REPRESENTATION_CONTEXT('2D SPACE',''
  ) );
#237 = PCURVE('',#126,#238);
#238 = DEFINITIONAL_REPRESENTATION('',(#239),#243);
#239 = LINE('',#240,#241);
#240 = CARTESIAN_POINT('',(5.,-15.));
#241 = VECTOR('',#242,1.);
#242 = DIRECTION('',(0.E+000,1.));
#243 = ( GEOMETRIC_REPRESENTATION_CONTEXT(2) 
PARAMETRIC_REPRESENTATION_CONTEXT() REPRESENTATION_CONTEXT('2D SPACE',''
  ) );
#244 = ADVANCED_FACE('',(#245,#293),#126,.T.);
#245 = FACE_BOUND('',#246,.T.);
#246 = EDGE_LOOP('',(#247,#248,#271,#292));
#247 = ORIENTED_EDGE('',*,*,#112,.T.);
#248 = ORIENTED_EDGE('',*,*,#249,.T.);
#249 = EDGE_CURVE('',#85,#250,#252,.T.);
#250 = VERTEX_POINT('',#251);
#251 = CARTESIAN_POINT('',(5.,-15.,0.E+000));
#252 = SURFACE_CURVE('',#253,(#257,#264),.PCURVE_S1.);
#253 = LINE('',#254,#255);
#254 = CARTESIAN_POINT('',(5.,15.,0.E+000));
#255 = VECTOR('',#256,1.);
#256 = DIRECTION('',(0.E+000,-1.,0.E+000));
#257 = PCURVE('',#126,#258);
#258 = DEFINITIONAL_REPRESENTATION('',(#259),#263);
#259 = LINE('',#260,#261);
#260 = CARTESIAN_POINT('',(-5.,15.));
#261 = VECTOR('',#262,1.);
#262 = DIRECTION('',(0.E+000,-1.));
#263 = ( GEOMETRIC_REPRESENTATION_CONTEXT(2) 
PARAMETRIC_REPRESENTATION_CONTEXT() REPRESENTATION_CONTEXT('2D SPACE',''
  ) );
#264 = PCURVE('',#100,#265);
#265 = DEFINITIONAL_REPRESENTATION('',(#266),#270);
#266 = LINE('',#267,#268);
#267 = CARTESIAN_POINT('',(0.E+000,0.E+000));
#268 = VECTOR('',#269,1.);
#269 = DIRECTION('',(1.,0.E+000));
#270 = ( GEOMETRIC_REPRESENTATION_CONTEXT(2) 
PARAMETRIC_REPRESENTATION_CONTEXT() REPRESENTATION_CONTEXT('2D SPACE',''
  ) );
#271 = ORIENTED_EDGE('',*,*,#272,.T.);
#272 = EDGE_CURVE('',#250,#173,#273,.T.);
#273 = SURFACE_CURVE('',#274,(#278,#285),.PCURVE_S1.);
#274 = LINE('',#275,#276);
#275 = CARTESIAN_POINT('',(5.,-15.,0.E+000));
#276 = VECTOR('',#277,1.);
#277 = DIRECTION('',(-1.,0.E+000,0.E+000));
#278 = PCURVE('',#126,#279);
#279 = DEFINITIONAL_REPRESENTATION('',(#280),#284);
#280 = LINE('',#281,#282);
#281 = CARTESIAN_POINT('',(-5.,-15.));
#282 = VECTOR('',#283,1.);
#283 = DIRECTION('',(1.,0.E+000));
#284 = ( GEOMETRIC_REPRESENTATION_CONTEXT(2) 
PARAMETRIC_REPRESENTATION_CONTEXT() REPRESENTATION_CONTEXT('2D SPACE',''
  ) );
#285 = PCURVE('',#190,#286);
#286 = DEFINITIONAL_REPRESENTATION('',(#287),#291);
#287 = LINE('',#288,#289);
#288 = CARTESIAN_POINT('',(0.E+000,-0.E+000));
#289 = VECTOR('',#290,1.);
#290 = DIRECTION('',(1.,0.E+000));
#291 = ( GEOMETRIC_REPRESENTATION_CONTEXT(2) 
PARAMETRIC_REPRESENTATION_CONTEXT() REPRESENTATION_CONTEXT('2D SPACE',''
  ) );
#292 = ORIENTED_EDGE('',*,*,#224,.T.);
#293 = FACE_BOUND('',#294,.T.);
#294 = EDGE_LOOP('',(#295));
#295 = ORIENTED_EDGE('',*,*,#296,.T.);
#296 = EDGE_CURVE('',#297,#297,#299,.T.);
#297 = VERTEX_POINT('',#298);
#298 = CARTESIAN_POINT('',(2.5,0.E+000,0.E+000));
#299 = SURFACE_CURVE('',#300,(#305,#316),.PCURVE_S1.);
#300 = CIRCLE('',#301,2.5);
#301 = AXIS2_PLACEMENT_3D('',#302,#303,#304);
#302 = CARTESIAN_POINT('',(0.E+000,0.E+000,0.E+000));
#303 = DIRECTION('',(0.E+000,0.E+000,1.));
#304 = DIRECTION('',(1.,0.E+000,0.E+000));
#305 = PCURVE('',#126,#306);
#306 = DEFINITIONAL_REPRESENTATION('',(#307),#315);
#307 = ( BOUNDED_CURVE() B_SPLINE_CURVE(2,(#308,#309,#310,#311,#312,#313
,#314),.UNSPECIFIED.,.T.,.F.) B_SPLINE_CURVE_WITH_KNOTS((1,2,2,2,2,1),(
    -2.094395102393,0.E+000,2.094395102393,4.188790204786,6.28318530718,
8.377580409573),.UNSPECIFIED.) CURVE() GEOMETRIC_REPRESENTATION_ITEM() 
RATIONAL_B_SPLINE_CURVE((1.,0.5,1.,0.5,1.,0.5,1.)) REPRESENTATION_ITEM(
  '') );
#308 = CARTESIAN_POINT('',(-2.5,0.E+000));
#309 = CARTESIAN_POINT('',(-2.5,4.330127018922));
#310 = CARTESIAN_POINT('',(1.25,2.165063509461));
#311 = CARTESIAN_POINT('',(5.,6.123233995737E-016));
#312 = CARTESIAN_POINT('',(1.25,-2.165063509461));
#313 = CARTESIAN_POINT('',(-2.5,-4.330127018922));
#314 = CARTESIAN_POINT('',(-2.5,0.E+000));
#315 = ( GEOMETRIC_REPRESENTATION_CONTEXT(2) 
PARAMETRIC_REPRESENTATION_CONTEXT() REPRESENTATION_CONTEXT('2D SPACE',''
  ) );
#316 = PCURVE('',#317,#322);
#317 = CYLINDRICAL_SURFACE('',#318,2.5);
#318 = AXIS2_PLACEMENT_3D('',#319,#320,#321);
#319 = CARTESIAN_POINT('',(0.E+000,0.E+000,10.));
#320 = DIRECTION('',(0.E+000,0.E+000,1.));
#321 = DIRECTION('',(1.,0.E+000,0.E+000));
#322 = DEFINITIONAL_REPRESENTATION('',(#323),#327);
#323 = LINE('',#324,#325);
#324 = CARTESIAN_POINT('',(0.E+000,-10.));
#325 = VECTOR('',#326,1.);
#326 = DIRECTION('',(1.,0.E+000));
#327 = ( GEOMETRIC_REPRESENTATION_CONTEXT(2) 
PARAMETRIC_REPRESENTATION_CONTEXT() REPRESENTATION_CONTEXT('2D SPACE',''
  ) );
#328 = ADVANCED_FACE('',(#329,#377,#407,#442),#72,.F.);
#329 = FACE_BOUND('',#330,.F.);
#330 = EDGE_LOOP('',(#331,#332,#355,#376));
#331 = ORIENTED_EDGE('',*,*,#56,.T.);
#332 = ORIENTED_EDGE('',*,*,#333,.T.);
#333 = EDGE_CURVE('',#57,#334,#336,.T.);
#334 = VERTEX_POINT('',#335);
#335 = CARTESIAN_POINT('',(5.,-15.,10.));
#336 = SURFACE_CURVE('',#337,(#341,#348),.PCURVE_S1.);
#337 = LINE('',#338,#339);
#338 = CARTESIAN_POINT('',(5.,15.,10.));
#339 = VECTOR('',#340,1.);
#340 = DIRECTION('',(0.E+000,-1.,0.E+000));
#341 = PCURVE('',#72,#342);
#342 = DEFINITIONAL_REPRESENTATION('',(#343),#347);
#343 = LINE('',#344,#345);
#344 = CARTESIAN_POINT('',(-5.,15.));
#345 = VECTOR('',#346,1.);
#346 = DIRECTION('',(0.E+000,-1.));
#347 = ( GEOMETRIC_REPRESENTATION_CONTEXT(2) 
PARAMETRIC_REPRESENTATION_CONTEXT() REPRESENTATION_CONTEXT('2D SPACE',''
  ) );
#348 = PCURVE('',#100,#349);
#349 = DEFINITIONAL_REPRESENTATION('',(#350),#354);
#350 = LINE('',#351,#352);
#351 = CARTESIAN_POINT('',(0.E+000,-10.));
#352 = VECTOR('',#353,1.);
#353 = DIRECTION('',(1.,0.E+000));
#354 = ( GEOMETRIC_REPRESENTATION_CONTEXT(2) 
PARAMETRIC_REPRESENTATION_CONTEXT() REPRESENTATION_CONTEXT('2D SPACE',''
  ) );
#355 = ORIENTED_EDGE('',*,*,#356,.T.);
#356 = EDGE_CURVE('',#334,#175,#357,.T.);
#357 = SURFACE_CURVE('',#358,(#362,#369),.PCURVE_S1.);
#358 = LINE('',#359,#360);
#359 = CARTESIAN_POINT('',(5.,-15.,10.));
#360 = VECTOR('',#361,1.);
#361 = DIRECTION('',(-1.,0.E+000,0.E+000));
#362 = PCURVE('',#72,#363);
#363 = DEFINITIONAL_REPRESENTATION('',(#364),#368);
#364 = LINE('',#365,#366);
#365 = CARTESIAN_POINT('',(-5.,-15.));
#366 = VECTOR('',#367,1.);
#367 = DIRECTION('',(1.,0.E+000));
#368 = ( GEOMETRIC_REPRESENTATION_CONTEXT(2) 
PARAMETRIC_REPRESENTATION_CONTEXT() REPRESENTATION_CONTEXT('2D SPACE',''
  ) );
#369 = PCURVE('',#190,#370);
#370 = DEFINITIONAL_REPRESENTATION('',(#371),#375);
#371 = LINE('',#372,#373);
#372 = CARTESIAN_POINT('',(0.E+000,-10.));
#373 = VECTOR('',#374,1.);
#374 = DIRECTION('',(1.,0.E+000));
#375 = ( GEOMETRIC_REPRESENTATION_CONTEXT(2) 
PARAMETRIC_REPRESENTATION_CONTEXT() REPRESENTATION_CONTEXT('2D SPACE',''
  ) );
#376 = ORIENTED_EDGE('',*,*,#202,.T.);
#377 = FACE_BOUND('',#378,.F.);
#378 = EDGE_LOOP('',(#379));
#379 = ORIENTED_EDGE('',*,*,#380,.T.);
#380 = EDGE_CURVE('',#381,#381,#383,.T.);
#381 = VERTEX_POINT('',#382);
#382 = CARTESIAN_POINT('',(2.5,0.E+000,10.));
#383 = SURFACE_CURVE('',#384,(#389,#400),.PCURVE_S1.);
#384 = CIRCLE('',#385,2.5);
#385 = AXIS2_PLACEMENT_3D('',#386,#387,#388);
#386 = CARTESIAN_POINT('',(0.E+000,0.E+000,10.));
#387 = DIRECTION('',(0.E+000,0.E+000,1.));
#388 = DIRECTION('',(1.,0.E+000,0.E+000));
#389 = PCURVE('',#72,#390);
#390 = DEFINITIONAL_REPRESENTATION('',(#391),#399);
#391 = ( BOUNDED_CURVE() B_SPLINE_CURVE(2,(#392,#393,#394,#395,#396,#397
,#398),.UNSPECIFIED.,.T.,.F.) B_SPLINE_CURVE_WITH_KNOTS((1,2,2,2,2,1),(
    -2.094395102393,0.E+000,2.094395102393,4.188790204786,6.28318530718,
8.377580409573),.UNSPECIFIED.) CURVE() GEOMETRIC_REPRESENTATION_ITEM() 
RATIONAL_B_SPLINE_CURVE((1.,0.5,1.,0.5,1.,0.5,1.)) REPRESENTATION_ITEM(
  '') );
#392 = CARTESIAN_POINT('',(-2.5,0.E+000));
#393 = CARTESIAN_POINT('',(-2.5,4.330127018922));
#394 = CARTESIAN_POINT('',(1.25,2.165063509461));
#395 = CARTESIAN_POINT('',(5.,6.123233995737E-016));
#396 = CARTESIAN_POINT('',(1.25,-2.165063509461));
#397 = CARTESIAN_POINT('',(-2.5,-4.330127018922));
#398 = CARTESIAN_POINT('',(-2.5,0.E+000));
#399 = ( GEOMETRIC_REPRESENTATION_CONTEXT(2) 
PARAMETRIC_REPRESENTATION_CONTEXT() REPRESENTATION_CONTEXT('2D SPACE',''
  ) );
#400 = PCURVE('',#317,#401);
#401 = DEFINITIONAL_REPRESENTATION('',(#402),#406);
#402 = LINE('',#403,#404);
#403 = CARTESIAN_POINT('',(0.E+000,0.E+000));
#404 = VECTOR('',#405,1.);
#405 = DIRECTION('',(1.,0.E+000));
#406 = ( GEOMETRIC_REPRESENTATION_CONTEXT(2) 
PARAMETRIC_REPRESENTATION_CONTEXT() REPRESENTATION_CONTEXT('2D SPACE',''
  ) );
#407 = FACE_BOUND('',#408,.F.);
#408 = EDGE_LOOP('',(#409));
#409 = ORIENTED_EDGE('',*,*,#410,.T.);
#410 = EDGE_CURVE('',#411,#411,#413,.T.);
#411 = VERTEX_POINT('',#412);
#412 = CARTESIAN_POINT('',(1.65,11.,10.));
#413 = SURFACE_CURVE('',#414,(#419,#430),.PCURVE_S1.);
#414 = CIRCLE('',#415,1.65);
#415 = AXIS2_PLACEMENT_3D('',#416,#417,#418);
#416 = CARTESIAN_POINT('',(0.E+000,11.,10.));
#417 = DIRECTION('',(0.E+000,0.E+000,1.));
#418 = DIRECTION('',(1.,0.E+000,0.E+000));
#419 = PCURVE('',#72,#420);
#420 = DEFINITIONAL_REPRESENTATION('',(#421),#429);
#421 = ( BOUNDED_CURVE() B_SPLINE_CURVE(2,(#422,#423,#424,#425,#426,#427
,#428),.UNSPECIFIED.,.T.,.F.) B_SPLINE_CURVE_WITH_KNOTS((1,2,2,2,2,1),(
    -2.094395102393,0.E+000,2.094395102393,4.188790204786,6.28318530718,
8.377580409573),.UNSPECIFIED.) CURVE() GEOMETRIC_REPRESENTATION_ITEM() 
RATIONAL_B_SPLINE_CURVE((1.,0.5,1.,0.5,1.,0.5,1.)) REPRESENTATION_ITEM(
  '') );
#422 = CARTESIAN_POINT('',(-1.65,11.));
#423 = CARTESIAN_POINT('',(-1.65,13.857883832489));
#424 = CARTESIAN_POINT('',(0.825,12.428941916244));
#425 = CARTESIAN_POINT('',(3.3,11.));
#426 = CARTESIAN_POINT('',(0.825,9.571058083756));
#427 = CARTESIAN_POINT('',(-1.65,8.142116167511));
#428 = CARTESIAN_POINT('',(-1.65,11.));
#429 = ( GEOMETRIC_REPRESENTATION_CONTEXT(2) 
PARAMETRIC_REPRESENTATION_CONTEXT() REPRESENTATION_CONTEXT('2D SPACE',''
  ) );
#430 = PCURVE('',#431,#436);
#431 = CYLINDRICAL_SURFACE('',#432,1.65);
#432 = AXIS2_PLACEMENT_3D('',#433,#434,#435);
#433 = CARTESIAN_POINT('',(0.E+000,11.,10.));
#434 = DIRECTION('',(-0.E+000,-0.E+000,-1.));
#435 = DIRECTION('',(1.,0.E+000,0.E+000));
#436 = DEFINITIONAL_REPRESENTATION('',(#437),#441);
#437 = LINE('',#438,#439);
#438 = CARTESIAN_POINT('',(-0.E+000,0.E+000));
#439 = VECTOR('',#440,1.);
#440 = DIRECTION('',(-1.,0.E+000));
#441 = ( GEOMETRIC_REPRESENTATION_CONTEXT(2) 
PARAMETRIC_REPRESENTATION_CONTEXT() REPRESENTATION_CONTEXT('2D SPACE',''
  ) );
#442 = FACE_BOUND('',#443,.F.);
#443 = EDGE_LOOP('',(#444));
#444 = ORIENTED_EDGE('',*,*,#445,.T.);
#445 = EDGE_CURVE('',#446,#446,#448,.T.);
#446 = VERTEX_POINT('',#447);
#447 = CARTESIAN_POINT('',(1.65,-11.,10.));
#448 = SURFACE_CURVE('',#449,(#454,#465),.PCURVE_S1.);
#449 = CIRCLE('',#450,1.65);
#450 = AXIS2_PLACEMENT_3D('',#451,#452,#453);
#451 = CARTESIAN_POINT('',(0.E+000,-11.,10.));
#452 = DIRECTION('',(0.E+000,0.E+000,1.));
#453 = DIRECTION('',(1.,0.E+000,0.E+000));
#454 = PCURVE('',#72,#455);
#455 = DEFINITIONAL_REPRESENTATION('',(#456),#464);
#456 = ( BOUNDED_CURVE() B_SPLINE_CURVE(2,(#457,#458,#459,#460,#461,#462
,#463),.UNSPECIFIED.,.T.,.F.) B_SPLINE_CURVE_WITH_KNOTS((1,2,2,2,2,1),(
    -2.094395102393,0.E+000,2.094395102393,4.188790204786,6.28318530718,
8.377580409573),.UNSPECIFIED.) CURVE() GEOMETRIC_REPRESENTATION_ITEM() 
RATIONAL_B_SPLINE_CURVE((1.,0.5,1.,0.5,1.,0.5,1.)) REPRESENTATION_ITEM(
  '') );
#457 = CARTESIAN_POINT('',(-1.65,-11.));
#458 = CARTESIAN_POINT('',(-1.65,-8.142116167511));
#459 = CARTESIAN_POINT('',(0.825,-9.571058083756));
#460 = CARTESIAN_POINT('',(3.3,-11.));
#461 = CARTESIAN_POINT('',(0.825,-12.42894191624));
#462 = CARTESIAN_POINT('',(-1.65,-13.85788383248));
#463 = CARTESIAN_POINT('',(-1.65,-11.));
#464 = ( GEOMETRIC_REPRESENTATION_CONTEXT(2) 
PARAMETRIC_REPRESENTATION_CONTEXT() REPRESENTATION_CONTEXT('2D SPACE',''
  ) );
#465 = PCURVE('',#466,#471);
#466 = CYLINDRICAL_SURFACE('',#467,1.65);
#467 = AXIS2_PLACEMENT_3D('',#468,#469,#470);
#468 = CARTESIAN_POINT('',(0.E+000,-11.,10.));
#469 = DIRECTION('',(-0.E+000,-0.E+000,-1.));
#470 = DIRECTION('',(1.,0.E+000,0.E+000));
#471 = DEFINITIONAL_REPRESENTATION('',(#472),#476);
#472 = LINE('',#473,#474);
#473 = CARTESIAN_POINT('',(-0.E+000,0.E+000));
#474 = VECTOR('',#475,1.);
#475 = DIRECTION('',(-1.,0.E+000));
#476 = ( GEOMETRIC_REPRESENTATION_CONTEXT(2) 
PARAMETRIC_REPRESENTATION_CONTEXT() REPRESENTATION_CONTEXT('2D SPACE',''
  ) );
#477 = ADVANCED_FACE('',(#478),#100,.T.);
#478 = FACE_BOUND('',#479,.T.);
#479 = EDGE_LOOP('',(#480,#481,#482,#503));
#480 = ORIENTED_EDGE('',*,*,#84,.T.);
#481 = ORIENTED_EDGE('',*,*,#333,.T.);
#482 = ORIENTED_EDGE('',*,*,#483,.F.);
#483 = EDGE_CURVE('',#250,#334,#484,.T.);
#484 = SURFACE_CURVE('',#485,(#489,#496),.PCURVE_S1.);
#485 = LINE('',#486,#487);
#486 = CARTESIAN_POINT('',(5.,-15.,0.E+000));
#487 = VECTOR('',#488,1.);
#488 = DIRECTION('',(0.E+000,0.E+000,1.));
#489 = PCURVE('',#100,#490);
#490 = DEFINITIONAL_REPRESENTATION('',(#491),#495);
#491 = LINE('',#492,#493);
#492 = CARTESIAN_POINT('',(30.,0.E+000));
#493 = VECTOR('',#494,1.);
#494 = DIRECTION('',(0.E+000,-1.));
#495 = ( GEOMETRIC_REPRESENTATION_CONTEXT(2) 
PARAMETRIC_REPRESENTATION_CONTEXT() REPRESENTATION_CONTEXT('2D SPACE',''
  ) );
#496 = PCURVE('',#190,#497);
#497 = DEFINITIONAL_REPRESENTATION('',(#498),#502);
#498 = LINE('',#499,#500);
#499 = CARTESIAN_POINT('',(0.E+000,-0.E+000));
#500 = VECTOR('',#501,1.);
#501 = DIRECTION('',(0.E+000,-1.));
#502 = ( GEOMETRIC_REPRESENTATION_CONTEXT(2) 
PARAMETRIC_REPRESENTATION_CONTEXT() REPRESENTATION_CONTEXT('2D SPACE',''
  ) );
#503 = ORIENTED_EDGE('',*,*,#249,.F.);
#504 = ADVANCED_FACE('',(#505,#559),#157,.F.);
#505 = FACE_BOUND('',#506,.F.);
#506 = EDGE_LOOP('',(#507,#530,#531,#532));
#507 = ORIENTED_EDGE('',*,*,#508,.F.);
#508 = EDGE_CURVE('',#141,#509,#511,.T.);
#509 = VERTEX_POINT('',#510);
#510 = CARTESIAN_POINT('',(-3.,5.,5.));
#511 = SEAM_CURVE('',#512,(#516,#523),.PCURVE_S1.);
#512 = LINE('',#513,#514);
#513 = CARTESIAN_POINT('',(-3.,15.,5.));
#514 = VECTOR('',#515,1.);
#515 = DIRECTION('',(0.E+000,-1.,2.2E-016));
#516 = PCURVE('',#157,#517);
#517 = DEFINITIONAL_REPRESENTATION('',(#518),#522);
#518 = LINE('',#519,#520);
#519 = CARTESIAN_POINT('',(6.28318530718,0.E+000));
#520 = VECTOR('',#521,1.);
#521 = DIRECTION('',(0.E+000,-1.));
#522 = ( GEOMETRIC_REPRESENTATION_CONTEXT(2) 
PARAMETRIC_REPRESENTATION_CONTEXT() REPRESENTATION_CONTEXT('2D SPACE',''
  ) );
#523 = PCURVE('',#157,#524);
#524 = DEFINITIONAL_REPRESENTATION('',(#525),#529);
#525 = LINE('',#526,#527);
#526 = CARTESIAN_POINT('',(0.E+000,0.E+000));
#527 = VECTOR('',#528,1.);
#528 = DIRECTION('',(0.E+000,-1.));
#529 = ( GEOMETRIC_REPRESENTATION_CONTEXT(2) 
PARAMETRIC_REPRESENTATION_CONTEXT() REPRESENTATION_CONTEXT('2D SPACE',''
  ) );
#530 = ORIENTED_EDGE('',*,*,#140,.F.);
#531 = ORIENTED_EDGE('',*,*,#508,.T.);
#532 = ORIENTED_EDGE('',*,*,#533,.T.);
#533 = EDGE_CURVE('',#509,#509,#534,.T.);
#534 = SURFACE_CURVE('',#535,(#540,#547),.PCURVE_S1.);
#535 = CIRCLE('',#536,3.);
#536 = AXIS2_PLACEMENT_3D('',#537,#538,#539);
#537 = CARTESIAN_POINT('',(0.E+000,5.,5.));
#538 = DIRECTION('',(0.E+000,1.,-0.E+000));
#539 = DIRECTION('',(-1.,0.E+000,0.E+000));
#540 = PCURVE('',#157,#541);
#541 = DEFINITIONAL_REPRESENTATION('',(#542),#546);
#542 = LINE('',#543,#544);
#543 = CARTESIAN_POINT('',(0.E+000,-10.));
#544 = VECTOR('',#545,1.);
#545 = DIRECTION('',(1.,0.E+000));
#546 = ( GEOMETRIC_REPRESENTATION_CONTEXT(2) 
PARAMETRIC_REPRESENTATION_CONTEXT() REPRESENTATION_CONTEXT('2D SPACE',''
  ) );
#547 = PCURVE('',#548,#553);
#548 = PLANE('',#549);
#549 = AXIS2_PLACEMENT_3D('',#550,#551,#552);
#550 = CARTESIAN_POINT('',(2.3E-016,5.,5.));
#551 = DIRECTION('',(2.E-016,1.,-3.4E-016));
#552 = DIRECTION('',(0.E+000,3.4E-016,1.));
#553 = DEFINITIONAL_REPRESENTATION('',(#554),#558);
#554 = CIRCLE('',#555,3.);
#555 = AXIS2_PLACEMENT_2D('',#556,#557);
#556 = CARTESIAN_POINT('',(0.E+000,-2.3E-016));
#557 = DIRECTION('',(0.E+000,-1.));
#558 = ( GEOMETRIC_REPRESENTATION_CONTEXT(2) 
PARAMETRIC_REPRESENTATION_CONTEXT() REPRESENTATION_CONTEXT('2D SPACE',''
  ) );
#559 = FACE_BOUND('',#560,.F.);
#560 = EDGE_LOOP('',(#561));
#561 = ORIENTED_EDGE('',*,*,#562,.F.);
#562 = EDGE_CURVE('',#563,#563,#565,.T.);
#563 = VERTEX_POINT('',#564);
#564 = CARTESIAN_POINT('',(1.65,11.,7.505493963274));
#565 = SURFACE_CURVE('',#566,(#665,#767),.PCURVE_S1.);
#566 = B_SPLINE_CURVE_WITH_KNOTS('',7,(#567,#568,#569,#570,#571,#572,
    #573,#574,#575,#576,#577,#578,#579,#580,#581,#582,#583,#584,#585,
    #586,#587,#588,#589,#590,#591,#592,#593,#594,#595,#596,#597,#598,
    #599,#600,#601,#602,#603,#604,#605,#606,#607,#608,#609,#610,#611,
    #612,#613,#614,#615,#616,#617,#618,#619,#620,#621,#622,#623,#624,
    #625,#626,#627,#628,#629,#630,#631,#632,#633,#634,#635,#636,#637,
    #638,#639,#640,#641,#642,#643,#644,#645,#646,#647,#648,#649,#650,
    #651,#652,#653,#654,#655,#656,#657,#658,#659,#660,#661,#662,#663,
    #664),.UNSPECIFIED.,.T.,.F.,(8,6,6,6,6,6,6,6,6,6,6,6,6,6,6,6,8),(
    0.E+000,4.938773390312E-002,9.701547943227E-002,0.160489349941,
    0.248441388851,0.351399440038,0.400630329934,0.448808743793,
    0.49828823028,0.548015307943,0.595970284706,0.659880258851,
    0.748436581126,0.852102015999,0.901671151695,0.950180580211,1.),
  .UNSPECIFIED.);
#567 = CARTESIAN_POINT('',(1.65,11.,7.505493963274));
#568 = CARTESIAN_POINT('',(1.649999993306,11.066939472845,7.505493967682
    ));
#569 = CARTESIAN_POINT('',(1.646831624593,11.133838072725,7.507580124673
    ));
#570 = CARTESIAN_POINT('',(1.640502086087,11.200528681469,7.511749167596
    ));
#571 = CARTESIAN_POINT('',(1.631027224569,11.266838218084,7.517952666619
    ));
#572 = CARTESIAN_POINT('',(1.618435246096,11.332588014276,7.526100113389
    ));
#573 = CARTESIAN_POINT('',(1.602770420715,11.397594189968,7.536062005686
    ));
#574 = CARTESIAN_POINT('',(1.566088609935,11.523458523163,7.558870089829
    ));
#575 = CARTESIAN_POINT('',(1.545280695681,11.584387865575,7.571602197932
    ));
#576 = CARTESIAN_POINT('',(1.521702155911,11.644380447347,7.585739535549
    ));
#577 = CARTESIAN_POINT('',(1.495374278912,11.703351811667,7.601137833677
    ));
#578 = CARTESIAN_POINT('',(1.466312680221,11.761208392727,7.617640352176
    ));
#579 = CARTESIAN_POINT('',(1.434529453071,11.81784725482,7.635079956791)
  );
#580 = CARTESIAN_POINT('',(1.35406471526,11.946866005882,7.677538130851)
  );
#581 = CARTESIAN_POINT('',(1.303283412162,12.018206296342,7.703145351156
    ));
#582 = CARTESIAN_POINT('',(1.247629624229,12.087053194082,7.729734162333
    ));
#583 = CARTESIAN_POINT('',(1.186985468934,12.15321351897,7.756921241318)
  );
#584 = CARTESIAN_POINT('',(1.121198303737,12.216404846391,7.784290751828
    ));
#585 = CARTESIAN_POINT('',(1.050102063276,12.276235934154,7.811376459454
    ));
#586 = CARTESIAN_POINT('',(0.86744906792,12.409715483809,7.874041032727)
  );
#587 = CARTESIAN_POINT('',(0.748511630589,12.481512674864,7.909673907893
    ));
#588 = CARTESIAN_POINT('',(0.617383749241,12.544199903604,7.942341780429
    ));
#589 = CARTESIAN_POINT('',(0.475210983807,12.594857911934,7.969672904389
    ));
#590 = CARTESIAN_POINT('',(0.323554540563,12.630898161259,7.989493750899
    ));
#591 = CARTESIAN_POINT('',(0.164364754083,12.65,8.));
#592 = CARTESIAN_POINT('',(-0.192407987054,12.65,8.));
#593 = CARTESIAN_POINT('',(-0.376476692275,12.623824255371,
    7.985602497353));
#594 = CARTESIAN_POINT('',(-0.549067205371,12.575552307601,7.95905765428
    ));
#595 = CARTESIAN_POINT('',(-0.707986954341,12.50896856859,7.923425725984
    ));
#596 = CARTESIAN_POINT('',(-0.851716459429,12.427877954461,
    7.882010054889));
#597 = CARTESIAN_POINT('',(-0.979368374884,12.336179500088,
    7.838156956097));
#598 = CARTESIAN_POINT('',(-1.144018226466,12.191117589189,
    7.773894600755));
#599 = CARTESIAN_POINT('',(-1.194153362898,12.142199084476,
    7.752962457038));
#600 = CARTESIAN_POINT('',(-1.241235054442,12.091468660352,
    7.732102852356));
#601 = CARTESIAN_POINT('',(-1.285327590967,12.039075895944,
    7.711516447176));
#602 = CARTESIAN_POINT('',(-1.326485142146,11.985139706436,
    7.691390512727));
#603 = CARTESIAN_POINT('',(-1.364750577707,11.92974928513,7.67190163478)
  );
#604 = CARTESIAN_POINT('',(-1.434801124166,11.817394760185,
    7.634934616786));
#605 = CARTESIAN_POINT('',(-1.466711987816,11.76048158288,7.617419851672
    ));
#606 = CARTESIAN_POINT('',(-1.495875776605,11.702339831861,
    7.600852120433));
#607 = CARTESIAN_POINT('',(-1.522280066563,11.643074038232,
    7.585400932195));
#608 = CARTESIAN_POINT('',(-1.545908901192,11.582779209952,
    7.571225169289));
#609 = CARTESIAN_POINT('',(-1.566740580883,11.521541095868,
    7.558470949673));
#610 = CARTESIAN_POINT('',(-1.603236550746,11.395654648895,7.5357655302)
  );
#611 = CARTESIAN_POINT('',(-1.618747409314,11.330953751362,
    7.525898108398));
#612 = CARTESIAN_POINT('',(-1.631215156978,11.265519744613,
    7.517829609958));
#613 = CARTESIAN_POINT('',(-1.640596296029,11.199533907637,
    7.511687116663));
#614 = CARTESIAN_POINT('',(-1.646863098069,11.133172450085,7.50755940803
    ));
#615 = CARTESIAN_POINT('',(-1.65,11.066606151409,7.505493963274));
#616 = CARTESIAN_POINT('',(-1.65,10.93306055703,7.505493963274));
#617 = CARTESIAN_POINT('',(-1.64683162481,10.866161928939,7.507580124634
    ));
#618 = CARTESIAN_POINT('',(-1.640502080308,10.799471294823,
    7.511749171381));
#619 = CARTESIAN_POINT('',(-1.631027219504,10.733161760648,
    7.517952669782));
#620 = CARTESIAN_POINT('',(-1.618435247819,10.667411990236,
    7.526100112199));
#621 = CARTESIAN_POINT('',(-1.602770428356,10.602405836249,
    7.536062000935));
#622 = CARTESIAN_POINT('',(-1.566088609935,10.476541476837,
    7.558870089829));
#623 = CARTESIAN_POINT('',(-1.545280695681,10.415612134425,
    7.571602197932));
#624 = CARTESIAN_POINT('',(-1.521702155911,10.355619552653,
    7.585739535549));
#625 = CARTESIAN_POINT('',(-1.495374278912,10.296648188333,
    7.601137833677));
#626 = CARTESIAN_POINT('',(-1.466312680221,10.238791607273,
    7.617640352176));
#627 = CARTESIAN_POINT('',(-1.434529453071,10.18215274518,7.635079956791
    ));
#628 = CARTESIAN_POINT('',(-1.35406471526,10.053133994118,7.677538130851
    ));
#629 = CARTESIAN_POINT('',(-1.303283412162,9.981793703658,7.703145351156
    ));
#630 = CARTESIAN_POINT('',(-1.247629624229,9.912946805918,7.729734162333
    ));
#631 = CARTESIAN_POINT('',(-1.186985468934,9.84678648103,7.756921241318)
  );
#632 = CARTESIAN_POINT('',(-1.121198303737,9.783595153609,7.784290751828
    ));
#633 = CARTESIAN_POINT('',(-1.050102063276,9.723764065846,7.811376459454
    ));
#634 = CARTESIAN_POINT('',(-0.86744906792,9.590284516191,7.874041032727)
  );
#635 = CARTESIAN_POINT('',(-0.748511630589,9.518487325136,7.909673907893
    ));
#636 = CARTESIAN_POINT('',(-0.617383749241,9.455800096396,7.942341780429
    ));
#637 = CARTESIAN_POINT('',(-0.475210983807,9.405142088066,7.969672904389
    ));
#638 = CARTESIAN_POINT('',(-0.323554540563,9.369101838741,7.989493750899
    ));
#639 = CARTESIAN_POINT('',(-0.164364754082,9.35,8.));
#640 = CARTESIAN_POINT('',(0.192407987054,9.35,8.));
#641 = CARTESIAN_POINT('',(0.376476692275,9.376175744629,7.985602497353)
  );
#642 = CARTESIAN_POINT('',(0.549067205372,9.424447692399,7.95905765428)
  );
#643 = CARTESIAN_POINT('',(0.707986954341,9.49103143141,7.923425725984)
  );
#644 = CARTESIAN_POINT('',(0.851716459429,9.572122045539,7.882010054889)
  );
#645 = CARTESIAN_POINT('',(0.979368374883,9.663820499912,7.838156956097)
  );
#646 = CARTESIAN_POINT('',(1.144018226466,9.808882410811,7.773894600755)
  );
#647 = CARTESIAN_POINT('',(1.194153362898,9.857800915524,7.752962457038)
  );
#648 = CARTESIAN_POINT('',(1.241235054442,9.908531339648,7.732102852356)
  );
#649 = CARTESIAN_POINT('',(1.285327590967,9.960924104056,7.711516447176)
  );
#650 = CARTESIAN_POINT('',(1.326485142146,10.014860293564,7.691390512727
    ));
#651 = CARTESIAN_POINT('',(1.364750577707,10.07025071487,7.67190163478)
  );
#652 = CARTESIAN_POINT('',(1.434801124166,10.182605239815,7.634934616786
    ));
#653 = CARTESIAN_POINT('',(1.466711987816,10.23951841712,7.617419851672)
  );
#654 = CARTESIAN_POINT('',(1.495875776605,10.297660168139,7.600852120433
    ));
#655 = CARTESIAN_POINT('',(1.522280066563,10.356925961768,7.585400932195
    ));
#656 = CARTESIAN_POINT('',(1.545908901193,10.417220790048,7.571225169289
    ));
#657 = CARTESIAN_POINT('',(1.566740580883,10.478458904132,7.558470949673
    ));
#658 = CARTESIAN_POINT('',(1.603236543135,10.604345324852,7.535765534935
    ));
#659 = CARTESIAN_POINT('',(1.618747407598,10.669046244128,7.525898109583
    ));
#660 = CARTESIAN_POINT('',(1.631215162021,10.734480276666,7.517829606808
    ));
#661 = CARTESIAN_POINT('',(1.640596301781,10.800466116067,7.511687112895
    ));
#662 = CARTESIAN_POINT('',(1.646863097854,10.866827548251,7.507559408069
    ));
#663 = CARTESIAN_POINT('',(1.649999993339,10.933393818746,7.50549396766)
  );
#664 = CARTESIAN_POINT('',(1.65,11.,7.505493963274));
#665 = PCURVE('',#157,#666);
#666 = DEFINITIONAL_REPRESENTATION('',(#667),#766);
#667 = B_SPLINE_CURVE_WITH_KNOTS('',7,(#668,#669,#670,#671,#672,#673,
    #674,#675,#676,#677,#678,#679,#680,#681,#682,#683,#684,#685,#686,
    #687,#688,#689,#690,#691,#692,#693,#694,#695,#696,#697,#698,#699,
    #700,#701,#702,#703,#704,#705,#706,#707,#708,#709,#710,#711,#712,
    #713,#714,#715,#716,#717,#718,#719,#720,#721,#722,#723,#724,#725,
    #726,#727,#728,#729,#730,#731,#732,#733,#734,#735,#736,#737,#738,
    #739,#740,#741,#742,#743,#744,#745,#746,#747,#748,#749,#750,#751,
    #752,#753,#754,#755,#756,#757,#758,#759,#760,#761,#762,#763,#764,
    #765),.UNSPECIFIED.,.T.,.F.,(8,6,6,6,6,6,6,6,6,6,6,6,6,6,6,6,8),(
    0.E+000,4.938773390312E-002,9.701547943227E-002,0.160489349941,
    0.248441388851,0.351399440038,0.400630329934,0.448808743793,
    0.49828823028,0.548015307943,0.595970284706,0.659880258851,
    0.748436581126,0.852102015999,0.901671151695,0.950180580211,1.),
  .UNSPECIFIED.);
#668 = CARTESIAN_POINT('',(2.153160564664,-4.));
#669 = CARTESIAN_POINT('',(2.153160561992,-3.933060527155));
#670 = CARTESIAN_POINT('',(2.151896087492,-3.866161927275));
#671 = CARTESIAN_POINT('',(2.149369646177,-3.799471318531));
#672 = CARTESIAN_POINT('',(2.145594657217,-3.733161781916));
#673 = CARTESIAN_POINT('',(2.140595540129,-3.667411985724));
#674 = CARTESIAN_POINT('',(2.134407800974,-3.602405810032));
#675 = CARTESIAN_POINT('',(2.120009637725,-3.476541476837));
#676 = CARTESIAN_POINT('',(2.111878455851,-3.415612134425));
#677 = CARTESIAN_POINT('',(2.102715061704,-3.355619552653));
#678 = CARTESIAN_POINT('',(2.0925495305,-3.296648188333));
#679 = CARTESIAN_POINT('',(2.081411195185,-3.238791607273));
#680 = CARTESIAN_POINT('',(2.069328317729,-3.18215274518));
#681 = CARTESIAN_POINT('',(2.039001815612,-3.053133994118));
#682 = CARTESIAN_POINT('',(2.020047698494,-2.981793703658));
#683 = CARTESIAN_POINT('',(1.999495614966,-2.912946805918));
#684 = CARTESIAN_POINT('',(1.97735527305,-2.84678648103));
#685 = CARTESIAN_POINT('',(1.95362058262,-2.783595153609));
#686 = CARTESIAN_POINT('',(1.928274355145,-2.723764065846));
#687 = CARTESIAN_POINT('',(1.863906518581,-2.590284516191));
#688 = CARTESIAN_POINT('',(1.822551829457,-2.518487325136));
#689 = CARTESIAN_POINT('',(1.777589030037,-2.455800096395));
#690 = CARTESIAN_POINT('',(1.729468679476,-2.405142088066));
#691 = CARTESIAN_POINT('',(1.67864782704,-2.369101838741));
#692 = CARTESIAN_POINT('',(1.625584578156,-2.35));
#693 = CARTESIAN_POINT('',(1.50666033111,-2.35));
#694 = CARTESIAN_POINT('',(1.445304161805,-2.376175744629));
#695 = CARTESIAN_POINT('',(1.387342678459,-2.424447692399));
#696 = CARTESIAN_POINT('',(1.333246248692,-2.49103143141));
#697 = CARTESIAN_POINT('',(1.283492932318,-2.572122045539));
#698 = CARTESIAN_POINT('',(1.238539559719,-2.663820499912));
#699 = CARTESIAN_POINT('',(1.179624155263,-2.808882410811));
#700 = CARTESIAN_POINT('',(1.16151928104,-2.857800915524));
#701 = CARTESIAN_POINT('',(1.144360116722,-2.908531339648));
#702 = CARTESIAN_POINT('',(1.128144678707,-2.960924104056));
#703 = CARTESIAN_POINT('',(1.112876382245,-3.014860293564));
#704 = CARTESIAN_POINT('',(1.098563738939,-3.07025071487));
#705 = CARTESIAN_POINT('',(1.072161635743,-3.182605239815));
#706 = CARTESIAN_POINT('',(1.060029429063,-3.23951841712));
#707 = CARTESIAN_POINT('',(1.048850758921,-3.297660168139));
#708 = CARTESIAN_POINT('',(1.038654350321,-3.356925961768));
#709 = CARTESIAN_POINT('',(1.02946999312,-3.417220790048));
#710 = CARTESIAN_POINT('',(1.021328206604,-3.478458904132));
#711 = CARTESIAN_POINT('',(1.007000719852,-3.604345351105));
#712 = CARTESIAN_POINT('',(1.000873177316,-3.669046248638));
#713 = CARTESIAN_POINT('',(0.995923117488,-3.734480255387));
#714 = CARTESIAN_POINT('',(0.992185403813,-3.800466092363));
#715 = CARTESIAN_POINT('',(0.989684006841,-3.866827549915));
#716 = CARTESIAN_POINT('',(0.988432088926,-3.933393848591));
#717 = CARTESIAN_POINT('',(0.988432088926,-4.06693944297));
#718 = CARTESIAN_POINT('',(0.98969656603,-4.133838071061));
#719 = CARTESIAN_POINT('',(0.992223009715,-4.200528705177));
#720 = CARTESIAN_POINT('',(0.995997998363,-4.266838239352));
#721 = CARTESIAN_POINT('',(1.000997112763,-4.332588009764));
#722 = CARTESIAN_POINT('',(1.007184849617,-4.397594163751));
#723 = CARTESIAN_POINT('',(1.021583015864,-4.523458523163));
#724 = CARTESIAN_POINT('',(1.029714197739,-4.584387865575));
#725 = CARTESIAN_POINT('',(1.038877591886,-4.644380447347));
#726 = CARTESIAN_POINT('',(1.04904312309,-4.703351811667));
#727 = CARTESIAN_POINT('',(1.060181458405,-4.761208392727));
#728 = CARTESIAN_POINT('',(1.072264335861,-4.81784725482));
#729 = CARTESIAN_POINT('',(1.102590837977,-4.946866005882));
#730 = CARTESIAN_POINT('',(1.121544955096,-5.018206296342));
#731 = CARTESIAN_POINT('',(1.142097038624,-5.087053194082));
#732 = CARTESIAN_POINT('',(1.16423738054,-5.15321351897));
#733 = CARTESIAN_POINT('',(1.187972070969,-5.216404846391));
#734 = CARTESIAN_POINT('',(1.213318298444,-5.276235934154));
#735 = CARTESIAN_POINT('',(1.277686135009,-5.409715483809));
#736 = CARTESIAN_POINT('',(1.319040824133,-5.481512674864));
#737 = CARTESIAN_POINT('',(1.364003623552,-5.544199903604));
#738 = CARTESIAN_POINT('',(1.412123974114,-5.594857911934));
#739 = CARTESIAN_POINT('',(1.46294482655,-5.630898161259));
#740 = CARTESIAN_POINT('',(1.516008075434,-5.65));
#741 = CARTESIAN_POINT('',(1.63493232248,-5.65));
#742 = CARTESIAN_POINT('',(1.696288491784,-5.623824255371));
#743 = CARTESIAN_POINT('',(1.754249975131,-5.575552307601));
#744 = CARTESIAN_POINT('',(1.808346404897,-5.50896856859));
#745 = CARTESIAN_POINT('',(1.858099721272,-5.427877954461));
#746 = CARTESIAN_POINT('',(1.903053093871,-5.336179500088));
#747 = CARTESIAN_POINT('',(1.961968498327,-5.191117589189));
#748 = CARTESIAN_POINT('',(1.98007337255,-5.142199084476));
#749 = CARTESIAN_POINT('',(1.997232536868,-5.091468660352));
#750 = CARTESIAN_POINT('',(2.013447974883,-5.039075895944));
#751 = CARTESIAN_POINT('',(2.028716271345,-4.985139706436));
#752 = CARTESIAN_POINT('',(2.043028914651,-4.92974928513));
#753 = CARTESIAN_POINT('',(2.069431017847,-4.817394760185));
#754 = CARTESIAN_POINT('',(2.081563224527,-4.76048158288));
#755 = CARTESIAN_POINT('',(2.092741894669,-4.702339831861));
#756 = CARTESIAN_POINT('',(2.102938303269,-4.643074038232));
#757 = CARTESIAN_POINT('',(2.11212266047,-4.582779209952));
#758 = CARTESIAN_POINT('',(2.120264446985,-4.521541095868));
#759 = CARTESIAN_POINT('',(2.13459193075,-4.395654675148));
#760 = CARTESIAN_POINT('',(2.140719475579,-4.330953755872));
#761 = CARTESIAN_POINT('',(2.145669538084,-4.265519723334));
#762 = CARTESIAN_POINT('',(2.149407252069,-4.199533883933));
#763 = CARTESIAN_POINT('',(2.151908646681,-4.133172451749));
#764 = CARTESIAN_POINT('',(2.153160562005,-4.066606181254));
#765 = CARTESIAN_POINT('',(2.153160564664,-4.));
#766 = ( GEOMETRIC_REPRESENTATION_CONTEXT(2) 
PARAMETRIC_REPRESENTATION_CONTEXT() REPRESENTATION_CONTEXT('2D SPACE',''
  ) );
#767 = PCURVE('',#431,#768);
#768 = DEFINITIONAL_REPRESENTATION('',(#769),#868);
#769 = B_SPLINE_CURVE_WITH_KNOTS('',7,(#770,#771,#772,#773,#774,#775,
    #776,#777,#778,#779,#780,#781,#782,#783,#784,#785,#786,#787,#788,
    #789,#790,#791,#792,#793,#794,#795,#796,#797,#798,#799,#800,#801,
    #802,#803,#804,#805,#806,#807,#808,#809,#810,#811,#812,#813,#814,
    #815,#816,#817,#818,#819,#820,#821,#822,#823,#824,#825,#826,#827,
    #828,#829,#830,#831,#832,#833,#834,#835,#836,#837,#838,#839,#840,
    #841,#842,#843,#844,#845,#846,#847,#848,#849,#850,#851,#852,#853,
    #854,#855,#856,#857,#858,#859,#860,#861,#862,#863,#864,#865,#866,
    #867),.UNSPECIFIED.,.F.,.F.,(8,6,6,6,6,6,6,6,6,6,6,6,6,6,6,6,8),(
    0.E+000,4.938773390312E-002,9.701547943227E-002,0.160489349941,
    0.248441388851,0.351399440038,0.400630329934,0.448808743793,
    0.49828823028,0.548015307943,0.595970284706,0.659880258851,
    0.748436581126,0.852102015999,0.901671151695,0.950180580211,1.),
  .UNSPECIFIED.);
#770 = CARTESIAN_POINT('',(0.E+000,2.494506036726));
#771 = CARTESIAN_POINT('',(-4.056937748177E-002,2.494506032318));
#772 = CARTESIAN_POINT('',(-8.11140606658E-002,2.492419875327));
#773 = CARTESIAN_POINT('',(-0.121641535501,2.488250832404));
#774 = CARTESIAN_POINT('',(-0.162155703758,2.482047333381));
#775 = CARTESIAN_POINT('',(-0.202655974158,2.473899886611));
#776 = CARTESIAN_POINT('',(-0.243136353512,2.463937994314));
#777 = CARTESIAN_POINT('',(-0.322591304884,2.441129910171));
#778 = CARTESIAN_POINT('',(-0.361571797703,2.428397802068));
#779 = CARTESIAN_POINT('',(-0.400573921531,2.414260464451));
#780 = CARTESIAN_POINT('',(-0.439641431421,2.398862166323));
#781 = CARTESIAN_POINT('',(-0.478815294439,2.382359647824));
#782 = CARTESIAN_POINT('',(-0.518135051869,2.364920043209));
#783 = CARTESIAN_POINT('',(-0.610288977792,2.322461869149));
#784 = CARTESIAN_POINT('',(-0.663261671468,2.296854648844));
#785 = CARTESIAN_POINT('',(-0.716753932734,2.270265837667));
#786 = CARTESIAN_POINT('',(-0.770954828399,2.243078758682));
#787 = CARTESIAN_POINT('',(-0.82605194447,2.215709248172));
#788 = CARTESIAN_POINT('',(-0.882236508844,2.188623540546));
#789 = CARTESIAN_POINT('',(-1.019344118266,2.125958967273));
#790 = CARTESIAN_POINT('',(-1.103217062887,2.090326092107));
#791 = CARTESIAN_POINT('',(-1.190622705701,2.057658219571));
#792 = CARTESIAN_POINT('',(-1.2811753861,2.030327095611));
#793 = CARTESIAN_POINT('',(-1.374702623283,2.010506249101));
#794 = CARTESIAN_POINT('',(-1.471181324321,2.));
#795 = CARTESIAN_POINT('',(-1.68740722804,2.));
#796 = CARTESIAN_POINT('',(-1.798964360244,2.014397502647));
#797 = CARTESIAN_POINT('',(-1.906152547012,2.04094234572));
#798 = CARTESIAN_POINT('',(-2.009234456146,2.076574274016));
#799 = CARTESIAN_POINT('',(-2.108274594779,2.117989945111));
#800 = CARTESIAN_POINT('',(-2.203061845336,2.161843043903));
#801 = CARTESIAN_POINT('',(-2.336053876305,2.226105399245));
#802 = CARTESIAN_POINT('',(-2.378451587743,2.247037542962));
#803 = CARTESIAN_POINT('',(-2.420316564811,2.267897147644));
#804 = CARTESIAN_POINT('',(-2.46173163716,2.288483552824));
#805 = CARTESIAN_POINT('',(-2.502776626942,2.308609487273));
#806 = CARTESIAN_POINT('',(-2.54353303693,2.32809836522));
#807 = CARTESIAN_POINT('',(-2.623777425661,2.365065383214));
#808 = CARTESIAN_POINT('',(-2.663279433725,2.382580148328));
#809 = CARTESIAN_POINT('',(-2.702634627526,2.399147879567));
#810 = CARTESIAN_POINT('',(-2.741882954535,2.414599067805));
#811 = CARTESIAN_POINT('',(-2.781065831427,2.428774830711));
#812 = CARTESIAN_POINT('',(-2.820227530525,2.441529050327));
#813 = CARTESIAN_POINT('',(-2.899663913692,2.4642344698));
#814 = CARTESIAN_POINT('',(-2.939943260549,2.474101891602));
#815 = CARTESIAN_POINT('',(-2.9802424858,2.482170390042));
#816 = CARTESIAN_POINT('',(-3.02055563029,2.488312883337));
#817 = CARTESIAN_POINT('',(-3.060882003294,2.49244059197));
#818 = CARTESIAN_POINT('',(-3.1012252891,2.494506036726));
#819 = CARTESIAN_POINT('',(-3.182162012966,2.494506036726));
#820 = CARTESIAN_POINT('',(-3.222706713019,2.492419875366));
#821 = CARTESIAN_POINT('',(-3.263234203528,2.488250828619));
#822 = CARTESIAN_POINT('',(-3.303748370651,2.482047330218));
#823 = CARTESIAN_POINT('',(-3.344248625142,2.473899887801));
#824 = CARTESIAN_POINT('',(-3.384728990552,2.463937999065));
#825 = CARTESIAN_POINT('',(-3.464183958474,2.441129910171));
#826 = CARTESIAN_POINT('',(-3.503164451292,2.428397802068));
#827 = CARTESIAN_POINT('',(-3.542166575121,2.414260464451));
#828 = CARTESIAN_POINT('',(-3.58123408501,2.398862166323));
#829 = CARTESIAN_POINT('',(-3.620407948028,2.382359647824));
#830 = CARTESIAN_POINT('',(-3.659727705459,2.364920043209));
#831 = CARTESIAN_POINT('',(-3.751881631382,2.322461869149));
#832 = CARTESIAN_POINT('',(-3.804854325058,2.296854648844));
#833 = CARTESIAN_POINT('',(-3.858346586324,2.270265837667));
#834 = CARTESIAN_POINT('',(-3.912547481988,2.243078758682));
#835 = CARTESIAN_POINT('',(-3.96764459806,2.215709248172));
#836 = CARTESIAN_POINT('',(-4.023829162433,2.188623540546));
#837 = CARTESIAN_POINT('',(-4.160936771856,2.125958967273));
#838 = CARTESIAN_POINT('',(-4.244809716477,2.090326092107));
#839 = CARTESIAN_POINT('',(-4.33221535929,2.057658219571));
#840 = CARTESIAN_POINT('',(-4.42276803969,2.030327095611));
#841 = CARTESIAN_POINT('',(-4.516295276873,2.010506249101));
#842 = CARTESIAN_POINT('',(-4.61277397791,2.));
#843 = CARTESIAN_POINT('',(-4.82899988163,2.));
#844 = CARTESIAN_POINT('',(-4.940557013834,2.014397502647));
#845 = CARTESIAN_POINT('',(-5.047745200603,2.040942345721));
#846 = CARTESIAN_POINT('',(-5.150827109736,2.076574274016));
#847 = CARTESIAN_POINT('',(-5.249867248369,2.117989945111));
#848 = CARTESIAN_POINT('',(-5.344654498926,2.161843043903));
#849 = CARTESIAN_POINT('',(-5.477646529895,2.226105399245));
#850 = CARTESIAN_POINT('',(-5.520044241333,2.247037542962));
#851 = CARTESIAN_POINT('',(-5.5619092184,2.267897147644));
#852 = CARTESIAN_POINT('',(-5.60332429075,2.288483552824));
#853 = CARTESIAN_POINT('',(-5.644369280532,2.308609487273));
#854 = CARTESIAN_POINT('',(-5.685125690519,2.32809836522));
#855 = CARTESIAN_POINT('',(-5.76537007925,2.365065383214));
#856 = CARTESIAN_POINT('',(-5.804872087314,2.382580148328));
#857 = CARTESIAN_POINT('',(-5.844227281116,2.399147879567));
#858 = CARTESIAN_POINT('',(-5.883475608124,2.414599067805));
#859 = CARTESIAN_POINT('',(-5.922658485017,2.428774830711));
#860 = CARTESIAN_POINT('',(-5.961820184115,2.441529050327));
#861 = CARTESIAN_POINT('',(-6.041256550716,2.464234465065));
#862 = CARTESIAN_POINT('',(-6.081535911532,2.474101890417));
#863 = CARTESIAN_POINT('',(-6.121835152696,2.482170393192));
#864 = CARTESIAN_POINT('',(-6.162148298314,2.488312887105));
#865 = CARTESIAN_POINT('',(-6.202474655649,2.492440591931));
#866 = CARTESIAN_POINT('',(-6.242817924602,2.49450603234));
#867 = CARTESIAN_POINT('',(-6.28318530718,2.494506036726));
#868 = ( GEOMETRIC_REPRESENTATION_CONTEXT(2) 
PARAMETRIC_REPRESENTATION_CONTEXT() REPRESENTATION_CONTEXT('2D SPACE',''
  ) );
#869 = ADVANCED_FACE('',(#870,#876),#190,.T.);
#870 = FACE_BOUND('',#871,.T.);
#871 = EDGE_LOOP('',(#872,#873,#874,#875));
#872 = ORIENTED_EDGE('',*,*,#483,.T.);
#873 = ORIENTED_EDGE('',*,*,#356,.T.);
#874 = ORIENTED_EDGE('',*,*,#172,.F.);
#875 = ORIENTED_EDGE('',*,*,#272,.F.);
#876 = FACE_BOUND('',#877,.T.);
#877 = EDGE_LOOP('',(#878));
#878 = ORIENTED_EDGE('',*,*,#879,.F.);
#879 = EDGE_CURVE('',#880,#880,#882,.T.);
#880 = VERTEX_POINT('',#881);
#881 = CARTESIAN_POINT('',(3.,-15.,5.));
#882 = SURFACE_CURVE('',#883,(#888,#895),.PCURVE_S1.);
#883 = CIRCLE('',#884,3.);
#884 = AXIS2_PLACEMENT_3D('',#885,#886,#887);
#885 = CARTESIAN_POINT('',(0.E+000,-15.,5.));
#886 = DIRECTION('',(0.E+000,-1.,0.E+000));
#887 = DIRECTION('',(1.,0.E+000,0.E+000));
#888 = PCURVE('',#190,#889);
#889 = DEFINITIONAL_REPRESENTATION('',(#890),#894);
#890 = CIRCLE('',#891,3.);
#891 = AXIS2_PLACEMENT_2D('',#892,#893);
#892 = CARTESIAN_POINT('',(5.,-5.));
#893 = DIRECTION('',(-1.,-0.E+000));
#894 = ( GEOMETRIC_REPRESENTATION_CONTEXT(2) 
PARAMETRIC_REPRESENTATION_CONTEXT() REPRESENTATION_CONTEXT('2D SPACE',''
  ) );
#895 = PCURVE('',#896,#901);
#896 = CYLINDRICAL_SURFACE('',#897,3.);
#897 = AXIS2_PLACEMENT_3D('',#898,#899,#900);
#898 = CARTESIAN_POINT('',(0.E+000,-15.,5.));
#899 = DIRECTION('',(0.E+000,-1.,2.2E-016));
#900 = DIRECTION('',(1.,0.E+000,0.E+000));
#901 = DEFINITIONAL_REPRESENTATION('',(#902),#906);
#902 = LINE('',#903,#904);
#903 = CARTESIAN_POINT('',(0.E+000,0.E+000));
#904 = VECTOR('',#905,1.);
#905 = DIRECTION('',(1.,0.E+000));
#906 = ( GEOMETRIC_REPRESENTATION_CONTEXT(2) 
PARAMETRIC_REPRESENTATION_CONTEXT() REPRESENTATION_CONTEXT('2D SPACE',''
  ) );
#907 = ADVANCED_FACE('',(#908),#317,.F.);
#908 = FACE_BOUND('',#909,.F.);
#909 = EDGE_LOOP('',(#910,#911,#932,#933));
#910 = ORIENTED_EDGE('',*,*,#380,.F.);
#911 = ORIENTED_EDGE('',*,*,#912,.T.);
#912 = EDGE_CURVE('',#381,#297,#913,.T.);
#913 = SEAM_CURVE('',#914,(#918,#925),.PCURVE_S1.);
#914 = LINE('',#915,#916);
#915 = CARTESIAN_POINT('',(2.5,0.E+000,10.));
#916 = VECTOR('',#917,1.);
#917 = DIRECTION('',(-0.E+000,-0.E+000,-1.));
#918 = PCURVE('',#317,#919);
#919 = DEFINITIONAL_REPRESENTATION('',(#920),#924);
#920 = LINE('',#921,#922);
#921 = CARTESIAN_POINT('',(6.28318530718,0.E+000));
#922 = VECTOR('',#923,1.);
#923 = DIRECTION('',(0.E+000,-1.));
#924 = ( GEOMETRIC_REPRESENTATION_CONTEXT(2) 
PARAMETRIC_REPRESENTATION_CONTEXT() REPRESENTATION_CONTEXT('2D SPACE',''
  ) );
#925 = PCURVE('',#317,#926);
#926 = DEFINITIONAL_REPRESENTATION('',(#927),#931);
#927 = LINE('',#928,#929);
#928 = CARTESIAN_POINT('',(0.E+000,0.E+000));
#929 = VECTOR('',#930,1.);
#930 = DIRECTION('',(0.E+000,-1.));
#931 = ( GEOMETRIC_REPRESENTATION_CONTEXT(2) 
PARAMETRIC_REPRESENTATION_CONTEXT() REPRESENTATION_CONTEXT('2D SPACE',''
  ) );
#932 = ORIENTED_EDGE('',*,*,#296,.T.);
#933 = ORIENTED_EDGE('',*,*,#912,.F.);
#934 = ADVANCED_FACE('',(#935),#431,.F.);
#935 = FACE_BOUND('',#936,.T.);
#936 = EDGE_LOOP('',(#937,#958,#959,#960));
#937 = ORIENTED_EDGE('',*,*,#938,.F.);
#938 = EDGE_CURVE('',#411,#563,#939,.T.);
#939 = SEAM_CURVE('',#940,(#944,#951),.PCURVE_S1.);
#940 = LINE('',#941,#942);
#941 = CARTESIAN_POINT('',(1.65,11.,10.));
#942 = VECTOR('',#943,1.);
#943 = DIRECTION('',(-4.E-017,0.E+000,-1.));
#944 = PCURVE('',#431,#945);
#945 = DEFINITIONAL_REPRESENTATION('',(#946),#950);
#946 = LINE('',#947,#948);
#947 = CARTESIAN_POINT('',(-0.E+000,0.E+000));
#948 = VECTOR('',#949,1.);
#949 = DIRECTION('',(-0.E+000,1.));
#950 = ( GEOMETRIC_REPRESENTATION_CONTEXT(2) 
PARAMETRIC_REPRESENTATION_CONTEXT() REPRESENTATION_CONTEXT('2D SPACE',''
  ) );
#951 = PCURVE('',#431,#952);
#952 = DEFINITIONAL_REPRESENTATION('',(#953),#957);
#953 = LINE('',#954,#955);
#954 = CARTESIAN_POINT('',(-6.28318530718,0.E+000));
#955 = VECTOR('',#956,1.);
#956 = DIRECTION('',(-0.E+000,1.));
#957 = ( GEOMETRIC_REPRESENTATION_CONTEXT(2) 
PARAMETRIC_REPRESENTATION_CONTEXT() REPRESENTATION_CONTEXT('2D SPACE',''
  ) );
#958 = ORIENTED_EDGE('',*,*,#410,.T.);
#959 = ORIENTED_EDGE('',*,*,#938,.T.);
#960 = ORIENTED_EDGE('',*,*,#562,.F.);
#961 = ADVANCED_FACE('',(#962),#466,.F.);
#962 = FACE_BOUND('',#963,.T.);
#963 = EDGE_LOOP('',(#964,#987,#988,#989));
#964 = ORIENTED_EDGE('',*,*,#965,.F.);
#965 = EDGE_CURVE('',#446,#966,#968,.T.);
#966 = VERTEX_POINT('',#967);
#967 = CARTESIAN_POINT('',(1.65,-11.,7.505493963274));
#968 = SEAM_CURVE('',#969,(#973,#980),.PCURVE_S1.);
#969 = LINE('',#970,#971);
#970 = CARTESIAN_POINT('',(1.65,-11.,10.));
#971 = VECTOR('',#972,1.);
#972 = DIRECTION('',(-4.E-017,0.E+000,-1.));
#973 = PCURVE('',#466,#974);
#974 = DEFINITIONAL_REPRESENTATION('',(#975),#979);
#975 = LINE('',#976,#977);
#976 = CARTESIAN_POINT('',(-0.E+000,0.E+000));
#977 = VECTOR('',#978,1.);
#978 = DIRECTION('',(-0.E+000,1.));
#979 = ( GEOMETRIC_REPRESENTATION_CONTEXT(2) 
PARAMETRIC_REPRESENTATION_CONTEXT() REPRESENTATION_CONTEXT('2D SPACE',''
  ) );
#980 = PCURVE('',#466,#981);
#981 = DEFINITIONAL_REPRESENTATION('',(#982),#986);
#982 = LINE('',#983,#984);
#983 = CARTESIAN_POINT('',(-6.28318530718,0.E+000));
#984 = VECTOR('',#985,1.);
#985 = DIRECTION('',(-0.E+000,1.));
#986 = ( GEOMETRIC_REPRESENTATION_CONTEXT(2) 
PARAMETRIC_REPRESENTATION_CONTEXT() REPRESENTATION_CONTEXT('2D SPACE',''
  ) );
#987 = ORIENTED_EDGE('',*,*,#445,.T.);
#988 = ORIENTED_EDGE('',*,*,#965,.T.);
#989 = ORIENTED_EDGE('',*,*,#990,.F.);
#990 = EDGE_CURVE('',#966,#966,#991,.T.);
#991 = SURFACE_CURVE('',#992,(#1091,#1193),.PCURVE_S1.);
#992 = B_SPLINE_CURVE_WITH_KNOTS('',7,(#993,#994,#995,#996,#997,#998,
    #999,#1000,#1001,#1002,#1003,#1004,#1005,#1006,#1007,#1008,#1009,
    #1010,#1011,#1012,#1013,#1014,#1015,#1016,#1017,#1018,#1019,#1020,
    #1021,#1022,#1023,#1024,#1025,#1026,#1027,#1028,#1029,#1030,#1031,
    #1032,#1033,#1034,#1035,#1036,#1037,#1038,#1039,#1040,#1041,#1042,
    #1043,#1044,#1045,#1046,#1047,#1048,#1049,#1050,#1051,#1052,#1053,
    #1054,#1055,#1056,#1057,#1058,#1059,#1060,#1061,#1062,#1063,#1064,
    #1065,#1066,#1067,#1068,#1069,#1070,#1071,#1072,#1073,#1074,#1075,
    #1076,#1077,#1078,#1079,#1080,#1081,#1082,#1083,#1084,#1085,#1086,
    #1087,#1088,#1089,#1090),.UNSPECIFIED.,.T.,.F.,(8,6,6,6,6,6,6,6,6,6,
    6,6,6,6,6,6,8),(0.E+000,4.938773404813E-002,9.701547971711E-002,
    0.160489357746,0.248441395839,0.351399446068,0.400630335506,
    0.448808748918,0.498288234945,0.548015312145,0.595970288463,
    0.659880262013,0.748436583464,0.852102017374,0.901671152609,
    0.950180580674,1.),.UNSPECIFIED.);
#993 = CARTESIAN_POINT('',(1.65,-11.,7.505493963274));
#994 = CARTESIAN_POINT('',(1.649999993306,-10.93306052715,7.505493967682
    ));
#995 = CARTESIAN_POINT('',(1.646831624593,-10.86616192727,7.507580124673
    ));
#996 = CARTESIAN_POINT('',(1.640502086087,-10.79947131853,7.511749167596
    ));
#997 = CARTESIAN_POINT('',(1.631027224569,-10.73316178191,7.517952666619
    ));
#998 = CARTESIAN_POINT('',(1.618435246096,-10.66741198572,7.526100113389
    ));
#999 = CARTESIAN_POINT('',(1.602770420715,-10.60240581003,7.536062005686
    ));
#1000 = CARTESIAN_POINT('',(1.566088609935,-10.47654147683,
    7.558870089829));
#1001 = CARTESIAN_POINT('',(1.545280695681,-10.41561213442,
    7.571602197932));
#1002 = CARTESIAN_POINT('',(1.521702155911,-10.35561955265,
    7.585739535549));
#1003 = CARTESIAN_POINT('',(1.495374278912,-10.29664818833,
    7.601137833677));
#1004 = CARTESIAN_POINT('',(1.466312680221,-10.23879160727,
    7.617640352176));
#1005 = CARTESIAN_POINT('',(1.434529453071,-10.18215274518,
    7.635079956791));
#1006 = CARTESIAN_POINT('',(1.354064709949,-10.0531339856,7.677538133654
    ));
#1007 = CARTESIAN_POINT('',(1.30328341992,-9.981793711472,7.703145348003
    ));
#1008 = CARTESIAN_POINT('',(1.247629628547,-9.91294681271,7.729734160061
    ));
#1009 = CARTESIAN_POINT('',(1.186985461314,-9.846786475165,
    7.756921244019));
#1010 = CARTESIAN_POINT('',(1.121198296628,-9.78359514555,7.784290754911
    ));
#1011 = CARTESIAN_POINT('',(1.050102073059,-9.723764072996,
    7.811376456098));
#1012 = CARTESIAN_POINT('',(0.86744906792,-9.590284516191,7.874041032727
    ));
#1013 = CARTESIAN_POINT('',(0.748511630589,-9.518487325136,
    7.909673907893));
#1014 = CARTESIAN_POINT('',(0.61738374924,-9.455800096396,7.942341780429
    ));
#1015 = CARTESIAN_POINT('',(0.475210983807,-9.405142088066,
    7.969672904389));
#1016 = CARTESIAN_POINT('',(0.323554540563,-9.369101838741,
    7.989493750899));
#1017 = CARTESIAN_POINT('',(0.164364754083,-9.35,8.));
#1018 = CARTESIAN_POINT('',(-0.192407987054,-9.35,8.));
#1019 = CARTESIAN_POINT('',(-0.376476692275,-9.376175744629,
    7.985602497353));
#1020 = CARTESIAN_POINT('',(-0.549067205371,-9.424447692399,
    7.95905765428));
#1021 = CARTESIAN_POINT('',(-0.707986954341,-9.49103143141,
    7.923425725984));
#1022 = CARTESIAN_POINT('',(-0.851716459429,-9.572122045539,
    7.882010054889));
#1023 = CARTESIAN_POINT('',(-0.979368374883,-9.663820499912,
    7.838156956097));
#1024 = CARTESIAN_POINT('',(-1.144018226466,-9.808882410811,
    7.773894600755));
#1025 = CARTESIAN_POINT('',(-1.194153362898,-9.857800915524,
    7.752962457038));
#1026 = CARTESIAN_POINT('',(-1.241235054442,-9.908531339648,
    7.732102852356));
#1027 = CARTESIAN_POINT('',(-1.285327590967,-9.960924104056,
    7.711516447176));
#1028 = CARTESIAN_POINT('',(-1.326485142146,-10.01486029356,
    7.691390512727));
#1029 = CARTESIAN_POINT('',(-1.364750577707,-10.07025071487,
    7.67190163478));
#1030 = CARTESIAN_POINT('',(-1.434801124166,-10.18260523981,
    7.634934616786));
#1031 = CARTESIAN_POINT('',(-1.466711987816,-10.23951841712,
    7.617419851672));
#1032 = CARTESIAN_POINT('',(-1.495875776605,-10.29766016813,
    7.600852120433));
#1033 = CARTESIAN_POINT('',(-1.522280066563,-10.35692596176,
    7.585400932195));
#1034 = CARTESIAN_POINT('',(-1.545908901193,-10.41722079004,
    7.571225169289));
#1035 = CARTESIAN_POINT('',(-1.566740580883,-10.47845890413,
    7.558470949673));
#1036 = CARTESIAN_POINT('',(-1.603236550746,-10.6043453511,7.5357655302)
  );
#1037 = CARTESIAN_POINT('',(-1.618747409314,-10.66904624863,
    7.525898108398));
#1038 = CARTESIAN_POINT('',(-1.631215156978,-10.73448025538,
    7.517829609958));
#1039 = CARTESIAN_POINT('',(-1.640596296029,-10.80046609236,
    7.511687116663));
#1040 = CARTESIAN_POINT('',(-1.646863098069,-10.86682754991,
    7.50755940803));
#1041 = CARTESIAN_POINT('',(-1.65,-10.93339384859,7.505493963274));
#1042 = CARTESIAN_POINT('',(-1.65,-11.06693944297,7.505493963274));
#1043 = CARTESIAN_POINT('',(-1.64683162481,-11.13383807106,
    7.507580124634));
#1044 = CARTESIAN_POINT('',(-1.640502080308,-11.20052870517,
    7.511749171381));
#1045 = CARTESIAN_POINT('',(-1.631027219504,-11.26683823935,
    7.517952669782));
#1046 = CARTESIAN_POINT('',(-1.618435247819,-11.33258800976,
    7.526100112199));
#1047 = CARTESIAN_POINT('',(-1.602770428356,-11.39759416375,
    7.536062000935));
#1048 = CARTESIAN_POINT('',(-1.566088609935,-11.52345852316,
    7.558870089829));
#1049 = CARTESIAN_POINT('',(-1.545280695681,-11.58438786557,
    7.571602197932));
#1050 = CARTESIAN_POINT('',(-1.521702155911,-11.64438044734,
    7.585739535549));
#1051 = CARTESIAN_POINT('',(-1.495374278912,-11.70335181166,
    7.601137833677));
#1052 = CARTESIAN_POINT('',(-1.466312680221,-11.76120839272,
    7.617640352176));
#1053 = CARTESIAN_POINT('',(-1.434529453071,-11.81784725482,
    7.635079956791));
#1054 = CARTESIAN_POINT('',(-1.35406471526,-11.94686600588,
    7.677538130851));
#1055 = CARTESIAN_POINT('',(-1.303283412162,-12.01820629634,
    7.703145351156));
#1056 = CARTESIAN_POINT('',(-1.247629624229,-12.08705319408,
    7.729734162333));
#1057 = CARTESIAN_POINT('',(-1.186985468934,-12.15321351897,
    7.756921241318));
#1058 = CARTESIAN_POINT('',(-1.121198303737,-12.21640484639,
    7.784290751828));
#1059 = CARTESIAN_POINT('',(-1.050102063276,-12.27623593415,
    7.811376459454));
#1060 = CARTESIAN_POINT('',(-0.86744906792,-12.4097154838,7.874041032727
    ));
#1061 = CARTESIAN_POINT('',(-0.748511630589,-12.48151267486,
    7.909673907893));
#1062 = CARTESIAN_POINT('',(-0.617383749242,-12.5441999036,
    7.942341780429));
#1063 = CARTESIAN_POINT('',(-0.475210983806,-12.59485791193,
    7.969672904389));
#1064 = CARTESIAN_POINT('',(-0.323554540563,-12.63089816125,
    7.989493750899));
#1065 = CARTESIAN_POINT('',(-0.164364754082,-12.65,8.));
#1066 = CARTESIAN_POINT('',(0.192407987054,-12.65,8.));
#1067 = CARTESIAN_POINT('',(0.376476692276,-12.62382425537,
    7.985602497353));
#1068 = CARTESIAN_POINT('',(0.549067205371,-12.5755523076,7.959057654279
    ));
#1069 = CARTESIAN_POINT('',(0.707986954341,-12.50896856859,
    7.923425725984));
#1070 = CARTESIAN_POINT('',(0.851716459429,-12.42787795446,
    7.882010054889));
#1071 = CARTESIAN_POINT('',(0.979368374883,-12.33617950008,
    7.838156956097));
#1072 = CARTESIAN_POINT('',(1.144018226466,-12.19111758918,
    7.773894600755));
#1073 = CARTESIAN_POINT('',(1.194153362898,-12.14219908447,
    7.752962457038));
#1074 = CARTESIAN_POINT('',(1.241235054442,-12.09146866035,
    7.732102852356));
#1075 = CARTESIAN_POINT('',(1.285327590967,-12.03907589594,
    7.711516447176));
#1076 = CARTESIAN_POINT('',(1.326485142146,-11.98513970643,
    7.691390512727));
#1077 = CARTESIAN_POINT('',(1.364750577707,-11.92974928513,7.67190163478
    ));
#1078 = CARTESIAN_POINT('',(1.434801124166,-11.81739476018,
    7.634934616786));
#1079 = CARTESIAN_POINT('',(1.466711987816,-11.76048158288,
    7.617419851672));
#1080 = CARTESIAN_POINT('',(1.495875776605,-11.70233983186,
    7.600852120433));
#1081 = CARTESIAN_POINT('',(1.522280066563,-11.64307403823,
    7.585400932195));
#1082 = CARTESIAN_POINT('',(1.545908901193,-11.58277920995,
    7.571225169289));
#1083 = CARTESIAN_POINT('',(1.566740580883,-11.52154109586,
    7.558470949673));
#1084 = CARTESIAN_POINT('',(1.603236543135,-11.39565467514,
    7.535765534935));
#1085 = CARTESIAN_POINT('',(1.618747407598,-11.33095375587,
    7.525898109583));
#1086 = CARTESIAN_POINT('',(1.631215162021,-11.26551972333,
    7.517829606808));
#1087 = CARTESIAN_POINT('',(1.640596301781,-11.19953388393,
    7.511687112895));
#1088 = CARTESIAN_POINT('',(1.646863097854,-11.13317245175,
    7.507559408069));
#1089 = CARTESIAN_POINT('',(1.649999993339,-11.06660618125,7.50549396766
    ));
#1090 = CARTESIAN_POINT('',(1.65,-11.,7.505493963274));
#1091 = PCURVE('',#466,#1092);
#1092 = DEFINITIONAL_REPRESENTATION('',(#1093),#1192);
#1093 = B_SPLINE_CURVE_WITH_KNOTS('',7,(#1094,#1095,#1096,#1097,#1098,
    #1099,#1100,#1101,#1102,#1103,#1104,#1105,#1106,#1107,#1108,#1109,
    #1110,#1111,#1112,#1113,#1114,#1115,#1116,#1117,#1118,#1119,#1120,
    #1121,#1122,#1123,#1124,#1125,#1126,#1127,#1128,#1129,#1130,#1131,
    #1132,#1133,#1134,#1135,#1136,#1137,#1138,#1139,#1140,#1141,#1142,
    #1143,#1144,#1145,#1146,#1147,#1148,#1149,#1150,#1151,#1152,#1153,
    #1154,#1155,#1156,#1157,#1158,#1159,#1160,#1161,#1162,#1163,#1164,
    #1165,#1166,#1167,#1168,#1169,#1170,#1171,#1172,#1173,#1174,#1175,
    #1176,#1177,#1178,#1179,#1180,#1181,#1182,#1183,#1184,#1185,#1186,
    #1187,#1188,#1189,#1190,#1191),.UNSPECIFIED.,.F.,.F.,(8,6,6,6,6,6,6,
    6,6,6,6,6,6,6,6,6,8),(0.E+000,4.938773404813E-002,
    9.701547971711E-002,0.160489357746,0.248441395839,0.351399446068,
    0.400630335506,0.448808748918,0.498288234945,0.548015312145,
    0.595970288463,0.659880262013,0.748436583464,0.852102017374,
    0.901671152609,0.950180580674,1.),.UNSPECIFIED.);
#1094 = CARTESIAN_POINT('',(0.E+000,2.494506036726));
#1095 = CARTESIAN_POINT('',(-4.056937748178E-002,2.494506032318));
#1096 = CARTESIAN_POINT('',(-8.11140606658E-002,2.492419875327));
#1097 = CARTESIAN_POINT('',(-0.121641535501,2.488250832404));
#1098 = CARTESIAN_POINT('',(-0.162155703758,2.482047333381));
#1099 = CARTESIAN_POINT('',(-0.202655974158,2.473899886611));
#1100 = CARTESIAN_POINT('',(-0.243136353512,2.463937994314));
#1101 = CARTESIAN_POINT('',(-0.322591304884,2.441129910171));
#1102 = CARTESIAN_POINT('',(-0.361571797702,2.428397802068));
#1103 = CARTESIAN_POINT('',(-0.400573921531,2.414260464451));
#1104 = CARTESIAN_POINT('',(-0.439641431421,2.398862166323));
#1105 = CARTESIAN_POINT('',(-0.478815294439,2.382359647824));
#1106 = CARTESIAN_POINT('',(-0.518135051869,2.364920043209));
#1107 = CARTESIAN_POINT('',(-0.610288983875,2.322461866346));
#1108 = CARTESIAN_POINT('',(-0.6632616647,2.296854651997));
#1109 = CARTESIAN_POINT('',(-0.716753927862,2.270265839939));
#1110 = CARTESIAN_POINT('',(-0.770954834235,2.243078755981));
#1111 = CARTESIAN_POINT('',(-0.826051951074,2.215709245089));
#1112 = CARTESIAN_POINT('',(-0.8822365015,2.188623543902));
#1113 = CARTESIAN_POINT('',(-1.019344118266,2.125958967273));
#1114 = CARTESIAN_POINT('',(-1.103217062887,2.090326092107));
#1115 = CARTESIAN_POINT('',(-1.190622705701,2.057658219571));
#1116 = CARTESIAN_POINT('',(-1.2811753861,2.030327095611));
#1117 = CARTESIAN_POINT('',(-1.374702623283,2.010506249101));
#1118 = CARTESIAN_POINT('',(-1.471181324321,2.));
#1119 = CARTESIAN_POINT('',(-1.68740722804,2.));
#1120 = CARTESIAN_POINT('',(-1.798964360244,2.014397502647));
#1121 = CARTESIAN_POINT('',(-1.906152547012,2.04094234572));
#1122 = CARTESIAN_POINT('',(-2.009234456146,2.076574274016));
#1123 = CARTESIAN_POINT('',(-2.108274594779,2.117989945111));
#1124 = CARTESIAN_POINT('',(-2.203061845336,2.161843043903));
#1125 = CARTESIAN_POINT('',(-2.336053876305,2.226105399245));
#1126 = CARTESIAN_POINT('',(-2.378451587743,2.247037542962));
#1127 = CARTESIAN_POINT('',(-2.420316564811,2.267897147644));
#1128 = CARTESIAN_POINT('',(-2.46173163716,2.288483552824));
#1129 = CARTESIAN_POINT('',(-2.502776626942,2.308609487273));
#1130 = CARTESIAN_POINT('',(-2.54353303693,2.32809836522));
#1131 = CARTESIAN_POINT('',(-2.623777425661,2.365065383214));
#1132 = CARTESIAN_POINT('',(-2.663279433725,2.382580148328));
#1133 = CARTESIAN_POINT('',(-2.702634627526,2.399147879567));
#1134 = CARTESIAN_POINT('',(-2.741882954535,2.414599067805));
#1135 = CARTESIAN_POINT('',(-2.781065831427,2.428774830711));
#1136 = CARTESIAN_POINT('',(-2.820227530525,2.441529050327));
#1137 = CARTESIAN_POINT('',(-2.899663913692,2.4642344698));
#1138 = CARTESIAN_POINT('',(-2.939943260549,2.474101891602));
#1139 = CARTESIAN_POINT('',(-2.9802424858,2.482170390042));
#1140 = CARTESIAN_POINT('',(-3.02055563029,2.488312883337));
#1141 = CARTESIAN_POINT('',(-3.060882003294,2.49244059197));
#1142 = CARTESIAN_POINT('',(-3.1012252891,2.494506036726));
#1143 = CARTESIAN_POINT('',(-3.182162012966,2.494506036726));
#1144 = CARTESIAN_POINT('',(-3.222706713019,2.492419875366));
#1145 = CARTESIAN_POINT('',(-3.263234203528,2.488250828619));
#1146 = CARTESIAN_POINT('',(-3.303748370651,2.482047330218));
#1147 = CARTESIAN_POINT('',(-3.344248625142,2.473899887801));
#1148 = CARTESIAN_POINT('',(-3.384728990552,2.463937999065));
#1149 = CARTESIAN_POINT('',(-3.464183958474,2.441129910171));
#1150 = CARTESIAN_POINT('',(-3.503164451292,2.428397802068));
#1151 = CARTESIAN_POINT('',(-3.542166575121,2.414260464451));
#1152 = CARTESIAN_POINT('',(-3.58123408501,2.398862166323));
#1153 = CARTESIAN_POINT('',(-3.620407948028,2.382359647824));
#1154 = CARTESIAN_POINT('',(-3.659727705459,2.364920043209));
#1155 = CARTESIAN_POINT('',(-3.751881631382,2.322461869149));
#1156 = CARTESIAN_POINT('',(-3.804854325058,2.296854648844));
#1157 = CARTESIAN_POINT('',(-3.858346586323,2.270265837667));
#1158 = CARTESIAN_POINT('',(-3.912547481988,2.243078758682));
#1159 = CARTESIAN_POINT('',(-3.96764459806,2.215709248172));
#1160 = CARTESIAN_POINT('',(-4.023829162433,2.188623540546));
#1161 = CARTESIAN_POINT('',(-4.160936771856,2.125958967273));
#1162 = CARTESIAN_POINT('',(-4.244809716477,2.090326092107));
#1163 = CARTESIAN_POINT('',(-4.33221535929,2.057658219571));
#1164 = CARTESIAN_POINT('',(-4.42276803969,2.030327095611));
#1165 = CARTESIAN_POINT('',(-4.516295276873,2.010506249101));
#1166 = CARTESIAN_POINT('',(-4.61277397791,2.));
#1167 = CARTESIAN_POINT('',(-4.82899988163,2.));
#1168 = CARTESIAN_POINT('',(-4.940557013834,2.014397502647));
#1169 = CARTESIAN_POINT('',(-5.047745200602,2.040942345721));
#1170 = CARTESIAN_POINT('',(-5.150827109736,2.076574274016));
#1171 = CARTESIAN_POINT('',(-5.249867248369,2.117989945111));
#1172 = CARTESIAN_POINT('',(-5.344654498926,2.161843043903));
#1173 = CARTESIAN_POINT('',(-5.477646529894,2.226105399245));
#1174 = CARTESIAN_POINT('',(-5.520044241333,2.247037542962));
#1175 = CARTESIAN_POINT('',(-5.5619092184,2.267897147644));
#1176 = CARTESIAN_POINT('',(-5.603324290749,2.288483552824));
#1177 = CARTESIAN_POINT('',(-5.644369280532,2.308609487273));
#1178 = CARTESIAN_POINT('',(-5.685125690519,2.32809836522));
#1179 = CARTESIAN_POINT('',(-5.76537007925,2.365065383214));
#1180 = CARTESIAN_POINT('',(-5.804872087314,2.382580148328));
#1181 = CARTESIAN_POINT('',(-5.844227281116,2.399147879567));
#1182 = CARTESIAN_POINT('',(-5.883475608124,2.414599067805));
#1183 = CARTESIAN_POINT('',(-5.922658485017,2.428774830711));
#1184 = CARTESIAN_POINT('',(-5.961820184115,2.441529050327));
#1185 = CARTESIAN_POINT('',(-6.041256550716,2.464234465065));
#1186 = CARTESIAN_POINT('',(-6.081535911532,2.474101890417));
#1187 = CARTESIAN_POINT('',(-6.121835152696,2.482170393192));
#1188 = CARTESIAN_POINT('',(-6.162148298314,2.488312887105));
#1189 = CARTESIAN_POINT('',(-6.202474655649,2.492440591931));
#1190 = CARTESIAN_POINT('',(-6.242817924602,2.49450603234));
#1191 = CARTESIAN_POINT('',(-6.28318530718,2.494506036726));
#1192 = ( GEOMETRIC_REPRESENTATION_CONTEXT(2) 
PARAMETRIC_REPRESENTATION_CONTEXT() REPRESENTATION_CONTEXT('2D SPACE',''
  ) );
#1193 = PCURVE('',#896,#1194);
#1194 = DEFINITIONAL_REPRESENTATION('',(#1195),#1294);
#1195 = B_SPLINE_CURVE_WITH_KNOTS('',7,(#1196,#1197,#1198,#1199,#1200,
    #1201,#1202,#1203,#1204,#1205,#1206,#1207,#1208,#1209,#1210,#1211,
    #1212,#1213,#1214,#1215,#1216,#1217,#1218,#1219,#1220,#1221,#1222,
    #1223,#1224,#1225,#1226,#1227,#1228,#1229,#1230,#1231,#1232,#1233,
    #1234,#1235,#1236,#1237,#1238,#1239,#1240,#1241,#1242,#1243,#1244,
    #1245,#1246,#1247,#1248,#1249,#1250,#1251,#1252,#1253,#1254,#1255,
    #1256,#1257,#1258,#1259,#1260,#1261,#1262,#1263,#1264,#1265,#1266,
    #1267,#1268,#1269,#1270,#1271,#1272,#1273,#1274,#1275,#1276,#1277,
    #1278,#1279,#1280,#1281,#1282,#1283,#1284,#1285,#1286,#1287,#1288,
    #1289,#1290,#1291,#1292,#1293),.UNSPECIFIED.,.T.,.F.,(8,6,6,6,6,6,6,
    6,6,6,6,6,6,6,6,6,8),(0.E+000,4.938773404813E-002,
    9.701547971711E-002,0.160489357746,0.248441395839,0.351399446068,
    0.400630335506,0.448808748918,0.498288234945,0.548015312145,
    0.595970288463,0.659880262013,0.748436583464,0.852102017374,
    0.901671152609,0.950180580674,1.),.UNSPECIFIED.);
#1196 = CARTESIAN_POINT('',(0.988432088926,-4.));
#1197 = CARTESIAN_POINT('',(0.988432091598,-4.066939472845));
#1198 = CARTESIAN_POINT('',(0.989696566098,-4.133838072725));
#1199 = CARTESIAN_POINT('',(0.992223007413,-4.200528681469));
#1200 = CARTESIAN_POINT('',(0.995997996373,-4.266838218084));
#1201 = CARTESIAN_POINT('',(1.00099711346,-4.332588014276));
#1202 = CARTESIAN_POINT('',(1.007184852616,-4.397594189968));
#1203 = CARTESIAN_POINT('',(1.021583015864,-4.523458523163));
#1204 = CARTESIAN_POINT('',(1.029714197739,-4.584387865575));
#1205 = CARTESIAN_POINT('',(1.038877591886,-4.644380447347));
#1206 = CARTESIAN_POINT('',(1.04904312309,-4.703351811667));
#1207 = CARTESIAN_POINT('',(1.060181458405,-4.761208392727));
#1208 = CARTESIAN_POINT('',(1.072264335861,-4.81784725482));
#1209 = CARTESIAN_POINT('',(1.102590839979,-4.946866014399));
#1210 = CARTESIAN_POINT('',(1.121544952299,-5.018206288528));
#1211 = CARTESIAN_POINT('',(1.142097036998,-5.08705318729));
#1212 = CARTESIAN_POINT('',(1.164237383236,-5.153213524835));
#1213 = CARTESIAN_POINT('',(1.187972073558,-5.21640485445));
#1214 = CARTESIAN_POINT('',(1.213318294997,-5.276235927004));
#1215 = CARTESIAN_POINT('',(1.277686135009,-5.409715483809));
#1216 = CARTESIAN_POINT('',(1.319040824133,-5.481512674864));
#1217 = CARTESIAN_POINT('',(1.364003623552,-5.544199903604));
#1218 = CARTESIAN_POINT('',(1.412123974113,-5.594857911934));
#1219 = CARTESIAN_POINT('',(1.46294482655,-5.630898161259));
#1220 = CARTESIAN_POINT('',(1.516008075434,-5.65));
#1221 = CARTESIAN_POINT('',(1.63493232248,-5.65));
#1222 = CARTESIAN_POINT('',(1.696288491784,-5.623824255371));
#1223 = CARTESIAN_POINT('',(1.754249975131,-5.575552307601));
#1224 = CARTESIAN_POINT('',(1.808346404897,-5.50896856859));
#1225 = CARTESIAN_POINT('',(1.858099721272,-5.427877954461));
#1226 = CARTESIAN_POINT('',(1.903053093871,-5.336179500088));
#1227 = CARTESIAN_POINT('',(1.961968498327,-5.191117589189));
#1228 = CARTESIAN_POINT('',(1.98007337255,-5.142199084476));
#1229 = CARTESIAN_POINT('',(1.997232536868,-5.091468660352));
#1230 = CARTESIAN_POINT('',(2.013447974883,-5.039075895944));
#1231 = CARTESIAN_POINT('',(2.028716271345,-4.985139706436));
#1232 = CARTESIAN_POINT('',(2.043028914651,-4.92974928513));
#1233 = CARTESIAN_POINT('',(2.069431017847,-4.817394760185));
#1234 = CARTESIAN_POINT('',(2.081563224527,-4.76048158288));
#1235 = CARTESIAN_POINT('',(2.092741894669,-4.702339831861));
#1236 = CARTESIAN_POINT('',(2.102938303269,-4.643074038232));
#1237 = CARTESIAN_POINT('',(2.11212266047,-4.582779209952));
#1238 = CARTESIAN_POINT('',(2.120264446985,-4.521541095868));
#1239 = CARTESIAN_POINT('',(2.134591933738,-4.395654648895));
#1240 = CARTESIAN_POINT('',(2.140719476274,-4.330953751362));
#1241 = CARTESIAN_POINT('',(2.145669536102,-4.265519744613));
#1242 = CARTESIAN_POINT('',(2.149407249777,-4.199533907637));
#1243 = CARTESIAN_POINT('',(2.151908646748,-4.133172450085));
#1244 = CARTESIAN_POINT('',(2.153160564664,-4.066606151409));
#1245 = CARTESIAN_POINT('',(2.153160564664,-3.93306055703));
#1246 = CARTESIAN_POINT('',(2.15189608756,-3.866161928939));
#1247 = CARTESIAN_POINT('',(2.149369643875,-3.799471294823));
#1248 = CARTESIAN_POINT('',(2.145594655226,-3.733161760648));
#1249 = CARTESIAN_POINT('',(2.140595540827,-3.667411990236));
#1250 = CARTESIAN_POINT('',(2.134407803973,-3.602405836249));
#1251 = CARTESIAN_POINT('',(2.120009637725,-3.476541476837));
#1252 = CARTESIAN_POINT('',(2.111878455851,-3.415612134425));
#1253 = CARTESIAN_POINT('',(2.102715061704,-3.355619552653));
#1254 = CARTESIAN_POINT('',(2.0925495305,-3.296648188333));
#1255 = CARTESIAN_POINT('',(2.081411195185,-3.238791607273));
#1256 = CARTESIAN_POINT('',(2.069328317729,-3.18215274518));
#1257 = CARTESIAN_POINT('',(2.039001815612,-3.053133994117));
#1258 = CARTESIAN_POINT('',(2.020047698494,-2.981793703658));
#1259 = CARTESIAN_POINT('',(1.999495614966,-2.912946805918));
#1260 = CARTESIAN_POINT('',(1.97735527305,-2.84678648103));
#1261 = CARTESIAN_POINT('',(1.95362058262,-2.783595153609));
#1262 = CARTESIAN_POINT('',(1.928274355145,-2.723764065846));
#1263 = CARTESIAN_POINT('',(1.863906518581,-2.590284516191));
#1264 = CARTESIAN_POINT('',(1.822551829457,-2.518487325136));
#1265 = CARTESIAN_POINT('',(1.777589030038,-2.455800096396));
#1266 = CARTESIAN_POINT('',(1.729468679476,-2.405142088065));
#1267 = CARTESIAN_POINT('',(1.67864782704,-2.369101838742));
#1268 = CARTESIAN_POINT('',(1.625584578156,-2.35));
#1269 = CARTESIAN_POINT('',(1.50666033111,-2.35));
#1270 = CARTESIAN_POINT('',(1.445304161805,-2.376175744629));
#1271 = CARTESIAN_POINT('',(1.387342678459,-2.424447692399));
#1272 = CARTESIAN_POINT('',(1.333246248693,-2.491031431409));
#1273 = CARTESIAN_POINT('',(1.283492932317,-2.572122045539));
#1274 = CARTESIAN_POINT('',(1.238539559719,-2.663820499912));
#1275 = CARTESIAN_POINT('',(1.179624155263,-2.808882410811));
#1276 = CARTESIAN_POINT('',(1.16151928104,-2.857800915524));
#1277 = CARTESIAN_POINT('',(1.144360116722,-2.908531339648));
#1278 = CARTESIAN_POINT('',(1.128144678707,-2.960924104056));
#1279 = CARTESIAN_POINT('',(1.112876382245,-3.014860293564));
#1280 = CARTESIAN_POINT('',(1.098563738939,-3.07025071487));
#1281 = CARTESIAN_POINT('',(1.072161635743,-3.182605239815));
#1282 = CARTESIAN_POINT('',(1.060029429063,-3.23951841712));
#1283 = CARTESIAN_POINT('',(1.048850758921,-3.297660168139));
#1284 = CARTESIAN_POINT('',(1.038654350321,-3.356925961768));
#1285 = CARTESIAN_POINT('',(1.02946999312,-3.417220790048));
#1286 = CARTESIAN_POINT('',(1.021328206604,-3.478458904132));
#1287 = CARTESIAN_POINT('',(1.00700072284,-3.604345324852));
#1288 = CARTESIAN_POINT('',(1.000873178011,-3.669046244128));
#1289 = CARTESIAN_POINT('',(0.995923115506,-3.734480276666));
#1290 = CARTESIAN_POINT('',(0.992185401521,-3.800466116067));
#1291 = CARTESIAN_POINT('',(0.989684006909,-3.86682754825));
#1292 = CARTESIAN_POINT('',(0.988432091585,-3.933393818746));
#1293 = CARTESIAN_POINT('',(0.988432088926,-4.));
#1294 = ( GEOMETRIC_REPRESENTATION_CONTEXT(2) 
PARAMETRIC_REPRESENTATION_CONTEXT() REPRESENTATION_CONTEXT('2D SPACE',''
  ) );
#1295 = ADVANCED_FACE('',(#1296),#548,.T.);
#1296 = FACE_BOUND('',#1297,.T.);
#1297 = EDGE_LOOP('',(#1298));
#1298 = ORIENTED_EDGE('',*,*,#533,.T.);
#1299 = ADVANCED_FACE('',(#1300,#1354),#896,.F.);
#1300 = FACE_BOUND('',#1301,.F.);
#1301 = EDGE_LOOP('',(#1302,#1325,#1326,#1327));
#1302 = ORIENTED_EDGE('',*,*,#1303,.F.);
#1303 = EDGE_CURVE('',#880,#1304,#1306,.T.);
#1304 = VERTEX_POINT('',#1305);
#1305 = CARTESIAN_POINT('',(3.,-5.,5.));
#1306 = SEAM_CURVE('',#1307,(#1311,#1318),.PCURVE_S1.);
#1307 = LINE('',#1308,#1309);
#1308 = CARTESIAN_POINT('',(3.,-15.,5.));
#1309 = VECTOR('',#1310,1.);
#1310 = DIRECTION('',(0.E+000,1.,-2.2E-016));
#1311 = PCURVE('',#896,#1312);
#1312 = DEFINITIONAL_REPRESENTATION('',(#1313),#1317);
#1313 = LINE('',#1314,#1315);
#1314 = CARTESIAN_POINT('',(6.28318530718,0.E+000));
#1315 = VECTOR('',#1316,1.);
#1316 = DIRECTION('',(0.E+000,-1.));
#1317 = ( GEOMETRIC_REPRESENTATION_CONTEXT(2) 
PARAMETRIC_REPRESENTATION_CONTEXT() REPRESENTATION_CONTEXT('2D SPACE',''
  ) );
#1318 = PCURVE('',#896,#1319);
#1319 = DEFINITIONAL_REPRESENTATION('',(#1320),#1324);
#1320 = LINE('',#1321,#1322);
#1321 = CARTESIAN_POINT('',(0.E+000,0.E+000));
#1322 = VECTOR('',#1323,1.);
#1323 = DIRECTION('',(0.E+000,-1.));
#1324 = ( GEOMETRIC_REPRESENTATION_CONTEXT(2) 
PARAMETRIC_REPRESENTATION_CONTEXT() REPRESENTATION_CONTEXT('2D SPACE',''
  ) );
#1325 = ORIENTED_EDGE('',*,*,#879,.F.);
#1326 = ORIENTED_EDGE('',*,*,#1303,.T.);
#1327 = ORIENTED_EDGE('',*,*,#1328,.T.);
#1328 = EDGE_CURVE('',#1304,#1304,#1329,.T.);
#1329 = SURFACE_CURVE('',#1330,(#1335,#1342),.PCURVE_S1.);
#1330 = CIRCLE('',#1331,3.);
#1331 = AXIS2_PLACEMENT_3D('',#1332,#1333,#1334);
#1332 = CARTESIAN_POINT('',(0.E+000,-5.,5.));
#1333 = DIRECTION('',(0.E+000,-1.,0.E+000));
#1334 = DIRECTION('',(1.,0.E+000,0.E+000));
#1335 = PCURVE('',#896,#1336);
#1336 = DEFINITIONAL_REPRESENTATION('',(#1337),#1341);
#1337 = LINE('',#1338,#1339);
#1338 = CARTESIAN_POINT('',(0.E+000,-10.));
#1339 = VECTOR('',#1340,1.);
#1340 = DIRECTION('',(1.,0.E+000));
#1341 = ( GEOMETRIC_REPRESENTATION_CONTEXT(2) 
PARAMETRIC_REPRESENTATION_CONTEXT() REPRESENTATION_CONTEXT('2D SPACE',''
  ) );
#1342 = PCURVE('',#1343,#1348);
#1343 = PLANE('',#1344);
#1344 = AXIS2_PLACEMENT_3D('',#1345,#1346,#1347);
#1345 = CARTESIAN_POINT('',(-2.3E-016,-5.,5.));
#1346 = DIRECTION('',(2.E-016,-1.,3.4E-016));
#1347 = DIRECTION('',(0.E+000,-3.4E-016,-1.));
#1348 = DEFINITIONAL_REPRESENTATION('',(#1349),#1353);
#1349 = CIRCLE('',#1350,3.);
#1350 = AXIS2_PLACEMENT_2D('',#1351,#1352);
#1351 = CARTESIAN_POINT('',(0.E+000,2.3E-016));
#1352 = DIRECTION('',(0.E+000,1.));
#1353 = ( GEOMETRIC_REPRESENTATION_CONTEXT(2) 
PARAMETRIC_REPRESENTATION_CONTEXT() REPRESENTATION_CONTEXT('2D SPACE',''
  ) );
#1354 = FACE_BOUND('',#1355,.F.);
#1355 = EDGE_LOOP('',(#1356));
#1356 = ORIENTED_EDGE('',*,*,#990,.F.);
#1357 = ADVANCED_FACE('',(#1358),#1343,.T.);
#1358 = FACE_BOUND('',#1359,.T.);
#1359 = EDGE_LOOP('',(#1360));
#1360 = ORIENTED_EDGE('',*,*,#1328,.T.);
#1361 = ( GEOMETRIC_REPRESENTATION_CONTEXT(3) 
GLOBAL_UNCERTAINTY_ASSIGNED_CONTEXT((#1365)) 
GLOBAL_UNIT_ASSIGNED_CONTEXT((#1362,#1363,#1364)) REPRESENTATION_CONTEXT
('Context #1','3D Context with UNIT and UNCERTAINTY') );
#1362 = ( LENGTH_UNIT() NAMED_UNIT(*) SI_UNIT(.MILLI.,.METRE.) );
#1363 = ( NAMED_UNIT(*) PLANE_ANGLE_UNIT() SI_UNIT($,.RADIAN.) );
#1364 = ( NAMED_UNIT(*) SI_UNIT($,.STERADIAN.) SOLID_ANGLE_UNIT() );
#1365 = UNCERTAINTY_MEASURE_WITH_UNIT(LENGTH_MEASURE(1.E-007),#1362,
  'distance_accuracy_value','confusion accuracy');
#1366 = PRODUCT_RELATED_PRODUCT_CATEGORY('part',$,(#7));
#1367 = MECHANICAL_DESIGN_GEOMETRIC_PRESENTATION_REPRESENTATION('',(
    #1368),#1361);
#1368 = STYLED_ITEM('color',(#1369),#15);
#1369 = PRESENTATION_STYLE_ASSIGNMENT((#1370,#1376));
#1370 = SURFACE_STYLE_USAGE(.BOTH.,#1371);
#1371 = SURFACE_SIDE_STYLE('',(#1372));
#1372 = SURFACE_STYLE_FILL_AREA(#1373);
#1373 = FILL_AREA_STYLE('',(#1374));
#1374 = FILL_AREA_STYLE_COLOUR('',#1375);
#1375 = COLOUR_RGB('',0.854901969433,0.854901969433,0.854901969433);
#1376 = CURVE_STYLE('',#1377,POSITIVE_LENGTH_MEASURE(0.1),#1375);
#1377 = DRAUGHTING_PRE_DEFINED_CURVE_FONT('continuous');
ENDSEC;
END-ISO-10303-21;
