(footprint "Omron_G6K-2G-Y" (version 20210126) (generator pcbnew) (layer "F.Cu")
  (tedit 60366F9A)
  (attr smd)
  (fp_text reference "REF**" (at 0 -4.4 unlocked) (layer "F.SilkS")
    (effects (font (size 1 1) (thickness 0.15)))
    (tstamp 1b680f78-24d6-4fc9-9e53-5fd115cc0d7e)
  )
  (fp_text value "Omron_G6K-2G-Y" (at 0 1 unlocked) (layer "F.Fab") hide
    (effects (font (size 1 1) (thickness 0.15)))
    (tstamp 0824b698-a70a-4292-ae2a-f0f256d15b1b)
  )
  (fp_text user "^" (at -3.8 4.5 unlocked) (layer "F.SilkS")
    (effects (font (size 1 1) (thickness 0.15)))
    (tstamp 74a310e5-5412-4440-9161-f3af372ba47d)
  )
  (fp_text user "${REFERENCE}" (at 0 0 unlocked) (layer "F.Fab")
    (effects (font (size 1 1) (thickness 0.15)))
    (tstamp af9ccc31-1c36-492e-8e9b-0384116a3516)
  )
  (fp_line (start 5 -3.25) (end 4.4 -3.25) (layer "F.SilkS") (width 0.12) (tstamp 419b235f-4345-44d2-9cee-f3cf0738b24f))
  (fp_line (start 2.2 3.25) (end 3.2 3.25) (layer "F.SilkS") (width 0.12) (tstamp 5a7c7261-6c87-4d2c-8775-ae29548d6397))
  (fp_line (start 3.2 -3.25) (end 2.2 -3.25) (layer "F.SilkS") (width 0.12) (tstamp 5b84f82e-cfcd-4f68-853e-2a02c1cfc3c5))
  (fp_line (start 4.4 3.25) (end 5 3.25) (layer "F.SilkS") (width 0.12) (tstamp 77c9d979-4d27-4ade-b6f3-67ca9838e270))
  (fp_line (start -4.35 -3.25) (end -5 -3.25) (layer "F.SilkS") (width 0.12) (tstamp 7a72919a-e551-4aa1-96ab-3a8edf4f181a))
  (fp_line (start -5 -3.25) (end -5 3.25) (layer "F.SilkS") (width 0.12) (tstamp b682695a-2089-4f59-a182-e02d0fdcc6d5))
  (fp_line (start 1 -3.25) (end 0 -3.25) (layer "F.SilkS") (width 0.12) (tstamp b8b12404-931f-4b6f-a0dc-8a6b74753cd3))
  (fp_line (start -5 3.25) (end -4.35 3.25) (layer "F.SilkS") (width 0.12) (tstamp d6fea554-ed06-443a-bcaa-09c34d012778))
  (fp_line (start 5 3.25) (end 5 -3.25) (layer "F.SilkS") (width 0.12) (tstamp f3c8c83b-190b-40cf-a179-dcc2889ebab2))
  (fp_line (start -1.2 -3.25) (end -3.25 -3.25) (layer "F.SilkS") (width 0.12) (tstamp f83147b8-d952-461c-b8ce-3a62689d071e))
  (fp_line (start 0 3.25) (end 1 3.25) (layer "F.SilkS") (width 0.12) (tstamp fc6187cf-2d1b-48b2-8d24-d0594baa7b97))
  (fp_line (start -3.25 3.25) (end -1.2 3.25) (layer "F.SilkS") (width 0.12) (tstamp fe936bc6-82c8-4149-a934-48b727bf5536))
  (fp_rect (start -5.3 -3.9) (end 5.2 3.9) (layer "F.CrtYd") (width 0.05) (fill none) (tstamp 5c77c9ee-5619-4c0c-9993-b17acd342b75))
  (fp_line (start -5 2.65) (end -5 -3.25) (layer "F.Fab") (width 0.1) (tstamp 894154cf-ed48-4c1f-ba12-dde4342dcb26))
  (fp_line (start 5 -3.25) (end 5 3.25) (layer "F.Fab") (width 0.1) (tstamp 9b618db5-189b-45b4-9887-0e609a6162d1))
  (fp_line (start -5 -3.25) (end 5 -3.25) (layer "F.Fab") (width 0.1) (tstamp ac25feb5-cfd3-4ccc-b4b2-a8d4c667b57e))
  (fp_line (start 5 3.25) (end -4.4 3.25) (layer "F.Fab") (width 0.1) (tstamp c9a4d590-3be2-4bbe-a342-b343910c5a3e))
  (fp_line (start -4.4 3.25) (end -5 2.65) (layer "F.Fab") (width 0.1) (tstamp d6e9109e-110c-4fed-9df8-4ca04beace9a))
  (pad "1" smd rect (at -3.81 2.85) (size 1 1.8) (layers "F.Cu" "F.Paste" "F.Mask")
    (solder_mask_margin -0.2) (tstamp f4097c70-73c1-4923-93c6-8f8ca3757a2e))
  (pad "2" smd rect (at -0.6 2.85) (size 1 1.8) (layers "F.Cu" "F.Paste" "F.Mask")
    (solder_mask_margin -0.2) (tstamp 5bbad8c5-7ec5-48d5-b3f5-5963c7a81f0e))
  (pad "3" smd rect (at 1.6 2.85) (size 1 1.8) (layers "F.Cu" "F.Paste" "F.Mask")
    (solder_mask_margin -0.2) (tstamp 7e899b9d-1187-4dca-9096-e4be67e920ea))
  (pad "4" smd rect (at 3.81 2.85) (size 1 1.8) (layers "F.Cu" "F.Paste" "F.Mask")
    (solder_mask_margin -0.2) (tstamp 737aee15-9ff5-4303-80e9-fb2f0f554580))
  (pad "5" smd rect (at 3.81 -2.85) (size 1 1.8) (layers "F.Cu" "F.Paste" "F.Mask")
    (solder_mask_margin -0.2) (tstamp 3937c5b8-4c99-4bd4-a58a-b0f2a27bb4e6))
  (pad "6" smd rect (at 1.6 -2.85) (size 1 1.8) (layers "F.Cu" "F.Paste" "F.Mask")
    (solder_mask_margin -0.2) (tstamp 2af614f7-19c8-4487-8569-c1ae2f98be04))
  (pad "7" smd rect (at -0.6 -2.85) (size 1 1.8) (layers "F.Cu" "F.Paste" "F.Mask")
    (solder_mask_margin -0.2) (tstamp da2f604e-1442-4758-9ed1-458c8272db03))
  (pad "8" smd rect (at -3.81 -2.85) (size 1 1.8) (layers "F.Cu" "F.Paste" "F.Mask")
    (solder_mask_margin -0.2) (tstamp a8440b85-c97d-46fe-aa27-9152656b944e))
  (model "${KICADLIB}/model/mechanical/Omron_G6K_2G_Y.step"
    (offset (xyz -3.815 0 0))
    (scale (xyz 1 1 1))
    (rotate (xyz -90 0 0))
  )
)
