(module "Amphenol_UE27AC54100" (layer F.Cu) (tedit 5EFF9A7D)
  (fp_text reference "REF**" (at 0 -5 unlocked) (layer F.SilkS)
    (effects (font (size 1 1) (thickness 0.15)))
  )
  (fp_text value "Amphenol_UE27AC54100" (at 0 -5 unlocked) (layer F.Fab) hide
    (effects (font (size 1 1) (thickness 0.15)))
  )
  (fp_text user "${REFERENCE}" (at 0 0 unlocked) (layer F.Fab)
    (effects (font (size 1 1) (thickness 0.15)))
  )
  (fp_text user "^" (at -3.5 -4.3 180 unlocked) (layer F.SilkS)
    (effects (font (size 1 1) (thickness 0.15)))
  )
  (fp_line (start 6.6 -1.7) (end 6.6 -3.5) (layer F.SilkS) (width 0.1))
  (fp_line (start 6.6 -3.502465) (end -6.6 -3.502465) (layer F.SilkS) (width 0.1))
  (fp_line (start -6.6 -1.7) (end -6.6 -3.5) (layer F.SilkS) (width 0.1))
  (fp_line (start -6.6 1.7) (end -6.6 3.8) (layer F.SilkS) (width 0.1))
  (fp_line (start -6.6 3.8) (end 6.6 3.8) (layer F.SilkS) (width 0.1))
  (fp_line (start 6.6 3.8) (end 6.6 1.7) (layer F.SilkS) (width 0.1))
  (fp_rect (start 8.3 -3.9) (end -8.3 10.6) (layer F.CrtYd) (width 0.05))
  (fp_line (start -5.3 -3.5) (end 6.6 -3.5) (layer F.Fab) (width 0.1))
  (fp_line (start 6.6 -3.5) (end 6.6 10.4) (layer F.Fab) (width 0.1))
  (fp_line (start 6.6 10.4) (end -6.6 10.4) (layer F.Fab) (width 0.1))
  (fp_line (start -6.6 10.4) (end -6.6 -2.2) (layer F.Fab) (width 0.1))
  (fp_line (start -6.6 -2.2) (end -5.3 -3.5) (layer F.Fab) (width 0.1))
  (pad "1" thru_hole circle (at -3.5 -2.71) (size 1.4 1.4) (drill 0.92) (layers *.Cu *.Mask) (tstamp 6e09593e-e474-405f-b24d-0908d7afd43f))
  (pad "2" thru_hole circle (at -1 -2.71) (size 1.4 1.4) (drill 0.92) (layers *.Cu *.Mask) (tstamp 3871e3c7-676a-4c8b-a501-d6f2387ca8ea))
  (pad "3" thru_hole circle (at 1 -2.71) (size 1.4 1.4) (drill 0.92) (layers *.Cu *.Mask) (tstamp c6b40710-f6ac-4d9d-ac0f-5726fb7b665e))
  (pad "4" thru_hole circle (at 3.5 -2.71) (size 1.4 1.4) (drill 0.92) (layers *.Cu *.Mask) (tstamp 1c56c874-849d-4eb7-80b3-532ce406d982))
  (pad "5" thru_hole circle (at -6.57 0) (size 3.2 3.2) (drill 2.3) (layers *.Cu *.Mask) (tstamp e4f3df73-1e5f-4e3a-b7e3-d67d1b4605be))
  (pad "5" thru_hole circle (at 6.57 0) (size 3.2 3.2) (drill 2.3) (layers *.Cu *.Mask) (tstamp cf97ac49-42f7-4ebd-84a7-6e141aa7121a))
  (model "${KICADLIB}/model/connector/Amphenol_UE27AC54100.step"
    (offset (xyz 0 3.5 7))
    (scale (xyz 1 1 1))
    (rotate (xyz 0 0 0))
  )
)
