(module "QFN40P400X400-29" (layer F.Cu) (tedit 5F42B56A)
  (descr "QFN, 28 Pin (package code T2844-1; https://pdfserv.maximintegrated.com/package_dwgs/21-0139.PDF), generated with kicad-footprint-generator ipc_noLead_generator.py")
  (tags "QFN NoLead")
  (attr smd)
  (fp_text reference "REF**" (at 0 -3.32) (layer F.SilkS)
    (effects (font (size 1 1) (thickness 0.15)))
    (tstamp 0196b79f-8bef-4a56-976c-f3bce71e0703)
  )
  (fp_text value "QFN-28-1EP_4x4mm_P0.4mm_EP2.6x2.6mm" (at 0 3.32) (layer F.Fab) hide
    (effects (font (size 1 1) (thickness 0.15)))
    (tstamp d5982597-13f7-412c-b3ef-8847f2622f6f)
  )
  (fp_text user "^" (at -3.25 -1.25 270 unlocked) (layer F.SilkS)
    (effects (font (size 1 1) (thickness 0.15)))
    (tstamp 0e44c78e-d75d-4e00-b5c9-2be1fe332fa4)
  )
  (fp_text user "${REFERENCE}" (at 0 0) (layer F.Fab)
    (effects (font (size 0.8 0.8) (thickness 0.15)))
    (tstamp 29cdc82c-f46b-49eb-bf85-5af2d8203992)
  )
  (fp_line (start 2.01 -2.01) (end 2.01 -1.46) (layer F.SilkS) (width 0.12) (tstamp 00d238bb-8c15-4e43-a599-c8ce3505b61a))
  (fp_line (start 1.46 -2.01) (end 2.01 -2.01) (layer F.SilkS) (width 0.12) (tstamp 057d3c90-963f-40fe-8364-c5dbdc869251))
  (fp_line (start -2.01 -1.46) (end -2.01 -2.01) (layer F.SilkS) (width 0.12) (tstamp 05dc952a-eeb1-4613-bc2c-aa7c0b3ac191))
  (fp_line (start -1.46 2.01) (end -2.01 2.01) (layer F.SilkS) (width 0.12) (tstamp 0c4fa84e-b378-4d17-a4f0-198583c053a2))
  (fp_line (start 2.01 2.01) (end 1.46 2.01) (layer F.SilkS) (width 0.12) (tstamp 247fd176-a5b4-45d7-8614-4aa64aa55019))
  (fp_line (start -2.01 -2.01) (end -1.46 -2.01) (layer F.SilkS) (width 0.12) (tstamp 43185107-1a69-42e4-8daa-e9f7d709cf66))
  (fp_line (start 2.01 1.46) (end 2.01 2.01) (layer F.SilkS) (width 0.12) (tstamp 585d793d-1a38-4434-ab57-f0641f81672c))
  (fp_line (start -2.01 2.01) (end -2.01 1.46) (layer F.SilkS) (width 0.12) (tstamp 88d0b5f3-5fda-4ca7-850f-550e27a45c54))
  (fp_line (start -2.62 2.62) (end 2.62 2.62) (layer F.CrtYd) (width 0.05) (tstamp 0c361ee5-eb0a-4186-bdbb-ed981a1b2149))
  (fp_line (start 2.62 2.62) (end 2.62 -2.62) (layer F.CrtYd) (width 0.05) (tstamp 309b788e-8c05-4246-a88a-763abc693594))
  (fp_line (start -2.62 -2.62) (end -2.62 2.62) (layer F.CrtYd) (width 0.05) (tstamp 37f87755-9cc9-4590-bb56-d9ff13ab696f))
  (fp_line (start 2.62 -2.62) (end -2.62 -2.62) (layer F.CrtYd) (width 0.05) (tstamp a6a3a465-c5e5-4537-9119-bffb424dafae))
  (fp_line (start -1 -2) (end 2 -2) (layer F.Fab) (width 0.1) (tstamp 0f43b183-5ed8-466a-9a62-01ad5dfb986f))
  (fp_line (start 2 2) (end -2 2) (layer F.Fab) (width 0.1) (tstamp 30ffb3c7-a2e5-4990-a404-608287847333))
  (fp_line (start -2 -1) (end -1 -2) (layer F.Fab) (width 0.1) (tstamp 4277c9c6-aac8-484f-8f51-cddfd40e128d))
  (fp_line (start -2 2) (end -2 -1) (layer F.Fab) (width 0.1) (tstamp 7c4ec614-1a92-4518-9e43-c6bac04627af))
  (fp_line (start 2 -2) (end 2 2) (layer F.Fab) (width 0.1) (tstamp f4ff22ef-bd59-4caa-88e6-55bd593f18b3))
  (pad "" smd roundrect (at -0.65 0.65) (size 1.05 1.05) (layers "F.Paste") (roundrect_rratio 0.238095) (tstamp 4c9ecda9-45e1-4060-9865-638a1d661466))
  (pad "" smd roundrect (at 0.65 -0.65) (size 1.05 1.05) (layers "F.Paste") (roundrect_rratio 0.238095) (tstamp 7c36f705-f3c1-4307-8244-f9ec0754a974))
  (pad "" smd roundrect (at -0.65 -0.65) (size 1.05 1.05) (layers "F.Paste") (roundrect_rratio 0.238095) (tstamp a9b3f5b5-72a3-47d4-be8a-5b9a252581db))
  (pad "" smd roundrect (at 0.65 0.65) (size 1.05 1.05) (layers "F.Paste") (roundrect_rratio 0.238095) (tstamp f67c7f6e-497a-4e63-a64d-a10d95d8f7d6))
  (pad "1" smd roundrect (at -1.9375 -1.2) (size 0.875 0.2) (layers "F.Cu" "F.Paste" "F.Mask") (roundrect_rratio 0.25) (tstamp 64d7d893-ede3-4937-be6a-f4306d2138f0))
  (pad "2" smd roundrect (at -1.9375 -0.8) (size 0.875 0.2) (layers "F.Cu" "F.Paste" "F.Mask") (roundrect_rratio 0.25) (tstamp 301481ee-bcae-4589-a360-ee1b179e41d4))
  (pad "3" smd roundrect (at -1.9375 -0.4) (size 0.875 0.2) (layers "F.Cu" "F.Paste" "F.Mask") (roundrect_rratio 0.25) (tstamp b32d8e8e-00b1-4738-8a31-c664a9f6fdf0))
  (pad "4" smd roundrect (at -1.9375 0) (size 0.875 0.2) (layers "F.Cu" "F.Paste" "F.Mask") (roundrect_rratio 0.25) (tstamp 1aa33de8-c1fe-4a43-926e-d519bce06ff5))
  (pad "5" smd roundrect (at -1.9375 0.4) (size 0.875 0.2) (layers "F.Cu" "F.Paste" "F.Mask") (roundrect_rratio 0.25) (tstamp c080922b-2efd-472c-b698-8b9e54597cb5))
  (pad "6" smd roundrect (at -1.9375 0.8) (size 0.875 0.2) (layers "F.Cu" "F.Paste" "F.Mask") (roundrect_rratio 0.25) (tstamp 0738b8e4-0d9b-4beb-9105-da19c8fa1691))
  (pad "7" smd roundrect (at -1.9375 1.2) (size 0.875 0.2) (layers "F.Cu" "F.Paste" "F.Mask") (roundrect_rratio 0.25) (tstamp a42fbd73-dd6f-4312-91e8-1c9352718ecb))
  (pad "8" smd roundrect (at -1.2 1.9375) (size 0.2 0.875) (layers "F.Cu" "F.Paste" "F.Mask") (roundrect_rratio 0.25) (tstamp 0b7d5fb9-fb65-45c8-bcfb-8ab990ee75a3))
  (pad "9" smd roundrect (at -0.8 1.9375) (size 0.2 0.875) (layers "F.Cu" "F.Paste" "F.Mask") (roundrect_rratio 0.25) (tstamp cd802d24-b139-4082-ae6a-c704608785a7))
  (pad "10" smd roundrect (at -0.4 1.9375) (size 0.2 0.875) (layers "F.Cu" "F.Paste" "F.Mask") (roundrect_rratio 0.25) (tstamp 8b4ada1e-d466-4bcb-8e23-f1d0d06d2032))
  (pad "11" smd roundrect (at 0 1.9375) (size 0.2 0.875) (layers "F.Cu" "F.Paste" "F.Mask") (roundrect_rratio 0.25) (tstamp 277216ce-400c-4cab-b0c4-526336c613f1))
  (pad "12" smd roundrect (at 0.4 1.9375) (size 0.2 0.875) (layers "F.Cu" "F.Paste" "F.Mask") (roundrect_rratio 0.25) (tstamp cf5c7157-1d10-46a9-a7ba-6f6f089ea761))
  (pad "13" smd roundrect (at 0.8 1.9375) (size 0.2 0.875) (layers "F.Cu" "F.Paste" "F.Mask") (roundrect_rratio 0.25) (tstamp 5336365f-04ab-4c98-a63a-155b238952c5))
  (pad "14" smd roundrect (at 1.2 1.9375) (size 0.2 0.875) (layers "F.Cu" "F.Paste" "F.Mask") (roundrect_rratio 0.25) (tstamp 531786eb-213f-4f0d-a770-4c11d53feae3))
  (pad "15" smd roundrect (at 1.9375 1.2) (size 0.875 0.2) (layers "F.Cu" "F.Paste" "F.Mask") (roundrect_rratio 0.25) (tstamp 7424577f-e829-4827-8103-5543474d1d54))
  (pad "16" smd roundrect (at 1.9375 0.8) (size 0.875 0.2) (layers "F.Cu" "F.Paste" "F.Mask") (roundrect_rratio 0.25) (tstamp 5b44e931-dfd6-4c11-96a8-90932846232c))
  (pad "17" smd roundrect (at 1.9375 0.4) (size 0.875 0.2) (layers "F.Cu" "F.Paste" "F.Mask") (roundrect_rratio 0.25) (tstamp 0fea5f02-05d2-4c80-9a7f-4ee173bd24a3))
  (pad "18" smd roundrect (at 1.9375 0) (size 0.875 0.2) (layers "F.Cu" "F.Paste" "F.Mask") (roundrect_rratio 0.25) (tstamp 98603aef-03b3-4235-8cb9-ace76211de74))
  (pad "19" smd roundrect (at 1.9375 -0.4) (size 0.875 0.2) (layers "F.Cu" "F.Paste" "F.Mask") (roundrect_rratio 0.25) (tstamp 9e4cfc6b-c74c-41c4-bf4b-99361395536c))
  (pad "20" smd roundrect (at 1.9375 -0.8) (size 0.875 0.2) (layers "F.Cu" "F.Paste" "F.Mask") (roundrect_rratio 0.25) (tstamp 4e3236da-9fb6-4f85-bd61-8029e3095544))
  (pad "21" smd roundrect (at 1.9375 -1.2) (size 0.875 0.2) (layers "F.Cu" "F.Paste" "F.Mask") (roundrect_rratio 0.25) (tstamp b91c6f0b-f290-49e9-984d-dcd4de46f08f))
  (pad "22" smd roundrect (at 1.2 -1.9375) (size 0.2 0.875) (layers "F.Cu" "F.Paste" "F.Mask") (roundrect_rratio 0.25) (tstamp cb90bb71-0f0d-48b9-8214-b697cf2dbd80))
  (pad "23" smd roundrect (at 0.8 -1.9375) (size 0.2 0.875) (layers "F.Cu" "F.Paste" "F.Mask") (roundrect_rratio 0.25) (tstamp 05fe7c4b-c934-4fde-9efa-3da5703d9317))
  (pad "24" smd roundrect (at 0.4 -1.9375) (size 0.2 0.875) (layers "F.Cu" "F.Paste" "F.Mask") (roundrect_rratio 0.25) (tstamp 92a74e39-7f0f-4185-8f13-52f756f617f4))
  (pad "25" smd roundrect (at 0 -1.9375) (size 0.2 0.875) (layers "F.Cu" "F.Paste" "F.Mask") (roundrect_rratio 0.25) (tstamp a29fff5e-00e0-4102-9c6e-ca110e63066d))
  (pad "26" smd roundrect (at -0.4 -1.9375) (size 0.2 0.875) (layers "F.Cu" "F.Paste" "F.Mask") (roundrect_rratio 0.25) (tstamp 7886f9d0-7cc9-46b6-a5be-d7f9d65ce368))
  (pad "27" smd roundrect (at -0.8 -1.9375) (size 0.2 0.875) (layers "F.Cu" "F.Paste" "F.Mask") (roundrect_rratio 0.25) (tstamp 92069aad-e2f1-482c-8559-47a157133ad1))
  (pad "28" smd roundrect (at -1.2 -1.9375) (size 0.2 0.875) (layers "F.Cu" "F.Paste" "F.Mask") (roundrect_rratio 0.25) (tstamp 80da4797-19fc-4e1d-8495-7be432265586))
  (pad "29" smd rect (at 0 0) (size 2.6 2.6) (layers "F.Cu" "F.Mask") (tstamp de5a5286-5095-47d7-b801-5a67a1c0860f))
  (model "${KICADLIB}/model/QFN/QFN40P400X400-29.step"
    (offset (xyz 0 0 0))
    (scale (xyz 1 1 1))
    (rotate (xyz 0 0 0))
  )
)
