(footprint "QFN50P160X160-8" (version 20210722) (generator pcbnew) (layer "F.Cu")
  (tedit 6116FBCE)
  (attr smd)
  (fp_text reference "REF**" (at -0.02 -1.62 unlocked) (layer "F.SilkS")
    (effects (font (size 1 1) (thickness 0.15)))
    (tstamp cb4faad7-113a-4685-b1cc-6572d4d86c6b)
  )
  (fp_text value "QFN50P160X160-8" (at -0.01 -1.66 unlocked) (layer "F.Fab") hide
    (effects (font (size 1 1) (thickness 0.15)))
    (tstamp 8a5685da-a8e6-4b9a-b710-ce253fb7a13b)
  )
  (fp_text user "^" (at -0.5 1.75 unlocked) (layer "F.SilkS")
    (effects (font (size 1 1) (thickness 0.15)))
    (tstamp a1f46b45-f584-4600-8aa1-1e58f438ba0a)
  )
  (fp_text user "${REFERENCE}" (at 0 0 unlocked) (layer "F.Fab")
    (effects (font (size 0.4 0.4) (thickness 0.05)))
    (tstamp 9264e5a1-59d7-4290-8e67-cc9c0bc903fe)
  )
  (fp_line (start -0.8 0.8) (end -0.8 0.2) (layer "F.SilkS") (width 0.1) (tstamp 1c690546-5f6b-4e46-8cd9-5e8d2e52b5fa))
  (fp_line (start -0.8 0.8) (end -0.7 0.8) (layer "F.SilkS") (width 0.1) (tstamp 258e1e9d-7090-46fc-a4ef-a848e5689a83))
  (fp_line (start -0.8 -0.8) (end -0.8 -0.2) (layer "F.SilkS") (width 0.1) (tstamp 3c5250d3-7179-4ca0-bb06-0602393cc061))
  (fp_line (start -0.8 -0.8) (end -0.7 -0.8) (layer "F.SilkS") (width 0.1) (tstamp 93053f1f-e71b-4170-8b88-ed5ebe90fd8d))
  (fp_line (start 0.8 0.8) (end 0.8 0.2) (layer "F.SilkS") (width 0.1) (tstamp bcf2dac2-6537-4e57-a2f1-9b577e503855))
  (fp_line (start 0.8 -0.8) (end 0.7 -0.8) (layer "F.SilkS") (width 0.1) (tstamp c153de8e-e665-45a7-b471-87de7d3430cc))
  (fp_line (start 0.8 -0.8) (end 0.8 -0.2) (layer "F.SilkS") (width 0.1) (tstamp f3dbd6d2-04cd-4db5-85aa-f1d8bddab86b))
  (fp_line (start 0.8 0.8) (end 0.7 0.8) (layer "F.SilkS") (width 0.1) (tstamp f430cf22-0980-4a34-99f3-7d7637961804))
  (fp_line (start 1.1 -1.1) (end 1.1 1.1) (layer "F.CrtYd") (width 0.05) (tstamp 05a86ad7-df32-4a06-b685-32b7ea143d55))
  (fp_line (start -1.1 1.1) (end -1.1 -1.1) (layer "F.CrtYd") (width 0.05) (tstamp 198842e5-8d0a-41ca-8ed9-085f3e6d99b6))
  (fp_line (start 1.1 1.1) (end -1.1 1.1) (layer "F.CrtYd") (width 0.05) (tstamp d13331d3-8f48-48cc-bb1d-6fff17aadb8d))
  (fp_line (start -1.1 -1.1) (end 1.1 -1.1) (layer "F.CrtYd") (width 0.05) (tstamp e30b8c28-15d6-4737-a400-e2e0360e0c44))
  (fp_line (start 0.8 0.8) (end -0.3 0.8) (layer "F.Fab") (width 0.05) (tstamp 21d51ac4-e5da-4f72-be35-03c6b3a06ec8))
  (fp_line (start -0.3 0.8) (end -0.8 0.3) (layer "F.Fab") (width 0.05) (tstamp 49e2d3d0-a7fe-4e2a-b2b3-ee1f23648874))
  (fp_line (start -0.8 0.3) (end -0.8 -0.8) (layer "F.Fab") (width 0.05) (tstamp ac851b11-ebd5-47c3-8791-05df450490a0))
  (fp_line (start -0.8 -0.8) (end 0.8 -0.8) (layer "F.Fab") (width 0.05) (tstamp de6d3cc4-a656-4dd7-a7c2-2c3133f4631d))
  (fp_line (start 0.8 -0.8) (end 0.8 0.8) (layer "F.Fab") (width 0.05) (tstamp f974c886-f3c9-45ce-8cb5-a4f71a7305ab))
  (pad "1" smd rect (at -0.5 0.7 90) (size 0.6 0.25) (layers "F.Cu" "F.Paste" "F.Mask") (tstamp 6a3cde4c-3985-4d7e-9cfa-0cbfcf73c04c))
  (pad "2" smd rect (at 0 0.7 90) (size 0.6 0.25) (layers "F.Cu" "F.Paste" "F.Mask") (tstamp 286bfbf3-41a2-4125-9c7a-ed76f83129c8))
  (pad "3" smd rect (at 0.5 0.7 90) (size 0.6 0.25) (layers "F.Cu" "F.Paste" "F.Mask") (tstamp abfc9a42-ce0d-402e-8391-01df25e31fd3))
  (pad "4" smd rect (at 0.7 0) (size 0.6 0.25) (layers "F.Cu" "F.Paste" "F.Mask") (tstamp 0c7d96d5-4f15-4a70-8d09-5626ef08641f))
  (pad "5" smd rect (at 0.5 -0.7 90) (size 0.6 0.25) (layers "F.Cu" "F.Paste" "F.Mask") (tstamp 8cc244c1-16e3-4e03-b4e4-6b2b01f44f00))
  (pad "6" smd rect (at 0 -0.7 90) (size 0.6 0.25) (layers "F.Cu" "F.Paste" "F.Mask") (tstamp 1f449b60-d264-4fbc-b1d8-4052d3a8376b))
  (pad "7" smd rect (at -0.5 -0.7 90) (size 0.6 0.25) (layers "F.Cu" "F.Paste" "F.Mask") (tstamp 458a3391-0509-4084-a8cc-75dd70f28b38))
  (pad "8" smd rect (at -0.7 0) (size 0.6 0.25) (layers "F.Cu" "F.Paste" "F.Mask") (tstamp 9beeb2ea-9e5b-4071-acf9-3a9f045da38b))
  (model "${KICADLIB}/model/QFN/QFN50P160X160-8.step"
    (offset (xyz 0 0 0))
    (scale (xyz 1 1 1))
    (rotate (xyz 0 0 -90))
  )
)
