(footprint "CAPC3225" (version 20221018) (generator pcbnew)
  (layer "F.Cu")
  (descr "Capacitor SMD 3225 metric (1210 imperial)")
  (tags "capacitor")
  (attr smd)
  (fp_text reference "REF**" (at 0 -2.25) (layer "F.SilkS")
      (effects (font (size 1 1) (thickness 0.15)))
    (tstamp 355ac0fe-1171-4d6e-926f-28947e563024)
  )
  (fp_text value "CAPC3225" (at 0 2.5) (layer "F.Fab") hide
      (effects (font (size 1 1) (thickness 0.15)))
    (tstamp 5be3f92d-56d6-4932-a433-3de458518023)
  )
  (fp_text user "${REFERENCE}" (at 0 0) (layer "F.Fab")
      (effects (font (size 0.75 0.75) (thickness 0.15)))
    (tstamp edb48fc1-5162-4f4b-a741-4ac7efb989f3)
  )
  (fp_line (start -0.9 1.25) (end 0.9 1.25)
    (stroke (width 0.1) (type solid)) (layer "F.SilkS") (tstamp f7fffe5f-5e5c-4e13-bb46-bb9f90a7f37b))
  (fp_line (start 0.9 -1.25) (end -0.9 -1.25)
    (stroke (width 0.1) (type solid)) (layer "F.SilkS") (tstamp ed1dadc2-eb01-44ff-91d2-81d5c7096289))
  (fp_line (start -2.1 -1.4) (end -2.1 1.4)
    (stroke (width 0.05) (type solid)) (layer "F.CrtYd") (tstamp 09b20c52-5dc3-4ae6-831e-316e09d1e58e))
  (fp_line (start -2.1 -1.4) (end 2.1 -1.4)
    (stroke (width 0.05) (type solid)) (layer "F.CrtYd") (tstamp b7fc3ecd-51ad-4f8d-b1b4-a17327a2352b))
  (fp_line (start 2.1 1.4) (end -2.1 1.4)
    (stroke (width 0.05) (type solid)) (layer "F.CrtYd") (tstamp 4d615563-db6e-4c30-b787-5b04c385caf3))
  (fp_line (start 2.1 1.4) (end 2.1 -1.4)
    (stroke (width 0.05) (type solid)) (layer "F.CrtYd") (tstamp 5d96c042-5b4e-42f1-a52b-a7b4201590a2))
  (fp_poly
    (pts
      (xy 1.6 -1.25)
      (xy 1.6 1.25)
      (xy -1.6 1.25)
      (xy -1.6 -1)
      (xy -1.35 -1.25)
    )

    (stroke (width 0.1) (type solid)) (fill none) (layer "F.Fab") (tstamp f5bcb0d4-d64a-479b-b347-be91678a2f9d))
  (pad "" smd roundrect (at -1.5 -0.75) (size 1 1) (layers "F.Paste") (roundrect_rratio 0.05) (tstamp 7b4160ea-17ba-45f3-9d62-812be8098e96))
  (pad "" smd roundrect (at -1.5 0.75) (size 1 1) (layers "F.Paste") (roundrect_rratio 0.05) (tstamp ad186879-915a-4afc-a829-b6c536f9e41f))
  (pad "" smd roundrect (at 1.5 -0.75) (size 1 1) (layers "F.Paste") (roundrect_rratio 0.05) (tstamp 894b5a55-2682-40e9-b6ac-f20f93623728))
  (pad "" smd roundrect (at 1.5 0.75) (size 1 1) (layers "F.Paste") (roundrect_rratio 0.05) (tstamp f392d7b6-7831-4b78-835c-cdbe5282a506))
  (pad "1" smd roundrect (at -1.5 0) (size 1 2.6) (layers "F.Cu" "F.Mask") (roundrect_rratio 0.05) (tstamp e2beb0c7-542d-4cb9-966c-fd1eb30b031d))
  (pad "2" smd roundrect (at 1.5 0) (size 1 2.6) (layers "F.Cu" "F.Mask") (roundrect_rratio 0.05) (tstamp 2d33dc0f-098a-4e34-9b74-ba9daf1bb858))
  (model "${KICADLIB}/model/passive/CAPC3225.step"
    (offset (xyz 0 0 0))
    (scale (xyz 1 1 1))
    (rotate (xyz 0 0 0))
  )
)
