(module LOGO (layer F.Cu)
  (at 0 0)
 (fp_text reference "G***" (at 0 0) (layer F.SilkS) hide
  (effects (font (thickness 0.3)))
  )
  (fp_text value "LOGO" (at 0.75 0) (layer F.SilkS) hide
  (effects (font (thickness 0.3)))
  )
  (fp_poly (pts (xy -1.165412 2.599765) (xy -2.629647 2.599765) (xy -2.629647 1.344706) (xy -2.420471 1.344706) (xy -2.420471 2.390588) (xy -1.374588 2.390588) (xy -1.374588 1.344706) (xy -2.420471 1.344706)
     (xy -2.629647 1.344706) (xy -2.629647 1.135529) (xy -1.165412 1.135529) (xy -1.165412 2.599765) )(layer F.SilkS) (width  0.010000)
  )
  (fp_poly (pts (xy -0.747059 1.972235) (xy -0.328706 1.972235) (xy -0.328706 2.076823) (xy -0.333332 2.146922) (xy -0.359431 2.175670) (xy -0.425334 2.181399) (xy -0.433294 2.181412) (xy -0.503393 2.186037)
     (xy -0.532141 2.212136) (xy -0.537870 2.278039) (xy -0.537883 2.286000) (xy -0.533257 2.356098) (xy -0.507158 2.384846) (xy -0.441255 2.390575) (xy -0.433294 2.390588) (xy -0.363196 2.395214)
     (xy -0.334448 2.421313) (xy -0.328719 2.487216) (xy -0.328706 2.495176) (xy -0.328706 2.599765) (xy -0.956235 2.599765) (xy -0.956235 2.181412) (xy -0.851647 2.181412) (xy -0.781549 2.176786)
     (xy -0.752801 2.150687) (xy -0.747072 2.084784) (xy -0.747059 2.076823) (xy -0.751685 2.006725) (xy -0.777784 1.977977) (xy -0.843687 1.972248) (xy -0.851647 1.972235) (xy -0.956235 1.972235)
     (xy -0.956235 1.553882) (xy -0.747059 1.553882) (xy -0.747059 1.972235) )(layer F.SilkS) (width  0.010000)
  )
  (fp_poly (pts (xy -0.956235 -0.328706) (xy -1.374588 -0.328706) (xy -1.374588 -0.537883) (xy -0.956235 -0.537883) (xy -0.956235 -0.328706) )(layer F.SilkS) (width  0.010000)
  )
  (fp_poly (pts (xy -0.956235 -0.642471) (xy -0.951610 -0.712569) (xy -0.925511 -0.741317) (xy -0.859608 -0.747046) (xy -0.851647 -0.747059) (xy -0.537883 -0.747059) (xy -0.537883 -0.537883) (xy -0.119530 -0.537883)
     (xy -0.119530 -0.433294) (xy -0.114904 -0.363196) (xy -0.088805 -0.334448) (xy -0.022902 -0.328719) (xy -0.014941 -0.328706) (xy 0.055157 -0.333332) (xy 0.083905 -0.359431) (xy 0.089634 -0.425334)
     (xy 0.089647 -0.433294) (xy 0.085021 -0.503393) (xy 0.058922 -0.532141) (xy -0.006981 -0.537870) (xy -0.014941 -0.537883) (xy -0.085040 -0.542508) (xy -0.113788 -0.568607) (xy -0.119517 -0.634510)
     (xy -0.119530 -0.642471) (xy -0.114904 -0.712569) (xy -0.088805 -0.741317) (xy -0.022902 -0.747046) (xy -0.014941 -0.747059) (xy 0.089647 -0.747059) (xy 0.089647 -1.165412) (xy 0.298823 -1.165412)
     (xy 0.298823 -0.747059) (xy 0.717176 -0.747059) (xy 0.717176 -0.851647) (xy 0.712550 -0.921746) (xy 0.686452 -0.950493) (xy 0.620549 -0.956222) (xy 0.612588 -0.956235) (xy 0.542490 -0.960861)
     (xy 0.513742 -0.986960) (xy 0.508013 -1.052863) (xy 0.508000 -1.060824) (xy 0.503374 -1.130922) (xy 0.477275 -1.159670) (xy 0.411372 -1.165399) (xy 0.403412 -1.165412) (xy 0.298823 -1.165412)
     (xy 0.298823 -1.583765) (xy 0.194235 -1.583765) (xy 0.124137 -1.588391) (xy 0.095389 -1.614489) (xy 0.089660 -1.680392) (xy 0.089647 -1.688353) (xy 0.085021 -1.758451) (xy 0.058922 -1.787199)
     (xy -0.006981 -1.792928) (xy -0.014941 -1.792941) (xy -0.085040 -1.788316) (xy -0.113788 -1.762217) (xy -0.119517 -1.696314) (xy -0.119530 -1.688353) (xy -0.124155 -1.618255) (xy -0.150254 -1.589507)
     (xy -0.216157 -1.583778) (xy -0.224118 -1.583765) (xy -0.328706 -1.583765) (xy -0.328706 -1.165412) (xy -0.119530 -1.165412) (xy -0.119530 -0.747059) (xy -0.537883 -0.747059) (xy -0.851647 -0.747059)
     (xy -0.781549 -0.751685) (xy -0.752801 -0.777784) (xy -0.747072 -0.843687) (xy -0.747059 -0.851647) (xy -0.751685 -0.921746) (xy -0.777784 -0.950493) (xy -0.843687 -0.956222) (xy -0.851647 -0.956235)
     (xy -0.956235 -0.956235) (xy -0.956235 -1.374588) (xy -0.747059 -1.374588) (xy -0.747059 -0.956235) (xy -0.537883 -0.956235) (xy -0.537883 -1.583765) (xy -0.642471 -1.583765) (xy -0.712569 -1.588391)
     (xy -0.741317 -1.614489) (xy -0.747046 -1.680392) (xy -0.747059 -1.688353) (xy -0.742433 -1.758451) (xy -0.716335 -1.787199) (xy -0.650432 -1.792928) (xy -0.642471 -1.792941) (xy -0.572372 -1.788316)
     (xy -0.543625 -1.762217) (xy -0.537896 -1.696314) (xy -0.537883 -1.688353) (xy -0.533257 -1.618255) (xy -0.507158 -1.589507) (xy -0.441255 -1.583778) (xy -0.433294 -1.583765) (xy -0.363196 -1.588391)
     (xy -0.334448 -1.614489) (xy -0.328719 -1.680392) (xy -0.328706 -1.688353) (xy -0.324080 -1.758451) (xy -0.297982 -1.787199) (xy -0.232079 -1.792928) (xy -0.224118 -1.792941) (xy -0.119530 -1.792941)
     (xy -0.119530 -2.211294) (xy 0.508000 -2.211294) (xy 0.508000 -2.106706) (xy 0.503374 -2.036608) (xy 0.477275 -2.007860) (xy 0.411372 -2.002131) (xy 0.403412 -2.002118) (xy 0.333313 -1.997492)
     (xy 0.304565 -1.971393) (xy 0.298836 -1.905490) (xy 0.298823 -1.897530) (xy 0.303449 -1.827431) (xy 0.329548 -1.798683) (xy 0.395451 -1.792954) (xy 0.403412 -1.792941) (xy 0.508000 -1.792941)
     (xy 0.508000 -1.165412) (xy 0.717176 -1.165412) (xy 0.717176 -2.420471) (xy 0.926353 -2.420471) (xy 0.926353 -0.328706) (xy 0.508000 -0.328706) (xy 0.508000 -0.433294) (xy 0.503374 -0.503393)
     (xy 0.477275 -0.532141) (xy 0.411372 -0.537870) (xy 0.403412 -0.537883) (xy 0.298823 -0.537883) (xy 0.298823 0.089647) (xy 0.403412 0.089647) (xy 0.473510 0.085021) (xy 0.502258 0.058922)
     (xy 0.507987 -0.006981) (xy 0.508000 -0.014941) (xy 0.508000 -0.119530) (xy 0.926353 -0.119530) (xy 0.926353 0.508000) (xy 1.030941 0.508000) (xy 1.101039 0.503374) (xy 1.129787 0.477275)
     (xy 1.135516 0.411372) (xy 1.135529 0.403412) (xy 1.140155 0.333313) (xy 1.166254 0.304565) (xy 1.232157 0.298836) (xy 1.240117 0.298823) (xy 1.310216 0.303449) (xy 1.338964 0.329548)
     (xy 1.344693 0.395451) (xy 1.344706 0.403412) (xy 1.349332 0.473510) (xy 1.375430 0.502258) (xy 1.441333 0.507987) (xy 1.449294 0.508000) (xy 1.519392 0.512626) (xy 1.548140 0.538724)
     (xy 1.553869 0.604627) (xy 1.553882 0.612588) (xy 1.558508 0.682686) (xy 1.584607 0.711434) (xy 1.650510 0.717163) (xy 1.658470 0.717176) (xy 1.763059 0.717176) (xy 1.763059 1.135529)
     (xy 1.867647 1.135529) (xy 1.937745 1.140155) (xy 1.966493 1.166254) (xy 1.972222 1.232157) (xy 1.972235 1.240117) (xy 1.967609 1.310216) (xy 1.941511 1.338964) (xy 1.875608 1.344693)
     (xy 1.867647 1.344706) (xy 1.797549 1.349332) (xy 1.768801 1.375430) (xy 1.763072 1.441333) (xy 1.763059 1.449294) (xy 1.767684 1.519392) (xy 1.793783 1.548140) (xy 1.859686 1.553869)
     (xy 1.867647 1.553882) (xy 1.972235 1.553882) (xy 1.972235 1.972235) (xy 2.076823 1.972235) (xy 2.146922 1.967609) (xy 2.175670 1.941511) (xy 2.181399 1.875608) (xy 2.181412 1.867647)
     (xy 2.186037 1.797549) (xy 2.212136 1.768801) (xy 2.278039 1.763072) (xy 2.286000 1.763059) (xy 2.356098 1.758433) (xy 2.384846 1.732334) (xy 2.390575 1.666431) (xy 2.390588 1.658470)
     (xy 2.385962 1.588372) (xy 2.359864 1.559624) (xy 2.293961 1.553895) (xy 2.286000 1.553882) (xy 2.215901 1.549256) (xy 2.187154 1.523158) (xy 2.181425 1.457255) (xy 2.181412 1.449294)
     (xy 2.186037 1.379196) (xy 2.212136 1.350448) (xy 2.278039 1.344719) (xy 2.286000 1.344706) (xy 2.356098 1.340080) (xy 2.384846 1.313981) (xy 2.390575 1.248078) (xy 2.390588 1.240117)
     (xy 2.385962 1.170019) (xy 2.359864 1.141271) (xy 2.293961 1.135542) (xy 2.286000 1.135529) (xy 2.215901 1.130903) (xy 2.187154 1.104805) (xy 2.181425 1.038902) (xy 2.181412 1.030941)
     (xy 2.176786 0.960843) (xy 2.150687 0.932095) (xy 2.084784 0.926366) (xy 2.076823 0.926353) (xy 1.972235 0.926353) (xy 1.972235 0.612588) (xy 2.181412 0.612588) (xy 2.186037 0.682686)
     (xy 2.212136 0.711434) (xy 2.278039 0.717163) (xy 2.286000 0.717176) (xy 2.356098 0.712550) (xy 2.384846 0.686452) (xy 2.390575 0.620549) (xy 2.390588 0.612588) (xy 2.385962 0.542490)
     (xy 2.359864 0.513742) (xy 2.293961 0.508013) (xy 2.286000 0.508000) (xy 2.215901 0.512626) (xy 2.187154 0.538724) (xy 2.181425 0.604627) (xy 2.181412 0.612588) (xy 1.972235 0.612588)
     (xy 1.972235 0.508000) (xy 1.867647 0.508000) (xy 1.797549 0.503374) (xy 1.768801 0.477275) (xy 1.763072 0.411372) (xy 1.763059 0.403412) (xy 1.758433 0.333313) (xy 1.732334 0.304565)
     (xy 1.666431 0.298836) (xy 1.658470 0.298823) (xy 1.588372 0.294197) (xy 1.559624 0.268099) (xy 1.553895 0.202196) (xy 1.553882 0.194235) (xy 1.553882 0.089647) (xy 1.135529 0.089647)
     (xy 1.135529 -0.014941) (xy 1.140155 -0.085040) (xy 1.166254 -0.113788) (xy 1.232157 -0.119517) (xy 1.240117 -0.119530) (xy 1.310216 -0.124155) (xy 1.338964 -0.150254) (xy 1.344693 -0.216157)
     (xy 1.344706 -0.224118) (xy 1.340080 -0.294216) (xy 1.313981 -0.322964) (xy 1.248078 -0.328693) (xy 1.240117 -0.328706) (xy 1.553882 -0.328706) (xy 1.553882 0.089647) (xy 1.658470 0.089647)
     (xy 1.728569 0.094273) (xy 1.757317 0.120371) (xy 1.763046 0.186274) (xy 1.763059 0.194235) (xy 1.763059 0.298823) (xy 2.181412 0.298823) (xy 2.181412 0.194235) (xy 2.186037 0.124137)
     (xy 2.212136 0.095389) (xy 2.278039 0.089660) (xy 2.286000 0.089647) (xy 2.356098 0.085021) (xy 2.384846 0.058922) (xy 2.390575 -0.006981) (xy 2.390588 -0.014941) (xy 2.390588 -0.119530)
     (xy 1.763059 -0.119530) (xy 1.763059 -0.224118) (xy 1.758433 -0.294216) (xy 1.732334 -0.322964) (xy 1.666431 -0.328693) (xy 1.658470 -0.328706) (xy 1.553882 -0.328706) (xy 1.240117 -0.328706)
     (xy 1.170019 -0.333332) (xy 1.141271 -0.359431) (xy 1.135542 -0.425334) (xy 1.135529 -0.433294) (xy 1.140155 -0.503393) (xy 1.166254 -0.532141) (xy 1.232157 -0.537870) (xy 1.240117 -0.537883)
     (xy 1.972235 -0.537883) (xy 1.972235 -0.328706) (xy 2.390588 -0.328706) (xy 2.390588 -0.537883) (xy 1.972235 -0.537883) (xy 1.240117 -0.537883) (xy 1.310216 -0.542508) (xy 1.338964 -0.568607)
     (xy 1.344693 -0.634510) (xy 1.344706 -0.642471) (xy 1.340080 -0.712569) (xy 1.313981 -0.741317) (xy 1.248078 -0.747046) (xy 1.240117 -0.747059) (xy 1.170019 -0.751685) (xy 1.141271 -0.777784)
     (xy 1.135542 -0.843687) (xy 1.135529 -0.851647) (xy 1.140155 -0.921746) (xy 1.166254 -0.950493) (xy 1.232157 -0.956222) (xy 1.240117 -0.956235) (xy 1.310216 -0.951610) (xy 1.338964 -0.925511)
     (xy 1.344693 -0.859608) (xy 1.344706 -0.851647) (xy 1.344706 -0.747059) (xy 2.390588 -0.747059) (xy 2.390588 -0.851647) (xy 2.395214 -0.921746) (xy 2.421313 -0.950493) (xy 2.487216 -0.956222)
     (xy 2.495176 -0.956235) (xy 2.565275 -0.951610) (xy 2.594022 -0.925511) (xy 2.599751 -0.859608) (xy 2.599765 -0.851647) (xy 2.595139 -0.781549) (xy 2.569040 -0.752801) (xy 2.503137 -0.747072)
     (xy 2.495176 -0.747059) (xy 2.425078 -0.742433) (xy 2.396330 -0.716335) (xy 2.390601 -0.650432) (xy 2.390588 -0.642471) (xy 2.395214 -0.572372) (xy 2.421313 -0.543625) (xy 2.487216 -0.537896)
     (xy 2.495176 -0.537883) (xy 2.599765 -0.537883) (xy 2.599765 0.089647) (xy 2.495176 0.089647) (xy 2.425078 0.094273) (xy 2.396330 0.120371) (xy 2.390601 0.186274) (xy 2.390588 0.194235)
     (xy 2.395214 0.264333) (xy 2.421313 0.293081) (xy 2.487216 0.298810) (xy 2.495176 0.298823) (xy 2.599765 0.298823) (xy 2.599765 0.717176) (xy 2.390588 0.717176) (xy 2.390588 1.135529)
     (xy 2.495176 1.135529) (xy 2.565275 1.140155) (xy 2.594022 1.166254) (xy 2.599751 1.232157) (xy 2.599765 1.240117) (xy 2.595139 1.310216) (xy 2.569040 1.338964) (xy 2.503137 1.344693)
     (xy 2.495176 1.344706) (xy 2.425078 1.349332) (xy 2.396330 1.375430) (xy 2.390601 1.441333) (xy 2.390588 1.449294) (xy 2.395214 1.519392) (xy 2.421313 1.548140) (xy 2.487216 1.553869)
     (xy 2.495176 1.553882) (xy 2.599765 1.553882) (xy 2.599765 2.599765) (xy 2.495176 2.599765) (xy 2.425078 2.595139) (xy 2.396330 2.569040) (xy 2.390601 2.503137) (xy 2.390588 2.495176)
     (xy 2.390588 2.390588) (xy 1.972235 2.390588) (xy 1.972235 2.495176) (xy 1.967609 2.565275) (xy 1.941511 2.594022) (xy 1.875608 2.599751) (xy 1.867647 2.599765) (xy 1.797549 2.595139)
     (xy 1.768801 2.569040) (xy 1.763072 2.503137) (xy 1.763059 2.495176) (xy 1.763059 2.390588) (xy 1.344706 2.390588) (xy 1.344706 2.599765) (xy 0.717176 2.599765) (xy 0.717176 2.495176)
     (xy 0.721802 2.425078) (xy 0.747901 2.396330) (xy 0.813804 2.390601) (xy 0.821765 2.390588) (xy 0.891863 2.385962) (xy 0.920611 2.359864) (xy 0.926340 2.293961) (xy 0.926353 2.286000)
     (xy 0.921727 2.215901) (xy 0.895628 2.187154) (xy 0.829725 2.181425) (xy 0.821765 2.181412) (xy 0.751666 2.176786) (xy 0.722918 2.150687) (xy 0.717189 2.084784) (xy 0.717176 2.076823)
     (xy 0.712550 2.006725) (xy 0.686452 1.977977) (xy 0.620549 1.972248) (xy 0.612588 1.972235) (xy 0.508000 1.972235) (xy 0.508000 2.599765) (xy 0.089647 2.599765) (xy 0.089647 2.495176)
     (xy 0.094273 2.425078) (xy 0.120371 2.396330) (xy 0.186274 2.390601) (xy 0.194235 2.390588) (xy 0.298823 2.390588) (xy 0.298823 1.867647) (xy 0.717176 1.867647) (xy 0.721802 1.937745)
     (xy 0.747901 1.966493) (xy 0.813804 1.972222) (xy 0.821765 1.972235) (xy 0.891863 1.976861) (xy 0.920611 2.002960) (xy 0.926340 2.068863) (xy 0.926353 2.076823) (xy 0.930979 2.146922)
     (xy 0.957077 2.175670) (xy 1.022980 2.181399) (xy 1.030941 2.181412) (xy 1.101039 2.186037) (xy 1.129787 2.212136) (xy 1.135516 2.278039) (xy 1.135529 2.286000) (xy 1.140155 2.356098)
     (xy 1.166254 2.384846) (xy 1.232157 2.390575) (xy 1.240117 2.390588) (xy 1.344706 2.390588) (xy 1.344706 1.972235) (xy 0.926353 1.972235) (xy 0.926353 1.867647) (xy 0.921727 1.797549)
     (xy 0.895628 1.768801) (xy 0.829725 1.763072) (xy 0.821765 1.763059) (xy 1.344706 1.763059) (xy 1.344706 1.972235) (xy 1.763059 1.972235) (xy 1.763059 2.390588) (xy 1.972235 2.390588)
     (xy 1.972235 1.972235) (xy 1.867647 1.972235) (xy 1.797549 1.967609) (xy 1.768801 1.941511) (xy 1.763072 1.875608) (xy 1.763059 1.867647) (xy 1.763059 1.763059) (xy 1.344706 1.763059)
     (xy 0.821765 1.763059) (xy 0.751666 1.767684) (xy 0.722918 1.793783) (xy 0.717189 1.859686) (xy 0.717176 1.867647) (xy 0.298823 1.867647) (xy 0.298823 1.763059) (xy -0.119530 1.763059)
     (xy -0.119530 1.344706) (xy -0.328706 1.344706) (xy -0.328706 1.763059) (xy -0.433294 1.763059) (xy -0.503393 1.758433) (xy -0.532141 1.732334) (xy -0.537870 1.666431) (xy -0.537883 1.658470)
     (xy -0.542508 1.588372) (xy -0.568607 1.559624) (xy -0.634510 1.553895) (xy -0.642471 1.553882) (xy -0.747059 1.553882) (xy -0.747059 1.135529) (xy -0.851647 1.135529) (xy -0.921746 1.130903)
     (xy -0.950493 1.104805) (xy -0.956222 1.038902) (xy -0.956235 1.030941) (xy -0.956235 0.926353) (xy -1.374588 0.926353) (xy -1.374588 0.821765) (xy -1.379214 0.751666) (xy -1.405313 0.722918)
     (xy -1.471216 0.717189) (xy -1.479177 0.717176) (xy -1.549275 0.721802) (xy -1.578023 0.747901) (xy -1.583752 0.813804) (xy -1.583765 0.821765) (xy -1.583765 0.926353) (xy -2.211294 0.926353)
     (xy -2.211294 0.821765) (xy -2.206668 0.751666) (xy -2.180570 0.722918) (xy -2.114667 0.717189) (xy -2.106706 0.717176) (xy -2.002118 0.717176) (xy -2.002118 0.298823) (xy -1.792941 0.298823)
     (xy -1.792941 0.717176) (xy -1.583765 0.717176) (xy -1.583765 0.612588) (xy -1.374588 0.612588) (xy -1.369963 0.682686) (xy -1.343864 0.711434) (xy -1.277961 0.717163) (xy -1.270000 0.717176)
     (xy -1.199902 0.712550) (xy -1.171154 0.686452) (xy -1.165425 0.620549) (xy -1.165412 0.612588) (xy -1.170038 0.542490) (xy -1.196136 0.513742) (xy -1.262039 0.508013) (xy -1.270000 0.508000)
     (xy -1.340099 0.512626) (xy -1.368846 0.538724) (xy -1.374575 0.604627) (xy -1.374588 0.612588) (xy -1.583765 0.612588) (xy -1.583765 0.298823) (xy -1.792941 0.298823) (xy -2.002118 0.298823)
     (xy -2.002118 0.089647) (xy -1.897530 0.089647) (xy -1.827431 0.085021) (xy -1.798683 0.058922) (xy -1.792954 -0.006981) (xy -1.792941 -0.014941) (xy -1.792941 -0.119530) (xy -2.629647 -0.119530)
     (xy -2.629647 -0.537883) (xy -2.525059 -0.537883) (xy -2.454961 -0.542508) (xy -2.426213 -0.568607) (xy -2.420484 -0.634510) (xy -2.420471 -0.642471) (xy -2.425097 -0.712569) (xy -2.451195 -0.741317)
     (xy -2.517098 -0.747046) (xy -2.525059 -0.747059) (xy -2.595157 -0.751685) (xy -2.623905 -0.777784) (xy -2.629634 -0.843687) (xy -2.629647 -0.851647) (xy -2.629647 -0.956235) (xy -2.211294 -0.956235)
     (xy -2.211294 -0.537883) (xy -2.106706 -0.537883) (xy -2.036608 -0.533257) (xy -2.007860 -0.507158) (xy -2.002131 -0.441255) (xy -2.002118 -0.433294) (xy -1.997492 -0.363196) (xy -1.971393 -0.334448)
     (xy -1.905490 -0.328719) (xy -1.897530 -0.328706) (xy -1.792941 -0.328706) (xy -1.792941 -0.747059) (xy -1.897530 -0.747059) (xy -1.967628 -0.751685) (xy -1.996376 -0.777784) (xy -2.002105 -0.843687)
     (xy -2.002118 -0.851647) (xy -2.002118 -0.956235) (xy -1.583765 -0.956235) (xy -1.583765 0.298823) (xy -1.165412 0.298823) (xy -1.165412 0.403412) (xy -1.160786 0.473510) (xy -1.134687 0.502258)
     (xy -1.068784 0.507987) (xy -1.060824 0.508000) (xy -0.956235 0.508000) (xy -0.747059 0.508000) (xy -0.747059 1.135529) (xy -0.642471 1.135529) (xy -0.572372 1.140155) (xy -0.543625 1.166254)
     (xy -0.537896 1.232157) (xy -0.537883 1.240117) (xy -0.533257 1.310216) (xy -0.507158 1.338964) (xy -0.441255 1.344693) (xy -0.433294 1.344706) (xy -0.363196 1.340080) (xy -0.334448 1.313981)
     (xy -0.328719 1.248078) (xy -0.328706 1.240117) (xy -0.333332 1.170019) (xy -0.359431 1.141271) (xy -0.425334 1.135542) (xy -0.433294 1.135529) (xy -0.119530 1.135529) (xy -0.119530 1.240117)
     (xy -0.114904 1.310216) (xy -0.088805 1.338964) (xy -0.022902 1.344693) (xy -0.014941 1.344706) (xy 0.055157 1.349332) (xy 0.083905 1.375430) (xy 0.089634 1.441333) (xy 0.089647 1.449294)
     (xy 0.094273 1.519392) (xy 0.120371 1.548140) (xy 0.186274 1.553869) (xy 0.194235 1.553882) (xy 0.264333 1.549256) (xy 0.293081 1.523158) (xy 0.298810 1.457255) (xy 0.298823 1.449294)
     (xy 0.298823 1.344706) (xy 0.717176 1.344706) (xy 0.717176 0.926353) (xy 0.926353 0.926353) (xy 0.926353 1.553882) (xy 1.553882 1.553882) (xy 1.553882 0.926353) (xy 0.926353 0.926353)
     (xy 0.717176 0.926353) (xy 0.717176 0.717176) (xy 0.821765 0.717176) (xy 0.891863 0.712550) (xy 0.920611 0.686452) (xy 0.926340 0.620549) (xy 0.926353 0.612588) (xy 0.921727 0.542490)
     (xy 0.895628 0.513742) (xy 0.829725 0.508013) (xy 0.821765 0.508000) (xy 0.751666 0.512626) (xy 0.722918 0.538724) (xy 0.717189 0.604627) (xy 0.717176 0.612588) (xy 0.712550 0.682686)
     (xy 0.686452 0.711434) (xy 0.620549 0.717163) (xy 0.612588 0.717176) (xy 0.508000 0.717176) (xy 0.508000 1.135529) (xy -0.119530 1.135529) (xy -0.433294 1.135529) (xy -0.503393 1.130903)
     (xy -0.532141 1.104805) (xy -0.537870 1.038902) (xy -0.537883 1.030941) (xy -0.537883 0.926353) (xy 0.298823 0.926353) (xy 0.298823 0.821765) (xy 0.303449 0.751666) (xy 0.329548 0.722918)
     (xy 0.395451 0.717189) (xy 0.403412 0.717176) (xy 0.508000 0.717176) (xy 0.508000 0.298823) (xy 0.403412 0.298823) (xy 0.333313 0.303449) (xy 0.304565 0.329548) (xy 0.298836 0.395451)
     (xy 0.298823 0.403412) (xy 0.298823 0.508000) (xy -0.119530 0.508000) (xy -0.119530 0.717176) (xy -0.537883 0.717176) (xy -0.537883 0.612588) (xy -0.542508 0.542490) (xy -0.568607 0.513742)
     (xy -0.634510 0.508013) (xy -0.642471 0.508000) (xy -0.747059 0.508000) (xy -0.956235 0.508000) (xy -0.956235 -0.119530) (xy -0.851647 -0.119530) (xy -0.537883 -0.119530) (xy -0.537883 0.298823)
     (xy 0.089647 0.298823) (xy 0.089647 0.089647) (xy -0.328706 0.089647) (xy -0.328706 -0.014941) (xy -0.333332 -0.085040) (xy -0.359431 -0.113788) (xy -0.425334 -0.119517) (xy -0.433294 -0.119530)
     (xy -0.537883 -0.119530) (xy -0.851647 -0.119530) (xy -0.781549 -0.124155) (xy -0.752801 -0.150254) (xy -0.747072 -0.216157) (xy -0.747059 -0.224118) (xy -0.742433 -0.294216) (xy -0.716335 -0.322964)
     (xy -0.650432 -0.328693) (xy -0.642471 -0.328706) (xy -0.572372 -0.333332) (xy -0.543625 -0.359431) (xy -0.537896 -0.425334) (xy -0.537883 -0.433294) (xy -0.537883 -0.537883) (xy -0.956235 -0.537883)
     (xy -0.956235 -0.642471) )(layer F.SilkS) (width  0.010000)
  )
  (fp_poly (pts (xy 0.055157 1.976861) (xy 0.083905 2.002960) (xy 0.089634 2.068863) (xy 0.089647 2.076823) (xy 0.085021 2.146922) (xy 0.058922 2.175670) (xy -0.006981 2.181399) (xy -0.014941 2.181412)
     (xy -0.085040 2.176786) (xy -0.113788 2.150687) (xy -0.119517 2.084784) (xy -0.119530 2.076823) (xy -0.114904 2.006725) (xy -0.088805 1.977977) (xy -0.022902 1.972248) (xy -0.014941 1.972235)
     (xy 0.055157 1.976861) )(layer F.SilkS) (width  0.010000)
  )
  (fp_poly (pts (xy -2.454961 0.094273) (xy -2.426213 0.120371) (xy -2.420484 0.186274) (xy -2.420471 0.194235) (xy -2.415845 0.264333) (xy -2.389746 0.293081) (xy -2.323843 0.298810) (xy -2.315883 0.298823)
     (xy -2.245784 0.303449) (xy -2.217036 0.329548) (xy -2.211307 0.395451) (xy -2.211294 0.403412) (xy -2.215920 0.473510) (xy -2.242019 0.502258) (xy -2.307922 0.507987) (xy -2.315883 0.508000)
     (xy -2.420471 0.508000) (xy -2.420471 0.926353) (xy -2.629647 0.926353) (xy -2.629647 0.089647) (xy -2.525059 0.089647) (xy -2.454961 0.094273) )(layer F.SilkS) (width  0.010000)
  )
  (fp_poly (pts (xy -1.199902 -0.114904) (xy -1.171154 -0.088805) (xy -1.165425 -0.022902) (xy -1.165412 -0.014941) (xy -1.170038 0.055157) (xy -1.196136 0.083905) (xy -1.262039 0.089634) (xy -1.270000 0.089647)
     (xy -1.340099 0.085021) (xy -1.368846 0.058922) (xy -1.374575 -0.006981) (xy -1.374588 -0.014941) (xy -1.369963 -0.085040) (xy -1.343864 -0.113788) (xy -1.277961 -0.119517) (xy -1.270000 -0.119530)
     (xy -1.199902 -0.114904) )(layer F.SilkS) (width  0.010000)
  )
  (fp_poly (pts (xy -1.199902 -0.951610) (xy -1.171154 -0.925511) (xy -1.165425 -0.859608) (xy -1.165412 -0.851647) (xy -1.170038 -0.781549) (xy -1.196136 -0.752801) (xy -1.262039 -0.747072) (xy -1.270000 -0.747059)
     (xy -1.340099 -0.751685) (xy -1.368846 -0.777784) (xy -1.374575 -0.843687) (xy -1.374588 -0.851647) (xy -1.369963 -0.921746) (xy -1.343864 -0.950493) (xy -1.277961 -0.956222) (xy -1.270000 -0.956235)
     (xy -1.199902 -0.951610) )(layer F.SilkS) (width  0.010000)
  )
  (fp_poly (pts (xy -1.165412 -1.165412) (xy -2.629647 -1.165412) (xy -2.629647 -2.420471) (xy -2.420471 -2.420471) (xy -2.420471 -1.374588) (xy -1.374588 -1.374588) (xy -1.374588 -2.420471) (xy -2.420471 -2.420471)
     (xy -2.629647 -2.420471) (xy -2.629647 -2.629647) (xy -1.165412 -2.629647) (xy -1.165412 -1.165412) )(layer F.SilkS) (width  0.010000)
  )
  (fp_poly (pts (xy 2.599765 -1.165412) (xy 1.135529 -1.165412) (xy 1.135529 -2.420471) (xy 1.344706 -2.420471) (xy 1.344706 -1.374588) (xy 2.390588 -1.374588) (xy 2.390588 -2.420471) (xy 1.344706 -2.420471)
     (xy 1.135529 -2.420471) (xy 1.135529 -2.629647) (xy 2.599765 -2.629647) (xy 2.599765 -1.165412) )(layer F.SilkS) (width  0.010000)
  )
  (fp_poly (pts (xy -0.781549 -2.625021) (xy -0.752801 -2.598923) (xy -0.747072 -2.533020) (xy -0.747059 -2.525059) (xy -0.747059 -2.420471) (xy -0.328706 -2.420471) (xy -0.328706 -2.002118) (xy -0.433294 -2.002118)
     (xy -0.503393 -2.006744) (xy -0.532141 -2.032842) (xy -0.537870 -2.098745) (xy -0.537883 -2.106706) (xy -0.542508 -2.176804) (xy -0.568607 -2.205552) (xy -0.634510 -2.211281) (xy -0.642471 -2.211294)
     (xy -0.712569 -2.215920) (xy -0.741317 -2.242019) (xy -0.747046 -2.307922) (xy -0.747059 -2.315883) (xy -0.751685 -2.385981) (xy -0.777784 -2.414729) (xy -0.843687 -2.420458) (xy -0.851647 -2.420471)
     (xy -0.921746 -2.425097) (xy -0.950493 -2.451195) (xy -0.956222 -2.517098) (xy -0.956235 -2.525059) (xy -0.951610 -2.595157) (xy -0.925511 -2.623905) (xy -0.859608 -2.629634) (xy -0.851647 -2.629647)
     (xy -0.781549 -2.625021) )(layer F.SilkS) (width  0.010000)
  )
  (fp_poly (pts (xy 0.089647 -2.420471) (xy -0.328706 -2.420471) (xy -0.328706 -2.629647) (xy 0.089647 -2.629647) (xy 0.089647 -2.420471) )(layer F.SilkS) (width  0.010000)
  )
  (fp_poly (pts (xy 0.473510 -2.625021) (xy 0.502258 -2.598923) (xy 0.507987 -2.533020) (xy 0.508000 -2.525059) (xy 0.503374 -2.454961) (xy 0.477275 -2.426213) (xy 0.411372 -2.420484) (xy 0.403412 -2.420471)
     (xy 0.333313 -2.425097) (xy 0.304565 -2.451195) (xy 0.298836 -2.517098) (xy 0.298823 -2.525059) (xy 0.303449 -2.595157) (xy 0.329548 -2.623905) (xy 0.395451 -2.629634) (xy 0.403412 -2.629647)
     (xy 0.473510 -2.625021) )(layer F.SilkS) (width  0.010000)
  )
  (fp_poly (pts (xy -1.583765 2.181412) (xy -2.211294 2.181412) (xy -2.211294 1.553882) (xy -1.583765 1.553882) (xy -1.583765 2.181412) )(layer F.SilkS) (width  0.010000)
  )
  (fp_poly (pts (xy 1.310216 1.140155) (xy 1.338964 1.166254) (xy 1.344693 1.232157) (xy 1.344706 1.240117) (xy 1.340080 1.310216) (xy 1.313981 1.338964) (xy 1.248078 1.344693) (xy 1.240117 1.344706)
     (xy 1.170019 1.340080) (xy 1.141271 1.313981) (xy 1.135542 1.248078) (xy 1.135529 1.240117) (xy 1.140155 1.170019) (xy 1.166254 1.141271) (xy 1.232157 1.135542) (xy 1.240117 1.135529)
     (xy 1.310216 1.140155) )(layer F.SilkS) (width  0.010000)
  )
  (fp_poly (pts (xy 0.089647 -1.165412) (xy -0.119530 -1.165412) (xy -0.119530 -1.583765) (xy 0.089647 -1.583765) (xy 0.089647 -1.165412) )(layer F.SilkS) (width  0.010000)
  )
  (fp_poly (pts (xy -1.583765 -1.583765) (xy -2.211294 -1.583765) (xy -2.211294 -2.211294) (xy -1.583765 -2.211294) (xy -1.583765 -1.583765) )(layer F.SilkS) (width  0.010000)
  )
  (fp_poly (pts (xy 2.181412 -1.583765) (xy 1.553882 -1.583765) (xy 1.553882 -2.211294) (xy 2.181412 -2.211294) (xy 2.181412 -1.583765) )(layer F.SilkS) (width  0.010000)
  )
)
