(footprint "P75-A2" (version 20201116) (generator pcbnew) (layer "F.Cu")
  (tedit 5FBBEFB6)
  (fp_text reference "REF**" (at 0 -2.5 unlocked) (layer "F.SilkS")
    (effects (font (size 1 1) (thickness 0.15)))
    (tstamp a4f257ee-b952-424d-9219-3550597d1ddf)
  )
  (fp_text value "P75-A2" (at 0 1 unlocked) (layer "F.Fab") hide
    (effects (font (size 1 1) (thickness 0.15)))
    (tstamp 7b3870de-fe23-4639-8975-37715362f9eb)
  )
  (fp_text user "${REFERENCE}" (at 0 0 unlocked) (layer "F.Fab")
    (effects (font (size 0.2 0.2) (thickness 0.05)))
    (tstamp 2fe44392-7f11-4e7a-bd50-2f31981da2ae)
  )
  (fp_circle (center 0 0) (end 0 -0.75) (layer "F.CrtYd") (width 0.05) (fill none) (tstamp 9702d4d6-0b20-4c9b-b621-8aec614c3b53))
  (fp_circle (center 0 0) (end 0 -0.5) (layer "F.Fab") (width 0.1) (fill none) (tstamp dd36a1e7-1cde-4be4-8763-6b074b448dba))
  (pad "1" thru_hole circle (at 0 0) (size 1.5 1.5) (drill 1.1) (layers *.Cu *.Mask) (tstamp a1e2c6af-781f-4624-a9f5-19cc2709eb45))
  (model "${KICADLIB}/model/mechanical/P75-A2.step"
    (offset (xyz 0 0 3.35))
    (scale (xyz 1 1 1))
    (rotate (xyz 0 0 0))
  )
)
