(footprint "PinHeader_2x15_P2.54mm_Vertical" (version 20211014) (generator pcbnew)
  (layer "F.Cu")
  (tedit 6116C912)
  (descr "Through hole straight pin header, 2x15, 2.54mm pitch, double rows")
  (tags "Through hole pin header THT 2x15 2.54mm double row")
  (attr through_hole)
  (fp_text reference "REF**" (at 1.27 -2.33) (layer "F.SilkS")
    (effects (font (size 1 1) (thickness 0.15)))
    (tstamp 3daca872-695f-4992-9973-933c99562ea5)
  )
  (fp_text value "PinHeader_2x15_P2.54mm_Vertical" (at 1.27 37.89) (layer "F.Fab") hide
    (effects (font (size 1 1) (thickness 0.15)))
    (tstamp d82b5c7d-582e-47ed-9f9f-9bb52a2f6301)
  )
  (fp_text user "${REFERENCE}" (at 1.27 17.78 90) (layer "F.Fab")
    (effects (font (size 1 1) (thickness 0.15)))
    (tstamp d9442c6a-37da-469f-bf05-fc5a9b2d3bce)
  )
  (fp_line (start 1.27 -1.33) (end 3.87 -1.33) (layer "F.SilkS") (width 0.12) (tstamp 14b64c12-8a81-49ec-b7ac-651b04098142))
  (fp_line (start -1.33 1.27) (end -1.33 36.89) (layer "F.SilkS") (width 0.12) (tstamp 3520ade7-4cbc-4687-b6e9-6085eb665e0c))
  (fp_line (start -1.33 1.27) (end 1.27 1.27) (layer "F.SilkS") (width 0.12) (tstamp 3f4ee297-3bd1-45bf-82d9-00b4d4cf72f3))
  (fp_line (start -1.33 0) (end -1.33 -1.33) (layer "F.SilkS") (width 0.12) (tstamp 4a67ea34-3e55-4c3e-b102-a3ed84d334a5))
  (fp_line (start -1.33 -1.33) (end 0 -1.33) (layer "F.SilkS") (width 0.12) (tstamp 7701b54d-f5ea-411d-b6d6-5bdc77d04950))
  (fp_line (start 1.27 1.27) (end 1.27 -1.33) (layer "F.SilkS") (width 0.12) (tstamp 873f0252-3260-4dcc-9c42-0093101522a6))
  (fp_line (start -1.33 36.89) (end 3.87 36.89) (layer "F.SilkS") (width 0.12) (tstamp 8c870e62-5bde-4eeb-b688-f8207f809cb6))
  (fp_line (start 3.87 -1.33) (end 3.87 36.89) (layer "F.SilkS") (width 0.12) (tstamp d390dd12-4347-4f66-acd4-d8fc6dffc608))
  (fp_line (start -1.8 37.35) (end 4.35 37.35) (layer "F.CrtYd") (width 0.05) (tstamp 08ecb2b1-a1e2-4e72-a572-e6de965f9681))
  (fp_line (start -1.8 -1.8) (end -1.8 37.35) (layer "F.CrtYd") (width 0.05) (tstamp 9e0d0676-fa87-4af8-bd94-ca01de135a10))
  (fp_line (start 4.35 -1.8) (end -1.8 -1.8) (layer "F.CrtYd") (width 0.05) (tstamp a5f1a41c-cb0c-4c50-8a07-d60676c515ef))
  (fp_line (start 4.35 37.35) (end 4.35 -1.8) (layer "F.CrtYd") (width 0.05) (tstamp cc51ef82-d71b-477f-bbb4-4041352b16d8))
  (fp_line (start -1.27 36.83) (end -1.27 0) (layer "F.Fab") (width 0.1) (tstamp 04141ff4-6f30-4a5a-a12e-390eace93016))
  (fp_line (start -1.27 0) (end 0 -1.27) (layer "F.Fab") (width 0.1) (tstamp 35153adc-f876-4a10-a37b-8cb5bb9b4b67))
  (fp_line (start 3.81 36.83) (end -1.27 36.83) (layer "F.Fab") (width 0.1) (tstamp 3bae3de8-f55d-4bd2-a763-370053491178))
  (fp_line (start 3.81 -1.27) (end 3.81 36.83) (layer "F.Fab") (width 0.1) (tstamp ca4524a7-d911-48c4-ade5-4ef695a29922))
  (fp_line (start 0 -1.27) (end 3.81 -1.27) (layer "F.Fab") (width 0.1) (tstamp e5722297-67c2-4d62-8eeb-50fb5140a725))
  (pad "1" thru_hole rect (at 0 0) (size 1.7 1.7) (drill 1) (layers *.Cu *.Mask) (tstamp 691f5643-efbc-449d-90bd-bc608019c837))
  (pad "2" thru_hole oval (at 2.54 0) (size 1.7 1.7) (drill 1) (layers *.Cu *.Mask) (tstamp 37153ca4-65e8-4866-88a2-72c50903d6b1))
  (pad "3" thru_hole oval (at 0 2.54) (size 1.7 1.7) (drill 1) (layers *.Cu *.Mask) (tstamp d0336464-d1c7-4654-a6a1-e5dc96917c5f))
  (pad "4" thru_hole oval (at 2.54 2.54) (size 1.7 1.7) (drill 1) (layers *.Cu *.Mask) (tstamp 25e5959a-5068-4bb9-be90-d628d1a6919a))
  (pad "5" thru_hole oval (at 0 5.08) (size 1.7 1.7) (drill 1) (layers *.Cu *.Mask) (tstamp df0d9f77-5c20-4921-8781-fd6cd52bbc80))
  (pad "6" thru_hole oval (at 2.54 5.08) (size 1.7 1.7) (drill 1) (layers *.Cu *.Mask) (tstamp 9e16d59b-fed8-4260-908f-d6870039e4a7))
  (pad "7" thru_hole oval (at 0 7.62) (size 1.7 1.7) (drill 1) (layers *.Cu *.Mask) (tstamp 8fff8063-b6c8-4478-a5e6-8dc5db51594f))
  (pad "8" thru_hole oval (at 2.54 7.62) (size 1.7 1.7) (drill 1) (layers *.Cu *.Mask) (tstamp 62b91612-ea22-45c7-aeba-a19967ff89d6))
  (pad "9" thru_hole oval (at 0 10.16) (size 1.7 1.7) (drill 1) (layers *.Cu *.Mask) (tstamp 80ada4af-14dd-4cd2-9cd0-75f8ce95b0f9))
  (pad "10" thru_hole oval (at 2.54 10.16) (size 1.7 1.7) (drill 1) (layers *.Cu *.Mask) (tstamp 7a5c1a4d-c198-464c-a95d-f8716ddc06af))
  (pad "11" thru_hole oval (at 0 12.7) (size 1.7 1.7) (drill 1) (layers *.Cu *.Mask) (tstamp b96d1fcb-4f4c-4447-8aa5-582e1b8fe6e9))
  (pad "12" thru_hole oval (at 2.54 12.7) (size 1.7 1.7) (drill 1) (layers *.Cu *.Mask) (tstamp 7304d162-5810-41b5-aace-93f7e8fd503f))
  (pad "13" thru_hole oval (at 0 15.24) (size 1.7 1.7) (drill 1) (layers *.Cu *.Mask) (tstamp 401d4069-33dd-411b-93b6-4f9b51974361))
  (pad "14" thru_hole oval (at 2.54 15.24) (size 1.7 1.7) (drill 1) (layers *.Cu *.Mask) (tstamp d56bca12-213a-4bda-b930-65af7acc88b4))
  (pad "15" thru_hole oval (at 0 17.78) (size 1.7 1.7) (drill 1) (layers *.Cu *.Mask) (tstamp 01145ed3-0f4b-4330-94d2-a57d53caedcb))
  (pad "16" thru_hole oval (at 2.54 17.78) (size 1.7 1.7) (drill 1) (layers *.Cu *.Mask) (tstamp da9ec58c-c4f4-4d0f-bb13-f65e630766dc))
  (pad "17" thru_hole oval (at 0 20.32) (size 1.7 1.7) (drill 1) (layers *.Cu *.Mask) (tstamp 422c4ef5-16c9-45d8-97e6-7ab16416c898))
  (pad "18" thru_hole oval (at 2.54 20.32) (size 1.7 1.7) (drill 1) (layers *.Cu *.Mask) (tstamp d9740f61-0402-4a07-9516-ec49b8cf378d))
  (pad "19" thru_hole oval (at 0 22.86) (size 1.7 1.7) (drill 1) (layers *.Cu *.Mask) (tstamp 5cdbed6f-c504-44d0-8690-52a5ef5884bd))
  (pad "20" thru_hole oval (at 2.54 22.86) (size 1.7 1.7) (drill 1) (layers *.Cu *.Mask) (tstamp 6571058a-8900-499e-b4bc-84404867efc2))
  (pad "21" thru_hole oval (at 0 25.4) (size 1.7 1.7) (drill 1) (layers *.Cu *.Mask) (tstamp c1e17af3-d8b4-4461-b873-350674a6fcdd))
  (pad "22" thru_hole oval (at 2.54 25.4) (size 1.7 1.7) (drill 1) (layers *.Cu *.Mask) (tstamp 35cbaf3c-7abc-4e41-a78d-8ad3dc06469e))
  (pad "23" thru_hole oval (at 0 27.94) (size 1.7 1.7) (drill 1) (layers *.Cu *.Mask) (tstamp 355eaef1-6c35-477b-9a13-89706906181d))
  (pad "24" thru_hole oval (at 2.54 27.94) (size 1.7 1.7) (drill 1) (layers *.Cu *.Mask) (tstamp 5a0b690f-7177-403a-b084-cace0f2ac048))
  (pad "25" thru_hole oval (at 0 30.48) (size 1.7 1.7) (drill 1) (layers *.Cu *.Mask) (tstamp dddb8047-b765-4468-8342-29ac5ddad99f))
  (pad "26" thru_hole oval (at 2.54 30.48) (size 1.7 1.7) (drill 1) (layers *.Cu *.Mask) (tstamp afa08d4a-eff5-478b-b843-bb4352797874))
  (pad "27" thru_hole oval (at 0 33.02) (size 1.7 1.7) (drill 1) (layers *.Cu *.Mask) (tstamp 809f6877-50a9-48bc-90f5-6014244eb2cd))
  (pad "28" thru_hole oval (at 2.54 33.02) (size 1.7 1.7) (drill 1) (layers *.Cu *.Mask) (tstamp 2303c6e3-2fef-45b1-94a3-1cc661c180d3))
  (pad "29" thru_hole oval (at 0 35.56) (size 1.7 1.7) (drill 1) (layers *.Cu *.Mask) (tstamp f2fe3802-9527-439a-ab9c-1a3a95fcb0f1))
  (pad "30" thru_hole oval (at 2.54 35.56) (size 1.7 1.7) (drill 1) (layers *.Cu *.Mask) (tstamp 12c6b9e1-90ab-40a9-ba73-287b026b1173))
  (model "${KICADLIB}/model/connector/PinHeader_2x15_P2.54mm_Vertical.step"
    (offset (xyz 0 0 0))
    (scale (xyz 1 1 1))
    (rotate (xyz 0 0 0))
  )
)
