(footprint "PinHeader_2x06_P2.54mm_Horizontal" (version 20210722) (generator pcbnew) (layer "F.Cu")
  (tedit 6116C8CE)
  (descr "Through hole angled pin header, 2x06, 2.54mm pitch, 6mm pin length, double rows")
  (tags "Through hole angled pin header THT 2x06 2.54mm double row")
  (attr through_hole)
  (fp_text reference "REF**" (at 5.655 -2.27) (layer "F.SilkS")
    (effects (font (size 1 1) (thickness 0.15)))
    (tstamp cb75bdb7-747d-4b23-b9cc-14c9293af247)
  )
  (fp_text value "PinHeader_2x06_P2.54mm_Horizontal" (at 5.655 14.97) (layer "F.Fab") hide
    (effects (font (size 1 1) (thickness 0.15)))
    (tstamp 3d2b6e92-92f2-4d9c-9e52-d5055f676d31)
  )
  (fp_text user "^" (at -2.1 0 270 unlocked) (layer "F.SilkS")
    (effects (font (size 1 1) (thickness 0.15)))
    (tstamp d12eb58b-12ec-4a20-b56c-0972ffec8f04)
  )
  (fp_text user "${REFERENCE}" (at 5.31 6.35 90) (layer "F.Fab")
    (effects (font (size 1 1) (thickness 0.15)))
    (tstamp 1591ca88-c166-4e7f-b7a1-cce385183724)
  )
  (fp_line (start 12.64 2.92) (end 6.64 2.92) (layer "F.SilkS") (width 0.12) (tstamp 0b404a2a-c894-4227-a97f-304cda9d1903))
  (fp_line (start 1.11 0.38) (end 1.497071 0.38) (layer "F.SilkS") (width 0.12) (tstamp 0e246f8b-bd7e-46fb-a5f5-c3aead331a61))
  (fp_line (start 3.98 8.89) (end 6.64 8.89) (layer "F.SilkS") (width 0.12) (tstamp 0e54e881-c082-4312-b5f0-618a09ab8d26))
  (fp_line (start 12.64 5.46) (end 6.64 5.46) (layer "F.SilkS") (width 0.12) (tstamp 0e9c9288-f2c2-4f7f-93e6-9fccbaeec3b0))
  (fp_line (start 12.64 9.78) (end 12.64 10.54) (layer "F.SilkS") (width 0.12) (tstamp 1659bb68-e445-47f0-b381-81a359fb7833))
  (fp_line (start 3.582929 5.46) (end 3.98 5.46) (layer "F.SilkS") (width 0.12) (tstamp 17988647-df27-46a0-a95e-fc746ed21678))
  (fp_line (start 6.64 -0.32) (end 12.64 -0.32) (layer "F.SilkS") (width 0.12) (tstamp 197df7fc-b6ee-4111-8bde-9a8d850fa8ea))
  (fp_line (start 12.64 13.08) (end 6.64 13.08) (layer "F.SilkS") (width 0.12) (tstamp 19b43a78-8600-4172-90d2-42959db47eec))
  (fp_line (start 3.582929 4.7) (end 3.98 4.7) (layer "F.SilkS") (width 0.12) (tstamp 24533620-ceb0-4227-94cc-ce2ade3dd0d0))
  (fp_line (start 1.11 -0.38) (end 1.497071 -0.38) (layer "F.SilkS") (width 0.12) (tstamp 2673ded1-c95b-487d-97d8-1dc267e6caba))
  (fp_line (start 3.582929 13.08) (end 3.98 13.08) (layer "F.SilkS") (width 0.12) (tstamp 2e791bf1-4d76-47d9-aa47-40aa59cfc55e))
  (fp_line (start 1.042929 12.32) (end 1.497071 12.32) (layer "F.SilkS") (width 0.12) (tstamp 37f7ecf0-30f6-4484-ae3d-992092ddcd3b))
  (fp_line (start 3.98 11.43) (end 6.64 11.43) (layer "F.SilkS") (width 0.12) (tstamp 3c756650-1638-4b19-98d3-bbe98ce78073))
  (fp_line (start 3.582929 0.38) (end 3.98 0.38) (layer "F.SilkS") (width 0.12) (tstamp 3eb33b04-a2e5-486d-aeb9-b2da8ee52dbe))
  (fp_line (start 12.64 12.32) (end 12.64 13.08) (layer "F.SilkS") (width 0.12) (tstamp 43809b9d-46ca-4d80-bb9e-6ef94e0791c7))
  (fp_line (start 1.042929 4.7) (end 1.497071 4.7) (layer "F.SilkS") (width 0.12) (tstamp 448b51c3-46af-4123-9eb3-902a62b2a3b4))
  (fp_line (start 6.64 -1.33) (end 3.98 -1.33) (layer "F.SilkS") (width 0.12) (tstamp 44fb56e0-da64-44b3-a4fe-b08508aaeea2))
  (fp_line (start 3.98 1.27) (end 6.64 1.27) (layer "F.SilkS") (width 0.12) (tstamp 4b2d6dad-423e-4f98-95d6-56dd288016eb))
  (fp_line (start 12.64 7.24) (end 12.64 8) (layer "F.SilkS") (width 0.12) (tstamp 4d6d954c-1590-4af3-b690-1a3c679132c9))
  (fp_line (start 3.582929 2.92) (end 3.98 2.92) (layer "F.SilkS") (width 0.12) (tstamp 51e2ee8d-fbe7-4832-86e0-c94a8b21c982))
  (fp_line (start 6.64 0.04) (end 12.64 0.04) (layer "F.SilkS") (width 0.12) (tstamp 56cd81cf-4890-450e-a610-c4188664da85))
  (fp_line (start 6.64 0.16) (end 12.64 0.16) (layer "F.SilkS") (width 0.12) (tstamp 5eeb4dd9-645a-4f3f-8eeb-ff2cf6d13f10))
  (fp_line (start 3.582929 9.78) (end 3.98 9.78) (layer "F.SilkS") (width 0.12) (tstamp 66293a7c-e9f4-4a38-af43-2fe9f7aecf98))
  (fp_line (start 6.64 7.24) (end 12.64 7.24) (layer "F.SilkS") (width 0.12) (tstamp 6899224f-0a4a-4112-96a1-7412a342ea7b))
  (fp_line (start -1.27 0) (end -1.27 -1.27) (layer "F.SilkS") (width 0.12) (tstamp 69220789-ff98-4bc0-8f1b-81ae0e1d98f3))
  (fp_line (start 12.64 10.54) (end 6.64 10.54) (layer "F.SilkS") (width 0.12) (tstamp 709587e9-00bd-4a88-a63f-8cc407585842))
  (fp_line (start 6.64 -0.08) (end 12.64 -0.08) (layer "F.SilkS") (width 0.12) (tstamp 72122dcd-aac9-4b30-bac6-1d166f42801e))
  (fp_line (start 12.64 8) (end 6.64 8) (layer "F.SilkS") (width 0.12) (tstamp 74002e44-309e-4ff8-a9c9-16393771aba0))
  (fp_line (start 1.042929 10.54) (end 1.497071 10.54) (layer "F.SilkS") (width 0.12) (tstamp 79e00bdd-6dbc-47b6-afea-9a09ff8e758e))
  (fp_line (start 12.64 4.7) (end 12.64 5.46) (layer "F.SilkS") (width 0.12) (tstamp 7aa42aba-7b09-454f-96b1-65711cacc1af))
  (fp_line (start 1.042929 8) (end 1.497071 8) (layer "F.SilkS") (width 0.12) (tstamp 7f1ddd75-efb3-47f7-b5d8-df19f1e9943b))
  (fp_line (start 6.64 -0.38) (end 12.64 -0.38) (layer "F.SilkS") (width 0.12) (tstamp 7f79678e-3f74-4468-a5c6-e7a18ed25795))
  (fp_line (start 6.64 14.03) (end 6.64 -1.33) (layer "F.SilkS") (width 0.12) (tstamp 8dde90bc-868c-4f45-9e2b-946285fba2c3))
  (fp_line (start 3.582929 7.24) (end 3.98 7.24) (layer "F.SilkS") (width 0.12) (tstamp 932b6943-bd32-4be5-b429-4b75bf14bdcf))
  (fp_line (start 6.64 9.78) (end 12.64 9.78) (layer "F.SilkS") (width 0.12) (tstamp 932e6b7f-7191-4aba-b9db-f40ae6daa11d))
  (fp_line (start 3.98 6.35) (end 6.64 6.35) (layer "F.SilkS") (width 0.12) (tstamp 9599ec09-5204-4120-b74f-b57ae1d065ae))
  (fp_line (start 3.582929 -0.38) (end 3.98 -0.38) (layer "F.SilkS") (width 0.12) (tstamp 95f773d9-afb3-4ff4-860b-dfc244473e9d))
  (fp_line (start 1.042929 13.08) (end 1.497071 13.08) (layer "F.SilkS") (width 0.12) (tstamp 99e03de5-1d23-4766-9d6c-82bfd1e41b3d))
  (fp_line (start 3.98 -1.33) (end 3.98 14.03) (layer "F.SilkS") (width 0.12) (tstamp 9bfd5dac-be2a-4830-8448-2c8c9f5725cf))
  (fp_line (start 3.582929 12.32) (end 3.98 12.32) (layer "F.SilkS") (width 0.12) (tstamp 9c327e0c-42da-4038-82cd-d02443565fa0))
  (fp_line (start 3.98 3.81) (end 6.64 3.81) (layer "F.SilkS") (width 0.12) (tstamp a4be60ac-6dfc-4193-92d2-943921d3f613))
  (fp_line (start 12.64 0.38) (end 6.64 0.38) (layer "F.SilkS") (width 0.12) (tstamp a6fabc5a-3909-45b5-853a-f4abda348135))
  (fp_line (start 6.64 2.16) (end 12.64 2.16) (layer "F.SilkS") (width 0.12) (tstamp a73cc35e-0cef-4cc2-969c-fa7d600903de))
  (fp_line (start 1.042929 2.16) (end 1.497071 2.16) (layer "F.SilkS") (width 0.12) (tstamp ab3b4a53-037a-4e33-a961-c26ae78815a5))
  (fp_line (start 12.64 2.16) (end 12.64 2.92) (layer "F.SilkS") (width 0.12) (tstamp ad2a262f-4fa5-4c55-986b-005214332707))
  (fp_line (start 1.042929 7.24) (end 1.497071 7.24) (layer "F.SilkS") (width 0.12) (tstamp b005657b-51e5-41f6-9f46-1bfafe0a054f))
  (fp_line (start 1.042929 9.78) (end 1.497071 9.78) (layer "F.SilkS") (width 0.12) (tstamp b01f50e4-21ee-4b59-bb2f-d73ea5c6dfe8))
  (fp_line (start 12.64 -0.38) (end 12.64 0.38) (layer "F.SilkS") (width 0.12) (tstamp b0c9909f-1f66-498d-ba34-8ba9ed1f7a8f))
  (fp_line (start 3.582929 2.16) (end 3.98 2.16) (layer "F.SilkS") (width 0.12) (tstamp b6b99e81-b813-4855-97e2-ca5f2f48249b))
  (fp_line (start 6.64 12.32) (end 12.64 12.32) (layer "F.SilkS") (width 0.12) (tstamp b97bea68-420c-4291-bbe9-f76255547335))
  (fp_line (start 6.64 0.28) (end 12.64 0.28) (layer "F.SilkS") (width 0.12) (tstamp c4aa238b-198e-4617-813c-05235172e486))
  (fp_line (start 6.64 4.7) (end 12.64 4.7) (layer "F.SilkS") (width 0.12) (tstamp c64614ac-c486-48ac-ba41-23ad60000d79))
  (fp_line (start 1.042929 2.92) (end 1.497071 2.92) (layer "F.SilkS") (width 0.12) (tstamp c85e4eb6-86f9-4535-a2a1-bea27263e759))
  (fp_line (start 6.64 -0.2) (end 12.64 -0.2) (layer "F.SilkS") (width 0.12) (tstamp d8fe9b29-bf5e-4848-b9f2-2abf1f819a44))
  (fp_line (start 3.582929 10.54) (end 3.98 10.54) (layer "F.SilkS") (width 0.12) (tstamp e2c5da9e-748e-4317-9eab-1d9be8166abd))
  (fp_line (start 3.582929 8) (end 3.98 8) (layer "F.SilkS") (width 0.12) (tstamp ee1bde15-1216-4c3c-ab19-d794eae036d9))
  (fp_line (start 1.042929 5.46) (end 1.497071 5.46) (layer "F.SilkS") (width 0.12) (tstamp f0256e12-45e9-4546-a881-21526ab002eb))
  (fp_line (start 3.98 14.03) (end 6.64 14.03) (layer "F.SilkS") (width 0.12) (tstamp f3c2303b-7a5d-4300-8fe1-85c5bbb12a22))
  (fp_line (start -1.27 -1.27) (end 0 -1.27) (layer "F.SilkS") (width 0.12) (tstamp fc53672c-83ea-4dcd-8aa1-9c24d0997770))
  (fp_line (start 13.1 14.5) (end 13.1 -1.8) (layer "F.CrtYd") (width 0.05) (tstamp 1bcaaab1-5dbc-44f8-b39d-608105ab87fa))
  (fp_line (start -1.8 -1.8) (end -1.8 14.5) (layer "F.CrtYd") (width 0.05) (tstamp de0c40e2-4337-4b6c-af5d-0a73ed4a1f0e))
  (fp_line (start 13.1 -1.8) (end -1.8 -1.8) (layer "F.CrtYd") (width 0.05) (tstamp f32e0599-f1f7-4cfa-8a92-03ce4d49bcd5))
  (fp_line (start -1.8 14.5) (end 13.1 14.5) (layer "F.CrtYd") (width 0.05) (tstamp ff691c4b-7613-4cc2-bf36-cd888e26df32))
  (fp_line (start 12.58 12.38) (end 12.58 13.02) (layer "F.Fab") (width 0.1) (tstamp 01ab8dc3-bcf1-489d-bd22-a4af9fe2d91e))
  (fp_line (start 6.58 12.38) (end 12.58 12.38) (layer "F.Fab") (width 0.1) (tstamp 03cd164f-d835-42b1-9d3d-9234ce219c84))
  (fp_line (start -0.32 7.94) (end 4.04 7.94) (layer "F.Fab") (width 0.1) (tstamp 14b07f96-95cd-42ee-b655-ba10eca83e18))
  (fp_line (start -0.32 10.48) (end 4.04 10.48) (layer "F.Fab") (width 0.1) (tstamp 17ccbdb0-fce9-4419-8d34-d5822224fb98))
  (fp_line (start -0.32 7.3) (end -0.32 7.94) (layer "F.Fab") (width 0.1) (tstamp 20d35427-40fd-47fa-bd26-6737f8220344))
  (fp_line (start -0.32 12.38) (end 4.04 12.38) (layer "F.Fab") (width 0.1) (tstamp 211f0e46-36c4-4172-b470-b450f2328aa8))
  (fp_line (start 12.58 4.76) (end 12.58 5.4) (layer "F.Fab") (width 0.1) (tstamp 292671fd-baef-4bb6-a5ae-3ce86ac32f61))
  (fp_line (start -0.32 -0.32) (end -0.32 0.32) (layer "F.Fab") (width 0.1) (tstamp 2f2d8919-b5fb-444f-934e-41bfb9034fd3))
  (fp_line (start 12.58 9.84) (end 12.58 10.48) (layer "F.Fab") (width 0.1) (tstamp 323a279d-966e-457c-ae51-e817f957c35f))
  (fp_line (start 6.58 0.32) (end 12.58 0.32) (layer "F.Fab") (width 0.1) (tstamp 32b4e5ba-dcc0-4804-a31c-60f209e34614))
  (fp_line (start 12.58 7.3) (end 12.58 7.94) (layer "F.Fab") (width 0.1) (tstamp 49a46f48-0aec-4351-9bbc-7fd2b66a56ac))
  (fp_line (start -0.32 9.84) (end -0.32 10.48) (layer "F.Fab") (width 0.1) (tstamp 4c93a588-0664-4594-b96a-d13e167ef046))
  (fp_line (start -0.32 7.3) (end 4.04 7.3) (layer "F.Fab") (width 0.1) (tstamp 4daa302b-5706-41fb-8287-2ce93e0a3cf3))
  (fp_line (start -0.32 13.02) (end 4.04 13.02) (layer "F.Fab") (width 0.1) (tstamp 50957153-6322-48e3-b9a6-2f686ed27e12))
  (fp_line (start -0.32 4.76) (end -0.32 5.4) (layer "F.Fab") (width 0.1) (tstamp 53fb061e-23ae-4dee-b026-ddeaf3684aff))
  (fp_line (start 4.675 -1.27) (end 6.58 -1.27) (layer "F.Fab") (width 0.1) (tstamp 64793ad8-428a-436b-abb7-37120a6eaca1))
  (fp_line (start 6.58 2.86) (end 12.58 2.86) (layer "F.Fab") (width 0.1) (tstamp 65c06a26-5cbd-40e9-8361-e60735033b69))
  (fp_line (start 6.58 10.48) (end 12.58 10.48) (layer "F.Fab") (width 0.1) (tstamp 67fabe84-224c-4d26-9e8f-25c9f5ba6110))
  (fp_line (start 6.58 13.02) (end 12.58 13.02) (layer "F.Fab") (width 0.1) (tstamp 693b88aa-8646-4714-b5ff-66ca544a722f))
  (fp_line (start -0.32 0.32) (end 4.04 0.32) (layer "F.Fab") (width 0.1) (tstamp 6d9dcca0-fb34-46e4-9aa0-6c710de86a65))
  (fp_line (start 6.58 9.84) (end 12.58 9.84) (layer "F.Fab") (width 0.1) (tstamp 6f9044c2-afca-41d6-8641-193a057c12f5))
  (fp_line (start 12.58 2.22) (end 12.58 2.86) (layer "F.Fab") (width 0.1) (tstamp 731be5f6-14fc-42c7-a9da-301dab8140df))
  (fp_line (start 6.58 7.94) (end 12.58 7.94) (layer "F.Fab") (width 0.1) (tstamp 74834f7e-04b8-4d7d-bf28-737625df16b5))
  (fp_line (start -0.32 4.76) (end 4.04 4.76) (layer "F.Fab") (width 0.1) (tstamp 88b812f9-906d-4d25-b449-e495df63212e))
  (fp_line (start -0.32 9.84) (end 4.04 9.84) (layer "F.Fab") (width 0.1) (tstamp 95e83342-5803-4a19-b248-c0194806eaae))
  (fp_line (start -0.32 2.22) (end -0.32 2.86) (layer "F.Fab") (width 0.1) (tstamp 9b4f83de-d359-435d-ad83-b80a946fd3fb))
  (fp_line (start 6.58 13.97) (end 4.04 13.97) (layer "F.Fab") (width 0.1) (tstamp a1a7d1d7-5601-4e61-b3b1-35af6a1c6214))
  (fp_line (start -0.32 2.22) (end 4.04 2.22) (layer "F.Fab") (width 0.1) (tstamp adb3eb12-62c1-4b25-ad8e-d0faa5a1bed9))
  (fp_line (start -0.32 -0.32) (end 4.04 -0.32) (layer "F.Fab") (width 0.1) (tstamp b35e8afd-ddef-4f62-bcbe-94b462da0571))
  (fp_line (start 4.04 -0.635) (end 4.675 -1.27) (layer "F.Fab") (width 0.1) (tstamp bf1ea853-61b3-4b80-809f-ace2fcb77e2f))
  (fp_line (start 6.58 4.76) (end 12.58 4.76) (layer "F.Fab") (width 0.1) (tstamp d7e4bc10-dd46-4184-b25c-7ddc471c0307))
  (fp_line (start -0.32 12.38) (end -0.32 13.02) (layer "F.Fab") (width 0.1) (tstamp daad8bc7-f473-4ebb-b199-e5118e4b9493))
  (fp_line (start -0.32 5.4) (end 4.04 5.4) (layer "F.Fab") (width 0.1) (tstamp e19d1b68-fabd-413e-b5d1-fdf93b42dbf6))
  (fp_line (start -0.32 2.86) (end 4.04 2.86) (layer "F.Fab") (width 0.1) (tstamp e20a1f19-bddf-4962-9197-b5b667e9b617))
  (fp_line (start 6.58 7.3) (end 12.58 7.3) (layer "F.Fab") (width 0.1) (tstamp e803779d-897c-4575-b60b-bf1a4648c170))
  (fp_line (start 12.58 -0.32) (end 12.58 0.32) (layer "F.Fab") (width 0.1) (tstamp ecf18087-9287-424d-9a4e-26c5274cd781))
  (fp_line (start 6.58 2.22) (end 12.58 2.22) (layer "F.Fab") (width 0.1) (tstamp ed4bd1d5-6499-42ba-b797-1d2d56f036a0))
  (fp_line (start 6.58 5.4) (end 12.58 5.4) (layer "F.Fab") (width 0.1) (tstamp ed5ea297-dc3f-4063-8cbe-f4a03a3a3547))
  (fp_line (start 6.58 -0.32) (end 12.58 -0.32) (layer "F.Fab") (width 0.1) (tstamp fa7dd65f-4c4d-43b6-85ee-0d9f8e7e8e08))
  (fp_line (start 4.04 13.97) (end 4.04 -0.635) (layer "F.Fab") (width 0.1) (tstamp fcf359c1-546b-4f79-a9d3-c286f473c095))
  (fp_line (start 6.58 -1.27) (end 6.58 13.97) (layer "F.Fab") (width 0.1) (tstamp fdae4219-c0e4-4bae-bd4d-f980854d624e))
  (pad "1" thru_hole rect (at 0 0) (size 1.7 1.7) (drill 1) (layers *.Cu *.Mask) (tstamp 52b5e99b-1470-4c40-8f75-457f18a0cbd3))
  (pad "2" thru_hole oval (at 2.54 0) (size 1.7 1.7) (drill 1) (layers *.Cu *.Mask) (tstamp af2f99fc-4833-4012-bb77-def45c8e42f8))
  (pad "3" thru_hole oval (at 0 2.54) (size 1.7 1.7) (drill 1) (layers *.Cu *.Mask) (tstamp f8dc38c0-a0a6-40dc-912e-a3119109d693))
  (pad "4" thru_hole oval (at 2.54 2.54) (size 1.7 1.7) (drill 1) (layers *.Cu *.Mask) (tstamp 67647834-ba36-4c75-a773-01e9972d6de9))
  (pad "5" thru_hole oval (at 0 5.08) (size 1.7 1.7) (drill 1) (layers *.Cu *.Mask) (tstamp 19d2fcfc-4ce4-4934-8cd2-83d07daffe9a))
  (pad "6" thru_hole oval (at 2.54 5.08) (size 1.7 1.7) (drill 1) (layers *.Cu *.Mask) (tstamp 7753572f-6e22-418b-8519-fac2e99d63c6))
  (pad "7" thru_hole oval (at 0 7.62) (size 1.7 1.7) (drill 1) (layers *.Cu *.Mask) (tstamp e6cf839e-9e25-4e14-bf73-9fc8534f34ce))
  (pad "8" thru_hole oval (at 2.54 7.62) (size 1.7 1.7) (drill 1) (layers *.Cu *.Mask) (tstamp 49dff8d9-d1f0-437d-b128-9fac7966b220))
  (pad "9" thru_hole oval (at 0 10.16) (size 1.7 1.7) (drill 1) (layers *.Cu *.Mask) (tstamp e3ad1118-b510-4a7c-a3c6-16b7eb6ee00b))
  (pad "10" thru_hole oval (at 2.54 10.16) (size 1.7 1.7) (drill 1) (layers *.Cu *.Mask) (tstamp c60c5972-5170-4b36-939d-8f558e71ab6a))
  (pad "11" thru_hole oval (at 0 12.7) (size 1.7 1.7) (drill 1) (layers *.Cu *.Mask) (tstamp dd1428c7-f19c-4509-a40d-155d67a699f2))
  (pad "12" thru_hole oval (at 2.54 12.7) (size 1.7 1.7) (drill 1) (layers *.Cu *.Mask) (tstamp 1858e52f-c46e-4e54-9c2b-ab728fff1af2))
  (model "${KICADLIB}/model/connector/PinHeader_2x06_P2.54mm_Horizontal.step"
    (offset (xyz 0 0 0))
    (scale (xyz 1 1 1))
    (rotate (xyz 0 0 0))
  )
)
