(footprint "NGFF_M.2_22xx_AE" (version 20211014) (generator pcbnew)
  (layer "F.Cu")
  (tedit 0)
  (attr exclude_from_bom)
  (fp_text reference "REF**" (at 0 4.1 unlocked) (layer "F.SilkS")
    (effects (font (size 1 1) (thickness 0.15)))
    (tstamp 29886cdb-808f-4bb9-8f9a-2b93957bcc98)
  )
  (fp_text value "NGFF_M.2_22xx_AE" (at 0 1 unlocked) (layer "F.Fab") hide
    (effects (font (size 1 1) (thickness 0.15)))
    (tstamp 2f6e3666-367c-4969-ad80-1eba32d8e4fc)
  )
  (fp_text user "2" (at -9.15 4.5 unlocked) (layer "B.SilkS")
    (effects (font (size 0.8 0.8) (thickness 0.15) italic) (justify mirror))
    (tstamp 0d1f4285-609d-4d2d-ac60-e71e3e28b9bf)
  )
  (fp_text user "74" (at 9.075 4.525 unlocked) (layer "B.SilkS")
    (effects (font (size 0.8 0.8) (thickness 0.15) italic) (justify mirror))
    (tstamp 9004a6d5-e6ce-4b71-857b-26f0b3eb1c9f)
  )
  (fp_text user "1" (at -9.25 2.9 unlocked) (layer "F.SilkS")
    (effects (font (size 0.8 0.8) (thickness 0.15) italic))
    (tstamp 57ac6035-cf40-46b5-8222-9db5ba04f597)
  )
  (fp_text user "75" (at 9.1 2.95 unlocked) (layer "F.SilkS")
    (effects (font (size 0.8 0.8) (thickness 0.15) italic))
    (tstamp 6e106836-90fb-4b81-bf6a-6e6931bb6893)
  )
  (fp_text user "A" (at -6.6 4.1 unlocked) (layer "F.SilkS")
    (effects (font (size 1 1) (thickness 0.15)))
    (tstamp ce701396-0d38-45af-a2f8-d9ad8c13f8c6)
  )
  (fp_text user "E" (at -2.625 4.1 unlocked) (layer "F.SilkS")
    (effects (font (size 1 1) (thickness 0.15)))
    (tstamp fdb4b7e3-fc8f-4c86-a204-1a812077ad1f)
  )
  (fp_text user "110" (at 2 111.5 unlocked) (layer "Dwgs.User")
    (effects (font (size 1 1) (thickness 0.15)))
    (tstamp 1372d651-6f12-4023-8372-68f805d8d1fd)
  )
  (fp_text user "30" (at 2 31.5 unlocked) (layer "Dwgs.User")
    (effects (font (size 1 1) (thickness 0.15)))
    (tstamp 209eb513-9df3-4369-bca6-fd50b740592a)
  )
  (fp_text user "80" (at 2 81.5 unlocked) (layer "Dwgs.User")
    (effects (font (size 1 1) (thickness 0.15)))
    (tstamp 26a2fcbf-2600-4de7-a37f-0f3a1445fd73)
  )
  (fp_text user "16" (at 9 28 90 unlocked) (layer "Dwgs.User")
    (effects (font (size 1 1) (thickness 0.15)))
    (tstamp 37015a6c-9543-43af-b48e-21789d4ce367)
  )
  (fp_text user "42" (at 2 43.5 unlocked) (layer "Dwgs.User")
    (effects (font (size 1 1) (thickness 0.15)))
    (tstamp 46407137-27d0-4b77-8c14-91dbcfae775b)
  )
  (fp_text user "30" (at 16 28 90 unlocked) (layer "Dwgs.User")
    (effects (font (size 1 1) (thickness 0.15)))
    (tstamp 6180385b-baf0-40a1-9baa-3616f80f4b23)
  )
  (fp_text user "22" (at 12 28 90 unlocked) (layer "Dwgs.User")
    (effects (font (size 1 1) (thickness 0.15)))
    (tstamp 769d8f33-daee-48fc-bb77-55b728609cea)
  )
  (fp_text user "60" (at 2 61.5 unlocked) (layer "Dwgs.User")
    (effects (font (size 1 1) (thickness 0.15)))
    (tstamp 8fe1beea-b645-44fa-b09b-83049566ca8f)
  )
  (fp_text user "stackup must total 0.8mm" (at 0 4.025 unlocked) (layer "Cmts.User")
    (effects (font (size 1 1) (thickness 0.15)))
    (tstamp 4949a8e4-b594-44b8-96c5-2af0db023c44)
  )
  (fp_text user "${REFERENCE}" (at 0 1.775 unlocked) (layer "B.Fab")
    (effects (font (size 1 1) (thickness 0.15)) (justify mirror))
    (tstamp 28e5b631-0a43-4c93-bbae-3ef643482259)
  )
  (fp_text user "bevel 20° 0.35mm" (at 0 -1.1 unlocked) (layer "F.Fab")
    (effects (font (size 1 1) (thickness 0.15)))
    (tstamp 9a0f4fac-cc28-4e27-ac7c-7758aa8ef1bf)
  )
  (fp_text user "${REFERENCE}" (at 0 1.8 unlocked) (layer "F.Fab")
    (effects (font (size 1 1) (thickness 0.15)))
    (tstamp c503c434-9e89-4fc4-92cb-c7b51cb6e8e8)
  )
  (fp_line (start 3 4.025) (end 3 4.425) (layer "B.SilkS") (width 0.1) (tstamp 0492dc43-f867-490d-b2d5-f32947267db1))
  (fp_line (start 0.5 4.025) (end 0.5 4.425) (layer "B.SilkS") (width 0.1) (tstamp 1a7353a5-a805-41a4-8e71-a1bbfa2a307a))
  (fp_line (start -4.5 4.025) (end -4.5 4.425) (layer "B.SilkS") (width 0.1) (tstamp 381691e4-b9f4-408f-978c-50a69497424f))
  (fp_line (start 5.5 4.025) (end 5.5 4.425) (layer "B.SilkS") (width 0.1) (tstamp 939f2a6d-4d4a-43b1-aab4-5d13fab63abb))
  (fp_line (start 8 4.025) (end 8 4.425) (layer "B.SilkS") (width 0.1) (tstamp ee7381f8-4a48-4171-9636-dbb6cb176ec4))
  (fp_line (start -4.25 2.825) (end -4.25 2.425) (layer "F.SilkS") (width 0.1) (tstamp 075efb08-205d-4b86-a6ef-0f6a33696217))
  (fp_line (start 8.25 2.825) (end 8.25 2.425) (layer "F.SilkS") (width 0.1) (tstamp 354349a3-4906-455f-b763-5f435da29270))
  (fp_line (start 3.25 2.825) (end 3.25 2.425) (layer "F.SilkS") (width 0.1) (tstamp 39285d96-7071-400c-87a2-1dfd0dbd986b))
  (fp_line (start 0.75 2.825) (end 0.75 2.425) (layer "F.SilkS") (width 0.1) (tstamp db0e891d-473b-45ca-969f-19821e36e427))
  (fp_line (start 5.75 2.825) (end 5.75 2.425) (layer "F.SilkS") (width 0.1) (tstamp e520afa1-7327-49c8-b200-9bab527d3561))
  (fp_line (start 0 30.775) (end 0 28.775) (layer "Dwgs.User") (width 0.1) (tstamp 56a1891c-c093-445e-aea3-fb821e0c0dd0))
  (fp_line (start 0 60.775) (end 0 58.775) (layer "Dwgs.User") (width 0.1) (tstamp 5bf48357-0a3e-4d79-812d-50d657ed354e))
  (fp_line (start 0 80.775) (end 0 78.775) (layer "Dwgs.User") (width 0.1) (tstamp adbcacb0-5e2d-4cbe-9183-00312eb25f69))
  (fp_line (start 0 110.775) (end 0 108.775) (layer "Dwgs.User") (width 0.1) (tstamp dcb9e3e0-de24-4093-b0aa-5c7cbd74e55c))
  (fp_line (start 0 42.775) (end 0 40.775) (layer "Dwgs.User") (width 0.1) (tstamp df467aa1-02aa-4e77-a844-c35af80d2cbb))
  (fp_rect (start -8 -0.225) (end 8 29.775) (layer "Dwgs.User") (width 0.12) (fill none) (tstamp 110ee6a7-dea5-45fb-8da3-03981cda0e83))
  (fp_rect (start -11 -0.225) (end 11 41.775) (layer "Dwgs.User") (width 0.12) (fill none) (tstamp 27b6e89e-d369-41e5-925a-dd036edef604))
  (fp_rect (start -11 -0.225) (end 11 109.775) (layer "Dwgs.User") (width 0.12) (fill none) (tstamp 35fc4ac8-bc60-49e7-ad07-f69894b4d917))
  (fp_rect (start -11 -0.225) (end 11 79.775) (layer "Dwgs.User") (width 0.12) (fill none) (tstamp 4e2e158c-5072-4c33-b980-7d9ff0509a36))
  (fp_rect (start -11 -0.225) (end 11 59.775) (layer "Dwgs.User") (width 0.12) (fill none) (tstamp 4f0029b4-90a6-49e2-9319-492247b25e22))
  (fp_rect (start -15 -0.225) (end 15 29.775) (layer "Dwgs.User") (width 0.12) (fill none) (tstamp 65643666-3c58-4783-8e36-5a3ab8848f6d))
  (fp_rect (start -11 -0.225) (end 11 29.775) (layer "Dwgs.User") (width 0.12) (fill none) (tstamp 77861d76-7ec5-4be4-8b5c-925dea83d9d0))
  (fp_rect (start -15 -0.225) (end 15 41.775) (layer "Dwgs.User") (width 0.12) (fill none) (tstamp a6e7ba0a-4bec-429a-9b8a-6fffcc221be3))
  (fp_arc (start -1.75 29.775) (mid 0 28.025) (end 1.75 29.775) (layer "Dwgs.User") (width 0.1) (tstamp 8aaf5486-5b91-410c-80ea-1c40813c31c1))
  (fp_arc (start -2.75 29.775) (mid 0 27.025) (end 2.75 29.775) (layer "Dwgs.User") (width 0.1) (tstamp 9b11f82e-71e1-4270-8f8b-4688f549286c))
  (fp_circle (center 0 41.775) (end 1 41.775) (layer "Dwgs.User") (width 0.1) (fill none) (tstamp 25f965f3-9432-4c25-854e-d5853602abb8))
  (fp_circle (center 0 79.775) (end 1 79.775) (layer "Dwgs.User") (width 0.1) (fill none) (tstamp 5452548f-9d3e-4097-81c3-deabd3f86a9f))
  (fp_circle (center 0 109.775) (end 1 109.775) (layer "Dwgs.User") (width 0.1) (fill none) (tstamp 6c2c4639-9397-4dbd-9516-0032fbc6f554))
  (fp_circle (center 0 59.775) (end 1 59.775) (layer "Dwgs.User") (width 0.1) (fill none) (tstamp d3b743c2-e5e8-4462-9359-2544503ae9a2))
  (fp_circle (center 0 29.775) (end 1 29.775) (layer "Dwgs.User") (width 0.1) (fill none) (tstamp dcc19298-1a87-4b21-96f3-1b611fb4f667))
  (fp_line (start -6.025 2.675) (end -6.025 -0.225) (layer "Edge.Cuts") (width 0.05) (tstamp 060a6378-246e-4c12-b68d-9637565eb92c))
  (fp_line (start -7.225 -0.225) (end -9.925 -0.225) (layer "Edge.Cuts") (width 0.05) (tstamp 0668308d-a00f-4204-88c7-041e3a712b68))
  (fp_line (start -2.025 2.675) (end -2.025 -0.225) (layer "Edge.Cuts") (width 0.05) (tstamp 0d9f93a5-2479-4bf5-8176-32d8b199e365))
  (fp_line (start -7.225 2.675) (end -7.225 -0.225) (layer "Edge.Cuts") (width 0.05) (tstamp 24aee96d-1238-4bb0-8361-d574c58ea0b9))
  (fp_line (start -9.925 -0.225) (end -9.924264 3.175736) (layer "Edge.Cuts") (width 0.05) (tstamp 316de160-29f0-4198-8e22-3ed995579592))
  (fp_line (start -11 29.775) (end -1.75 29.775) (layer "Edge.Cuts") (width 0.05) (tstamp 331c2968-8e46-484a-9d11-41c3d1218976))
  (fp_line (start 1.75 29.775) (end 11 29.775) (layer "Edge.Cuts") (width 0.05) (tstamp 44f8a0ce-480e-4f61-ad4f-a4fbd38084a2))
  (fp_line (start 9.925 -0.225) (end 9.924264 3.175736) (layer "Edge.Cuts") (width 0.05) (tstamp 61920a52-3378-4b48-ad21-4057a03e4031))
  (fp_line (start -2.025 -0.225) (end 9.925 -0.225) (layer "Edge.Cuts") (width 0.05) (tstamp 696f54c0-5536-4479-a9b4-875727ec4797))
  (fp_line (start -3.225 2.675) (end -3.225 -0.225) (layer "Edge.Cuts") (width 0.05) (tstamp 6ba5ea68-b60d-40ac-8b94-437a07c5d5cb))
  (fp_line (start -11 3.775) (end -11 29.775) (layer "Edge.Cuts") (width 0.05) (tstamp 6ec69f0c-0e58-43fc-9d7d-e6747a12bf75))
  (fp_line (start -11 3.775) (end -10.524264 3.775736) (layer "Edge.Cuts") (width 0.05) (tstamp 7ad3e10f-8078-4bde-a3eb-d7606bc62d24))
  (fp_line (start -3.225 -0.225) (end -6.025 -0.225) (layer "Edge.Cuts") (width 0.05) (tstamp 9e476cc0-1044-4171-9cb4-e6c20d379a75))
  (fp_line (start 11 3.775) (end 10.524264 3.775736) (layer "Edge.Cuts") (width 0.05) (tstamp d809ac42-164b-47b6-b0ef-c51f906ec8b1))
  (fp_line (start 11 3.775) (end 11 29.775) (layer "Edge.Cuts") (width 0.05) (tstamp eb1629aa-53c5-4b71-a271-12b7283fe38d))
  (fp_arc (start 10.524264 3.775736) (mid 10.1 3.6) (end 9.924264 3.175736) (layer "Edge.Cuts") (width 0.05) (tstamp 137a5212-ed3d-45b3-add3-3723b2f7ceb8))
  (fp_arc (start -9.924264 3.175736) (mid -10.1 3.6) (end -10.524264 3.775736) (layer "Edge.Cuts") (width 0.05) (tstamp 1ed5811f-8712-4743-9b16-55ea96d2f234))
  (fp_arc (start -1.75 29.775) (mid 0 28.025) (end 1.75 29.775) (layer "Edge.Cuts") (width 0.05) (tstamp 2f00d12a-42f2-4c1f-a630-eb288723acab))
  (fp_arc (start -6.025 2.675) (mid -6.625 3.275) (end -7.225 2.675) (layer "Edge.Cuts") (width 0.05) (tstamp b20052c9-3c30-4459-b2aa-094c9d3a48d6))
  (fp_arc (start -2.025 2.675) (mid -2.625 3.275) (end -3.225 2.675) (layer "Edge.Cuts") (width 0.05) (tstamp d489d673-4207-467e-87b6-a05e66b644cb))
  (fp_rect (start -11 -0.225) (end 11 4.975) (layer "B.CrtYd") (width 0.05) (fill none) (tstamp 45cb1492-f9ef-42a7-85bf-6b3e4445a92e))
  (fp_rect (start -11 -0.225) (end 11 3.775) (layer "F.CrtYd") (width 0.05) (fill none) (tstamp f2fad3e5-61a8-440e-84a7-0685491c8a21))
  (fp_poly (pts
      (xy -9.925 3.775)
      (xy 9.925 3.775)
      (xy 9.925 -0.225)
      (xy -9.175 -0.225)
      (xy -9.925 0.525)
    ) (layer "B.Fab") (width 0.1) (fill none) (tstamp eeceb1cc-0f35-4dcd-93bc-a77c6d2b89c9))
  (fp_rect (start -9.925 -0.225) (end 9.925 0.125) (layer "F.Fab") (width 0.1) (fill solid) (tstamp 3d2c0b56-a3c8-4b5d-a95b-2b50b6df0057))
  (fp_poly (pts
      (xy 9.925 3.775)
      (xy -9.925 3.775)
      (xy -9.925 0.525)
      (xy -9.175 -0.225)
      (xy 9.925 -0.225)
    ) (layer "F.Fab") (width 0.1) (fill none) (tstamp 81be951c-bea3-49c2-a229-563da72da9b9))
  (pad "1" smd rect (at -9.25 1.275) (size 0.35 2) (layers "F.Cu" "F.Mask") (tstamp 92a3c526-311f-477e-b44a-f891620033b9))
  (pad "2" smd rect (at -9 1.525) (size 0.35 2.5) (layers "B.Cu" "B.Mask") (tstamp c8ffaf9b-1bb9-4b26-9262-caa33a1c95e2))
  (pad "3" smd rect (at -8.75 1.275) (size 0.35 2) (layers "F.Cu" "F.Mask") (tstamp 8400ea37-97fd-4c78-8c53-9f506a25df00))
  (pad "4" smd rect (at -8.5 1.525) (size 0.35 2.5) (layers "B.Cu" "B.Mask") (tstamp 271c14d2-42e9-4921-bfd0-bd9f622be9c9))
  (pad "5" smd rect (at -8.25 1.275) (size 0.35 2) (layers "F.Cu" "F.Mask") (tstamp 39f1d5fc-c97f-445a-b2ce-5b0b8965a82c))
  (pad "6" smd rect (at -8 1.525) (size 0.35 2.5) (layers "B.Cu" "B.Mask") (tstamp 7c90c6d1-3f66-43c9-9aa4-c9d880e46d92))
  (pad "7" smd rect (at -7.75 1.275) (size 0.35 2) (layers "F.Cu" "F.Mask") (tstamp 37e40b62-d973-4833-8d12-229db8a0d8c0))
  (pad "16" smd rect (at -5.5 1.525) (size 0.35 2.5) (layers "B.Cu" "B.Mask") (tstamp 7df91acc-0e17-4f1e-af8f-49515d49b0cd))
  (pad "17" smd rect (at -5.25 1.275) (size 0.35 2) (layers "F.Cu" "F.Mask") (tstamp 638cb9c4-076a-46ec-b86e-e0b28c632903))
  (pad "18" smd rect (at -5 1.525) (size 0.35 2.5) (layers "B.Cu" "B.Mask") (tstamp 596f1908-2840-4137-b404-1dec54302154))
  (pad "19" smd rect (at -4.75 1.275) (size 0.35 2) (layers "F.Cu" "F.Mask") (tstamp 922406fc-1ec7-4e51-bad7-4e19f0f3b9f7))
  (pad "20" smd rect (at -4.5 1.525) (size 0.35 2.5) (layers "B.Cu" "B.Mask") (tstamp 1d31dab4-4fd1-4646-a6ca-7deec5990f6e))
  (pad "21" smd rect (at -4.25 1.275) (size 0.35 2) (layers "F.Cu" "F.Mask") (tstamp 85457314-7d81-42e5-a03f-d2ce545298aa))
  (pad "22" smd rect (at -4 1.525) (size 0.35 2.5) (layers "B.Cu" "B.Mask") (tstamp 1572aec3-644c-4a23-b579-5802d83b74e9))
  (pad "23" smd rect (at -3.75 1.275) (size 0.35 2) (layers "F.Cu" "F.Mask") (tstamp 52945829-c6b4-4ee4-9c4f-e6de4146c66d))
  (pad "32" smd rect (at -1.5 1.525) (size 0.35 2.5) (layers "B.Cu" "B.Mask") (tstamp d8c43942-e3fb-48bc-a0c4-98a3eb403842))
  (pad "33" smd rect (at -1.25 1.275) (size 0.35 2) (layers "F.Cu" "F.Mask") (tstamp ee0b47a6-446a-435a-9f78-970e73f6a15d))
  (pad "34" smd rect (at -1 1.525) (size 0.35 2.5) (layers "B.Cu" "B.Mask") (tstamp 2105d9bc-c54e-4649-8715-f202c8288e65))
  (pad "35" smd rect (at -0.75 1.275) (size 0.35 2) (layers "F.Cu" "F.Mask") (tstamp c87aa427-2525-4c7d-b4a4-c4910d063c5a))
  (pad "36" smd rect (at -0.5 1.525) (size 0.35 2.5) (layers "B.Cu" "B.Mask") (tstamp 2bacbb51-3fff-4f16-b30b-bdb6ef8cb7d7))
  (pad "37" smd rect (at -0.25 1.275) (size 0.35 2) (layers "F.Cu" "F.Mask") (tstamp d55f6d0a-f4fb-4e43-b41a-2cd78c61b063))
  (pad "38" smd rect (at 0 1.525) (size 0.35 2.5) (layers "B.Cu" "B.Mask") (tstamp a64da9e2-39b1-4135-aec1-2777510c5139))
  (pad "39" smd rect (at 0.25 1.275) (size 0.35 2) (layers "F.Cu" "F.Mask") (tstamp 56b533ed-cf54-46d4-9e2d-a6f18460b9a1))
  (pad "40" smd rect (at 0.5 1.525) (size 0.35 2.5) (layers "B.Cu" "B.Mask") (tstamp 88b408bc-c9a9-4726-b73f-72696a01d384))
  (pad "41" smd rect (at 0.75 1.275) (size 0.35 2) (layers "F.Cu" "F.Mask") (tstamp e9502165-c057-447d-891a-6fbd022ec8d4))
  (pad "42" smd rect (at 1 1.525) (size 0.35 2.5) (layers "B.Cu" "B.Mask") (tstamp 6d214fe5-7ed2-49dd-90bb-c48c8a9eae1e))
  (pad "43" smd rect (at 1.25 1.275) (size 0.35 2) (layers "F.Cu" "F.Mask") (tstamp 04d9aef0-6feb-4893-b7c9-46ab0d77df50))
  (pad "44" smd rect (at 1.5 1.525) (size 0.35 2.5) (layers "B.Cu" "B.Mask") (tstamp 7b66b122-8cf7-4658-8e91-d6eba92a6f31))
  (pad "45" smd rect (at 1.75 1.275) (size 0.35 2) (layers "F.Cu" "F.Mask") (tstamp d2e7626e-9d19-4b2d-8fcc-1cf214f29376))
  (pad "46" smd rect (at 2 1.525) (size 0.35 2.5) (layers "B.Cu" "B.Mask") (tstamp 5eaef990-9e9d-4494-997c-0f06ee9a52fc))
  (pad "47" smd rect (at 2.25 1.275) (size 0.35 2) (layers "F.Cu" "F.Mask") (tstamp b4d53cd1-3c83-4b8d-9a8f-bb41e3537734))
  (pad "48" smd rect (at 2.5 1.525) (size 0.35 2.5) (layers "B.Cu" "B.Mask") (tstamp ea203a1f-e221-497e-8fce-cbe0c42e3237))
  (pad "49" smd rect (at 2.75 1.275) (size 0.35 2) (layers "F.Cu" "F.Mask") (tstamp 893ff526-3def-4e42-92c1-7eec30d1f52e))
  (pad "50" smd rect (at 3 1.525) (size 0.35 2.5) (layers "B.Cu" "B.Mask") (tstamp 9c10a540-69a0-44a5-bd58-33a53d60b3b4))
  (pad "51" smd rect (at 3.25 1.275) (size 0.35 2) (layers "F.Cu" "F.Mask") (tstamp b35ac136-c3d4-4525-88b9-cb1099f11cc6))
  (pad "52" smd rect (at 3.5 1.525) (size 0.35 2.5) (layers "B.Cu" "B.Mask") (tstamp 3e202764-654a-4a85-97bf-0a33257f9a37))
  (pad "53" smd rect (at 3.75 1.275) (size 0.35 2) (layers "F.Cu" "F.Mask") (tstamp 6c74c1f8-5516-4d7c-b406-ec63d3abd703))
  (pad "54" smd rect (at 4 1.525) (size 0.35 2.5) (layers "B.Cu" "B.Mask") (tstamp a02e6b3e-c8e9-4f17-8f49-872ff2d00e79))
  (pad "55" smd rect (at 4.25 1.275) (size 0.35 2) (layers "F.Cu" "F.Mask") (tstamp c3c3ef0b-b8aa-436e-a7b7-78665d60b12c))
  (pad "56" smd rect (at 4.5 1.525) (size 0.35 2.5) (layers "B.Cu" "B.Mask") (tstamp 20d66425-0a44-4caa-a7c1-66f62050a767))
  (pad "57" smd rect (at 4.75 1.275) (size 0.35 2) (layers "F.Cu" "F.Mask") (tstamp fbf10961-7228-490b-bf88-327b7aa8373f))
  (pad "58" smd rect (at 5 1.525) (size 0.35 2.5) (layers "B.Cu" "B.Mask") (tstamp fe0aed60-54fd-4877-8510-f1461d4bdc8a))
  (pad "59" smd rect (at 5.25 1.275) (size 0.35 2) (layers "F.Cu" "F.Mask") (tstamp 18f87e38-106d-40e6-bae1-e116c31301c3))
  (pad "60" smd rect (at 5.5 1.525) (size 0.35 2.5) (layers "B.Cu" "B.Mask") (tstamp e2a995db-1ead-4799-8153-602f81999f83))
  (pad "61" smd rect (at 5.75 1.275) (size 0.35 2) (layers "F.Cu" "F.Mask") (tstamp 4801ac27-be9f-4546-a09e-a7733107bbc8))
  (pad "62" smd rect (at 6 1.525) (size 0.35 2.5) (layers "B.Cu" "B.Mask") (tstamp 1489f29d-5b27-4d91-9130-18723c5f359a))
  (pad "63" smd rect (at 6.25 1.275) (size 0.35 2) (layers "F.Cu" "F.Mask") (tstamp 098fbdc7-748d-4034-82de-034e77e4cbd7))
  (pad "64" smd rect (at 6.5 1.525) (size 0.35 2.5) (layers "B.Cu" "B.Mask") (tstamp bea84cda-f087-44da-acf3-cfece137cd20))
  (pad "65" smd rect (at 6.75 1.275) (size 0.35 2) (layers "F.Cu" "F.Mask") (tstamp f6bf6a08-3b31-497e-820f-011ab80b82da))
  (pad "66" smd rect (at 7 1.525) (size 0.35 2.5) (layers "B.Cu" "B.Mask") (tstamp d10c8aef-0285-42b3-987b-b38efaa4424b))
  (pad "67" smd rect (at 7.25 1.275) (size 0.35 2) (layers "F.Cu" "F.Mask") (tstamp 700ccd87-3c19-4d91-8e4a-7971e11b19ee))
  (pad "68" smd rect (at 7.5 1.525) (size 0.35 2.5) (layers "B.Cu" "B.Mask") (tstamp 6cdd7592-cf26-4189-9e72-a31e74e76190))
  (pad "69" smd rect (at 7.75 1.275) (size 0.35 2) (layers "F.Cu" "F.Mask") (tstamp b0ad636e-93de-49f9-9905-aa52c020fd7f))
  (pad "70" smd rect (at 8 1.525) (size 0.35 2.5) (layers "B.Cu" "B.Mask") (tstamp 7eb3697a-a4de-4ade-bdfb-3c31c63e0f01))
  (pad "71" smd rect (at 8.25 1.275) (size 0.35 2) (layers "F.Cu" "F.Mask") (tstamp 809ab56e-a5bb-46c9-a40f-923bd7823a75))
  (pad "72" smd rect (at 8.5 1.525) (size 0.35 2.5) (layers "B.Cu" "B.Mask") (tstamp f6a52256-221b-46d4-ba21-9d3562c2f845))
  (pad "73" smd rect (at 8.75 1.275) (size 0.35 2) (layers "F.Cu" "F.Mask") (tstamp acd1f28c-8f8a-4e76-bcdb-896597369a60))
  (pad "74" smd rect (at 9 1.525) (size 0.35 2.5) (layers "B.Cu" "B.Mask") (tstamp 9b37170a-d07a-41af-9929-dd035eb31a85))
  (pad "75" smd rect (at 9.25 1.275) (size 0.35 2) (layers "F.Cu" "F.Mask") (tstamp 6f379710-c024-4364-bc6b-e203594ee1e0))
  (zone (net 0) (net_name "") (layer "F.Cu") (tstamp aed2c91e-cb7f-454c-a410-5999d8f3c048) (name "mntclear_top") (hatch edge 0.508)
    (connect_pads (clearance 0))
    (min_thickness 0.254)
    (keepout (tracks allowed) (vias allowed) (pads allowed) (copperpour allowed) (footprints not_allowed))
    (fill (thermal_gap 0.508) (thermal_bridge_width 0.508))
    (polygon
      (pts
        (xy 11 29.775)
        (xy -11 29.775)
        (xy -11 25.975)
        (xy 11 25.975)
      )
    )
  )
  (zone (net 0) (net_name "") (layer "F.Cu") (tstamp f11a7421-dafc-4262-a0f3-858bdfa463d9) (name "mating_top") (hatch edge 0.508)
    (connect_pads (clearance 0))
    (min_thickness 0.254)
    (keepout (tracks allowed) (vias allowed) (pads allowed) (copperpour allowed) (footprints not_allowed))
    (fill (thermal_gap 0.508) (thermal_bridge_width 0.508))
    (polygon
      (pts
        (xy 11 3.775)
        (xy -11 3.775)
        (xy -11 -0.225)
        (xy 11 -0.225)
      )
    )
  )
  (zone (net 0) (net_name "") (layer "B.Cu") (tstamp 74e0960e-ea62-46b0-8824-b46ef2dfe288) (name "mating_bot") (hatch edge 0.508)
    (connect_pads (clearance 0))
    (min_thickness 0.254)
    (keepout (tracks allowed) (vias allowed) (pads allowed) (copperpour allowed) (footprints not_allowed))
    (fill (thermal_gap 0.508) (thermal_bridge_width 0.508))
    (polygon
      (pts
        (xy 11 4.975)
        (xy -11 4.975)
        (xy -11 -0.225)
        (xy 11 -0.225)
      )
    )
  )
  (model "${KICADLIB}/model/connector/NGFF_M2_CONN4P2_A.stp"
    (offset (xyz 0 -4 -1.2))
    (scale (xyz 1 1 1))
    (rotate (xyz -90 0 0))
  )
  (model "${KICADLIB}/model/connector/NGFF_M2_CONN4P2_E.stp"
    (offset (xyz 0 -4 -1.2))
    (scale (xyz 1 1 1))
    (rotate (xyz -90 0 0))
  )
)
