(footprint "OSC_3225_4pad"
	(version 20240108)
	(generator "pcbnew")
	(generator_version "8.0")
	(layer "F.Cu")
	(property "Reference" "REF**"
		(at 0 -1.95 0)
		(layer "F.SilkS")
		(uuid "c66424f7-a419-4f4e-86b5-eab4dc2bdd2b")
		(effects
			(font
				(size 0.8 0.8)
				(thickness 0.15)
			)
		)
	)
	(property "Value" "OSC_3225_4pad"
		(at 0 4.8 0)
		(unlocked yes)
		(layer "F.Fab")
		(hide yes)
		(uuid "583c5079-973f-4012-9105-c45bbd335091")
		(effects
			(font
				(size 1 1)
				(thickness 0.15)
			)
		)
	)
	(property "Footprint" "OSC_3225_4pad"
		(at 0 3.3 0)
		(unlocked yes)
		(layer "F.Fab")
		(hide yes)
		(uuid "e6a4899a-9679-4d7a-97f4-b13b756d32d2")
		(effects
			(font
				(size 1 1)
			)
		)
	)
	(property "Datasheet" ""
		(at 0 0 0)
		(unlocked yes)
		(layer "F.Fab")
		(hide yes)
		(uuid "a90c1ff8-10ac-4d19-8954-30f7843b4834")
		(effects
			(font
				(size 1.27 1.27)
			)
		)
	)
	(property "Description" ""
		(at 0 0 0)
		(unlocked yes)
		(layer "F.Fab")
		(hide yes)
		(uuid "42a123e0-174f-47ff-8227-524990476b43")
		(effects
			(font
				(size 1.27 1.27)
			)
		)
	)
	(fp_line
		(start -1.6 -0.15)
		(end -1.6 0.15)
		(stroke
			(width 0.1)
			(type solid)
		)
		(layer "F.SilkS")
		(uuid "f4dbf083-993c-4c12-bcc9-379bff60fff0")
	)
	(fp_line
		(start -0.3 1.25)
		(end 0.3 1.25)
		(stroke
			(width 0.1)
			(type solid)
		)
		(layer "F.SilkS")
		(uuid "cd6466b6-b268-4c05-9cad-e4e363f4dfff")
	)
	(fp_line
		(start 0.3 -1.25)
		(end -0.3 -1.25)
		(stroke
			(width 0.1)
			(type solid)
		)
		(layer "F.SilkS")
		(uuid "29d7c9cd-0c69-4c10-95e9-3e7f34cbdc98")
	)
	(fp_line
		(start 1.6 -0.15)
		(end 1.6 0.15)
		(stroke
			(width 0.1)
			(type solid)
		)
		(layer "F.SilkS")
		(uuid "0911129e-8b38-49ba-866a-f59082575b2a")
	)
	(fp_rect
		(start -1.8 -1.45)
		(end 1.8 1.45)
		(stroke
			(width 0.05)
			(type solid)
		)
		(fill none)
		(layer "F.CrtYd")
		(uuid "807ea345-cd7f-40ab-8616-de1cbac25548")
	)
	(fp_poly
		(pts
			(xy -1.35 1.25) (xy -1.6 1) (xy -1.6 -1.25) (xy 1.6 -1.25) (xy 1.6 1.25)
		)
		(stroke
			(width 0.1)
			(type solid)
		)
		(fill none)
		(layer "F.Fab")
		(uuid "34fb7112-529c-4784-ad1e-5fc5881e82b4")
	)
	(fp_text user "^"
		(at -1.05 2.1 0)
		(unlocked yes)
		(layer "F.SilkS")
		(uuid "92dee506-235c-467c-9937-fc8ddd235f31")
		(effects
			(font
				(size 1 1)
				(thickness 0.15)
			)
		)
	)
	(fp_text user "${REFERENCE}"
		(at 0 0 0)
		(layer "F.Fab")
		(uuid "10ea9d2f-a3ab-4dd1-b266-4e0d740042cd")
		(effects
			(font
				(size 0.7 0.7)
				(thickness 0.1)
			)
		)
	)
	(pad "1" smd roundrect
		(at -1.05 0.8)
		(size 1.3 1.1)
		(layers "F.Cu" "F.Paste" "F.Mask")
		(roundrect_rratio 0.04545454545)
		(uuid "62b8eb85-3cbf-416c-b3f9-f518785e1c7e")
	)
	(pad "2" smd roundrect
		(at 1.05 0.8)
		(size 1.3 1.1)
		(layers "F.Cu" "F.Paste" "F.Mask")
		(roundrect_rratio 0.04545454545)
		(uuid "5b4d0e26-3834-46c5-bbe7-7bdd84ccf32d")
	)
	(pad "3" smd roundrect
		(at 1.05 -0.8)
		(size 1.3 1.1)
		(layers "F.Cu" "F.Paste" "F.Mask")
		(roundrect_rratio 0.04545454545)
		(uuid "9df85aa0-661d-4642-a76e-b31a6bc90f74")
	)
	(pad "4" smd roundrect
		(at -1.05 -0.8)
		(size 1.3 1.1)
		(layers "F.Cu" "F.Paste" "F.Mask")
		(roundrect_rratio 0.04545454545)
		(uuid "65055d2e-b87a-4320-88d5-b2f0591e200b")
	)
	(model "${KICADLIB}/model/clock/Abracon_ASE.STEP"
		(hide yes)
		(offset
			(xyz 0 0 0.53)
		)
		(scale
			(xyz 1 1 1)
		)
		(rotate
			(xyz 0 0 0)
		)
	)
	(model "${KICADLIB}/model/clock/OSC3225-4.STEP"
		(offset
			(xyz 0 0 0.025)
		)
		(scale
			(xyz 1 1 1)
		)
		(rotate
			(xyz -90 0 0)
		)
	)
)
