(module "DFN300X300X75-10" (layer F.Cu) (tedit 5EBB0801)
  (attr smd)
  (fp_text reference "REF**" (at 0 -2.4) (layer F.SilkS)
    (effects (font (size 1 1) (thickness 0.15)))
  )
  (fp_text value "DFN300X300X75-10" (at 0 2.8) (layer F.Fab) hide
    (effects (font (size 1 1) (thickness 0.15)))
  )
  (fp_line (start -1.25 -1.5) (end -1.5 -1.5) (layer F.SilkS) (width 0.15))
  (fp_line (start -1.5 -1.5) (end -1.5 1.5) (layer F.SilkS) (width 0.15))
  (fp_line (start -1.5 1.5) (end -1.25 1.5) (layer F.SilkS) (width 0.15))
  (fp_line (start 1.25 1.5) (end 1.5 1.5) (layer F.SilkS) (width 0.15))
  (fp_line (start 1.5 1.5) (end 1.5 -1.5) (layer F.SilkS) (width 0.15))
  (fp_line (start 1.5 -1.5) (end 1.25 -1.5) (layer F.SilkS) (width 0.15))
  (fp_line (start -1 1.9) (end -1.2 2.1) (layer F.SilkS) (width 0.15))
  (fp_line (start -1 1.9) (end -0.8 2.1) (layer F.SilkS) (width 0.15))
  (fp_line (start 1.5 -1.5) (end 1.5 1.5) (layer F.Fab) (width 0.1))
  (fp_line (start 1.5 1.5) (end -1 1.5) (layer F.Fab) (width 0.1))
  (fp_line (start -1 1.5) (end -1.5 1) (layer F.Fab) (width 0.1))
  (fp_line (start -1.5 1) (end -1.5 -1.5) (layer F.Fab) (width 0.1))
  (fp_line (start -1.5 -1.5) (end 1.5 -1.5) (layer F.Fab) (width 0.1))
  (fp_line (start 1.65 -1.9) (end 1.65 1.9) (layer F.CrtYd) (width 0.05))
  (fp_line (start 1.65 1.9) (end -1.65 1.9) (layer F.CrtYd) (width 0.05))
  (fp_line (start -1.65 1.9) (end -1.65 -1.9) (layer F.CrtYd) (width 0.05))
  (fp_line (start -1.65 -1.9) (end 1.65 -1.9) (layer F.CrtYd) (width 0.05))
  (fp_text user "${REFERENCE}" (at 0 0 unlocked) (layer F.Fab)
    (effects (font (size 0.6 0.6) (thickness 0.1)))
  )
  (pad "1" smd rect (at -1 1.425) (size 0.25 0.7) (layers "F.Cu" "F.Paste" "F.Mask") (tstamp 0a3f6024-b34e-4b99-85f9-0483b14e971d))
  (pad "2" smd rect (at -0.5 1.425) (size 0.25 0.7) (layers "F.Cu" "F.Paste" "F.Mask") (tstamp bcbbbd65-1e4f-4416-b4df-3430f19dcfee))
  (pad "3" smd rect (at 0 1.425) (size 0.25 0.7) (layers "F.Cu" "F.Paste" "F.Mask") (tstamp a8c2e59b-527c-4e07-b8e5-9b60b80d0e00))
  (pad "4" smd rect (at 0.5 1.425) (size 0.25 0.7) (layers "F.Cu" "F.Paste" "F.Mask") (tstamp 121046ff-c938-4181-bce1-fe52cd096490))
  (pad "5" smd rect (at 1 1.425) (size 0.25 0.7) (layers "F.Cu" "F.Paste" "F.Mask") (tstamp cde76b3a-8b73-4af9-ba73-d95072acc81d))
  (pad "6" smd rect (at 1 -1.425) (size 0.25 0.7) (layers "F.Cu" "F.Paste" "F.Mask") (tstamp 42466318-3aee-41ec-bd1a-a265d3329ab3))
  (pad "7" smd rect (at 0.5 -1.425) (size 0.25 0.7) (layers "F.Cu" "F.Paste" "F.Mask") (tstamp ea296af8-5844-439d-aec8-bf0b30252c10))
  (pad "8" smd rect (at 0 -1.425) (size 0.25 0.7) (layers "F.Cu" "F.Paste" "F.Mask") (tstamp cf3f13f1-1a0c-439d-979f-27017c6d6215))
  (pad "9" smd rect (at -0.5 -1.425) (size 0.25 0.7) (layers "F.Cu" "F.Paste" "F.Mask") (tstamp 9d97ef61-03bc-47a9-b61f-f32fe5829d8d))
  (pad "10" smd rect (at -1 -1.425) (size 0.25 0.7) (layers "F.Cu" "F.Paste" "F.Mask") (tstamp 3da4ab4d-ecb6-4e31-9670-e73e8427b181))
  (pad "11" smd rect (at 0 0) (size 2.38 1.65) (layers "F.Cu" "F.Paste" "F.Mask") (tstamp 70f5039f-865f-4bcc-a04e-8f18f5158f62))
  (model "${KICADLIB}/model/DFN/DFN300X300X75-10.step"
    (at (xyz 0 0 0))
    (scale (xyz 1 1 1))
    (rotate (xyz 0 0 -90))
  )
)
