(footprint "BGA4N40P2X2_78X78X50" (version 20211014) (generator pcbnew)
  (layer "F.Cu")
  (tedit 61C29F07)
  (attr smd)
  (fp_text reference "REF**" (at 0 -1.44 unlocked) (layer "F.SilkS")
    (effects (font (size 1 1) (thickness 0.15)))
    (tstamp d0ec65f3-3ca4-488f-8d01-196dac7d277b)
  )
  (fp_text value "BGA4N40P2X2_78X78X50" (at 0 1 unlocked) (layer "F.Fab") hide
    (effects (font (size 1 1) (thickness 0.15)))
    (tstamp 4e976b63-a173-4d8f-93f7-109df2337768)
  )
  (fp_text user "^" (at -1.23 -0.2 270 unlocked) (layer "F.SilkS")
    (effects (font (size 1 1) (thickness 0.15)))
    (tstamp 21450048-d778-4134-806d-b6de713a1b40)
  )
  (fp_text user "${REFERENCE}" (at 0 0 45 unlocked) (layer "F.Fab")
    (effects (font (size 0.2 0.2) (thickness 0.05)))
    (tstamp b99541c5-85a3-4f80-8cd2-b9baccf7d722)
  )
  (fp_rect (start -0.1 -0.1) (end -0.3 -0.3) (layer "F.Paste") (width 0.05) (fill solid) (tstamp 86bc456f-fab9-4512-ba24-118697466c80))
  (fp_rect (start -0.1 0.3) (end -0.3 0.1) (layer "F.Paste") (width 0.05) (fill solid) (tstamp a076d334-8a51-46b2-b9a0-36f280fb736b))
  (fp_rect (start 0.3 -0.1) (end 0.1 -0.3) (layer "F.Paste") (width 0.05) (fill solid) (tstamp b61b5121-21d2-4749-afba-e9a85d1f6700))
  (fp_rect (start 0.3 0.3) (end 0.1 0.1) (layer "F.Paste") (width 0.05) (fill solid) (tstamp ceaa0a82-b82b-47f9-a244-0ac7eed9f96b))
  (fp_line (start 0.4 0.4) (end -0.4 0.4) (layer "F.SilkS") (width 0.1) (tstamp 33388fdc-c803-4432-87de-1d42669b6232))
  (fp_line (start -0.4 0.4) (end -0.4 -0.4) (layer "F.SilkS") (width 0.1) (tstamp 4d28c9b2-c337-47ec-b42d-52cac50a2964))
  (fp_line (start 0.4 -0.4) (end 0.4 0.4) (layer "F.SilkS") (width 0.1) (tstamp 6d0ad952-93ba-49d6-b4a4-506b64cff2c8))
  (fp_line (start -0.4 -0.4) (end 0.4 -0.4) (layer "F.SilkS") (width 0.1) (tstamp 9438619b-d0dc-4d4b-be55-6c8919669fb8))
  (fp_rect (start -0.5 -0.5) (end 0.5 0.5) (layer "F.CrtYd") (width 0.05) (fill none) (tstamp 15c87e4a-9501-4685-a49d-e50b333e160c))
  (fp_line (start 0.4 0.4) (end -0.4 0.4) (layer "F.Fab") (width 0.1) (tstamp 0c5dcbd7-418d-4f18-9bae-afb92bde0a08))
  (fp_line (start -0.2 -0.4) (end 0.4 -0.4) (layer "F.Fab") (width 0.1) (tstamp 3a5fb3e5-8fec-4524-96b4-68f0a9283df3))
  (fp_line (start 0.4 -0.4) (end 0.4 0.4) (layer "F.Fab") (width 0.1) (tstamp 7665f3a2-5168-4742-b1a2-9803f8270e5a))
  (fp_line (start -0.4 0.4) (end -0.4 -0.2) (layer "F.Fab") (width 0.1) (tstamp d7fdbe0b-c719-4c7a-ad10-fb15c73695d8))
  (fp_line (start -0.4 -0.2) (end -0.2 -0.4) (layer "F.Fab") (width 0.1) (tstamp f00dac9a-1f56-481b-b063-8de24c0fcc22))
  (pad "A1" smd circle (at -0.2 -0.2) (size 0.23 0.23) (layers "F.Cu" "F.Mask")
    (solder_mask_margin 0.05) (tstamp 73cc77c7-d0be-4c8e-8635-44979a243105))
  (pad "A2" smd circle (at 0.2 -0.2) (size 0.23 0.23) (layers "F.Cu" "F.Mask")
    (solder_mask_margin 0.05) (tstamp 851fa815-ccd3-42d3-9e0b-01b62eb78804))
  (pad "B1" smd circle (at -0.2 0.2) (size 0.23 0.23) (layers "F.Cu" "F.Mask")
    (solder_mask_margin 0.05) (tstamp 57eadffe-587f-479d-b7e0-ad4349184032))
  (pad "B2" smd circle (at 0.2 0.2) (size 0.23 0.23) (layers "F.Cu" "F.Mask")
    (solder_mask_margin 0.05) (tstamp 67581fbd-9194-4bc6-a682-fca8adc1c9bb))
  (model "${KICADLIB}/model/BGA/BGA4N40P2X2_78X78X50.step"
    (offset (xyz 0 0 0))
    (scale (xyz 1 1 1))
    (rotate (xyz 0 0 0))
  )
)
