(footprint "FUSER4532" (version 20221018) (generator pcbnew)
  (layer "F.Cu")
  (attr smd)
  (fp_text reference "REF**" (at 0 -2.4 unlocked) (layer "F.SilkS")
      (effects (font (size 1 1) (thickness 0.15)))
    (tstamp 0d27b47b-0120-4063-aedb-2ec6968425da)
  )
  (fp_text value "FUSER4532" (at 1.4 -0.2 unlocked) (layer "F.Fab") hide
      (effects (font (size 1 1) (thickness 0.15)))
    (tstamp 33ef4c20-c676-48d5-933b-6a3bb44c9756)
  )
  (fp_text user "${REFERENCE}" (at 0 0 unlocked) (layer "F.Fab")
      (effects (font (size 1 1) (thickness 0.15)))
    (tstamp f122de84-f3e7-4263-a0d3-f056bf6e12a6)
  )
  (fp_line (start -2.37 -1.7) (end 2.37 -1.7)
    (stroke (width 0.1) (type solid)) (layer "F.SilkS") (tstamp 95c3e0c1-ebeb-40cc-ac00-3cad28804889))
  (fp_line (start 2.37 1.7) (end -2.37 1.7)
    (stroke (width 0.1) (type solid)) (layer "F.SilkS") (tstamp e49bdcbd-596a-4087-9869-b32cdbb4db1e))
  (fp_rect (start 3.4 -1.85) (end -3.4 1.85)
    (stroke (width 0.05) (type solid)) (fill none) (layer "F.CrtYd") (tstamp 4aba9fff-27de-46e5-902c-58311928b676))
  (fp_rect (start 2.37 -1.7) (end -2.37 1.7)
    (stroke (width 0.1) (type solid)) (fill none) (layer "F.Fab") (tstamp 80dfe245-a0c2-4d6d-9261-e7df6621b862))
  (pad "" smd roundrect (at -2.4 -0.95) (size 1.75 1.25) (layers "F.Paste") (roundrect_rratio 0.05) (tstamp 7c394c77-978c-4dec-b42b-35382ace7658))
  (pad "" smd roundrect (at -2.4 0.95) (size 1.75 1.25) (layers "F.Paste") (roundrect_rratio 0.05) (tstamp 4ad2bcc1-779f-406c-828a-0de043678b98))
  (pad "" smd roundrect (at 2.4 -0.95) (size 1.75 1.25) (layers "F.Paste") (roundrect_rratio 0.05) (tstamp d8e54e64-ff68-45da-8377-514fd234e17d))
  (pad "" smd roundrect (at 2.4 0.95) (size 1.75 1.25) (layers "F.Paste") (roundrect_rratio 0.05) (tstamp 02747357-e659-4302-ae38-8784323216bf))
  (pad "1" smd roundrect (at -2.4 0) (size 1.78 3.15) (layers "F.Cu" "F.Mask") (roundrect_rratio 0.02808988764) (tstamp d2894964-25ee-42d2-91aa-d2c6982967fc))
  (pad "2" smd roundrect (at 2.4 0) (size 1.78 3.15) (layers "F.Cu" "F.Mask") (roundrect_rratio 0.02808988764) (tstamp 55ac5b7f-fb2b-43bc-b9fd-952e23a8e61c))
  (model "${KICADLIB}/model/passive/bourns_msmf075.stp"
    (offset (xyz 0 0 0))
    (scale (xyz 1 1 1))
    (rotate (xyz -90 0 90))
  )
)
