(footprint "SOP-8-Advance5x5" (version 20210228) (generator pcbnew) (layer "F.Cu")
  (tedit 606A1BC3)
  (attr smd)
  (fp_text reference "REF**" (at 0 3.9 unlocked) (layer "F.SilkS")
    (effects (font (size 1 1) (thickness 0.15)))
    (tstamp bdc3e996-1bb8-49f9-a1b5-c4ca616bcdd9)
  )
  (fp_text value "SOP-8-Advance5x5" (at 0 -4.9 unlocked) (layer "F.Fab") hide
    (effects (font (size 1 1) (thickness 0.15)))
    (tstamp 8e353b8e-5c18-4d8c-8b98-411329af4498)
  )
  (fp_text user "^" (at -2.9 3 270 unlocked) (layer "F.SilkS")
    (effects (font (size 1 1) (thickness 0.15)))
    (tstamp 9e908933-7a2b-4909-8abf-858b84d26f55)
  )
  (fp_text user "${REFERENCE}" (at 0 0 unlocked) (layer "F.Fab")
    (effects (font (size 1 1) (thickness 0.15)))
    (tstamp 06eaafa9-ad48-4419-8fa3-0a8f5fd5d27b)
  )
  (fp_line (start -2.5 2.5) (end -2.2 2.5) (layer "F.SilkS") (width 0.12) (tstamp 3a3f9972-86d7-48e9-99f7-6ae950fa7dd5))
  (fp_line (start 2.5 2.5) (end 2.5 -2.5) (layer "F.SilkS") (width 0.12) (tstamp 43db75f7-1d6d-4a8d-ac7e-f97de371f8b1))
  (fp_line (start 2.5 2.5) (end 2.2 2.5) (layer "F.SilkS") (width 0.12) (tstamp 61bf65c1-177e-47ef-ac73-508ed520470b))
  (fp_line (start -2.5 -2.5) (end -2.5 2.5) (layer "F.SilkS") (width 0.12) (tstamp 79fe41f8-6306-4b3c-9f1b-502a8e57b7f1))
  (fp_line (start -2.5 -2.5) (end -2.2 -2.5) (layer "F.SilkS") (width 0.12) (tstamp b19952aa-a767-45f1-b1e8-af104cddc0e5))
  (fp_line (start 2.5 -2.5) (end 2.2 -2.5) (layer "F.SilkS") (width 0.12) (tstamp d2b83f4e-8206-4a5c-89b8-6cdf8fb8a65c))
  (fp_line (start -2.65 -3.15) (end 2.65 -3.15) (layer "F.CrtYd") (width 0.05) (tstamp 7d4e376b-2b21-4422-a15d-f14604cd6b05))
  (fp_line (start 2.65 3.15) (end -2.65 3.15) (layer "F.CrtYd") (width 0.05) (tstamp a3ffaf27-1ec1-49ea-85e7-2bb11a41264d))
  (fp_line (start -2.65 3.15) (end -2.65 -3.15) (layer "F.CrtYd") (width 0.05) (tstamp ba19dc1c-827b-450a-87a1-cadec99ef6cb))
  (fp_line (start 2.65 -3.15) (end 2.65 3.15) (layer "F.CrtYd") (width 0.05) (tstamp be515e7c-5baf-47f7-9d12-84a4c9b8ba53))
  (fp_line (start -2.5 -2.5) (end 2.5 -2.5) (layer "F.Fab") (width 0.1) (tstamp 363c53fb-83ac-498c-a969-2a328be886dc))
  (fp_line (start -2 2.5) (end -2.5 2) (layer "F.Fab") (width 0.1) (tstamp 52c91eea-923e-4325-92da-cbe87cfd033d))
  (fp_line (start 2.5 2.5) (end -2 2.5) (layer "F.Fab") (width 0.1) (tstamp ad49c217-54bd-4a48-85ee-4526d0b8e19e))
  (fp_line (start 2.5 -2.5) (end 2.5 2.5) (layer "F.Fab") (width 0.1) (tstamp ad8f1968-f378-4439-9d66-e59327aa2d47))
  (fp_line (start -2.5 2) (end -2.5 -2.5) (layer "F.Fab") (width 0.1) (tstamp fe739c59-3fc2-4c24-be87-94e9f296e9aa))
  (pad "" smd roundrect (at -0.75 -0.5) (size 1.25 2.25) (layers "F.Paste") (roundrect_rratio 0.1) (tstamp 140c53ad-1846-4704-8daf-7765df47bf64))
  (pad "" smd roundrect (at 0.75 -0.5) (size 1.25 2.25) (layers "F.Paste") (roundrect_rratio 0.1) (tstamp 7c5d269e-3662-4b60-a5a9-c9128d1f1388))
  (pad "1" smd rect (at -1.905 2.54) (size 0.5 1) (layers "F.Cu" "F.Paste" "F.Mask") (tstamp 978801c8-c9db-4ac1-b13c-91bf50816b21))
  (pad "2" smd rect (at -0.635 2.54) (size 0.5 1) (layers "F.Cu" "F.Paste" "F.Mask") (tstamp e8d16f87-0ed6-4de7-9823-1f5628d3b9ea))
  (pad "3" smd rect (at 0.635 2.54) (size 0.5 1) (layers "F.Cu" "F.Paste" "F.Mask") (tstamp e5c9d5d6-b1e1-4ec1-b6e8-bef9150d764c))
  (pad "4" smd rect (at 1.905 2.54) (size 0.5 1) (layers "F.Cu" "F.Paste" "F.Mask") (tstamp dd701d6f-5365-434e-9c90-b813d08effd8))
  (pad "5" smd rect (at 0.635 -2.54 180) (size 0.5 1) (layers "F.Cu" "F.Paste" "F.Mask") (tstamp 1255db9b-f7df-4fce-b17d-ed7a4b333f7e))
  (pad "5" smd rect (at -0.635 -2.54 180) (size 0.5 1) (layers "F.Cu" "F.Paste" "F.Mask") (tstamp 3c4e88b7-9021-48c2-92eb-4b93cec336fb))
  (pad "5" smd rect (at -1.905 -2.54 180) (size 0.5 1) (layers "F.Cu" "F.Paste" "F.Mask") (tstamp 7da450b9-feb7-4fb1-acdb-2d480ad4a8c9))
  (pad "5" smd rect (at 1.905 -2.54 180) (size 0.5 1) (layers "F.Cu" "F.Paste" "F.Mask") (tstamp 9b8de959-66dd-472e-a9ec-6f00db0c9467))
  (pad "5" smd rect (at 0 -0.889 180) (size 4.25 3.5) (layers "F.Cu" "F.Mask") (tstamp b6c43a15-ecdf-42db-b8a5-44f9dd1820a1))
)
