(module "BGA192N40P16X16_700X700X83" (layer F.Cu) (tedit 5EBB071E)
  (attr smd)
  (fp_text reference "REF**" (at 0 -4.5) (layer F.SilkS)
    (effects (font (size 1 1) (thickness 0.15)))
  )
  (fp_text value "BGA192N40P16X16_700X700X83" (at 0 4.5) (layer F.Fab) hide
    (effects (font (size 1 1) (thickness 0.15)))
  )
  (fp_text user "${REFERENCE}" (at 0 0 unlocked) (layer F.Fab)
    (effects (font (size 1 1) (thickness 0.15)))
  )
  (fp_line (start 1.75 -3.5) (end 3.5 -3.5) (layer F.SilkS) (width 0.1))
  (fp_line (start 3.5 -3.5) (end 3.5 -1.75) (layer F.SilkS) (width 0.1))
  (fp_line (start 1.75 3.5) (end 3.5 3.5) (layer F.SilkS) (width 0.1))
  (fp_line (start 3.5 3.5) (end 3.5 1.75) (layer F.SilkS) (width 0.1))
  (fp_line (start -1.75 3.5) (end -3.5 3.5) (layer F.SilkS) (width 0.1))
  (fp_line (start -3.5 3.5) (end -3.5 1.75) (layer F.SilkS) (width 0.1))
  (fp_line (start -3.75 -3.75) (end 3.75 -3.75) (layer F.CrtYd) (width 0.05))
  (fp_line (start 3.75 -3.75) (end 3.75 3.75) (layer F.CrtYd) (width 0.05))
  (fp_line (start 3.75 3.75) (end -3.75 3.75) (layer F.CrtYd) (width 0.05))
  (fp_line (start -3.75 3.75) (end -3.75 -3.75) (layer F.CrtYd) (width 0.05))
  (fp_line (start -3.5 -1.75) (end -3.5 -3.5) (layer F.SilkS) (width 0.1))
  (fp_line (start -3.5 -3.5) (end -1.75 -3.5) (layer F.SilkS) (width 0.1))
  (fp_text user "^" (at -4.3 -3 -90 unlocked) (layer F.SilkS)
    (effects (font (size 1 1) (thickness 0.15)))
  )
  (fp_line (start -3 -3.5) (end 3.5 -3.5) (layer F.Fab) (width 0.1))
  (fp_line (start 3.5 -3.5) (end 3.5 3.5) (layer F.Fab) (width 0.1))
  (fp_line (start 3.5 3.5) (end -3.5 3.5) (layer F.Fab) (width 0.1))
  (fp_line (start -3.5 3.5) (end -3.5 -3) (layer F.Fab) (width 0.1))
  (fp_line (start -3.5 -3) (end -3 -3.5) (layer F.Fab) (width 0.1))
  (pad "A1" smd circle (at -3 -3) (size 0.25 0.25) (layers "F.Cu" "F.Paste" "F.Mask") (tstamp b74417cb-8832-4465-9994-410af58d169c))
  (pad "B1" smd circle (at -3 -2.6) (size 0.25 0.25) (layers "F.Cu" "F.Paste" "F.Mask") (tstamp 32aa81b1-37d2-40d9-985a-26fd70967521))
  (pad "C1" smd circle (at -3 -2.2) (size 0.25 0.25) (layers "F.Cu" "F.Paste" "F.Mask") (tstamp 4c527934-82ec-4430-8aba-e8eb11acc906))
  (pad "D1" smd circle (at -3 -1.8) (size 0.25 0.25) (layers "F.Cu" "F.Paste" "F.Mask") (tstamp a8192749-aaef-4896-9f5b-d8ac333458a6))
  (pad "E1" smd circle (at -3 -1.4) (size 0.25 0.25) (layers "F.Cu" "F.Paste" "F.Mask") (tstamp 8ed7a8c4-7687-4fde-a630-be6075face6b))
  (pad "F1" smd circle (at -3 -1) (size 0.25 0.25) (layers "F.Cu" "F.Paste" "F.Mask") (tstamp 96e198ef-2d48-47c0-a74b-079e5fa7c285))
  (pad "G1" smd circle (at -3 -0.6) (size 0.25 0.25) (layers "F.Cu" "F.Paste" "F.Mask") (tstamp 031c12b0-ac59-496c-a022-528b3b4c367f))
  (pad "H1" smd circle (at -3 -0.2) (size 0.25 0.25) (layers "F.Cu" "F.Paste" "F.Mask") (tstamp 4277547a-740e-4195-9c11-7f7fba0d1784))
  (pad "J1" smd circle (at -3 0.2) (size 0.25 0.25) (layers "F.Cu" "F.Paste" "F.Mask") (tstamp e20aa12b-59e6-4aca-9989-6a917ed2068a))
  (pad "K1" smd circle (at -3 0.6) (size 0.25 0.25) (layers "F.Cu" "F.Paste" "F.Mask") (tstamp ee4dcb3d-6d58-4f75-acd3-6c46d57cd81b))
  (pad "L1" smd circle (at -3 1) (size 0.25 0.25) (layers "F.Cu" "F.Paste" "F.Mask") (tstamp f8f5c64e-b55c-4d6d-b9c9-5f72f7d95f73))
  (pad "M1" smd circle (at -3 1.4) (size 0.25 0.25) (layers "F.Cu" "F.Paste" "F.Mask") (tstamp 235addaf-85e2-458f-a29c-15e978f10aa5))
  (pad "N1" smd circle (at -3 1.8) (size 0.25 0.25) (layers "F.Cu" "F.Paste" "F.Mask") (tstamp c5bb4b18-21e3-4e04-bd9f-e09b5d2ad898))
  (pad "P1" smd circle (at -3 2.2) (size 0.25 0.25) (layers "F.Cu" "F.Paste" "F.Mask") (tstamp bad2fef2-30c0-4ad2-b8d4-39ec1b54062d))
  (pad "R1" smd circle (at -3 2.6) (size 0.25 0.25) (layers "F.Cu" "F.Paste" "F.Mask") (tstamp 432fdaa0-c1eb-46ad-a9dc-7418546611ad))
  (pad "T1" smd circle (at -3 3) (size 0.25 0.25) (layers "F.Cu" "F.Paste" "F.Mask") (tstamp a5e4cd22-a29c-4912-90eb-b9ad6b251328))
  (pad "A2" smd circle (at -2.6 -3) (size 0.25 0.25) (layers "F.Cu" "F.Paste" "F.Mask") (tstamp 5821080b-57d0-445b-b3ff-92c0e892b2fc))
  (pad "B2" smd circle (at -2.6 -2.6) (size 0.25 0.25) (layers "F.Cu" "F.Paste" "F.Mask") (tstamp 71b7955a-fbc5-466a-9d6f-9a9d468dd7f1))
  (pad "C2" smd circle (at -2.6 -2.2) (size 0.25 0.25) (layers "F.Cu" "F.Paste" "F.Mask") (tstamp 570e1f61-68da-4b58-a760-4c352b366ba2))
  (pad "D2" smd circle (at -2.6 -1.8) (size 0.25 0.25) (layers "F.Cu" "F.Paste" "F.Mask") (tstamp d2911cdc-f755-4713-bbf1-2e296da3feeb))
  (pad "E2" smd circle (at -2.6 -1.4) (size 0.25 0.25) (layers "F.Cu" "F.Paste" "F.Mask") (tstamp 03f3e37f-40d3-4d6f-a391-937d9e39a1dc))
  (pad "F2" smd circle (at -2.6 -1) (size 0.25 0.25) (layers "F.Cu" "F.Paste" "F.Mask") (tstamp 2d9ff80d-bc4e-4ed0-b458-35b5cbaef4d3))
  (pad "G2" smd circle (at -2.6 -0.6) (size 0.25 0.25) (layers "F.Cu" "F.Paste" "F.Mask") (tstamp d81eb2ba-fcbf-4c85-8eb3-c0e66b1774b7))
  (pad "H2" smd circle (at -2.6 -0.2) (size 0.25 0.25) (layers "F.Cu" "F.Paste" "F.Mask") (tstamp bcbadfc5-1c5a-49f5-8183-cf17216a834b))
  (pad "J2" smd circle (at -2.6 0.2) (size 0.25 0.25) (layers "F.Cu" "F.Paste" "F.Mask") (tstamp 7b218c51-f3c0-47e9-b0ed-ff3679b3df6f))
  (pad "K2" smd circle (at -2.6 0.6) (size 0.25 0.25) (layers "F.Cu" "F.Paste" "F.Mask") (tstamp bd165f88-faf5-44c0-8df0-b7544a87c546))
  (pad "L2" smd circle (at -2.6 1) (size 0.25 0.25) (layers "F.Cu" "F.Paste" "F.Mask") (tstamp e75cbc2d-a08d-4342-8e2c-b3ee299fc9db))
  (pad "M2" smd circle (at -2.6 1.4) (size 0.25 0.25) (layers "F.Cu" "F.Paste" "F.Mask") (tstamp 8aa0bd18-e97e-4c07-909c-94c43b7beed8))
  (pad "N2" smd circle (at -2.6 1.8) (size 0.25 0.25) (layers "F.Cu" "F.Paste" "F.Mask") (tstamp 56d528b5-e6e0-408d-a0d5-14b0a488ba02))
  (pad "P2" smd circle (at -2.6 2.2) (size 0.25 0.25) (layers "F.Cu" "F.Paste" "F.Mask") (tstamp 63fc9247-c530-4f17-a899-78a1eef7f489))
  (pad "R2" smd circle (at -2.6 2.6) (size 0.25 0.25) (layers "F.Cu" "F.Paste" "F.Mask") (tstamp 858cb9e9-3332-4cd9-8ef9-87619dd55262))
  (pad "T2" smd circle (at -2.6 3) (size 0.25 0.25) (layers "F.Cu" "F.Paste" "F.Mask") (tstamp 925ddefd-8e33-41a3-9192-3864dbca211a))
  (pad "A3" smd circle (at -2.2 -3) (size 0.25 0.25) (layers "F.Cu" "F.Paste" "F.Mask") (tstamp fd93cb2a-0bbf-495d-8b09-8eb4684c6d8f))
  (pad "B3" smd circle (at -2.2 -2.6) (size 0.25 0.25) (layers "F.Cu" "F.Paste" "F.Mask") (tstamp ee8d4c8f-6530-4f75-abb8-ab3cdfb2ba67))
  (pad "C3" smd circle (at -2.2 -2.2) (size 0.25 0.25) (layers "F.Cu" "F.Paste" "F.Mask") (tstamp 5184351b-6ab9-4992-99c7-d32226787f83))
  (pad "D3" smd circle (at -2.2 -1.8) (size 0.25 0.25) (layers "F.Cu" "F.Paste" "F.Mask") (tstamp 5487c279-305a-4428-815b-f83eb9d2b201))
  (pad "E3" smd circle (at -2.2 -1.4) (size 0.25 0.25) (layers "F.Cu" "F.Paste" "F.Mask") (tstamp 2df98784-266c-49f5-ab18-ee0ecb4f16ac))
  (pad "F3" smd circle (at -2.2 -1) (size 0.25 0.25) (layers "F.Cu" "F.Paste" "F.Mask") (tstamp e92f575a-4725-4df1-8ae8-79b886c49e62))
  (pad "G3" smd circle (at -2.2 -0.6) (size 0.25 0.25) (layers "F.Cu" "F.Paste" "F.Mask") (tstamp b2f85faf-9209-4e50-8465-c1a5b8d434fa))
  (pad "H3" smd circle (at -2.2 -0.2) (size 0.25 0.25) (layers "F.Cu" "F.Paste" "F.Mask") (tstamp 3b1485fd-2e17-49d0-b98b-26f310847dd1))
  (pad "J3" smd circle (at -2.2 0.2) (size 0.25 0.25) (layers "F.Cu" "F.Paste" "F.Mask") (tstamp 4b8fef24-2414-4809-8f41-144bb87b197e))
  (pad "K3" smd circle (at -2.2 0.6) (size 0.25 0.25) (layers "F.Cu" "F.Paste" "F.Mask") (tstamp 82b75603-cb69-46fb-8770-fb4034ba9e77))
  (pad "L3" smd circle (at -2.2 1) (size 0.25 0.25) (layers "F.Cu" "F.Paste" "F.Mask") (tstamp 96db01c8-4185-4579-9796-4b0832c01b1e))
  (pad "M3" smd circle (at -2.2 1.4) (size 0.25 0.25) (layers "F.Cu" "F.Paste" "F.Mask") (tstamp 691d32af-8a30-462c-94e7-4a9fc32dfb59))
  (pad "N3" smd circle (at -2.2 1.8) (size 0.25 0.25) (layers "F.Cu" "F.Paste" "F.Mask") (tstamp cf2e639f-c2e0-4257-990a-f1bfaf24aa4d))
  (pad "P3" smd circle (at -2.2 2.2) (size 0.25 0.25) (layers "F.Cu" "F.Paste" "F.Mask") (tstamp fee39a34-0ad1-4963-a495-8fa21c28e395))
  (pad "R3" smd circle (at -2.2 2.6) (size 0.25 0.25) (layers "F.Cu" "F.Paste" "F.Mask") (tstamp 4fa525bd-1866-434e-b266-20f9230c070e))
  (pad "T3" smd circle (at -2.2 3) (size 0.25 0.25) (layers "F.Cu" "F.Paste" "F.Mask") (tstamp 59238a58-adf1-4b15-a1b7-656dfd02de6c))
  (pad "A4" smd circle (at -1.8 -3) (size 0.25 0.25) (layers "F.Cu" "F.Paste" "F.Mask") (tstamp 673b0af4-2e7a-42f4-a84d-9e908739016f))
  (pad "B4" smd circle (at -1.8 -2.6) (size 0.25 0.25) (layers "F.Cu" "F.Paste" "F.Mask") (tstamp 1260336c-e6a1-4a0f-97eb-944883eda844))
  (pad "C4" smd circle (at -1.8 -2.2) (size 0.25 0.25) (layers "F.Cu" "F.Paste" "F.Mask") (tstamp eef7777f-3818-4d63-b484-f12a286bce14))
  (pad "P4" smd circle (at -1.8 2.2) (size 0.25 0.25) (layers "F.Cu" "F.Paste" "F.Mask") (tstamp c3dbef91-ff74-454a-81b4-3e8fc5179c5c))
  (pad "R4" smd circle (at -1.8 2.6) (size 0.25 0.25) (layers "F.Cu" "F.Paste" "F.Mask") (tstamp 7acae21e-76b3-4931-9db4-c397c18283b2))
  (pad "T4" smd circle (at -1.8 3) (size 0.25 0.25) (layers "F.Cu" "F.Paste" "F.Mask") (tstamp bfba6e45-245e-4f39-b75b-87818557a89f))
  (pad "A5" smd circle (at -1.4 -3) (size 0.25 0.25) (layers "F.Cu" "F.Paste" "F.Mask") (tstamp b3f8da88-4c62-410d-a0ac-8364d9c673f0))
  (pad "B5" smd circle (at -1.4 -2.6) (size 0.25 0.25) (layers "F.Cu" "F.Paste" "F.Mask") (tstamp fd1db12c-82da-4cb3-9044-daaa2b01f21a))
  (pad "C5" smd circle (at -1.4 -2.2) (size 0.25 0.25) (layers "F.Cu" "F.Paste" "F.Mask") (tstamp d2893fcb-0c09-49c9-a507-8b6cac1aa83f))
  (pad "P5" smd circle (at -1.4 2.2) (size 0.25 0.25) (layers "F.Cu" "F.Paste" "F.Mask") (tstamp 665c0e4b-5ba8-4a8d-954b-fe6717917eec))
  (pad "R5" smd circle (at -1.4 2.6) (size 0.25 0.25) (layers "F.Cu" "F.Paste" "F.Mask") (tstamp 77c08472-34b5-4722-8e24-23eac508eac3))
  (pad "T5" smd circle (at -1.4 3) (size 0.25 0.25) (layers "F.Cu" "F.Paste" "F.Mask") (tstamp 75d2972a-e8fc-4f49-8772-c3c58cbadda6))
  (pad "A6" smd circle (at -1 -3) (size 0.25 0.25) (layers "F.Cu" "F.Paste" "F.Mask") (tstamp c605233d-2782-4acb-a6c0-d332f9a1876b))
  (pad "B6" smd circle (at -1 -2.6) (size 0.25 0.25) (layers "F.Cu" "F.Paste" "F.Mask") (tstamp 2217ec04-1d4c-42d7-99a5-57afc377f4dc))
  (pad "C6" smd circle (at -1 -2.2) (size 0.25 0.25) (layers "F.Cu" "F.Paste" "F.Mask") (tstamp 6731a9c2-18b7-45fb-8033-2936f5ccc5db))
  (pad "F6" smd circle (at -1 -1) (size 0.25 0.25) (layers "F.Cu" "F.Paste" "F.Mask") (tstamp 6e6127c5-542e-4fea-b0ac-674fdddc08ba))
  (pad "G6" smd circle (at -1 -0.6) (size 0.25 0.25) (layers "F.Cu" "F.Paste" "F.Mask") (tstamp 7015643f-b5ab-44e5-af71-9b0dcc4b10c7))
  (pad "H6" smd circle (at -1 -0.2) (size 0.25 0.25) (layers "F.Cu" "F.Paste" "F.Mask") (tstamp d935bf5c-c3f3-44fc-a4cb-997407bbb9d5))
  (pad "J6" smd circle (at -1 0.2) (size 0.25 0.25) (layers "F.Cu" "F.Paste" "F.Mask") (tstamp aefaa746-00ff-42eb-8c51-348cfc1bb64f))
  (pad "K6" smd circle (at -1 0.6) (size 0.25 0.25) (layers "F.Cu" "F.Paste" "F.Mask") (tstamp 12c3cd85-baf5-4ea1-8a26-29fcc066b955))
  (pad "L6" smd circle (at -1 1) (size 0.25 0.25) (layers "F.Cu" "F.Paste" "F.Mask") (tstamp f3603cd7-3f6e-452f-881f-e40fc143ddae))
  (pad "P6" smd circle (at -1 2.2) (size 0.25 0.25) (layers "F.Cu" "F.Paste" "F.Mask") (tstamp ae6bd2cd-3fe1-4bc1-89f7-261acfdcd410))
  (pad "R6" smd circle (at -1 2.6) (size 0.25 0.25) (layers "F.Cu" "F.Paste" "F.Mask") (tstamp 7e81126d-d18d-4d9d-97c5-8fb3449d1f41))
  (pad "T6" smd circle (at -1 3) (size 0.25 0.25) (layers "F.Cu" "F.Paste" "F.Mask") (tstamp 8efe83c9-09fc-43c5-ae28-2b025eb6aa92))
  (pad "A7" smd circle (at -0.6 -3) (size 0.25 0.25) (layers "F.Cu" "F.Paste" "F.Mask") (tstamp 7e0ee233-cc58-4a70-a221-32978b0760bb))
  (pad "B7" smd circle (at -0.6 -2.6) (size 0.25 0.25) (layers "F.Cu" "F.Paste" "F.Mask") (tstamp 2d916723-6545-4320-b69c-6ef5c5a6584c))
  (pad "C7" smd circle (at -0.6 -2.2) (size 0.25 0.25) (layers "F.Cu" "F.Paste" "F.Mask") (tstamp 0c24d9c9-d86e-40dd-b276-55862d0393c6))
  (pad "F7" smd circle (at -0.6 -1) (size 0.25 0.25) (layers "F.Cu" "F.Paste" "F.Mask") (tstamp 06c30213-49eb-4e9e-a376-7e0b513f7a5d))
  (pad "G7" smd circle (at -0.6 -0.6) (size 0.25 0.25) (layers "F.Cu" "F.Paste" "F.Mask") (tstamp d5d7f4b1-6778-473a-a8ac-1e93c7d7cace))
  (pad "H7" smd circle (at -0.6 -0.2) (size 0.25 0.25) (layers "F.Cu" "F.Paste" "F.Mask") (tstamp 4d719ebb-4936-4c2b-9645-9d95c48de820))
  (pad "J7" smd circle (at -0.6 0.2) (size 0.25 0.25) (layers "F.Cu" "F.Paste" "F.Mask") (tstamp e1bcc7b3-22db-4f71-893a-ec84d872deb8))
  (pad "K7" smd circle (at -0.6 0.6) (size 0.25 0.25) (layers "F.Cu" "F.Paste" "F.Mask") (tstamp 05fd4e66-7585-435a-8a7d-73812b6ea691))
  (pad "L7" smd circle (at -0.6 1) (size 0.25 0.25) (layers "F.Cu" "F.Paste" "F.Mask") (tstamp ddd0021b-7be3-4410-b35d-b17995d2b9e9))
  (pad "P7" smd circle (at -0.6 2.2) (size 0.25 0.25) (layers "F.Cu" "F.Paste" "F.Mask") (tstamp 0523e664-db40-43a0-89b2-12a2ac18720a))
  (pad "R7" smd circle (at -0.6 2.6) (size 0.25 0.25) (layers "F.Cu" "F.Paste" "F.Mask") (tstamp 3f12b6ee-4941-43a4-b021-e97dd0d71d0f))
  (pad "T7" smd circle (at -0.6 3) (size 0.25 0.25) (layers "F.Cu" "F.Paste" "F.Mask") (tstamp ba151037-72b3-4d4b-98b2-284673f487fc))
  (pad "A8" smd circle (at -0.2 -3) (size 0.25 0.25) (layers "F.Cu" "F.Paste" "F.Mask") (tstamp f486ba36-f3a1-424b-b3ce-ab03460ae429))
  (pad "B8" smd circle (at -0.2 -2.6) (size 0.25 0.25) (layers "F.Cu" "F.Paste" "F.Mask") (tstamp dc439eb5-b043-4399-aa13-0c09dcca4a8d))
  (pad "C8" smd circle (at -0.2 -2.2) (size 0.25 0.25) (layers "F.Cu" "F.Paste" "F.Mask") (tstamp a547c911-9c13-45b0-a78e-8e3f3007e6e3))
  (pad "F8" smd circle (at -0.2 -1) (size 0.25 0.25) (layers "F.Cu" "F.Paste" "F.Mask") (tstamp a173b7f1-7932-4071-91ab-08153d4a67a1))
  (pad "G8" smd circle (at -0.2 -0.6) (size 0.25 0.25) (layers "F.Cu" "F.Paste" "F.Mask") (tstamp b77811f8-8cad-48ab-b9cd-a0d4fc1cca7f))
  (pad "H8" smd circle (at -0.2 -0.2) (size 0.25 0.25) (layers "F.Cu" "F.Paste" "F.Mask") (tstamp 8922bf2d-f20f-48b1-b4bc-7a225ddf512c))
  (pad "J8" smd circle (at -0.2 0.2) (size 0.25 0.25) (layers "F.Cu" "F.Paste" "F.Mask") (tstamp 12bda786-4058-4573-a175-b36ba04f69e4))
  (pad "K8" smd circle (at -0.2 0.6) (size 0.25 0.25) (layers "F.Cu" "F.Paste" "F.Mask") (tstamp f9ba905f-c9be-4792-bf62-4a400340a998))
  (pad "L8" smd circle (at -0.2 1) (size 0.25 0.25) (layers "F.Cu" "F.Paste" "F.Mask") (tstamp 6454f5e0-2ab9-46c2-8b15-34012e83bcde))
  (pad "P8" smd circle (at -0.2 2.2) (size 0.25 0.25) (layers "F.Cu" "F.Paste" "F.Mask") (tstamp b17c31e0-509e-4ae3-9a78-fa5626d0fd0f))
  (pad "R8" smd circle (at -0.2 2.6) (size 0.25 0.25) (layers "F.Cu" "F.Paste" "F.Mask") (tstamp cd9d1c34-4d24-49ff-aa31-29b2fc8b5e19))
  (pad "T8" smd circle (at -0.2 3) (size 0.25 0.25) (layers "F.Cu" "F.Paste" "F.Mask") (tstamp cca39ca1-e50a-424c-9361-8cf99ee37847))
  (pad "A9" smd circle (at 0.2 -3) (size 0.25 0.25) (layers "F.Cu" "F.Paste" "F.Mask") (tstamp e1eaf7cf-e837-47d5-816f-09331c3d4976))
  (pad "B9" smd circle (at 0.2 -2.6) (size 0.25 0.25) (layers "F.Cu" "F.Paste" "F.Mask") (tstamp 9feef269-7d5c-4d57-bb77-319797a34f44))
  (pad "C9" smd circle (at 0.2 -2.2) (size 0.25 0.25) (layers "F.Cu" "F.Paste" "F.Mask") (tstamp fc3693c3-ed01-4b6e-b6a5-9e788d5f7beb))
  (pad "F9" smd circle (at 0.2 -1) (size 0.25 0.25) (layers "F.Cu" "F.Paste" "F.Mask") (tstamp e52c0a76-ed61-4dba-80ec-0afcce2c4d6d))
  (pad "G9" smd circle (at 0.2 -0.6) (size 0.25 0.25) (layers "F.Cu" "F.Paste" "F.Mask") (tstamp 9d5323e2-aef9-4adf-b6bb-5b6ce796e409))
  (pad "H9" smd circle (at 0.2 -0.2) (size 0.25 0.25) (layers "F.Cu" "F.Paste" "F.Mask") (tstamp 7bdb9e3f-7e31-4c63-bb71-c6742c42ba24))
  (pad "J9" smd circle (at 0.2 0.2) (size 0.25 0.25) (layers "F.Cu" "F.Paste" "F.Mask") (tstamp 50dee751-5acc-491b-b29c-9d9cdf503fbe))
  (pad "K9" smd circle (at 0.2 0.6) (size 0.25 0.25) (layers "F.Cu" "F.Paste" "F.Mask") (tstamp 75ac021f-fec4-4a36-a11b-1cc8f1e076d6))
  (pad "L9" smd circle (at 0.2 1) (size 0.25 0.25) (layers "F.Cu" "F.Paste" "F.Mask") (tstamp 5ab9908a-7f0f-4437-b9d4-d25cda61ce8d))
  (pad "P9" smd circle (at 0.2 2.2) (size 0.25 0.25) (layers "F.Cu" "F.Paste" "F.Mask") (tstamp bdc3b73b-f2f7-4645-b432-fbf9d50eb917))
  (pad "R9" smd circle (at 0.2 2.6) (size 0.25 0.25) (layers "F.Cu" "F.Paste" "F.Mask") (tstamp 85386572-4861-4f41-a000-3e7ddfbae398))
  (pad "T9" smd circle (at 0.2 3) (size 0.25 0.25) (layers "F.Cu" "F.Paste" "F.Mask") (tstamp 8fe67f74-63d8-4b71-9710-71ac9291d7aa))
  (pad "A10" smd circle (at 0.6 -3) (size 0.25 0.25) (layers "F.Cu" "F.Paste" "F.Mask") (tstamp 0059c2b0-c6f7-4dfa-80bb-9e937f74ce0c))
  (pad "B10" smd circle (at 0.6 -2.6) (size 0.25 0.25) (layers "F.Cu" "F.Paste" "F.Mask") (tstamp 26bf1fe7-b98e-44f3-a816-6e458b9b9064))
  (pad "C10" smd circle (at 0.6 -2.2) (size 0.25 0.25) (layers "F.Cu" "F.Paste" "F.Mask") (tstamp 6b627138-402f-463a-9ac7-3a742fa75f15))
  (pad "F10" smd circle (at 0.6 -1) (size 0.25 0.25) (layers "F.Cu" "F.Paste" "F.Mask") (tstamp f43f71b6-4690-4855-9c06-ac99c1d3ff6c))
  (pad "G10" smd circle (at 0.6 -0.6) (size 0.25 0.25) (layers "F.Cu" "F.Paste" "F.Mask") (tstamp d5550aa0-4644-4771-ad27-cc16833b8117))
  (pad "H10" smd circle (at 0.6 -0.2) (size 0.25 0.25) (layers "F.Cu" "F.Paste" "F.Mask") (tstamp b70fb8ab-2f90-49d1-8a57-ac716b528122))
  (pad "J10" smd circle (at 0.6 0.2) (size 0.25 0.25) (layers "F.Cu" "F.Paste" "F.Mask") (tstamp e9aa4fbd-87d0-4e49-a5d1-597d1abcf4f3))
  (pad "K10" smd circle (at 0.6 0.6) (size 0.25 0.25) (layers "F.Cu" "F.Paste" "F.Mask") (tstamp 92532bfc-0aa1-4924-bf1d-51e2ea912cad))
  (pad "L10" smd circle (at 0.6 1) (size 0.25 0.25) (layers "F.Cu" "F.Paste" "F.Mask") (tstamp 40859ec6-ddf5-4a62-a9a5-2f94e81ac62a))
  (pad "P10" smd circle (at 0.6 2.2) (size 0.25 0.25) (layers "F.Cu" "F.Paste" "F.Mask") (tstamp fcd0506d-8940-4838-b94e-fb43255a120b))
  (pad "R10" smd circle (at 0.6 2.6) (size 0.25 0.25) (layers "F.Cu" "F.Paste" "F.Mask") (tstamp 32e76f1e-c8b4-4158-ab15-107e72bf0354))
  (pad "T10" smd circle (at 0.6 3) (size 0.25 0.25) (layers "F.Cu" "F.Paste" "F.Mask") (tstamp 9ed1d43e-89b6-4f6f-9541-ed1577466e8f))
  (pad "A11" smd circle (at 1 -3) (size 0.25 0.25) (layers "F.Cu" "F.Paste" "F.Mask") (tstamp 0e5f2769-807c-437d-9c4b-4a50e1ae6d84))
  (pad "B11" smd circle (at 1 -2.6) (size 0.25 0.25) (layers "F.Cu" "F.Paste" "F.Mask") (tstamp 3f613b57-1883-47a5-bd7d-4ac0ef471e9c))
  (pad "C11" smd circle (at 1 -2.2) (size 0.25 0.25) (layers "F.Cu" "F.Paste" "F.Mask") (tstamp 199e6429-8817-4838-815b-e13bb1c244f4))
  (pad "F11" smd circle (at 1 -1) (size 0.25 0.25) (layers "F.Cu" "F.Paste" "F.Mask") (tstamp 5220d5cc-d56b-47e2-8794-0ded869ed034))
  (pad "G11" smd circle (at 1 -0.6) (size 0.25 0.25) (layers "F.Cu" "F.Paste" "F.Mask") (tstamp 38f0270d-9faf-4b11-90f7-2bbf10ff4d21))
  (pad "H11" smd circle (at 1 -0.2) (size 0.25 0.25) (layers "F.Cu" "F.Paste" "F.Mask") (tstamp 039eb076-6a98-4195-a925-1a3528596e65))
  (pad "J11" smd circle (at 1 0.2) (size 0.25 0.25) (layers "F.Cu" "F.Paste" "F.Mask") (tstamp 2473aa86-1954-45ed-aa07-f7baeeb8aa4f))
  (pad "K11" smd circle (at 1 0.6) (size 0.25 0.25) (layers "F.Cu" "F.Paste" "F.Mask") (tstamp 8cb228c9-bbf9-45b6-8ed7-55fe892ef989))
  (pad "L11" smd circle (at 1 1) (size 0.25 0.25) (layers "F.Cu" "F.Paste" "F.Mask") (tstamp f14162eb-fc7a-4b2a-a6e7-8e449fc1e168))
  (pad "P11" smd circle (at 1 2.2) (size 0.25 0.25) (layers "F.Cu" "F.Paste" "F.Mask") (tstamp 35aab4ad-9c6c-4883-88a8-a076f5ea52aa))
  (pad "R11" smd circle (at 1 2.6) (size 0.25 0.25) (layers "F.Cu" "F.Paste" "F.Mask") (tstamp b76f9b1e-34b8-40cc-b70e-628fa104f52d))
  (pad "T11" smd circle (at 1 3) (size 0.25 0.25) (layers "F.Cu" "F.Paste" "F.Mask") (tstamp bab9029e-06ba-4a9f-a18a-03fdc5367f32))
  (pad "A12" smd circle (at 1.4 -3) (size 0.25 0.25) (layers "F.Cu" "F.Paste" "F.Mask") (tstamp 93d8da92-a6e4-4b86-a248-e4ba12e38bec))
  (pad "B12" smd circle (at 1.4 -2.6) (size 0.25 0.25) (layers "F.Cu" "F.Paste" "F.Mask") (tstamp 43e99c8c-27ee-4559-9475-201f0f01bf62))
  (pad "C12" smd circle (at 1.4 -2.2) (size 0.25 0.25) (layers "F.Cu" "F.Paste" "F.Mask") (tstamp d839887a-09f4-41f3-b296-d06e95b8bb22))
  (pad "P12" smd circle (at 1.4 2.2) (size 0.25 0.25) (layers "F.Cu" "F.Paste" "F.Mask") (tstamp a2f017e3-3bea-4a47-8a12-511fab7be25d))
  (pad "R12" smd circle (at 1.4 2.6) (size 0.25 0.25) (layers "F.Cu" "F.Paste" "F.Mask") (tstamp ffba75fb-9056-4e80-ba8a-a7158435bca9))
  (pad "T12" smd circle (at 1.4 3) (size 0.25 0.25) (layers "F.Cu" "F.Paste" "F.Mask") (tstamp 4ca2008f-5cd7-47f0-b07f-5d40ee439838))
  (pad "A13" smd circle (at 1.8 -3) (size 0.25 0.25) (layers "F.Cu" "F.Paste" "F.Mask") (tstamp abcea7cf-71bf-4704-a3b4-3af9c0a3acd3))
  (pad "B13" smd circle (at 1.8 -2.6) (size 0.25 0.25) (layers "F.Cu" "F.Paste" "F.Mask") (tstamp 905b73bc-5b7b-44a4-aaf1-956bd9d697b0))
  (pad "C13" smd circle (at 1.8 -2.2) (size 0.25 0.25) (layers "F.Cu" "F.Paste" "F.Mask") (tstamp a3b6cbe2-e9e1-41cc-83f2-ca12de39cfe6))
  (pad "P13" smd circle (at 1.8 2.2) (size 0.25 0.25) (layers "F.Cu" "F.Paste" "F.Mask") (tstamp e93cceee-5670-4de9-88d5-8c697e8799aa))
  (pad "R13" smd circle (at 1.8 2.6) (size 0.25 0.25) (layers "F.Cu" "F.Paste" "F.Mask") (tstamp 9965c1b8-4759-4e26-8657-679a4b7754d0))
  (pad "T13" smd circle (at 1.8 3) (size 0.25 0.25) (layers "F.Cu" "F.Paste" "F.Mask") (tstamp 2d98efae-5de7-41ed-8831-4e3672d639d7))
  (pad "A14" smd circle (at 2.2 -3) (size 0.25 0.25) (layers "F.Cu" "F.Paste" "F.Mask") (tstamp 8a43468f-fd11-422c-829f-882bdd8cf1c6))
  (pad "B14" smd circle (at 2.2 -2.6) (size 0.25 0.25) (layers "F.Cu" "F.Paste" "F.Mask") (tstamp 67f6baf6-296d-4eb2-bc88-fb4d24db9692))
  (pad "C14" smd circle (at 2.2 -2.2) (size 0.25 0.25) (layers "F.Cu" "F.Paste" "F.Mask") (tstamp a2fc9e34-326b-47bc-b08f-766397d98fa8))
  (pad "D14" smd circle (at 2.2 -1.8) (size 0.25 0.25) (layers "F.Cu" "F.Paste" "F.Mask") (tstamp 34dda654-ad7e-4483-a5c9-b7497b0918a2))
  (pad "E14" smd circle (at 2.2 -1.4) (size 0.25 0.25) (layers "F.Cu" "F.Paste" "F.Mask") (tstamp 04de381c-baf8-4405-996f-14468cbe6454))
  (pad "F14" smd circle (at 2.2 -1) (size 0.25 0.25) (layers "F.Cu" "F.Paste" "F.Mask") (tstamp 48bc910e-53aa-421d-82e5-02780cf3d234))
  (pad "G14" smd circle (at 2.2 -0.6) (size 0.25 0.25) (layers "F.Cu" "F.Paste" "F.Mask") (tstamp 250820a8-f6e7-46cd-9b7b-f4e5c5885011))
  (pad "H14" smd circle (at 2.2 -0.2) (size 0.25 0.25) (layers "F.Cu" "F.Paste" "F.Mask") (tstamp 4378fbe5-3999-49b2-8bd6-71db360a6520))
  (pad "J14" smd circle (at 2.2 0.2) (size 0.25 0.25) (layers "F.Cu" "F.Paste" "F.Mask") (tstamp afd2a21a-9245-4186-a935-d068321abcbb))
  (pad "K14" smd circle (at 2.2 0.6) (size 0.25 0.25) (layers "F.Cu" "F.Paste" "F.Mask") (tstamp d98b5bfd-20df-4320-8878-223ae9b0101b))
  (pad "L14" smd circle (at 2.2 1) (size 0.25 0.25) (layers "F.Cu" "F.Paste" "F.Mask") (tstamp 62b52635-8ff9-4f8a-b9e1-8967823a5e95))
  (pad "M14" smd circle (at 2.2 1.4) (size 0.25 0.25) (layers "F.Cu" "F.Paste" "F.Mask") (tstamp 6f6e3b7b-87a0-4b84-9f17-47c1c9a75dc4))
  (pad "N14" smd circle (at 2.2 1.8) (size 0.25 0.25) (layers "F.Cu" "F.Paste" "F.Mask") (tstamp 0fff0b86-0203-42ee-9162-d0f39fa18f74))
  (pad "P14" smd circle (at 2.2 2.2) (size 0.25 0.25) (layers "F.Cu" "F.Paste" "F.Mask") (tstamp 005ab81b-d5ca-4431-bd9a-f2f6081cf4ce))
  (pad "R14" smd circle (at 2.2 2.6) (size 0.25 0.25) (layers "F.Cu" "F.Paste" "F.Mask") (tstamp 294cb674-5bed-4121-b4c6-9c4e82ce4931))
  (pad "T14" smd circle (at 2.2 3) (size 0.25 0.25) (layers "F.Cu" "F.Paste" "F.Mask") (tstamp 6d4cb9fe-df54-4e2b-8c2b-384e5e16c0cb))
  (pad "A15" smd circle (at 2.6 -3) (size 0.25 0.25) (layers "F.Cu" "F.Paste" "F.Mask") (tstamp 260e890d-d411-4933-b98a-58383018fd9e))
  (pad "B15" smd circle (at 2.6 -2.6) (size 0.25 0.25) (layers "F.Cu" "F.Paste" "F.Mask") (tstamp 8e946198-1296-45bf-8b2f-d61c2604f097))
  (pad "C15" smd circle (at 2.6 -2.2) (size 0.25 0.25) (layers "F.Cu" "F.Paste" "F.Mask") (tstamp ff7a4666-492d-4770-9d94-5079795b3879))
  (pad "D15" smd circle (at 2.6 -1.8) (size 0.25 0.25) (layers "F.Cu" "F.Paste" "F.Mask") (tstamp f09064f5-d4bb-4bcc-95fc-90b92e53efa0))
  (pad "E15" smd circle (at 2.6 -1.4) (size 0.25 0.25) (layers "F.Cu" "F.Paste" "F.Mask") (tstamp 976e0935-2b1d-4683-9ac4-09699ede82bf))
  (pad "F15" smd circle (at 2.6 -1) (size 0.25 0.25) (layers "F.Cu" "F.Paste" "F.Mask") (tstamp e9fd811f-adfd-45fb-abab-ff70b0d5d440))
  (pad "G15" smd circle (at 2.6 -0.6) (size 0.25 0.25) (layers "F.Cu" "F.Paste" "F.Mask") (tstamp 9485d1d7-c496-404a-b0fc-1806b3a7ba18))
  (pad "H15" smd circle (at 2.6 -0.2) (size 0.25 0.25) (layers "F.Cu" "F.Paste" "F.Mask") (tstamp e142872b-d905-4957-821c-bb2d259f9b19))
  (pad "J15" smd circle (at 2.6 0.2) (size 0.25 0.25) (layers "F.Cu" "F.Paste" "F.Mask") (tstamp 6adfff8f-2213-4fbb-9733-56428cf44129))
  (pad "K15" smd circle (at 2.6 0.6) (size 0.25 0.25) (layers "F.Cu" "F.Paste" "F.Mask") (tstamp 03f1d8ae-c0a8-4703-95a0-4bc2f14b4841))
  (pad "L15" smd circle (at 2.6 1) (size 0.25 0.25) (layers "F.Cu" "F.Paste" "F.Mask") (tstamp 433e7438-9315-41fb-aa62-803d267e5e20))
  (pad "M15" smd circle (at 2.6 1.4) (size 0.25 0.25) (layers "F.Cu" "F.Paste" "F.Mask") (tstamp 9d262491-b2d3-4f16-996e-26010de344be))
  (pad "N15" smd circle (at 2.6 1.8) (size 0.25 0.25) (layers "F.Cu" "F.Paste" "F.Mask") (tstamp 9e277170-5df6-40d3-ba94-e626d1cc5622))
  (pad "P15" smd circle (at 2.6 2.2) (size 0.25 0.25) (layers "F.Cu" "F.Paste" "F.Mask") (tstamp 5ecdca78-b69b-444c-b68e-d9a936435b1e))
  (pad "R15" smd circle (at 2.6 2.6) (size 0.25 0.25) (layers "F.Cu" "F.Paste" "F.Mask") (tstamp 2f616935-0f29-4a33-99ec-81dfdaaf6425))
  (pad "T15" smd circle (at 2.6 3) (size 0.25 0.25) (layers "F.Cu" "F.Paste" "F.Mask") (tstamp 2bb59d8a-753a-4986-9d68-bdfde811fb95))
  (pad "A16" smd circle (at 3 -3) (size 0.25 0.25) (layers "F.Cu" "F.Paste" "F.Mask") (tstamp 7c57c64e-9888-47aa-a7e3-41b06be9320e))
  (pad "B16" smd circle (at 3 -2.6) (size 0.25 0.25) (layers "F.Cu" "F.Paste" "F.Mask") (tstamp 8d9ea566-0982-4cec-9ff0-f8fff243e7c8))
  (pad "C16" smd circle (at 3 -2.2) (size 0.25 0.25) (layers "F.Cu" "F.Paste" "F.Mask") (tstamp f6f5bb60-63f0-4a41-ab89-4433753841e4))
  (pad "D16" smd circle (at 3 -1.8) (size 0.25 0.25) (layers "F.Cu" "F.Paste" "F.Mask") (tstamp d3da40b1-945b-4511-a19c-a0686c4e1f0e))
  (pad "E16" smd circle (at 3 -1.4) (size 0.25 0.25) (layers "F.Cu" "F.Paste" "F.Mask") (tstamp b27ef9b5-65bd-4c9a-a2af-7b725a51f843))
  (pad "F16" smd circle (at 3 -1) (size 0.25 0.25) (layers "F.Cu" "F.Paste" "F.Mask") (tstamp 37ab9ddb-3a49-40ae-88d9-fcb29412d93e))
  (pad "G16" smd circle (at 3 -0.6) (size 0.25 0.25) (layers "F.Cu" "F.Paste" "F.Mask") (tstamp 910627c0-1c1f-4c44-adeb-ccac63adfd97))
  (pad "H16" smd circle (at 3 -0.2) (size 0.25 0.25) (layers "F.Cu" "F.Paste" "F.Mask") (tstamp 15de766c-6de3-4552-97dd-4f4146001cb3))
  (pad "J16" smd circle (at 3 0.2) (size 0.25 0.25) (layers "F.Cu" "F.Paste" "F.Mask") (tstamp 34022a28-96fa-4c1e-8d81-d9709a8ee75f))
  (pad "K16" smd circle (at 3 0.6) (size 0.25 0.25) (layers "F.Cu" "F.Paste" "F.Mask") (tstamp 0162cf64-a523-4856-9339-d0676551204e))
  (pad "L16" smd circle (at 3 1) (size 0.25 0.25) (layers "F.Cu" "F.Paste" "F.Mask") (tstamp 8673bba3-1bcb-458a-bd23-46c1bcb75a8b))
  (pad "M16" smd circle (at 3 1.4) (size 0.25 0.25) (layers "F.Cu" "F.Paste" "F.Mask") (tstamp 626a67e5-a01b-4159-97c2-8b7f54c503cd))
  (pad "N16" smd circle (at 3 1.8) (size 0.25 0.25) (layers "F.Cu" "F.Paste" "F.Mask") (tstamp 0d746d32-c484-44af-aed3-b74b076ed4f4))
  (pad "P16" smd circle (at 3 2.2) (size 0.25 0.25) (layers "F.Cu" "F.Paste" "F.Mask") (tstamp a70ee342-b705-4636-92cd-e8b000e18c69))
  (pad "R16" smd circle (at 3 2.6) (size 0.25 0.25) (layers "F.Cu" "F.Paste" "F.Mask") (tstamp 3baff0c3-9c0c-4d96-b1a6-b63e183fc277))
  (pad "T16" smd circle (at 3 3) (size 0.25 0.25) (layers "F.Cu" "F.Paste" "F.Mask") (tstamp be02784d-a1b6-41f0-aed7-ff6e34e3704c))
  (model "${KICADLIB}/model/BGA/BGA192N40P16X16_700X700X83.step"
    (offset (xyz 0 0 0.18))
    (scale (xyz 1 1 1))
    (rotate (xyz 0 0 0))
  )
)
