(footprint "VSSOP50P230X200-8" (version 20221018) (generator pcbnew)
  (layer "F.Cu")
  (descr "VSSOP-8 2.3x2mm Pitch 0.5mm")
  (tags "VSSOP-8 2.3x2mm Pitch 0.5mm")
  (attr smd)
  (fp_text reference "REF**" (at 0 -1.8) (layer "F.SilkS")
      (effects (font (size 1 1) (thickness 0.15)))
    (tstamp c01dfdb4-0c4a-4e70-9f5b-9fab46c78a4d)
  )
  (fp_text value "VSSOP50P230X200-8" (at 0 2.2) (layer "F.Fab") hide
      (effects (font (size 1 1) (thickness 0.15)))
    (tstamp 31fa42fd-1359-458d-a5ac-77976d01bccb)
  )
  (fp_text user "^" (at -2.65 -0.75 -90 unlocked) (layer "F.SilkS")
      (effects (font (size 1 1) (thickness 0.15)))
    (tstamp 33c1df4e-ab26-424a-90a9-c8aaedfabcd4)
  )
  (fp_text user "${REFERENCE}" (at 0 0) (layer "F.Fab")
      (effects (font (size 0.5 0.5) (thickness 0.1)))
    (tstamp 2602c254-18ff-4b9f-ab44-99704f6b9796)
  )
  (fp_line (start 1.15 -1) (end -1.15 -1)
    (stroke (width 0.12) (type solid)) (layer "F.SilkS") (tstamp 41fbd412-9516-4cb3-b011-faaa70fac078))
  (fp_line (start 1.15 1) (end -1.15 1)
    (stroke (width 0.12) (type solid)) (layer "F.SilkS") (tstamp 5f144730-b93a-4742-9188-7b78ea57e24d))
  (fp_line (start -2.25 -1.25) (end 2.25 -1.25)
    (stroke (width 0.05) (type solid)) (layer "F.CrtYd") (tstamp 4635794c-7814-43d4-b2fb-07ef2448c3ab))
  (fp_line (start -2.25 1.25) (end -2.25 -1.25)
    (stroke (width 0.05) (type solid)) (layer "F.CrtYd") (tstamp c261873e-86c2-4ae9-ae71-ff86da8600ba))
  (fp_line (start 2.25 -1.25) (end 2.25 1.25)
    (stroke (width 0.05) (type solid)) (layer "F.CrtYd") (tstamp 1c637065-ec12-4926-a4f8-bc0a4fd7ee42))
  (fp_line (start 2.25 1.25) (end -2.25 1.25)
    (stroke (width 0.05) (type solid)) (layer "F.CrtYd") (tstamp 6878e95f-11b2-432d-8476-fc1613046a6e))
  (fp_line (start -1.15 -0.35) (end -1.15 1)
    (stroke (width 0.1) (type solid)) (layer "F.Fab") (tstamp b7052a89-b061-4246-99d8-398c92d6ae8a))
  (fp_line (start -1.15 1) (end 1.15 1)
    (stroke (width 0.1) (type solid)) (layer "F.Fab") (tstamp 386eec3b-b865-474f-ba98-9210e5a54f3f))
  (fp_line (start -0.5 -1) (end -1.15 -0.35)
    (stroke (width 0.1) (type solid)) (layer "F.Fab") (tstamp 3584c0cb-5a88-4593-9e9e-12401a0e842c))
  (fp_line (start 1.15 -1) (end -0.5 -1)
    (stroke (width 0.1) (type solid)) (layer "F.Fab") (tstamp 4d92de23-e109-4c9b-91bc-980e731ef43a))
  (fp_line (start 1.15 1) (end 1.15 -1)
    (stroke (width 0.1) (type solid)) (layer "F.Fab") (tstamp 05b7465f-a059-4355-b041-591654d2f178))
  (pad "1" smd roundrect (at -1.55 -0.75 270) (size 0.3 0.8) (layers "F.Cu" "F.Paste" "F.Mask") (roundrect_rratio 0.1666666667) (tstamp 08ebda72-1c14-456c-8d7e-6e6558d836fd))
  (pad "2" smd roundrect (at -1.55 -0.25 270) (size 0.3 0.8) (layers "F.Cu" "F.Paste" "F.Mask") (roundrect_rratio 0.1666666667) (tstamp f69a1e01-edc8-4fee-8541-52e68de6f92d))
  (pad "3" smd roundrect (at -1.55 0.25 270) (size 0.3 0.8) (layers "F.Cu" "F.Paste" "F.Mask") (roundrect_rratio 0.1666666667) (tstamp 220d532b-c9c5-465a-b0d3-ecc2673882dc))
  (pad "4" smd roundrect (at -1.55 0.75 270) (size 0.3 0.8) (layers "F.Cu" "F.Paste" "F.Mask") (roundrect_rratio 0.1666666667) (tstamp fa66c175-7356-40d9-a8e9-21a67d3a9803))
  (pad "5" smd roundrect (at 1.55 0.75 270) (size 0.3 0.8) (layers "F.Cu" "F.Paste" "F.Mask") (roundrect_rratio 0.1666666667) (tstamp 30777994-895d-4037-8b9e-bcb1dba82a03))
  (pad "6" smd roundrect (at 1.55 0.25 270) (size 0.3 0.8) (layers "F.Cu" "F.Paste" "F.Mask") (roundrect_rratio 0.1666666667) (tstamp 4699c205-10f9-4fcb-9a65-e031b394765e))
  (pad "7" smd roundrect (at 1.55 -0.25 270) (size 0.3 0.8) (layers "F.Cu" "F.Paste" "F.Mask") (roundrect_rratio 0.1666666667) (tstamp 4806f5db-876c-4408-bacc-220d0bd9af33))
  (pad "8" smd roundrect (at 1.55 -0.75 270) (size 0.3 0.8) (layers "F.Cu" "F.Paste" "F.Mask") (roundrect_rratio 0.1666666667) (tstamp f5ba2e00-625c-4549-b2a8-ffc7c0824c60))
  (model "${KICADLIB}/model/SO/VSSOP50P230X200-8.step"
    (offset (xyz 0 0 0))
    (scale (xyz 1 1 1))
    (rotate (xyz 0 0 0))
  )
)
