(footprint "PinHeader_2x04_P1.27mm_Vertical" (version 20211014) (generator pcbnew)
  (layer "F.Cu")
  (tedit 6116C8AB)
  (descr "Through hole straight pin header, 2x04, 1.27mm pitch, double rows")
  (tags "Through hole pin header THT 2x04 1.27mm double row")
  (attr through_hole)
  (fp_text reference "REF**" (at 0.635 -1.695) (layer "F.SilkS")
    (effects (font (size 1 1) (thickness 0.15)))
    (tstamp 72abd8ac-17d9-46bf-8804-bafb9ec07640)
  )
  (fp_text value "PinHeader_2x04_P1.27mm_Vertical" (at 0.635 5.505) (layer "F.Fab") hide
    (effects (font (size 1 1) (thickness 0.15)))
    (tstamp 731b2c86-d88a-4b83-a198-05966828dd81)
  )
  (fp_text user "${REFERENCE}" (at 0.635 1.905 90) (layer "F.Fab")
    (effects (font (size 1 1) (thickness 0.15)))
    (tstamp 2349e277-a7a9-4c9f-be40-3db434688024)
  )
  (fp_line (start 0.30753 4.505) (end 0.96247 4.505) (layer "F.SilkS") (width 0.12) (tstamp 0f802763-c037-4030-b3be-c39fa640463c))
  (fp_line (start 1.57753 4.505) (end 2.4 4.505) (layer "F.SilkS") (width 0.12) (tstamp 22931539-5ec1-4578-a4c5-b69fc73e7a3c))
  (fp_line (start 0.563471 0.76) (end 0.706529 0.76) (layer "F.SilkS") (width 0.12) (tstamp 2f7ddd43-ad72-4ed3-af89-bc9e8393e336))
  (fp_line (start -1.13 -0.76) (end 0 -0.76) (layer "F.SilkS") (width 0.12) (tstamp 4424c434-f2c8-4bff-8068-2119a8c9e873))
  (fp_line (start -1.13 0.76) (end -0.563471 0.76) (layer "F.SilkS") (width 0.12) (tstamp 45359fb6-0950-41ab-a4fa-59f6f56a22dc))
  (fp_line (start 1.57753 -0.695) (end 2.4 -0.695) (layer "F.SilkS") (width 0.12) (tstamp 483d1c16-2a1d-4b6b-859c-d05dfbfa23a1))
  (fp_line (start -1.13 4.505) (end -0.30753 4.505) (layer "F.SilkS") (width 0.12) (tstamp 4cf8ef10-8741-4b0e-843a-959cf276d9c3))
  (fp_line (start 2.4 -0.695) (end 2.4 4.505) (layer "F.SilkS") (width 0.12) (tstamp 64395b46-100c-4e7f-b9db-87f48c282352))
  (fp_line (start -1.13 0.76) (end -1.13 4.505) (layer "F.SilkS") (width 0.12) (tstamp 833c1574-82f9-4c18-9280-9147e055adf9))
  (fp_line (start -1.13 0) (end -1.13 -0.76) (layer "F.SilkS") (width 0.12) (tstamp a5f789e6-1cc4-470f-a9f2-1da3925ef137))
  (fp_line (start 0.76 0.706529) (end 0.76 0.563471) (layer "F.SilkS") (width 0.12) (tstamp a9afbf88-7145-42fb-9ac0-da85849a8a31))
  (fp_line (start 0.76 -0.563471) (end 0.76 -0.695) (layer "F.SilkS") (width 0.12) (tstamp bc48a9c6-1d05-44ef-ab0c-a905bd7c4661))
  (fp_line (start 0.76 -0.695) (end 0.96247 -0.695) (layer "F.SilkS") (width 0.12) (tstamp f6ddf1b3-57be-4762-975d-d593d881d69c))
  (fp_line (start 2.85 -1.15) (end -1.6 -1.15) (layer "F.CrtYd") (width 0.05) (tstamp 2f076ec0-fd09-4aa3-b698-d28afceddb1e))
  (fp_line (start -1.6 -1.15) (end -1.6 4.95) (layer "F.CrtYd") (width 0.05) (tstamp 72ee0794-b704-42b8-a86e-04b4a92144e4))
  (fp_line (start -1.6 4.95) (end 2.85 4.95) (layer "F.CrtYd") (width 0.05) (tstamp 8529dc82-bdc9-4331-91fa-f29f9792fd9d))
  (fp_line (start 2.85 4.95) (end 2.85 -1.15) (layer "F.CrtYd") (width 0.05) (tstamp a62b571a-3317-4f5a-ace4-d8dbb85f6141))
  (fp_line (start -1.07 4.445) (end -1.07 0.2175) (layer "F.Fab") (width 0.1) (tstamp 2ccf1d1c-036c-422b-be15-dc26b4484f66))
  (fp_line (start -0.2175 -0.635) (end 2.34 -0.635) (layer "F.Fab") (width 0.1) (tstamp 3b24b449-aaa1-44d0-b607-7747b1222243))
  (fp_line (start 2.34 4.445) (end -1.07 4.445) (layer "F.Fab") (width 0.1) (tstamp 4ee524df-7bd7-4f56-828d-26ba4b023327))
  (fp_line (start 2.34 -0.635) (end 2.34 4.445) (layer "F.Fab") (width 0.1) (tstamp 72d06c7f-a344-4496-9dbc-04550f4c3a8c))
  (fp_line (start -1.07 0.2175) (end -0.2175 -0.635) (layer "F.Fab") (width 0.1) (tstamp a7778c6b-433b-41b3-b8a7-c197e238cf8f))
  (pad "1" thru_hole rect (at 0 0) (size 1 1) (drill 0.65) (layers *.Cu *.Mask) (tstamp d231e710-cdbc-41c8-b592-6c928fd7ee5f))
  (pad "2" thru_hole oval (at 1.27 0) (size 1 1) (drill 0.65) (layers *.Cu *.Mask) (tstamp c957b280-214f-4ee0-b4a9-28fd954b498d))
  (pad "3" thru_hole oval (at 0 1.27) (size 1 1) (drill 0.65) (layers *.Cu *.Mask) (tstamp eb08efa1-206c-48bf-a851-3a70c5fe52bf))
  (pad "4" thru_hole oval (at 1.27 1.27) (size 1 1) (drill 0.65) (layers *.Cu *.Mask) (tstamp 7721cfa6-d918-4a2b-8bd6-2d43df361c1e))
  (pad "5" thru_hole oval (at 0 2.54) (size 1 1) (drill 0.65) (layers *.Cu *.Mask) (tstamp 5c1e3d6d-8060-4098-b78f-6f8732b15c71))
  (pad "6" thru_hole oval (at 1.27 2.54) (size 1 1) (drill 0.65) (layers *.Cu *.Mask) (tstamp bd6aafbe-4d59-46de-afdc-abdb56fc99cc))
  (pad "7" thru_hole oval (at 0 3.81) (size 1 1) (drill 0.65) (layers *.Cu *.Mask) (tstamp b83a18dc-06ac-42ec-94ea-c0c1138f0734))
  (pad "8" thru_hole oval (at 1.27 3.81) (size 1 1) (drill 0.65) (layers *.Cu *.Mask) (tstamp 68ff713c-1cf5-4475-acf6-1351e336a086))
  (model "${KICADLIB}/model/connector/PinHeader_2x04_P1.27mm_Vertical.step"
    (offset (xyz 0 0 0))
    (scale (xyz 1 1 1))
    (rotate (xyz 0 0 0))
  )
)
