(footprint "INDP6363" (version 20211014) (generator pcbnew)
  (layer "F.Cu")
  (tedit 63977867)
  (attr smd)
  (fp_text reference "REF**" (at 0 -3.7) (layer "F.SilkS")
    (effects (font (size 1 1) (thickness 0.15)))
    (tstamp c6d0dc9f-aad2-482a-8d03-1323921e12d6)
  )
  (fp_text value "INDP6363" (at 0 4.35) (layer "F.Fab") hide
    (effects (font (size 1 1) (thickness 0.15)))
    (tstamp 228007a8-cdee-4e3b-b3f5-16b565d4a224)
  )
  (fp_text user "${REFERENCE}" (at 0 0) (layer "F.Fab")
    (effects (font (size 1 1) (thickness 0.15)))
    (tstamp c6fc6220-3c84-48d1-8e77-e4f3c9df3ab5)
  )
  (fp_line (start -3 3) (end 3 3) (layer "F.SilkS") (width 0.127) (tstamp 6051d711-739d-4bb4-8c96-503d48a57ec7))
  (fp_line (start -3 -3) (end 3 -3) (layer "F.SilkS") (width 0.127) (tstamp e467b135-d5fe-4419-8c94-69cdb4c74d04))
  (fp_line (start -3.4 3.25) (end -3.4 -3.25) (layer "F.CrtYd") (width 0.05) (tstamp 3bab9ce6-d02f-4662-9c34-ce497b4f41dc))
  (fp_line (start 3.4 -3.25) (end 3.4 3.25) (layer "F.CrtYd") (width 0.05) (tstamp 79741eb6-bc30-4b74-a9c9-e7b8f9b27e9f))
  (fp_line (start -3.4 -3.25) (end 3.4 -3.25) (layer "F.CrtYd") (width 0.05) (tstamp 84569032-9105-4557-b55b-04c3607d6b20))
  (fp_line (start 3.4 3.25) (end -3.4 3.25) (layer "F.CrtYd") (width 0.05) (tstamp d85c4064-a569-41ad-97ca-6feb30390a0a))
  (fp_poly (pts
      (xy -3 3)
      (xy 3 3)
      (xy 3 -3)
      (xy -2.5 -3)
      (xy -3 -2.5)
    ) (layer "F.Fab") (width 0.127) (fill none) (tstamp 5b18cb0e-7674-4ec1-b709-6b40cfa8ad09))
  (pad "" smd roundrect (at -2.35 0.8 180) (size 1.5 1.2) (layers "F.Paste") (roundrect_rratio 0.05) (tstamp 3dcbab11-325c-4418-b292-ae277cae2623))
  (pad "" smd roundrect (at 2.35 -0.8 180) (size 1.5 1.2) (layers "F.Paste") (roundrect_rratio 0.05) (tstamp 69837904-2e32-484c-a9bb-5e3a02a766a3))
  (pad "" smd roundrect (at 2.35 2.3 180) (size 1.5 1) (layers "F.Paste") (roundrect_rratio 0.05) (tstamp 6eaf88ca-f9d7-44ef-a732-c82f3486c5d6))
  (pad "" smd roundrect (at 2.35 -2.3 180) (size 1.5 1) (layers "F.Paste") (roundrect_rratio 0.05) (tstamp 7aa40bcb-582b-410a-96c4-848354c87e5a))
  (pad "" smd roundrect (at 2.35 0.8 180) (size 1.5 1.2) (layers "F.Paste") (roundrect_rratio 0.05) (tstamp 8011001b-b6a6-4df6-8f43-93a9d32a9be9))
  (pad "" smd roundrect (at -2.35 2.3 180) (size 1.5 1) (layers "F.Paste") (roundrect_rratio 0.05) (tstamp 97f3a8b2-c5af-41dd-b36a-168e7ef6c110))
  (pad "" smd roundrect (at -2.35 -2.3 180) (size 1.5 1) (layers "F.Paste") (roundrect_rratio 0.05) (tstamp c4d887c4-1bc9-4522-90a0-dd8d261fe90d))
  (pad "" smd roundrect (at -2.35 -0.8 180) (size 1.5 1.2) (layers "F.Paste") (roundrect_rratio 0.05) (tstamp cd19ba3e-8f64-421b-a858-64323d551fbc))
  (pad "1" smd roundrect (at -2.35 0 90) (size 5.7 1.6) (layers "F.Cu" "F.Mask") (roundrect_rratio 0.03125) (tstamp a8c57700-f713-43b7-85f0-0bace54c844d))
  (pad "2" smd roundrect (at 2.35 0 90) (size 5.7 1.6) (layers "F.Cu" "F.Mask") (roundrect_rratio 0.03125) (tstamp e6297034-cfb4-49eb-8419-1876120819a6))
  (model "${KICADLIB}/model/passive/INDP6363.step"
    (offset (xyz 0 0 0))
    (scale (xyz 1 1 1))
    (rotate (xyz -90 0 90))
  )
)
