(footprint "PinHeader_1x10_P1.27mm_Vertical" (version 20211014) (generator pcbnew)
  (layer "F.Cu")
  (tedit 6116C7AF)
  (descr "Through hole straight pin header, 1x10, 1.27mm pitch, single row")
  (tags "Through hole pin header THT 1x10 1.27mm single row")
  (attr through_hole)
  (fp_text reference "REF**" (at 0 -1.695) (layer "F.SilkS")
    (effects (font (size 1 1) (thickness 0.15)))
    (tstamp d1583221-3b88-4e48-a20c-85356dadd6fe)
  )
  (fp_text value "PinHeader_1x10_P1.27mm_Vertical" (at 0 13.125) (layer "F.Fab") hide
    (effects (font (size 1 1) (thickness 0.15)))
    (tstamp ce9cd960-3df6-471c-9d2c-10ec225884a5)
  )
  (fp_text user "${REFERENCE}" (at 0 5.715 90) (layer "F.Fab")
    (effects (font (size 1 1) (thickness 0.15)))
    (tstamp 4a20e970-2f6e-494b-beba-a108783af5ff)
  )
  (fp_line (start 1.11 0.76) (end 1.11 12.125) (layer "F.SilkS") (width 0.12) (tstamp 452d365a-01c4-4a35-870b-0df68b6fcf02))
  (fp_line (start 0.30753 12.125) (end 1.11 12.125) (layer "F.SilkS") (width 0.12) (tstamp 4d2a1f45-1423-4709-818e-09fff0fd61e4))
  (fp_line (start -1.11 0.76) (end -1.11 12.125) (layer "F.SilkS") (width 0.12) (tstamp 4fdd6782-79a8-40e3-b37f-8659bd2d0824))
  (fp_line (start 0.563471 0.76) (end 1.11 0.76) (layer "F.SilkS") (width 0.12) (tstamp 69496076-eafb-4095-b54d-2d13193ea07a))
  (fp_line (start -1.11 12.125) (end -0.30753 12.125) (layer "F.SilkS") (width 0.12) (tstamp 6e8a384d-1298-4df6-bdfc-1a28c1c4229f))
  (fp_line (start -1.11 -0.76) (end 0 -0.76) (layer "F.SilkS") (width 0.12) (tstamp 99e959dd-208d-45df-a7d7-f3499808d56c))
  (fp_line (start -1.11 0) (end -1.11 -0.76) (layer "F.SilkS") (width 0.12) (tstamp aaee9d67-eced-4e4e-bc44-685c466e2bb2))
  (fp_line (start -1.11 0.76) (end -0.563471 0.76) (layer "F.SilkS") (width 0.12) (tstamp e7f8171d-9d1a-49df-a0c4-95024aa90722))
  (fp_line (start -1.55 12.6) (end 1.55 12.6) (layer "F.CrtYd") (width 0.05) (tstamp 33b52104-ea6a-49a9-8131-e01367a45080))
  (fp_line (start 1.55 12.6) (end 1.55 -1.15) (layer "F.CrtYd") (width 0.05) (tstamp 37574a7d-1b7f-4266-a912-46e212e1eec3))
  (fp_line (start -1.55 -1.15) (end -1.55 12.6) (layer "F.CrtYd") (width 0.05) (tstamp 4fcbaca7-75a9-4c01-9f12-fb15e20f0dfd))
  (fp_line (start 1.55 -1.15) (end -1.55 -1.15) (layer "F.CrtYd") (width 0.05) (tstamp 6d06222e-b0f5-4423-b93f-1b90069307c3))
  (fp_line (start 1.05 -0.635) (end 1.05 12.065) (layer "F.Fab") (width 0.1) (tstamp 729424bc-4bf9-4182-b078-18fecfc19518))
  (fp_line (start -1.05 12.065) (end -1.05 -0.11) (layer "F.Fab") (width 0.1) (tstamp 86633059-3d65-4718-905c-92429f9626ac))
  (fp_line (start 1.05 12.065) (end -1.05 12.065) (layer "F.Fab") (width 0.1) (tstamp 92cb66d2-f527-491a-ac5b-9f788f5b3632))
  (fp_line (start -0.525 -0.635) (end 1.05 -0.635) (layer "F.Fab") (width 0.1) (tstamp d6d6b045-3bd3-4085-a981-5bdebad41f20))
  (fp_line (start -1.05 -0.11) (end -0.525 -0.635) (layer "F.Fab") (width 0.1) (tstamp f132fdc0-7f73-4aa0-a402-39dcc42d3ffb))
  (pad "1" thru_hole rect (at 0 0) (size 1 1) (drill 0.65) (layers *.Cu *.Mask) (tstamp 0a38187a-b6b7-41b1-8c2c-103675f72d33))
  (pad "2" thru_hole oval (at 0 1.27) (size 1 1) (drill 0.65) (layers *.Cu *.Mask) (tstamp 1e9eec39-15e0-41b9-bb19-4af858404875))
  (pad "3" thru_hole oval (at 0 2.54) (size 1 1) (drill 0.65) (layers *.Cu *.Mask) (tstamp b30a8db4-7846-4076-b97d-2d93914d60e5))
  (pad "4" thru_hole oval (at 0 3.81) (size 1 1) (drill 0.65) (layers *.Cu *.Mask) (tstamp a0c96fe4-4a50-4546-9289-764ef676d5e8))
  (pad "5" thru_hole oval (at 0 5.08) (size 1 1) (drill 0.65) (layers *.Cu *.Mask) (tstamp c2149559-52a2-47ee-bbd1-6bf2783f0906))
  (pad "6" thru_hole oval (at 0 6.35) (size 1 1) (drill 0.65) (layers *.Cu *.Mask) (tstamp aa7608bb-4fac-4862-a48e-cd3d9105af59))
  (pad "7" thru_hole oval (at 0 7.62) (size 1 1) (drill 0.65) (layers *.Cu *.Mask) (tstamp b8d2417b-1c42-4b2c-880b-c76679f67126))
  (pad "8" thru_hole oval (at 0 8.89) (size 1 1) (drill 0.65) (layers *.Cu *.Mask) (tstamp 6dad8a54-8e62-426e-9930-62cf27adbcec))
  (pad "9" thru_hole oval (at 0 10.16) (size 1 1) (drill 0.65) (layers *.Cu *.Mask) (tstamp 5fef29aa-2102-4476-8e27-060fbd100427))
  (pad "10" thru_hole oval (at 0 11.43) (size 1 1) (drill 0.65) (layers *.Cu *.Mask) (tstamp bf96fb3b-c4a0-4d15-b6a1-293c3eaf93af))
  (model "${KICADLIB}/model/connector/PinHeader_1x10_P1.27mm_Vertical.step"
    (offset (xyz 0 0 0))
    (scale (xyz 1 1 1))
    (rotate (xyz 0 0 0))
  )
)
