(module C&K_PN12SJNA03QE (layer F.Cu) (tedit 5CFD6098)
  (fp_text reference REF** (at -7.41 0.01 90) (layer F.SilkS)
    (effects (font (size 1 1) (thickness 0.15)))
  )
  (fp_text value C&K_PN12SJNA03QE (at -0.01 -3.84) (layer F.Fab)
    (effects (font (size 1 1) (thickness 0.15)))
  )
  (fp_line (start -6.01 2.49) (end 5.99 2.49) (layer F.SilkS) (width 0.15))
  (fp_line (start 5.99 2.49) (end 5.99 -1.16) (layer F.SilkS) (width 0.15))
  (fp_line (start -6.01 2.49) (end -6.01 2.24) (layer F.SilkS) (width 0.15))
  (fp_line (start -6.01 0.17) (end -6.01 -2.5) (layer F.SilkS) (width 0.15))
  (fp_line (start -6.01 -2.5) (end 4.54 -2.5) (layer F.SilkS) (width 0.15))
  (pad 3 thru_hole circle (at 2.5 0) (size 1.6 1.6) (drill 0.9) (layers *.Cu *.Mask))
  (pad 2 thru_hole circle (at 0 0) (size 1.6 1.6) (drill 0.9) (layers *.Cu *.Mask))
  (pad 1 thru_hole circle (at -2.5 0) (size 1.6 1.6) (drill 0.9) (layers *.Cu *.Mask))
  (pad "" thru_hole circle (at -5.7 1.2) (size 2 2) (drill 1.1) (layers *.Cu *.Mask))
  (pad "" thru_hole circle (at 5.6 -2.2) (size 2 2) (drill 1.1) (layers *.Cu *.Mask))
  (model ${KICADLIB}/model/mechanical/C&K_PN12SJNA03QE.stp
    (offset (xyz 0 0 5.05))
    (scale (xyz 1 1 1))
    (rotate (xyz -90 0 0))
  )
  (model ${KICADLIB}/model/mechanical/E-Switch_1RBLK.stp
    (offset (xyz 12.5 0 4.75))
    (scale (xyz 1 1 1))
    (rotate (xyz 0 -90 0))
  )
)
