(footprint "Bourns_3386F-T" (version 20211014) (generator pcbnew)
  (layer "F.Cu")
  (tedit 61E48EB5)
  (attr through_hole)
  (fp_text reference "REF**" (at 0 -5.75 unlocked) (layer "F.SilkS")
    (effects (font (size 1 1) (thickness 0.15)))
    (tstamp 2f25c50d-c26c-4995-a196-0758ab31eafa)
  )
  (fp_text value "Bourns_3386F-T" (at 0 1 unlocked) (layer "F.Fab") hide
    (effects (font (size 1 1) (thickness 0.15)))
    (tstamp 621f87b4-d961-4117-bba1-54bf40432829)
  )
  (fp_text user "^" (at -2.5 4.1 unlocked) (layer "B.SilkS")
    (effects (font (size 1 1) (thickness 0.15)) (justify mirror))
    (tstamp 6d246eba-5e62-4be0-ba9e-439ed9b910a6)
  )
  (fp_text user "^" (at -2.5 5.8 unlocked) (layer "F.SilkS")
    (effects (font (size 1 1) (thickness 0.15)))
    (tstamp 26bb578b-347c-437b-9d3e-592baa51cf75)
  )
  (fp_text user "CW" (at 0.55 1.6 unlocked) (layer "Dwgs.User")
    (effects (font (size 0.5 0.5) (thickness 0.125)))
    (tstamp cee800cf-9d6c-4f3a-8494-64423ea2b822)
  )
  (fp_text user "${REFERENCE}" (at 0 0 unlocked) (layer "F.Fab")
    (effects (font (size 1 1) (thickness 0.15)))
    (tstamp 6d625633-7ad6-4c31-9d88-4e78c911644f)
  )
  (fp_rect (start -4.8 -4.8) (end 4.8 4.8) (layer "F.SilkS") (width 0.1) (fill none) (tstamp 10994530-93c2-412f-9219-21e9d3d934be))
  (fp_line (start 0.505592 0.997183) (end 1 1.1) (layer "Dwgs.User") (width 0.12) (tstamp d2d62120-bcf9-4f58-a64d-2a7ffd9277a4))
  (fp_line (start 0.505592 0.997183) (end 0.6 0.5) (layer "Dwgs.User") (width 0.12) (tstamp d5c905f2-2a00-422d-9e8f-f3ea611544a7))
  (fp_arc (start -0.5 0.999999) (mid -0.00312 -1.116015) (end 0.505591 0.997186) (layer "Dwgs.User") (width 0.12) (tstamp c07bdcb2-6545-4017-ad03-a8af6fb7a750))
  (fp_rect (start -5 -5) (end 5 5) (layer "F.CrtYd") (width 0.05) (fill none) (tstamp 63fb9f9e-e6fd-49b8-9b83-49ab71fd327a))
  (fp_line (start -3.8 4.8) (end 4.8 4.8) (layer "F.Fab") (width 0.1) (tstamp 03cbc4a7-a15a-4f94-be03-96efb58f74fa))
  (fp_line (start -4.8 -4.8) (end -4.8 3.8) (layer "F.Fab") (width 0.1) (tstamp 2221edf9-4f70-40d2-a411-ba9836b69787))
  (fp_line (start -3.8 4.8) (end -4.8 3.8) (layer "F.Fab") (width 0.1) (tstamp 6aab0e53-4310-48dc-8fbe-4ef4bdd521ab))
  (fp_line (start 4.8 4.8) (end 4.8 -4.8) (layer "F.Fab") (width 0.1) (tstamp 7b576bc9-4bcc-430e-a18d-ae046bacbd40))
  (fp_line (start 4.8 -4.8) (end -4.8 -4.8) (layer "F.Fab") (width 0.1) (tstamp a6a7da37-c309-4b32-82ec-305741f68cea))
  (pad "1" thru_hole circle (at -2.54 2.54) (size 1.4 1.4) (drill 0.8) (layers *.Cu *.Mask) (tstamp 7e0c94dc-a29f-44a5-a6c8-f8f6a168470e))
  (pad "2" thru_hole circle (at 0 -2.54) (size 1.4 1.4) (drill 0.8) (layers *.Cu *.Mask) (tstamp e5b64244-6764-45fc-ae72-4d17cb709d0c))
  (pad "3" thru_hole circle (at 2.54 2.54) (size 1.4 1.4) (drill 0.8) (layers *.Cu *.Mask) (tstamp 6b6f7c53-7075-4b1a-b69f-27433391a536))
  (model "${KICADLIB}/model/passive/Bourns_3386F(T).stp"
    (offset (xyz 0 -0.85 4.95))
    (scale (xyz 1 1 1))
    (rotate (xyz 180 0 -90))
  )
)
