(footprint "ublox_TOBY_LARA_SARA" (version 20211014) (generator pcbnew)
  (layer "F.Cu")
  (tedit 5EBEE185)
  (attr smd)
  (fp_text reference "REF**" (at -18.65 0 90 unlocked) (layer "F.SilkS")
    (effects (font (size 1 1) (thickness 0.15)))
    (tstamp 1fe28d9d-0fba-4f15-a307-53260d3e2087)
  )
  (fp_text value "ublox_TOBY_LARA_SARA" (at 0 11.6 unlocked) (layer "F.Fab") hide
    (effects (font (size 1 1) (thickness 0.15)))
    (tstamp f55f6912-99bc-4dbc-b289-3cb79db3309a)
  )
  (fp_text user "^" (at -15.4 13.2 unlocked) (layer "F.SilkS")
    (effects (font (size 1 1) (thickness 0.15)))
    (tstamp 1e64a239-a350-4c1f-82d9-e359e2b98545)
  )
  (fp_text user "${REFERENCE}" (at 0.1 0 unlocked) (layer "F.Fab")
    (effects (font (size 1 1) (thickness 0.15)))
    (tstamp bd04074d-4a77-40ed-8a7c-033fbe9f9f61)
  )
  (fp_rect (start -2.15 -5.75) (end -1.4 -4.75) (layer "F.Paste") (width 0.1) (fill solid) (tstamp 7baba4c7-9fba-467f-a4cf-643ecd56a4d4))
  (fp_rect (start -2.15 4.75) (end -1.4 5.75) (layer "F.Paste") (width 0.1) (fill solid) (tstamp 924e2b18-5b5d-4cc3-9ffb-d3adeff4d0b7))
  (fp_line (start -14.9 7.8) (end -15.9 7.8) (layer "F.SilkS") (width 0.1) (tstamp 263b83dd-ec1f-44f9-9c6d-ceae9855c3c3))
  (fp_line (start -17.8 -12.4) (end -17.8 12.4) (layer "F.SilkS") (width 0.12) (tstamp 26d860db-1a68-42bc-bc91-d534bb435402))
  (fp_line (start -15.9 7.8) (end -15.9 6.1) (layer "F.SilkS") (width 0.1) (tstamp 3964e410-8925-440c-8f24-a54ab7ec065e))
  (fp_line (start -15.9 6.1) (end -14.9 6.1) (layer "F.SilkS") (width 0.1) (tstamp 3f77d67c-e77a-4b5e-ae5c-c94beb4b0523))
  (fp_line (start 8.6 -10.15) (end 8.6 10.15) (layer "F.SilkS") (width 0.1) (tstamp 46bff0f1-3e69-40d4-9223-7330807266c1))
  (fp_line (start -17.4 12) (end -17.4 -12) (layer "F.SilkS") (width 0.1) (tstamp 47ce28b3-5358-43ad-835d-512a4c966cc0))
  (fp_line (start -15.9 -8) (end 8.6 -8) (layer "F.SilkS") (width 0.1) (tstamp 6a0102a7-1e66-46ef-a5c9-0bff699c7b14))
  (fp_line (start 8.6 12) (end -17.4 12) (layer "F.SilkS") (width 0.1) (tstamp 6db30ed6-7fe4-4691-abb7-061e1081f558))
  (fp_line (start -17.4 -12) (end 8.6 -12) (layer "F.SilkS") (width 0.1) (tstamp 7db52526-954a-408c-af03-8ede6ef24f8c))
  (fp_line (start -14.9 6.1) (end -14.9 7.8) (layer "F.SilkS") (width 0.1) (tstamp 8bf5bbd1-32cc-48b1-9885-5abc4143e69b))
  (fp_line (start -15.9 10.15) (end -15.9 12) (layer "F.SilkS") (width 0.1) (tstamp 8d8f8dd2-f658-4be6-aaf0-9b2b95b928e6))
  (fp_line (start -15.9 10.15) (end -14.9 10.15) (layer "F.SilkS") (width 0.1) (tstamp 8e970924-b7bf-4a4b-9f63-331624487127))
  (fp_line (start 8.6 -12) (end 8.6 -11.85) (layer "F.SilkS") (width 0.1) (tstamp 9b1d5191-1c80-4407-858d-9e48a54680fa))
  (fp_line (start 8.6 8) (end -15.9 8) (layer "F.SilkS") (width 0.1) (tstamp 9df80f25-c301-458b-9795-c4b613be7dd1))
  (fp_line (start -17.4 8) (end -17.4 -8) (layer "F.SilkS") (width 0.1) (tstamp a0e8e25a-8130-4208-9e94-cb1e0c92d5b0))
  (fp_line (start -17.4 -8) (end -17.2 -8) (layer "F.SilkS") (width 0.1) (tstamp a31ef58f-8a73-494c-b24f-d0947fd35cdf))
  (fp_line (start -17.8 12.4) (end 17.8 12.4) (layer "F.SilkS") (width 0.12) (tstamp b1ba3fd8-d147-40de-ab05-3a9c30b3575a))
  (fp_line (start 17.8 -12.4) (end -17.8 -12.4) (layer "F.SilkS") (width 0.12) (tstamp ccc2d93d-ac4e-4623-894b-ce2fe792ebe3))
  (fp_line (start 8.6 12) (end 8.6 11.85) (layer "F.SilkS") (width 0.1) (tstamp da243cef-ee40-4ec0-b806-9c5d8148f2f1))
  (fp_line (start 8.6 -8) (end 8.6 8) (layer "F.SilkS") (width 0.1) (tstamp da4be78c-56c2-4dca-b3c9-58a82e3511a0))
  (fp_line (start -17.4 8) (end -17.2 8) (layer "F.SilkS") (width 0.1) (tstamp e2ea53aa-ff2d-4df0-b03a-75109e2f107c))
  (fp_line (start 17.8 12.4) (end 17.8 -12.4) (layer "F.SilkS") (width 0.12) (tstamp e559de75-4465-4b17-8cb1-065b8c837fb1))
  (fp_line (start -14.9 10.15) (end -14.9 12) (layer "F.SilkS") (width 0.1) (tstamp e6273014-5bcc-434a-bc1b-e7a016dcb1d5))
  (fp_line (start -15.9 7.8) (end -15.9 10.15) (layer "F.SilkS") (width 0.1) (tstamp f6f0777e-1d54-49ca-96f0-f5a0871528b7))
  (fp_line (start 18 12.6) (end 18 -12.6) (layer "F.CrtYd") (width 0.05) (tstamp 458c345d-8cf6-4334-9d5c-e441aa7ed224))
  (fp_line (start 18 -12.6) (end -18 -12.6) (layer "F.CrtYd") (width 0.05) (tstamp 711c5106-924a-4a6e-8a18-1a2b242f1be6))
  (fp_line (start -18 12.6) (end 18 12.6) (layer "F.CrtYd") (width 0.05) (tstamp 876bf1b8-a03c-4d0f-b1e8-6b8ed058ab06))
  (fp_line (start -18 -12.6) (end -18 12.6) (layer "F.CrtYd") (width 0.05) (tstamp a4853f36-d6fd-4f70-9ba5-817171dfc252))
  (fp_line (start -17.8 11.6) (end -17 12.4) (layer "F.Fab") (width 0.1) (tstamp 18860265-844b-431a-a0ec-f376161b81a9))
  (fp_line (start -17.4 11) (end -17.4 -12) (layer "F.Fab") (width 0.1) (tstamp 20c039b4-57a6-4268-a74b-d0f7d5b28b89))
  (fp_line (start 8.6 12) (end -16.4 12) (layer "F.Fab") (width 0.1) (tstamp 2d3d9cd1-1609-4df5-8c53-848d4c9a7006))
  (fp_line (start -16.4 12) (end -17.4 11) (layer "F.Fab") (width 0.1) (tstamp 3301c45e-daf9-4556-b905-b7bb4a895880))
  (fp_line (start 8.6 -12) (end 8.6 12) (layer "F.Fab") (width 0.1) (tstamp 512c233b-4913-42c2-a9d1-873f5d8faf83))
  (fp_line (start 8.6 8) (end -16.4 8) (layer "F.Fab") (width 0.1) (tstamp 5f3badfe-0d3d-4acf-8b4d-b60c54d02e67))
  (fp_line (start -17.4 -12) (end 8.6 -12) (layer "F.Fab") (width 0.1) (tstamp 64b35a2b-5adb-40d0-b447-dee18a9981cc))
  (fp_line (start 17.8 -12.4) (end -17.8 -12.4) (layer "F.Fab") (width 0.1) (tstamp 64ee8783-cba7-4123-b25f-f22f5649aaa6))
  (fp_line (start -17.4 7) (end -17.4 -8) (layer "F.Fab") (width 0.1) (tstamp 69158327-aa61-4aaf-b3de-c1f455bedfcf))
  (fp_line (start 8.6 -8) (end 8.6 8) (layer "F.Fab") (width 0.1) (tstamp 83040ad4-278c-4297-b67b-83f946beeceb))
  (fp_line (start -17.8 -12.4) (end -17.8 11.6) (layer "F.Fab") (width 0.1) (tstamp aff38f10-8834-4efb-bdc3-0f89f6249637))
  (fp_line (start -16.4 8) (end -17.4 7) (layer "F.Fab") (width 0.1) (tstamp c0e1bf15-5289-4c8d-b4db-8f3005cf521c))
  (fp_line (start -17.4 -8) (end 8.6 -8) (layer "F.Fab") (width 0.1) (tstamp d000da75-1cac-44d1-a9be-d1f606613f6f))
  (fp_line (start 17.8 12.4) (end 17.8 -12.4) (layer "F.Fab") (width 0.1) (tstamp d6e996b3-352d-4e74-893b-1682c6d15864))
  (fp_line (start -17 12.4) (end 17.8 12.4) (layer "F.Fab") (width 0.1) (tstamp fbd075db-2e7c-4658-b86f-d133e7c48df4))
  (pad "1" smd rect (at -15.4 11) (size 0.8 1.5) (layers "F.Cu" "F.Paste" "F.Mask") (tstamp 5d3f138e-838a-48c3-b631-78ead4a94a70))
  (pad "2" smd rect (at -14.3 11) (size 0.8 1.5) (layers "F.Cu" "F.Paste" "F.Mask") (tstamp 4331b5f8-712d-4075-9b26-a6fdd270e599))
  (pad "3" smd rect (at -13.2 11) (size 0.8 1.5) (layers "F.Cu" "F.Paste" "F.Mask") (tstamp 7b784483-4f63-42f3-9bde-7b92a5dd3dc7))
  (pad "4" smd rect (at -12.1 11) (size 0.8 1.5) (layers "F.Cu" "F.Paste" "F.Mask") (tstamp 0a362e4f-c40a-4f10-a1ee-fdd2cc195b48))
  (pad "4" smd rect (at 2.2 6.95 90) (size 1.5 0.8) (layers "F.Cu" "F.Paste" "F.Mask") (tstamp e6038797-ceae-4479-84ae-7b41fed90c4e))
  (pad "5" smd rect (at -12.1 6.95 90) (size 1.5 0.8) (layers "F.Cu" "F.Paste" "F.Mask") (tstamp 69bc3ec6-762d-4281-90b5-a7f0de0d2563))
  (pad "5" smd rect (at -11 11) (size 0.8 1.5) (layers "F.Cu" "F.Paste" "F.Mask") (tstamp 78d3afee-1d45-40ae-b628-97d80d8c4bc9))
  (pad "6" smd rect (at -9.9 11) (size 0.8 1.5) (layers "F.Cu" "F.Paste" "F.Mask") (tstamp 86d60c78-c5c4-4af6-a9da-5366e57009a5))
  (pad "7" smd rect (at -8.8 11) (size 0.8 1.5) (layers "F.Cu" "F.Paste" "F.Mask") (tstamp f09a6a72-e06a-499d-80b0-f75f6f8e51cb))
  (pad "8" smd rect (at -7.7 11) (size 0.8 1.5) (layers "F.Cu" "F.Paste" "F.Mask") (tstamp 0c3a7c92-7048-4fc5-a44b-280b4b8de2f6))
  (pad "9" smd rect (at -6.6 11) (size 0.8 1.5) (layers "F.Cu" "F.Paste" "F.Mask") (tstamp 59e73712-1b46-457e-9a9d-a91df9f96bed))
  (pad "10" smd rect (at -5.5 11) (size 0.8 1.5) (layers "F.Cu" "F.Paste" "F.Mask") (tstamp c7af39d4-9253-4b3d-888b-068f779266df))
  (pad "10" smd rect (at -9.9 6.95 90) (size 1.5 0.8) (layers "F.Cu" "F.Paste" "F.Mask") (tstamp e1809797-6b32-4aee-92ba-bf53150dbfa1))
  (pad "11" smd rect (at -4.4 11) (size 0.8 1.5) (layers "F.Cu" "F.Paste" "F.Mask") (tstamp 6dcd7ef5-1d5a-4294-8548-7fad8238480e))
  (pad "11" smd rect (at -8.8 6.95 90) (size 1.5 0.8) (layers "F.Cu" "F.Paste" "F.Mask") (tstamp df25b381-ce7d-4acc-8190-0e5a61778ba5))
  (pad "12" smd rect (at -7.7 6.95 90) (size 1.5 0.8) (layers "F.Cu" "F.Paste" "F.Mask") (tstamp 3b759875-8c5f-4c4f-ba26-300b4c171d27))
  (pad "12" smd rect (at -3.3 11) (size 0.8 1.5) (layers "F.Cu" "F.Paste" "F.Mask") (tstamp bb86a0bc-5bce-4476-8113-e9c87cdd4a11))
  (pad "13" smd rect (at -2.2 11) (size 0.8 1.5) (layers "F.Cu" "F.Paste" "F.Mask") (tstamp 29287095-6d41-48bc-8825-3db861741cb2))
  (pad "13" smd rect (at -6.6 6.95 90) (size 1.5 0.8) (layers "F.Cu" "F.Paste" "F.Mask") (tstamp 934300d9-490a-4d95-8bf4-a5c8525d6723))
  (pad "14" smd rect (at -5.5 6.95 90) (size 1.5 0.8) (layers "F.Cu" "F.Paste" "F.Mask") (tstamp 1c74e07a-c71f-4aaf-9e3d-20ee88fe84ca))
  (pad "14" smd rect (at -1.1 11) (size 0.8 1.5) (layers "F.Cu" "F.Paste" "F.Mask") (tstamp ec407331-c6d0-4faa-9cc4-071909481a02))
  (pad "15" smd rect (at 0 11) (size 0.8 1.5) (layers "F.Cu" "F.Paste" "F.Mask") (tstamp 8bbabec3-ddd4-4a06-8f82-e2041714c66f))
  (pad "15" smd rect (at -4.4 6.95 90) (size 1.5 0.8) (layers "F.Cu" "F.Paste" "F.Mask") (tstamp a35c8aba-a288-4a72-9996-0c78ce5aaa3d))
  (pad "16" smd rect (at -3.3 6.95 90) (size 1.5 0.8) (layers "F.Cu" "F.Paste" "F.Mask") (tstamp 92656124-8a15-4a6b-b2e2-9fddcb62e72d))
  (pad "16" smd rect (at 1.1 11) (size 0.8 1.5) (layers "F.Cu" "F.Paste" "F.Mask") (tstamp aea93848-c9e0-4822-81c9-cd6e422ac24b))
  (pad "17" smd rect (at 2.2 11) (size 0.8 1.5) (layers "F.Cu" "F.Paste" "F.Mask") (tstamp 39d0169f-1422-4ace-a3c0-83d21b141b52))
  (pad "17" smd rect (at -2.2 6.95 90) (size 1.5 0.8) (layers "F.Cu" "F.Paste" "F.Mask") (tstamp c37e64ab-d65e-48da-b92b-7f1941ae60ed))
  (pad "18" smd rect (at 3.3 11) (size 0.8 1.5) (layers "F.Cu" "F.Paste" "F.Mask") (tstamp 3bd665cf-f1a1-4736-a2c8-ac62fb7b4970))
  (pad "19" smd rect (at 4.4 11) (size 0.8 1.5) (layers "F.Cu" "F.Paste" "F.Mask") (tstamp 45d43441-5d34-4ee1-99f3-512cba7e6a12))
  (pad "20" smd rect (at 5.5 11) (size 0.8 1.5) (layers "F.Cu" "F.Paste" "F.Mask") (tstamp 4ddb9d29-88a4-4531-a23d-cdf85d8adf3e))
  (pad "20" smd rect (at 0 6.95 90) (size 1.5 0.8) (layers "F.Cu" "F.Paste" "F.Mask") (tstamp 72d30d08-ac14-4b94-961f-079d33ec2da6))
  (pad "21" smd rect (at 6.6 11) (size 0.8 1.5) (layers "F.Cu" "F.Paste" "F.Mask") (tstamp 1350e49e-5fe1-42f2-b233-dec6e8c38d01))
  (pad "21" smd rect (at 1.1 6.95 90) (size 1.5 0.8) (layers "F.Cu" "F.Paste" "F.Mask") (tstamp c951e967-7f12-4e84-95d3-b9bb52bbb00e))
  (pad "22" smd rect (at 7.55 4.4 180) (size 1.5 0.8) (layers "F.Cu" "F.Paste" "F.Mask") (tstamp 229499a4-68c4-4217-8ea2-fc4bc0e7d281))
  (pad "22" smd rect (at 7.7 11) (size 0.8 1.5) (layers "F.Cu" "F.Paste" "F.Mask") (tstamp ce0526e7-181e-4177-aa83-d4e88fc5c52e))
  (pad "23" smd rect (at 8.8 11) (size 0.8 1.5) (layers "F.Cu" "F.Paste" "F.Mask") (tstamp 27eab1db-d456-4f2e-9da9-157bf889f811))
  (pad "23" smd rect (at 3.3 6.95 90) (size 1.5 0.8) (layers "F.Cu" "F.Paste" "F.Mask") (tstamp 7edbc685-a86b-4bd4-a3d5-05d1149ed651))
  (pad "24" smd rect (at 9.9 11) (size 0.8 1.5) (layers "F.Cu" "F.Paste" "F.Mask") (tstamp 50248333-14a1-439d-91da-63d8516744f6))
  (pad "24" smd rect (at 7.55 3.3 180) (size 1.5 0.8) (layers "F.Cu" "F.Paste" "F.Mask") (tstamp c242564f-aa5f-4b73-a9b0-f4fff96d5b5c))
  (pad "25" smd rect (at 7.55 2.2 180) (size 1.5 0.8) (layers "F.Cu" "F.Paste" "F.Mask") (tstamp 4db0ec2a-bb6e-426a-8a6c-bf243497699f))
  (pad "25" smd rect (at 11 11) (size 0.8 1.5) (layers "F.Cu" "F.Paste" "F.Mask") (tstamp b63076e2-c0fe-4b99-92e0-50448fa1b991))
  (pad "26" smd rect (at 12.1 11) (size 0.8 1.5) (layers "F.Cu" "F.Paste" "F.Mask") (tstamp c3264feb-3e5d-4a70-a88e-449dd943474f))
  (pad "27" smd rect (at 7.55 -1.1 180) (size 1.5 0.8) (layers "F.Cu" "F.Paste" "F.Mask") (tstamp 35b768d5-73b2-496c-848c-0b0654a44817))
  (pad "27" smd rect (at 13.2 11) (size 0.8 1.5) (layers "F.Cu" "F.Paste" "F.Mask") (tstamp 927d12e9-86a3-4b4c-a367-a74963724d26))
  (pad "28" smd rect (at 14.3 11) (size 0.8 1.5) (layers "F.Cu" "F.Paste" "F.Mask") (tstamp a938f9fe-a5d5-46a7-b418-209146e7d767))
  (pad "28" smd rect (at 7.55 -2.2 180) (size 1.5 0.8) (layers "F.Cu" "F.Paste" "F.Mask") (tstamp b8bee481-d23a-4e43-a690-9b169e6414df))
  (pad "29" smd rect (at 15.4 11) (size 0.8 1.5) (layers "F.Cu" "F.Paste" "F.Mask") (tstamp df63c483-3c31-4ee8-95cd-d8f1f599064d))
  (pad "30" smd rect (at -11 6.95 90) (size 1.5 0.8) (layers "F.Cu" "F.Paste" "F.Mask") (tstamp 1fbe7683-6d18-4c54-8ddf-c007b5b15a8a))
  (pad "30" smd rect (at 7.55 -3.3 180) (size 1.5 0.8) (layers "F.Cu" "F.Paste" "F.Mask") (tstamp 3cf5240e-207f-43ca-9257-cfb67e8e8cce))
  (pad "30" smd rect (at -15.4 6.95 90) (size 1.5 0.8) (layers "F.Cu" "F.Paste" "F.Mask") (tstamp 523756e0-ce34-472e-adf5-61af00c67fdc))
  (pad "30" smd rect (at -12.1 -6.95 270) (size 1.5 0.8) (layers "F.Cu" "F.Paste" "F.Mask") (tstamp 5c5acdcf-2f1f-4513-a732-67b8d0aca873))
  (pad "30" smd rect (at 7.55 5.5 180) (size 1.5 0.8) (layers "F.Cu" "F.Paste" "F.Mask") (tstamp 62e7f59d-e106-4289-b133-d6ee3a027aed))
  (pad "30" smd rect (at -1.1 6.95 90) (size 1.5 0.8) (layers "F.Cu" "F.Paste" "F.Mask") (tstamp b26daa03-db5d-4518-aa2d-3a8f052b455d))
  (pad "30" smd rect (at 5.5 6.95 90) (size 1.5 0.8) (layers "F.Cu" "F.Paste" "F.Mask") (tstamp cd03dbbb-0fb3-4e54-8df1-fb4d274d9f4b))
  (pad "30" smd rect (at -13.2 6.95 90) (size 1.5 0.8) (layers "F.Cu" "F.Paste" "F.Mask") (tstamp d4c0c23b-669c-41ad-a6f2-f324db049c52))
  (pad "30" smd rect (at -14.3 6.95 90) (size 1.5 0.8) (layers "F.Cu" "F.Paste" "F.Mask") (tstamp e94ca7af-781c-4bc2-a263-fb604ec47b95))
  (pad "30" smd rect (at 16.7 10.15) (size 0.8 1.5) (layers "F.Cu" "F.Paste" "F.Mask") (tstamp ebd7d6e1-1d3d-4fb9-b756-9a940eab5740))
  (pad "30" smd rect (at -4.4 -6.95 270) (size 1.5 0.8) (layers "F.Cu" "F.Paste" "F.Mask") (tstamp ebfd4b6d-15ee-4f0e-8bf9-583114cbf624))
  (pad "31" smd rect (at 16.55 8.55) (size 1.1 1.1) (layers "F.Cu" "F.Paste" "F.Mask") (tstamp 1e002ffc-65e0-49c7-b35c-8c995d27813f))
  (pad "32" smd rect (at 7.55 -5.5 180) (size 1.5 0.8) (layers "F.Cu" "F.Paste" "F.Mask") (tstamp 31816dcd-9214-454f-a903-15a833ed0fc1))
  (pad "32" smd rect (at 16.7 6.95) (size 0.8 1.5) (layers "F.Cu" "F.Paste" "F.Mask") (tstamp eb9a5040-9678-43e7-af87-df528b2deca5))
  (pad "33" smd rect (at 16.35 5.5 270) (size 0.8 1.5) (layers "F.Cu" "F.Paste" "F.Mask") (tstamp 932abe3f-e9e7-4ec9-bafa-6ef08f36aa89))
  (pad "34" smd rect (at 16.35 4.4 270) (size 0.8 1.5) (layers "F.Cu" "F.Paste" "F.Mask") (tstamp 8bacf252-6b29-4c6d-84a4-26406ee4d753))
  (pad "35" smd rect (at 16.35 3.3 270) (size 0.8 1.5) (layers "F.Cu" "F.Paste" "F.Mask") (tstamp 9bfc9b3a-5ed6-42a3-a670-e97bae27aa79))
  (pad "36" smd rect (at 16.35 2.2 270) (size 0.8 1.5) (layers "F.Cu" "F.Paste" "F.Mask") (tstamp f17f0800-17f2-4de7-b0eb-2534a6eb2de2))
  (pad "37" smd rect (at 16.35 1.1 270) (size 0.8 1.5) (layers "F.Cu" "F.Paste" "F.Mask") (tstamp 6a791812-c2bf-495b-a4fc-53b023d97e73))
  (pad "38" smd rect (at 16.35 0 270) (size 0.8 1.5) (layers "F.Cu" "F.Paste" "F.Mask") (tstamp 4af76142-c9c7-4e90-bc7f-bc490e9cb491))
  (pad "39" smd rect (at 16.35 -1.1 270) (size 0.8 1.5) (layers "F.Cu" "F.Paste" "F.Mask") (tstamp 6363cace-83b8-4400-bb65-a67725216330))
  (pad "40" smd rect (at 16.35 -2.2 270) (size 0.8 1.5) (layers "F.Cu" "F.Paste" "F.Mask") (tstamp 9bd068e7-b729-4145-a131-22801780bda8))
  (pad "41" smd rect (at 16.35 -3.3 270) (size 0.8 1.5) (layers "F.Cu" "F.Paste" "F.Mask") (tstamp 152602be-a784-4b5e-a358-4e54cab2efbc))
  (pad "42" smd rect (at 16.35 -4.4 270) (size 0.8 1.5) (layers "F.Cu" "F.Paste" "F.Mask") (tstamp ab62443a-def5-4ef8-8414-bf8e5855ed55))
  (pad "43" smd rect (at 16.35 -5.5 270) (size 0.8 1.5) (layers "F.Cu" "F.Paste" "F.Mask") (tstamp 04e1811b-40bf-4ef0-aa0d-1d63084ec5b5))
  (pad "44" smd rect (at 16.7 -6.95) (size 0.8 1.5) (layers "F.Cu" "F.Paste" "F.Mask") (tstamp ab247f80-14b8-481d-b57f-bfa8db6b4502))
  (pad "45" smd rect (at 16.55 -8.55) (size 1.1 1.1) (layers "F.Cu" "F.Paste" "F.Mask") (tstamp 245a02eb-829a-4885-85ca-6331b2da3b76))
  (pad "46" smd rect (at 16.7 -10.15) (size 0.8 1.5) (layers "F.Cu" "F.Paste" "F.Mask") (tstamp 471d23fd-ae9d-416e-b14b-e0f39f4b6e99))
  (pad "47" smd rect (at 15.4 -11 180) (size 0.8 1.5) (layers "F.Cu" "F.Paste" "F.Mask") (tstamp 1f92b9ff-9577-4130-b688-cdd2c9e9f80d))
  (pad "48" smd rect (at 14.3 -11 180) (size 0.8 1.5) (layers "F.Cu" "F.Paste" "F.Mask") (tstamp b2badcdf-5c77-4f5d-a1c1-f2386e901ba8))
  (pad "49" smd rect (at 13.2 -11 180) (size 0.8 1.5) (layers "F.Cu" "F.Paste" "F.Mask") (tstamp 979b0f01-74dc-42fa-be38-4454de5a1977))
  (pad "50" smd rect (at 5.5 -6.95 270) (size 1.5 0.8) (layers "F.Cu" "F.Paste" "F.Mask") (tstamp 2475a59b-a723-4f00-aa0e-c735dd2b53e8))
  (pad "50" smd rect (at 12.1 -11 180) (size 0.8 1.5) (layers "F.Cu" "F.Paste" "F.Mask") (tstamp 4bfebb95-25f8-49b6-8a13-3f4cc5907f1c))
  (pad "51" smd rect (at 11 -11 180) (size 0.8 1.5) (layers "F.Cu" "F.Paste" "F.Mask") (tstamp 82e523ca-860f-4027-857b-b8e9cf143cfb))
  (pad "51" smd rect (at 4.4 -6.95 270) (size 1.5 0.8) (layers "F.Cu" "F.Paste" "F.Mask") (tstamp d1788058-4bb4-4d24-8e41-3fa6102df179))
  (pad "52" smd rect (at 3.3 -6.95 270) (size 1.5 0.8) (layers "F.Cu" "F.Paste" "F.Mask") (tstamp 4aeb3eb4-c6de-4ec1-8567-68d3ab2bb1ee))
  (pad "52" smd rect (at 9.9 -11 180) (size 0.8 1.5) (layers "F.Cu" "F.Paste" "F.Mask") (tstamp 67eca81f-65ef-40dd-a38b-258860f34509))
  (pad "53" smd rect (at 8.8 -11 180) (size 0.8 1.5) (layers "F.Cu" "F.Paste" "F.Mask") (tstamp 27416b42-425e-4549-8e1b-819d4f7e12bf))
  (pad "53" smd rect (at 2.2 -6.95 270) (size 1.5 0.8) (layers "F.Cu" "F.Paste" "F.Mask") (tstamp cdcd8f3e-7833-4413-a08d-4763455cf742))
  (pad "54" smd rect (at 7.55 0 180) (size 1.5 0.8) (layers "F.Cu" "F.Paste" "F.Mask") (tstamp 2cf30ce8-5736-4ce8-bd2b-173466754201))
  (pad "54" smd rect (at 7.7 -11 180) (size 0.8 1.5) (layers "F.Cu" "F.Paste" "F.Mask") (tstamp 3958694d-643b-43d4-a10a-ce0f5c31b629))
  (pad "55" smd rect (at 7.55 1.1 180) (size 1.5 0.8) (layers "F.Cu" "F.Paste" "F.Mask") (tstamp ace69e03-5a60-4476-a636-c75c6688516e))
  (pad "55" smd rect (at 6.6 -11 180) (size 0.8 1.5) (layers "F.Cu" "F.Paste" "F.Mask") (tstamp d72df49e-728a-439c-9ff0-01ece2dc7c57))
  (pad "56" smd rect (at 1.1 -6.95 270) (size 1.5 0.8) (layers "F.Cu" "F.Paste" "F.Mask") (tstamp 4bbcf8ed-1020-4851-9e21-cc9597f0da8c))
  (pad "56" smd rect (at 5.5 -11 180) (size 0.8 1.5) (layers "F.Cu" "F.Paste" "F.Mask") (tstamp dd708faf-d619-4bec-a8ad-110d6fa8eef2))
  (pad "57" smd rect (at 0 -6.95 270) (size 1.5 0.8) (layers "F.Cu" "F.Paste" "F.Mask") (tstamp 6b016086-65bb-4488-ad7c-c7d49c122682))
  (pad "57" smd rect (at 4.4 -11 180) (size 0.8 1.5) (layers "F.Cu" "F.Paste" "F.Mask") (tstamp db2599bf-cfa5-418f-86f0-e4bb3f11a341))
  (pad "58" smd rect (at -1.1 -6.95 270) (size 1.5 0.8) (layers "F.Cu" "F.Paste" "F.Mask") (tstamp 136999ee-0124-4b67-81bb-27284d404b1f))
  (pad "58" smd rect (at 3.3 -11 180) (size 0.8 1.5) (layers "F.Cu" "F.Paste" "F.Mask") (tstamp 82ae6ab3-c57d-4b8e-9d7b-2c628e4d073b))
  (pad "59" smd rect (at 2.2 -11 180) (size 0.8 1.5) (layers "F.Cu" "F.Paste" "F.Mask") (tstamp d1b6e940-014e-4860-92bd-fe78e0a09c86))
  (pad "59" smd rect (at -2.2 -6.95 270) (size 1.5 0.8) (layers "F.Cu" "F.Paste" "F.Mask") (tstamp d80a1b9b-44bf-445b-b848-a5a7680b720a))
  (pad "60" smd rect (at 1.1 -11 180) (size 0.8 1.5) (layers "F.Cu" "F.Paste" "F.Mask") (tstamp 492aa2c4-2273-4aeb-a0af-b868436cd040))
  (pad "60" smd rect (at -3.3 -6.95 270) (size 1.5 0.8) (layers "F.Cu" "F.Paste" "F.Mask") (tstamp 6206be55-367e-495c-8372-2fc42917cad9))
  (pad "61" smd rect (at 0 -11 180) (size 0.8 1.5) (layers "F.Cu" "F.Paste" "F.Mask") (tstamp 6f7b8b28-9238-4cf5-8fc6-a13fd6480c5a))
  (pad "61" smd rect (at 4.4 6.95 90) (size 1.5 0.8) (layers "F.Cu" "F.Paste" "F.Mask") (tstamp be0a170b-8e96-424c-9cb8-90ebd5e9f166))
  (pad "62" smd rect (at -1.1 -11 180) (size 0.8 1.5) (layers "F.Cu" "F.Paste" "F.Mask") (tstamp ba23f71e-d60b-4654-af6a-11ddb6593089))
  (pad "63" smd rect (at -5.5 -6.95 270) (size 1.5 0.8) (layers "F.Cu" "F.Paste" "F.Mask") (tstamp 56c9727f-88f5-452f-82b8-a3020a3fd5bc))
  (pad "63" smd rect (at -2.2 -11 180) (size 0.8 1.5) (layers "F.Cu" "F.Paste" "F.Mask") (tstamp 90c73b4b-30b0-42dc-bb8a-40b32dd11f22))
  (pad "64" smd rect (at -6.6 -6.95 270) (size 1.5 0.8) (layers "F.Cu" "F.Paste" "F.Mask") (tstamp bfbc5b8e-b91e-4c1a-abf6-5a0098354b60))
  (pad "64" smd rect (at -3.3 -11 180) (size 0.8 1.5) (layers "F.Cu" "F.Paste" "F.Mask") (tstamp ed5d84af-92dd-45d3-99ce-ff4ef6b87c38))
  (pad "65" smd rect (at -7.7 -6.95 270) (size 1.5 0.8) (layers "F.Cu" "F.Paste" "F.Mask") (tstamp 64cf6323-7150-48d5-9bad-a5ec18439763))
  (pad "65" smd rect (at -4.4 -11 180) (size 0.8 1.5) (layers "F.Cu" "F.Paste" "F.Mask") (tstamp d5a5c590-9b4d-49fb-a8dd-b47f8e0ba235))
  (pad "66" smd rect (at -5.5 -11 180) (size 0.8 1.5) (layers "F.Cu" "F.Paste" "F.Mask") (tstamp 5ed3fa83-70db-433f-b924-7812e7f44623))
  (pad "66" smd rect (at -8.8 -6.95 270) (size 1.5 0.8) (layers "F.Cu" "F.Paste" "F.Mask") (tstamp c3529961-4a19-4361-9399-c03258a2f59e))
  (pad "67" smd rect (at -9.9 -6.95 270) (size 1.5 0.8) (layers "F.Cu" "F.Paste" "F.Mask") (tstamp 1373ba07-bda1-4e3f-8677-d9958d807417))
  (pad "67" smd rect (at -6.6 -11 180) (size 0.8 1.5) (layers "F.Cu" "F.Paste" "F.Mask") (tstamp 8d39704c-e7ad-497b-bc10-025be62a97d9))
  (pad "68" smd rect (at -7.7 -11 180) (size 0.8 1.5) (layers "F.Cu" "F.Paste" "F.Mask") (tstamp bbd700f2-aa6b-48b5-9ec1-dcf8c810ae4d))
  (pad "68" smd rect (at -11 -6.95 270) (size 1.5 0.8) (layers "F.Cu" "F.Paste" "F.Mask") (tstamp e355f30d-7a5f-4d36-b865-a25b4503e136))
  (pad "69" smd rect (at -8.8 -11 180) (size 0.8 1.5) (layers "F.Cu" "F.Paste" "F.Mask") (tstamp eafac7e6-701e-4e53-ab2e-fdad4847abac))
  (pad "70" smd rect (at -13.2 -6.95 270) (size 1.5 0.8) (layers "F.Cu" "F.Paste" "F.Mask") (tstamp 8d0d3ba5-0d43-4d2f-a545-accd6ae49196))
  (pad "70" smd rect (at -9.9 -11 180) (size 0.8 1.5) (layers "F.Cu" "F.Paste" "F.Mask") (tstamp 9cfb0e5f-32b5-416f-85de-8ecaef455d0a))
  (pad "71" smd rect (at -14.3 -6.95 270) (size 1.5 0.8) (layers "F.Cu" "F.Paste" "F.Mask") (tstamp 1d848ee2-3951-40c0-8d2b-7a2ed9b3e5e7))
  (pad "71" smd rect (at -11 -11 180) (size 0.8 1.5) (layers "F.Cu" "F.Paste" "F.Mask") (tstamp 447b7786-8f84-410e-b8ea-a759a2446f58))
  (pad "72" smd rect (at -12.1 -11 180) (size 0.8 1.5) (layers "F.Cu" "F.Paste" "F.Mask") (tstamp d79251c4-da37-4b39-9c86-cb2565c85a61))
  (pad "72" smd rect (at -15.4 -6.95 270) (size 1.5 0.8) (layers "F.Cu" "F.Paste" "F.Mask") (tstamp dbba47b5-e520-46a8-add5-c831abbc4538))
  (pad "73" smd rect (at -13.2 -11 180) (size 0.8 1.5) (layers "F.Cu" "F.Paste" "F.Mask") (tstamp 44c37c00-b534-48c1-ab96-5526b414a8b5))
  (pad "74" smd rect (at -14.3 -11 180) (size 0.8 1.5) (layers "F.Cu" "F.Paste" "F.Mask") (tstamp f7967d89-abe9-4463-a543-ace58e76e1ba))
  (pad "75" smd rect (at -15.4 -11 180) (size 0.8 1.5) (layers "F.Cu" "F.Paste" "F.Mask") (tstamp 2c7a5f4a-3f23-4261-ab1a-772b04eaede9))
  (pad "75" smd rect (at -16.35 0 270) (size 0.8 1.5) (layers "F.Cu" "F.Paste" "F.Mask") (tstamp f4a3109d-55e7-4ed2-8d86-9a4c27515939))
  (pad "76" smd rect (at -16.7 -10.15 180) (size 0.8 1.5) (layers "F.Cu" "F.Paste" "F.Mask") (tstamp 537ff8d1-6ff5-4f96-b841-75524c0bb1f0))
  (pad "77" smd rect (at -16.55 -8.55 180) (size 1.1 1.1) (layers "F.Cu" "F.Paste" "F.Mask") (tstamp c6e90e38-8413-4a9e-bdc8-5a0deeaa0826))
  (pad "78" smd rect (at -16.7 -6.95 180) (size 0.8 1.5) (layers "F.Cu" "F.Paste" "F.Mask") (tstamp a8226b11-b11d-4a42-86a5-c21b611d6157))
  (pad "79" smd rect (at -16.35 -5.5 270) (size 0.8 1.5) (layers "F.Cu" "F.Paste" "F.Mask") (tstamp bcd0f8c0-03da-43e9-837a-110a538af8bf))
  (pad "80" smd rect (at -16.35 -4.4 270) (size 0.8 1.5) (layers "F.Cu" "F.Paste" "F.Mask") (tstamp cf3e49ec-b7a9-40b8-b5bc-f032338451b7))
  (pad "81" smd rect (at -16.35 -3.3 270) (size 0.8 1.5) (layers "F.Cu" "F.Paste" "F.Mask") (tstamp 8b659d11-0d19-4ebf-b130-3c860f1a28a3))
  (pad "82" smd rect (at -16.35 -2.2 270) (size 0.8 1.5) (layers "F.Cu" "F.Paste" "F.Mask") (tstamp 8bbe9a6f-a7f9-45e8-93a4-57a31c6cb067))
  (pad "83" smd rect (at -16.35 -1.1 270) (size 0.8 1.5) (layers "F.Cu" "F.Paste" "F.Mask") (tstamp 25b301ca-7fe5-4da8-b332-33d6a78a9770))
  (pad "85" smd rect (at -16.35 1.1 270) (size 0.8 1.5) (layers "F.Cu" "F.Paste" "F.Mask") (tstamp 4ff727ed-20fc-477c-badd-890306d4ae6f))
  (pad "86" smd rect (at -16.35 2.2 270) (size 0.8 1.5) (layers "F.Cu" "F.Paste" "F.Mask") (tstamp fcbfb982-f80f-404e-aaa2-7515d0c886e4))
  (pad "87" smd rect (at -16.35 3.3 270) (size 0.8 1.5) (layers "F.Cu" "F.Paste" "F.Mask") (tstamp 4568c2bb-1bf5-4a68-aa7c-c3f157366ab1))
  (pad "88" smd rect (at -16.35 4.4 270) (size 0.8 1.5) (layers "F.Cu" "F.Paste" "F.Mask") (tstamp b1218895-cf1b-4b82-ac53-491132b2d7bf))
  (pad "89" smd rect (at -16.35 5.5 270) (size 0.8 1.5) (layers "F.Cu" "F.Paste" "F.Mask") (tstamp f81ec5d4-ea20-4031-a583-c0d8db6336b0))
  (pad "90" smd rect (at -16.7 6.95 180) (size 0.8 1.5) (layers "F.Cu" "F.Paste" "F.Mask") (tstamp a4adb023-a3bb-481a-a7a1-d86bebd705bb))
  (pad "91" smd rect (at -16.55 8.55 180) (size 1.1 1.1) (layers "F.Cu" "F.Paste" "F.Mask") (tstamp d00f2a9b-e86d-40ee-b748-c49edb7b21ff))
  (pad "92" smd rect (at -16.7 10.15 180) (size 0.8 1.5) (layers "F.Cu" "F.Paste" "F.Mask") (tstamp 7ea043b1-17d4-4ccd-9860-f08f1cfe4406))
  (pad "93" smd rect (at -14.95 8.55 270) (size 0.8 1.5) (layers "F.Cu" "F.Paste" "F.Mask") (tstamp 2f25063a-48f6-4bfb-a25e-e7dceeee4f7e))
  (pad "94" smd rect (at -14.65 5.25 270) (size 1.1 1.1) (layers "F.Cu" "F.Paste" "F.Mask") (tstamp c4e9b416-9ddf-4413-9a5b-a26865aacb71))
  (pad "95" smd rect (at -14.65 3.15 270) (size 1.1 1.1) (layers "F.Cu" "F.Paste" "F.Mask") (tstamp b042ac7b-ac51-4460-a927-7e7ebca9355b))
  (pad "96" smd rect (at -14.65 1.05 270) (size 1.1 1.1) (layers "F.Cu" "F.Paste" "F.Mask") (tstamp a8ac6524-8a93-45b0-9e4f-b44535d5cbeb))
  (pad "97" smd rect (at -14.65 -1.05 270) (size 1.1 1.1) (layers "F.Cu" "F.Paste" "F.Mask") (tstamp de2da586-0ac3-42dc-a8d4-21f8b4900853))
  (pad "98" smd rect (at -14.65 -3.15 270) (size 1.1 1.1) (layers "F.Cu" "F.Paste" "F.Mask") (tstamp 7a0a76d1-0f49-41f2-b534-8dc44458985d))
  (pad "99" smd rect (at 2.25 1.05) (size 1.1 1.1) (layers "F.Cu" "F.Paste" "F.Mask") (tstamp 49e227a7-32f3-487e-b125-3a52b3a240a9))
  (pad "99" smd rect (at -14.65 -5.25 270) (size 1.1 1.1) (layers "F.Cu" "F.Paste" "F.Mask") (tstamp 7b926093-94e1-42fd-b0b1-cc64faa46ac9))
  (pad "100" smd rect (at 2.25 -1.05) (size 1.1 1.1) (layers "F.Cu" "F.Paste" "F.Mask") (tstamp 590c3189-ec49-405d-a402-ab4cf90d345e))
  (pad "100" smd rect (at -14.95 -8.55 270) (size 0.8 1.5) (layers "F.Cu" "F.Paste" "F.Mask") (tstamp e7bac9bd-df88-4285-9356-fcf7e1c333e5))
  (pad "101" smd rect (at -12.85 5.25 270) (size 1.1 1.1) (layers "F.Cu" "F.Paste" "F.Mask") (tstamp a2c539cc-debf-4275-8f01-0769c9a233cb))
  (pad "102" smd rect (at -12.85 3.15 270) (size 1.1 1.1) (layers "F.Cu" "F.Paste" "F.Mask") (tstamp f42dddae-2f24-427a-8e9c-08aee272af45))
  (pad "103" smd rect (at -12.85 1.05 270) (size 1.1 1.1) (layers "F.Cu" "F.Paste" "F.Mask") (tstamp 32b7fd93-2cf4-4012-9fce-9e5a7f78409f))
  (pad "104" smd rect (at -12.85 -1.05 270) (size 1.1 1.1) (layers "F.Cu" "F.Paste" "F.Mask") (tstamp 5d709a04-bfe4-4a6d-8c8c-f2f86561f70f))
  (pad "105" smd rect (at -12.85 -3.15 270) (size 1.1 1.1) (layers "F.Cu" "F.Paste" "F.Mask") (tstamp 6aad56f2-5223-405e-a637-719e5857b489))
  (pad "106" smd rect (at -12.85 -5.25 270) (size 1.1 1.1) (layers "F.Cu" "F.Paste" "F.Mask") (tstamp 18f9d095-f2b4-4e96-ba34-aeaecdcef1fa))
  (pad "107" smd rect (at -11.05 5.25 270) (size 1.1 1.1) (layers "F.Cu" "F.Paste" "F.Mask") (tstamp 4d6f691e-680f-48ff-ad81-51c7fa2fa98a))
  (pad "108" smd rect (at -11.05 -5.25 270) (size 1.1 1.1) (layers "F.Cu" "F.Paste" "F.Mask") (tstamp b97fc93e-8578-4503-b352-5bfabd97cabf))
  (pad "109" smd rect (at -5.85 5.25 270) (size 1.1 1.1) (layers "F.Cu" "F.Paste" "F.Mask") (tstamp a97b6356-dea2-428e-9a01-6aa286933bf5))
  (pad "109" smd rect (at -7.45 5.25) (size 1.1 1.1) (layers "F.Cu" "F.Paste" "F.Mask") (tstamp e1c27335-b7e5-401f-b514-c5fcc3f541ec))
  (pad "110" smd rect (at -5.85 3.15 270) (size 1.1 1.1) (layers "F.Cu" "F.Paste" "F.Mask") (tstamp c85f9638-26bd-4bd5-8c7c-2790ef608fa3))
  (pad "111" smd rect (at -5.85 1.05 270) (size 1.1 1.1) (layers "F.Cu" "F.Paste" "F.Mask") (tstamp 990543d1-5871-401f-b916-7d80eb740ac3))
  (pad "112" smd rect (at -5.85 -1.05 270) (size 1.1 1.1) (layers "F.Cu" "F.Paste" "F.Mask") (tstamp 374e8245-79f1-4cc9-83ab-ecfbedb09978))
  (pad "113" smd rect (at -5.85 -3.15 270) (size 1.1 1.1) (layers "F.Cu" "F.Paste" "F.Mask") (tstamp d0ac64a4-ba27-4d3c-a423-9dde8b6be98d))
  (pad "114" smd rect (at -5.85 -5.25 270) (size 1.1 1.1) (layers "F.Cu" "F.Paste" "F.Mask") (tstamp 9cca09b0-fefc-429c-ac3d-abdfd302835b))
  (pad "114" smd rect (at -7.45 -5.25) (size 1.1 1.1) (layers "F.Cu" "F.Paste" "F.Mask") (tstamp fc5fb3b8-2f0c-49db-ad88-e0eeafda27fd))
  (pad "115" smd rect (at -4.05 5.25 270) (size 1.1 1.1) (layers "F.Cu" "F.Paste" "F.Mask") (tstamp 2a8abb6c-018e-423d-af09-f058ed2c8add))
  (pad "116" smd rect (at -4.05 3.15 270) (size 1.1 1.1) (layers "F.Cu" "F.Paste" "F.Mask") (tstamp a33c9ff1-4e13-4e04-bf12-79520ea6cad0))
  (pad "117" smd rect (at -4.05 1.05 270) (size 1.1 1.1) (layers "F.Cu" "F.Paste" "F.Mask") (tstamp af6d7601-9692-4c1b-ab20-3622d7830535))
  (pad "118" smd rect (at -4.05 -1.05 270) (size 1.1 1.1) (layers "F.Cu" "F.Paste" "F.Mask") (tstamp 696459ec-94df-4655-a584-5758ad392364))
  (pad "119" smd rect (at -4.05 -3.15 270) (size 1.1 1.1) (layers "F.Cu" "F.Paste" "F.Mask") (tstamp 42260a75-b216-40fd-b9a6-67d4d7312658))
  (pad "120" smd rect (at -4.05 -5.25 270) (size 1.1 1.1) (layers "F.Cu" "F.Paste" "F.Mask") (tstamp 7d3bd0bb-dab5-4462-91ef-f082697dcca7))
  (pad "121" smd rect (at -2.25 5.25 270) (size 1.1 1.1) (layers "F.Cu" "F.Mask") (tstamp 9c3e3fe7-70f8-4f4f-897b-929dee1798c0))
  (pad "121" smd rect (at -1.35 5.25) (size 1.1 1.1) (layers "F.Cu" "F.Mask") (tstamp bc85e59d-968c-4e9b-a147-2b3867147cdd))
  (pad "122" smd rect (at -1.35 -5.25) (size 1.1 1.1) (layers "F.Cu" "F.Mask") (tstamp 6ce2b7c6-c1d2-4051-8170-cdcc78e61dc2))
  (pad "122" smd rect (at -2.25 -5.25 270) (size 1.1 1.1) (layers "F.Cu" "F.Mask") (tstamp 7d2ad6f6-fb3d-40fa-b177-a17066010c48))
  (pad "123" smd rect (at 2.25 5.25 90) (size 1.1 1.1) (layers "F.Cu" "F.Paste" "F.Mask") (tstamp a7285357-3913-4ddb-a4f5-14da4fe07961))
  (pad "124" smd rect (at 2.25 -5.25 90) (size 1.1 1.1) (layers "F.Cu" "F.Paste" "F.Mask") (tstamp 78c6f29f-f4b1-484f-ae4c-3762fe3f7b61))
  (pad "125" smd rect (at 4.05 5.25 90) (size 1.1 1.1) (layers "F.Cu" "F.Paste" "F.Mask") (tstamp 68015f2e-e98a-4cba-85d8-162652f56b64))
  (pad "126" smd rect (at 4.05 3.15 90) (size 1.1 1.1) (layers "F.Cu" "F.Paste" "F.Mask") (tstamp b168cc26-9488-4d01-a087-97e566c923e9))
  (pad "127" smd rect (at 4.05 1.05 90) (size 1.1 1.1) (layers "F.Cu" "F.Paste" "F.Mask") (tstamp 32e1cbfb-d13e-4918-a3ae-d664cac72e1e))
  (pad "128" smd rect (at 4.05 -1.05 90) (size 1.1 1.1) (layers "F.Cu" "F.Paste" "F.Mask") (tstamp 3f737ead-58b3-476e-98b3-94586fcce1ac))
  (pad "129" smd rect (at 4.05 -3.15 90) (size 1.1 1.1) (layers "F.Cu" "F.Paste" "F.Mask") (tstamp 8a3e7dbd-170e-4558-952a-dfc5827d10dd))
  (pad "130" smd rect (at 4.05 -5.25 90) (size 1.1 1.1) (layers "F.Cu" "F.Paste" "F.Mask") (tstamp 033b3813-e8f0-41ea-9122-9ee8e62469dc))
  (pad "131" smd rect (at 5.85 5.25 90) (size 1.1 1.1) (layers "F.Cu" "F.Paste" "F.Mask") (tstamp f32d56c9-99ea-4cf7-a883-789da9ce3588))
  (pad "132" smd rect (at 5.85 3.15 90) (size 1.1 1.1) (layers "F.Cu" "F.Paste" "F.Mask") (tstamp e1f71eac-d07f-4135-b38e-3e898d3141d8))
  (pad "133" smd rect (at 5.85 1.05 90) (size 1.1 1.1) (layers "F.Cu" "F.Paste" "F.Mask") (tstamp 2ab3b55f-f637-419e-a550-e764e5005333))
  (pad "134" smd rect (at 5.85 -1.05 90) (size 1.1 1.1) (layers "F.Cu" "F.Paste" "F.Mask") (tstamp 02121620-0b41-4541-96bf-174ef0e15d96))
  (pad "135" smd rect (at 5.85 -3.15 90) (size 1.1 1.1) (layers "F.Cu" "F.Paste" "F.Mask") (tstamp f2f32492-c6ec-434d-9b62-b9f5c43a808e))
  (pad "136" smd rect (at 5.85 -5.25 90) (size 1.1 1.1) (layers "F.Cu" "F.Paste" "F.Mask") (tstamp 80e32418-9d6b-4a6e-bbe2-99560f28d26b))
  (pad "137" smd rect (at 11.05 5.25 90) (size 1.1 1.1) (layers "F.Cu" "F.Paste" "F.Mask") (tstamp 49a5dfec-b85f-4a24-b6bc-84228313aa2c))
  (pad "138" smd rect (at 11.05 -5.25 90) (size 1.1 1.1) (layers "F.Cu" "F.Paste" "F.Mask") (tstamp 415fae70-e933-4996-98a2-b89e8c9e9fce))
  (pad "139" smd rect (at 12.85 5.25 90) (size 1.1 1.1) (layers "F.Cu" "F.Paste" "F.Mask") (tstamp 52bd32ee-ae34-462d-ab18-3753c0f1bc19))
  (pad "140" smd rect (at 12.85 3.15 90) (size 1.1 1.1) (layers "F.Cu" "F.Paste" "F.Mask") (tstamp 821d033f-d74d-45b6-9417-e83c6269f8c8))
  (pad "141" smd rect (at 12.85 1.05 90) (size 1.1 1.1) (layers "F.Cu" "F.Paste" "F.Mask") (tstamp de828444-b273-4384-b3bf-a55684735bec))
  (pad "142" smd rect (at 12.85 -1.05 90) (size 1.1 1.1) (layers "F.Cu" "F.Paste" "F.Mask") (tstamp 890aee5e-2bca-44ce-b814-defb57cb2795))
  (pad "143" smd rect (at 12.85 -3.15 90) (size 1.1 1.1) (layers "F.Cu" "F.Paste" "F.Mask") (tstamp ac2423fb-7d0d-4f8f-afa5-27f28660c3f0))
  (pad "144" smd rect (at 12.85 -5.25 90) (size 1.1 1.1) (layers "F.Cu" "F.Paste" "F.Mask") (tstamp 359d3ace-df03-4687-b295-ac06443ec16e))
  (pad "145" smd rect (at 14.95 8.55 90) (size 0.8 1.5) (layers "F.Cu" "F.Paste" "F.Mask") (tstamp 40d9f100-80f6-448e-8b05-48c460bae891))
  (pad "146" smd rect (at 14.65 5.25 90) (size 1.1 1.1) (layers "F.Cu" "F.Paste" "F.Mask") (tstamp 6277d169-e0ef-42cb-b0c0-2221efe99f4c))
  (pad "147" smd rect (at 14.65 3.15 90) (size 1.1 1.1) (layers "F.Cu" "F.Paste" "F.Mask") (tstamp 24ea3e8a-fa43-4340-8ccd-5bbf2e9e8ef3))
  (pad "148" smd rect (at 14.65 1.05 90) (size 1.1 1.1) (layers "F.Cu" "F.Paste" "F.Mask") (tstamp 8bc67645-e964-4a82-9a5d-057a398a62bb))
  (pad "149" smd rect (at 14.65 -1.05 90) (size 1.1 1.1) (layers "F.Cu" "F.Paste" "F.Mask") (tstamp 90154ec8-a190-4059-a9bd-80a060a9062f))
  (pad "150" smd rect (at 14.65 -3.15 90) (size 1.1 1.1) (layers "F.Cu" "F.Paste" "F.Mask") (tstamp 9d361fd8-7a9c-4ef2-8068-522282d8ccc8))
  (pad "151" smd rect (at 14.65 -5.25 90) (size 1.1 1.1) (layers "F.Cu" "F.Paste" "F.Mask") (tstamp 5ef3fd54-34fe-4c1d-b6ca-9bedf3fa0ae9))
  (pad "152" smd rect (at 14.95 -8.55 90) (size 0.8 1.5) (layers "F.Cu" "F.Paste" "F.Mask") (tstamp 7c2bcb01-9fe5-42db-a7d7-9147cd965b70))
  (pad "L21" smd rect (at 6.6 6.95 90) (size 1.5 0.8) (layers "F.Cu" "F.Paste" "F.Mask") (tstamp 1123a8c1-c33e-453c-b60d-f1f744e71d86))
  (pad "L31" smd rect (at 7.55 -4.4 180) (size 1.5 0.8) (layers "F.Cu" "F.Paste" "F.Mask") (tstamp dec356aa-4c57-4540-84db-1e9d414bbaf6))
  (pad "L33" smd rect (at 6.6 -6.95 270) (size 1.5 0.8) (layers "F.Cu" "F.Paste" "F.Mask") (tstamp 762668b6-3f0f-4d3a-8bd1-6224a0147261))
  (pad "L97" smd rect (at -11.05 1.05) (size 1.1 1.1) (layers "F.Cu" "F.Paste" "F.Mask") (tstamp 6b6769f2-e53d-412c-b06b-3b025357d69c))
  (pad "L98" smd rect (at -11.05 -1.05) (size 1.1 1.1) (layers "F.Cu" "F.Paste" "F.Mask") (tstamp 2ae38d16-00d1-4c98-a5b7-1eed259d23de))
  (model "${KICADLIB}/model/SoM/ublox_TOBY.step"
    (offset (xyz 0 0 0))
    (scale (xyz 1 1 1))
    (rotate (xyz 0 0 -90))
  )
  (model "${KICADLIB}/model/SoM/ublox_LARA.step" hide
    (offset (xyz -4.25 -0.65 -23.3))
    (scale (xyz 1 1 1))
    (rotate (xyz 0 0 -90))
  )
  (model "${KICADLIB}/model/SoM/ublox_SARA.step" hide
    (offset (xyz -7.325 -1.1 2.9))
    (scale (xyz 1 1 1))
    (rotate (xyz 0 0 0))
  )
)
