(module "CAPPR750-1450X2000" (layer F.Cu) (tedit 5EBAD5E0)
  (descr "CP, Radial series, Radial, pin pitch=7.50mm, , diameter=14mm, Electrolytic Capacitor")
  (tags "CP Radial series Radial pin pitch 7.50mm  diameter 14mm Electrolytic Capacitor")
  (fp_text reference "REF**" (at 3.75 -8.25) (layer F.SilkS)
    (effects (font (size 1 1) (thickness 0.15)))
  )
  (fp_text value "CAPPR750-1450X2000" (at 3.75 8.25) (layer F.Fab) hide
    (effects (font (size 1 1) (thickness 0.15)))
  )
  (fp_circle (center 3.75 0) (end 11 0) (layer F.Fab) (width 0.1))
  (fp_circle (center 3.75 0) (end 11 0) (layer F.SilkS) (width 0.12))
  (fp_circle (center 3.75 0) (end 11.1 0) (layer F.CrtYd) (width 0.05))
  (fp_line (start -2.263066 -3.0675) (end -0.863066 -3.0675) (layer F.Fab) (width 0.1))
  (fp_line (start -1.563066 -3.7675) (end -1.563066 -2.3675) (layer F.Fab) (width 0.1))
  (fp_line (start 3.75 -7.08) (end 3.75 7.08) (layer F.SilkS) (width 0.12))
  (fp_line (start 3.79 -7.08) (end 3.79 7.08) (layer F.SilkS) (width 0.12))
  (fp_line (start 3.83 -7.08) (end 3.83 7.08) (layer F.SilkS) (width 0.12))
  (fp_line (start 3.87 -7.079) (end 3.87 7.079) (layer F.SilkS) (width 0.12))
  (fp_line (start 3.91 -7.079) (end 3.91 7.079) (layer F.SilkS) (width 0.12))
  (fp_line (start 3.95 -7.078) (end 3.95 7.078) (layer F.SilkS) (width 0.12))
  (fp_line (start 3.99 -7.076) (end 3.99 7.076) (layer F.SilkS) (width 0.12))
  (fp_line (start 4.03 -7.075) (end 4.03 7.075) (layer F.SilkS) (width 0.12))
  (fp_line (start 4.07 -7.073) (end 4.07 7.073) (layer F.SilkS) (width 0.12))
  (fp_line (start 4.11 -7.071) (end 4.11 7.071) (layer F.SilkS) (width 0.12))
  (fp_line (start 4.15 -7.069) (end 4.15 7.069) (layer F.SilkS) (width 0.12))
  (fp_line (start 4.19 -7.067) (end 4.19 7.067) (layer F.SilkS) (width 0.12))
  (fp_line (start 4.23 -7.064) (end 4.23 7.064) (layer F.SilkS) (width 0.12))
  (fp_line (start 4.27 -7.061) (end 4.27 7.061) (layer F.SilkS) (width 0.12))
  (fp_line (start 4.31 -7.058) (end 4.31 7.058) (layer F.SilkS) (width 0.12))
  (fp_line (start 4.35 -7.055) (end 4.35 7.055) (layer F.SilkS) (width 0.12))
  (fp_line (start 4.39 -7.052) (end 4.39 7.052) (layer F.SilkS) (width 0.12))
  (fp_line (start 4.43 -7.048) (end 4.43 7.048) (layer F.SilkS) (width 0.12))
  (fp_line (start 4.471 -7.044) (end 4.471 7.044) (layer F.SilkS) (width 0.12))
  (fp_line (start 4.511 -7.04) (end 4.511 7.04) (layer F.SilkS) (width 0.12))
  (fp_line (start 4.551 -7.035) (end 4.551 7.035) (layer F.SilkS) (width 0.12))
  (fp_line (start 4.591 -7.031) (end 4.591 7.031) (layer F.SilkS) (width 0.12))
  (fp_line (start 4.631 -7.026) (end 4.631 7.026) (layer F.SilkS) (width 0.12))
  (fp_line (start 4.671 -7.021) (end 4.671 7.021) (layer F.SilkS) (width 0.12))
  (fp_line (start 4.711 -7.015) (end 4.711 7.015) (layer F.SilkS) (width 0.12))
  (fp_line (start 4.751 -7.01) (end 4.751 7.01) (layer F.SilkS) (width 0.12))
  (fp_line (start 4.791 -7.004) (end 4.791 7.004) (layer F.SilkS) (width 0.12))
  (fp_line (start 4.831 -6.998) (end 4.831 6.998) (layer F.SilkS) (width 0.12))
  (fp_line (start 4.871 -6.992) (end 4.871 6.992) (layer F.SilkS) (width 0.12))
  (fp_line (start 4.911 -6.985) (end 4.911 6.985) (layer F.SilkS) (width 0.12))
  (fp_line (start 4.951 -6.979) (end 4.951 6.979) (layer F.SilkS) (width 0.12))
  (fp_line (start 4.991 -6.972) (end 4.991 6.972) (layer F.SilkS) (width 0.12))
  (fp_line (start 5.031 -6.964) (end 5.031 6.964) (layer F.SilkS) (width 0.12))
  (fp_line (start 5.071 -6.957) (end 5.071 6.957) (layer F.SilkS) (width 0.12))
  (fp_line (start 5.111 -6.949) (end 5.111 6.949) (layer F.SilkS) (width 0.12))
  (fp_line (start 5.151 -6.942) (end 5.151 6.942) (layer F.SilkS) (width 0.12))
  (fp_line (start 5.191 -6.933) (end 5.191 6.933) (layer F.SilkS) (width 0.12))
  (fp_line (start 5.231 -6.925) (end 5.231 6.925) (layer F.SilkS) (width 0.12))
  (fp_line (start 5.271 -6.916) (end 5.271 6.916) (layer F.SilkS) (width 0.12))
  (fp_line (start 5.311 -6.907) (end 5.311 6.907) (layer F.SilkS) (width 0.12))
  (fp_line (start 5.351 -6.898) (end 5.351 6.898) (layer F.SilkS) (width 0.12))
  (fp_line (start 5.391 -6.889) (end 5.391 6.889) (layer F.SilkS) (width 0.12))
  (fp_line (start 5.431 -6.879) (end 5.431 6.879) (layer F.SilkS) (width 0.12))
  (fp_line (start 5.471 -6.87) (end 5.471 6.87) (layer F.SilkS) (width 0.12))
  (fp_line (start 5.511 -6.86) (end 5.511 6.86) (layer F.SilkS) (width 0.12))
  (fp_line (start 5.551 -6.849) (end 5.551 6.849) (layer F.SilkS) (width 0.12))
  (fp_line (start 5.591 -6.839) (end 5.591 6.839) (layer F.SilkS) (width 0.12))
  (fp_line (start 5.631 -6.828) (end 5.631 6.828) (layer F.SilkS) (width 0.12))
  (fp_line (start 5.671 -6.817) (end 5.671 6.817) (layer F.SilkS) (width 0.12))
  (fp_line (start 5.711 -6.805) (end 5.711 6.805) (layer F.SilkS) (width 0.12))
  (fp_line (start 5.751 -6.794) (end 5.751 6.794) (layer F.SilkS) (width 0.12))
  (fp_line (start 5.791 -6.782) (end 5.791 6.782) (layer F.SilkS) (width 0.12))
  (fp_line (start 5.831 -6.77) (end 5.831 6.77) (layer F.SilkS) (width 0.12))
  (fp_line (start 5.871 -6.758) (end 5.871 6.758) (layer F.SilkS) (width 0.12))
  (fp_line (start 5.911 -6.745) (end 5.911 6.745) (layer F.SilkS) (width 0.12))
  (fp_line (start 5.951 -6.732) (end 5.951 6.732) (layer F.SilkS) (width 0.12))
  (fp_line (start 5.991 -6.719) (end 5.991 6.719) (layer F.SilkS) (width 0.12))
  (fp_line (start 6.031 -6.706) (end 6.031 6.706) (layer F.SilkS) (width 0.12))
  (fp_line (start 6.071 -6.692) (end 6.071 -1.44) (layer F.SilkS) (width 0.12))
  (fp_line (start 6.071 1.44) (end 6.071 6.692) (layer F.SilkS) (width 0.12))
  (fp_line (start 6.111 -6.678) (end 6.111 -1.44) (layer F.SilkS) (width 0.12))
  (fp_line (start 6.111 1.44) (end 6.111 6.678) (layer F.SilkS) (width 0.12))
  (fp_line (start 6.151 -6.664) (end 6.151 -1.44) (layer F.SilkS) (width 0.12))
  (fp_line (start 6.151 1.44) (end 6.151 6.664) (layer F.SilkS) (width 0.12))
  (fp_line (start 6.191 -6.649) (end 6.191 -1.44) (layer F.SilkS) (width 0.12))
  (fp_line (start 6.191 1.44) (end 6.191 6.649) (layer F.SilkS) (width 0.12))
  (fp_line (start 6.231 -6.635) (end 6.231 -1.44) (layer F.SilkS) (width 0.12))
  (fp_line (start 6.231 1.44) (end 6.231 6.635) (layer F.SilkS) (width 0.12))
  (fp_line (start 6.271 -6.62) (end 6.271 -1.44) (layer F.SilkS) (width 0.12))
  (fp_line (start 6.271 1.44) (end 6.271 6.62) (layer F.SilkS) (width 0.12))
  (fp_line (start 6.311 -6.604) (end 6.311 -1.44) (layer F.SilkS) (width 0.12))
  (fp_line (start 6.311 1.44) (end 6.311 6.604) (layer F.SilkS) (width 0.12))
  (fp_line (start 6.351 -6.589) (end 6.351 -1.44) (layer F.SilkS) (width 0.12))
  (fp_line (start 6.351 1.44) (end 6.351 6.589) (layer F.SilkS) (width 0.12))
  (fp_line (start 6.391 -6.573) (end 6.391 -1.44) (layer F.SilkS) (width 0.12))
  (fp_line (start 6.391 1.44) (end 6.391 6.573) (layer F.SilkS) (width 0.12))
  (fp_line (start 6.431 -6.557) (end 6.431 -1.44) (layer F.SilkS) (width 0.12))
  (fp_line (start 6.431 1.44) (end 6.431 6.557) (layer F.SilkS) (width 0.12))
  (fp_line (start 6.471 -6.54) (end 6.471 -1.44) (layer F.SilkS) (width 0.12))
  (fp_line (start 6.471 1.44) (end 6.471 6.54) (layer F.SilkS) (width 0.12))
  (fp_line (start 6.511 -6.524) (end 6.511 -1.44) (layer F.SilkS) (width 0.12))
  (fp_line (start 6.511 1.44) (end 6.511 6.524) (layer F.SilkS) (width 0.12))
  (fp_line (start 6.551 -6.507) (end 6.551 -1.44) (layer F.SilkS) (width 0.12))
  (fp_line (start 6.551 1.44) (end 6.551 6.507) (layer F.SilkS) (width 0.12))
  (fp_line (start 6.591 -6.49) (end 6.591 -1.44) (layer F.SilkS) (width 0.12))
  (fp_line (start 6.591 1.44) (end 6.591 6.49) (layer F.SilkS) (width 0.12))
  (fp_line (start 6.631 -6.472) (end 6.631 -1.44) (layer F.SilkS) (width 0.12))
  (fp_line (start 6.631 1.44) (end 6.631 6.472) (layer F.SilkS) (width 0.12))
  (fp_line (start 6.671 -6.454) (end 6.671 -1.44) (layer F.SilkS) (width 0.12))
  (fp_line (start 6.671 1.44) (end 6.671 6.454) (layer F.SilkS) (width 0.12))
  (fp_line (start 6.711 -6.436) (end 6.711 -1.44) (layer F.SilkS) (width 0.12))
  (fp_line (start 6.711 1.44) (end 6.711 6.436) (layer F.SilkS) (width 0.12))
  (fp_line (start 6.751 -6.418) (end 6.751 -1.44) (layer F.SilkS) (width 0.12))
  (fp_line (start 6.751 1.44) (end 6.751 6.418) (layer F.SilkS) (width 0.12))
  (fp_line (start 6.791 -6.399) (end 6.791 -1.44) (layer F.SilkS) (width 0.12))
  (fp_line (start 6.791 1.44) (end 6.791 6.399) (layer F.SilkS) (width 0.12))
  (fp_line (start 6.831 -6.38) (end 6.831 -1.44) (layer F.SilkS) (width 0.12))
  (fp_line (start 6.831 1.44) (end 6.831 6.38) (layer F.SilkS) (width 0.12))
  (fp_line (start 6.871 -6.36) (end 6.871 -1.44) (layer F.SilkS) (width 0.12))
  (fp_line (start 6.871 1.44) (end 6.871 6.36) (layer F.SilkS) (width 0.12))
  (fp_line (start 6.911 -6.341) (end 6.911 -1.44) (layer F.SilkS) (width 0.12))
  (fp_line (start 6.911 1.44) (end 6.911 6.341) (layer F.SilkS) (width 0.12))
  (fp_line (start 6.951 -6.321) (end 6.951 -1.44) (layer F.SilkS) (width 0.12))
  (fp_line (start 6.951 1.44) (end 6.951 6.321) (layer F.SilkS) (width 0.12))
  (fp_line (start 6.991 -6.301) (end 6.991 -1.44) (layer F.SilkS) (width 0.12))
  (fp_line (start 6.991 1.44) (end 6.991 6.301) (layer F.SilkS) (width 0.12))
  (fp_line (start 7.031 -6.28) (end 7.031 -1.44) (layer F.SilkS) (width 0.12))
  (fp_line (start 7.031 1.44) (end 7.031 6.28) (layer F.SilkS) (width 0.12))
  (fp_line (start 7.071 -6.259) (end 7.071 -1.44) (layer F.SilkS) (width 0.12))
  (fp_line (start 7.071 1.44) (end 7.071 6.259) (layer F.SilkS) (width 0.12))
  (fp_line (start 7.111 -6.238) (end 7.111 -1.44) (layer F.SilkS) (width 0.12))
  (fp_line (start 7.111 1.44) (end 7.111 6.238) (layer F.SilkS) (width 0.12))
  (fp_line (start 7.151 -6.216) (end 7.151 -1.44) (layer F.SilkS) (width 0.12))
  (fp_line (start 7.151 1.44) (end 7.151 6.216) (layer F.SilkS) (width 0.12))
  (fp_line (start 7.191 -6.194) (end 7.191 -1.44) (layer F.SilkS) (width 0.12))
  (fp_line (start 7.191 1.44) (end 7.191 6.194) (layer F.SilkS) (width 0.12))
  (fp_line (start 7.231 -6.172) (end 7.231 -1.44) (layer F.SilkS) (width 0.12))
  (fp_line (start 7.231 1.44) (end 7.231 6.172) (layer F.SilkS) (width 0.12))
  (fp_line (start 7.271 -6.15) (end 7.271 -1.44) (layer F.SilkS) (width 0.12))
  (fp_line (start 7.271 1.44) (end 7.271 6.15) (layer F.SilkS) (width 0.12))
  (fp_line (start 7.311 -6.127) (end 7.311 -1.44) (layer F.SilkS) (width 0.12))
  (fp_line (start 7.311 1.44) (end 7.311 6.127) (layer F.SilkS) (width 0.12))
  (fp_line (start 7.351 -6.103) (end 7.351 -1.44) (layer F.SilkS) (width 0.12))
  (fp_line (start 7.351 1.44) (end 7.351 6.103) (layer F.SilkS) (width 0.12))
  (fp_line (start 7.391 -6.08) (end 7.391 -1.44) (layer F.SilkS) (width 0.12))
  (fp_line (start 7.391 1.44) (end 7.391 6.08) (layer F.SilkS) (width 0.12))
  (fp_line (start 7.431 -6.056) (end 7.431 -1.44) (layer F.SilkS) (width 0.12))
  (fp_line (start 7.431 1.44) (end 7.431 6.056) (layer F.SilkS) (width 0.12))
  (fp_line (start 7.471 -6.031) (end 7.471 -1.44) (layer F.SilkS) (width 0.12))
  (fp_line (start 7.471 1.44) (end 7.471 6.031) (layer F.SilkS) (width 0.12))
  (fp_line (start 7.511 -6.007) (end 7.511 -1.44) (layer F.SilkS) (width 0.12))
  (fp_line (start 7.511 1.44) (end 7.511 6.007) (layer F.SilkS) (width 0.12))
  (fp_line (start 7.551 -5.982) (end 7.551 -1.44) (layer F.SilkS) (width 0.12))
  (fp_line (start 7.551 1.44) (end 7.551 5.982) (layer F.SilkS) (width 0.12))
  (fp_line (start 7.591 -5.956) (end 7.591 -1.44) (layer F.SilkS) (width 0.12))
  (fp_line (start 7.591 1.44) (end 7.591 5.956) (layer F.SilkS) (width 0.12))
  (fp_line (start 7.631 -5.93) (end 7.631 -1.44) (layer F.SilkS) (width 0.12))
  (fp_line (start 7.631 1.44) (end 7.631 5.93) (layer F.SilkS) (width 0.12))
  (fp_line (start 7.671 -5.904) (end 7.671 -1.44) (layer F.SilkS) (width 0.12))
  (fp_line (start 7.671 1.44) (end 7.671 5.904) (layer F.SilkS) (width 0.12))
  (fp_line (start 7.711 -5.878) (end 7.711 -1.44) (layer F.SilkS) (width 0.12))
  (fp_line (start 7.711 1.44) (end 7.711 5.878) (layer F.SilkS) (width 0.12))
  (fp_line (start 7.751 -5.851) (end 7.751 -1.44) (layer F.SilkS) (width 0.12))
  (fp_line (start 7.751 1.44) (end 7.751 5.851) (layer F.SilkS) (width 0.12))
  (fp_line (start 7.791 -5.823) (end 7.791 -1.44) (layer F.SilkS) (width 0.12))
  (fp_line (start 7.791 1.44) (end 7.791 5.823) (layer F.SilkS) (width 0.12))
  (fp_line (start 7.831 -5.796) (end 7.831 -1.44) (layer F.SilkS) (width 0.12))
  (fp_line (start 7.831 1.44) (end 7.831 5.796) (layer F.SilkS) (width 0.12))
  (fp_line (start 7.871 -5.767) (end 7.871 -1.44) (layer F.SilkS) (width 0.12))
  (fp_line (start 7.871 1.44) (end 7.871 5.767) (layer F.SilkS) (width 0.12))
  (fp_line (start 7.911 -5.739) (end 7.911 -1.44) (layer F.SilkS) (width 0.12))
  (fp_line (start 7.911 1.44) (end 7.911 5.739) (layer F.SilkS) (width 0.12))
  (fp_line (start 7.951 -5.71) (end 7.951 -1.44) (layer F.SilkS) (width 0.12))
  (fp_line (start 7.951 1.44) (end 7.951 5.71) (layer F.SilkS) (width 0.12))
  (fp_line (start 7.991 -5.68) (end 7.991 -1.44) (layer F.SilkS) (width 0.12))
  (fp_line (start 7.991 1.44) (end 7.991 5.68) (layer F.SilkS) (width 0.12))
  (fp_line (start 8.031 -5.65) (end 8.031 -1.44) (layer F.SilkS) (width 0.12))
  (fp_line (start 8.031 1.44) (end 8.031 5.65) (layer F.SilkS) (width 0.12))
  (fp_line (start 8.071 -5.62) (end 8.071 -1.44) (layer F.SilkS) (width 0.12))
  (fp_line (start 8.071 1.44) (end 8.071 5.62) (layer F.SilkS) (width 0.12))
  (fp_line (start 8.111 -5.589) (end 8.111 -1.44) (layer F.SilkS) (width 0.12))
  (fp_line (start 8.111 1.44) (end 8.111 5.589) (layer F.SilkS) (width 0.12))
  (fp_line (start 8.151 -5.558) (end 8.151 -1.44) (layer F.SilkS) (width 0.12))
  (fp_line (start 8.151 1.44) (end 8.151 5.558) (layer F.SilkS) (width 0.12))
  (fp_line (start 8.191 -5.527) (end 8.191 -1.44) (layer F.SilkS) (width 0.12))
  (fp_line (start 8.191 1.44) (end 8.191 5.527) (layer F.SilkS) (width 0.12))
  (fp_line (start 8.231 -5.494) (end 8.231 -1.44) (layer F.SilkS) (width 0.12))
  (fp_line (start 8.231 1.44) (end 8.231 5.494) (layer F.SilkS) (width 0.12))
  (fp_line (start 8.271 -5.462) (end 8.271 -1.44) (layer F.SilkS) (width 0.12))
  (fp_line (start 8.271 1.44) (end 8.271 5.462) (layer F.SilkS) (width 0.12))
  (fp_line (start 8.311 -5.429) (end 8.311 -1.44) (layer F.SilkS) (width 0.12))
  (fp_line (start 8.311 1.44) (end 8.311 5.429) (layer F.SilkS) (width 0.12))
  (fp_line (start 8.351 -5.395) (end 8.351 -1.44) (layer F.SilkS) (width 0.12))
  (fp_line (start 8.351 1.44) (end 8.351 5.395) (layer F.SilkS) (width 0.12))
  (fp_line (start 8.391 -5.361) (end 8.391 -1.44) (layer F.SilkS) (width 0.12))
  (fp_line (start 8.391 1.44) (end 8.391 5.361) (layer F.SilkS) (width 0.12))
  (fp_line (start 8.431 -5.326) (end 8.431 -1.44) (layer F.SilkS) (width 0.12))
  (fp_line (start 8.431 1.44) (end 8.431 5.326) (layer F.SilkS) (width 0.12))
  (fp_line (start 8.471 -5.291) (end 8.471 -1.44) (layer F.SilkS) (width 0.12))
  (fp_line (start 8.471 1.44) (end 8.471 5.291) (layer F.SilkS) (width 0.12))
  (fp_line (start 8.511 -5.255) (end 8.511 -1.44) (layer F.SilkS) (width 0.12))
  (fp_line (start 8.511 1.44) (end 8.511 5.255) (layer F.SilkS) (width 0.12))
  (fp_line (start 8.551 -5.219) (end 8.551 -1.44) (layer F.SilkS) (width 0.12))
  (fp_line (start 8.551 1.44) (end 8.551 5.219) (layer F.SilkS) (width 0.12))
  (fp_line (start 8.591 -5.182) (end 8.591 -1.44) (layer F.SilkS) (width 0.12))
  (fp_line (start 8.591 1.44) (end 8.591 5.182) (layer F.SilkS) (width 0.12))
  (fp_line (start 8.631 -5.145) (end 8.631 -1.44) (layer F.SilkS) (width 0.12))
  (fp_line (start 8.631 1.44) (end 8.631 5.145) (layer F.SilkS) (width 0.12))
  (fp_line (start 8.671 -5.107) (end 8.671 -1.44) (layer F.SilkS) (width 0.12))
  (fp_line (start 8.671 1.44) (end 8.671 5.107) (layer F.SilkS) (width 0.12))
  (fp_line (start 8.711 -5.069) (end 8.711 -1.44) (layer F.SilkS) (width 0.12))
  (fp_line (start 8.711 1.44) (end 8.711 5.069) (layer F.SilkS) (width 0.12))
  (fp_line (start 8.751 -5.029) (end 8.751 -1.44) (layer F.SilkS) (width 0.12))
  (fp_line (start 8.751 1.44) (end 8.751 5.029) (layer F.SilkS) (width 0.12))
  (fp_line (start 8.791 -4.99) (end 8.791 -1.44) (layer F.SilkS) (width 0.12))
  (fp_line (start 8.791 1.44) (end 8.791 4.99) (layer F.SilkS) (width 0.12))
  (fp_line (start 8.831 -4.949) (end 8.831 -1.44) (layer F.SilkS) (width 0.12))
  (fp_line (start 8.831 1.44) (end 8.831 4.949) (layer F.SilkS) (width 0.12))
  (fp_line (start 8.871 -4.908) (end 8.871 -1.44) (layer F.SilkS) (width 0.12))
  (fp_line (start 8.871 1.44) (end 8.871 4.908) (layer F.SilkS) (width 0.12))
  (fp_line (start 8.911 -4.866) (end 8.911 -1.44) (layer F.SilkS) (width 0.12))
  (fp_line (start 8.911 1.44) (end 8.911 4.866) (layer F.SilkS) (width 0.12))
  (fp_line (start 8.951 -4.824) (end 8.951 4.824) (layer F.SilkS) (width 0.12))
  (fp_line (start 8.991 -4.781) (end 8.991 4.781) (layer F.SilkS) (width 0.12))
  (fp_line (start 9.031 -4.737) (end 9.031 4.737) (layer F.SilkS) (width 0.12))
  (fp_line (start 9.071 -4.693) (end 9.071 4.693) (layer F.SilkS) (width 0.12))
  (fp_line (start 9.111 -4.647) (end 9.111 4.647) (layer F.SilkS) (width 0.12))
  (fp_line (start 9.151 -4.601) (end 9.151 4.601) (layer F.SilkS) (width 0.12))
  (fp_line (start 9.191 -4.554) (end 9.191 4.554) (layer F.SilkS) (width 0.12))
  (fp_line (start 9.231 -4.506) (end 9.231 4.506) (layer F.SilkS) (width 0.12))
  (fp_line (start 9.271 -4.458) (end 9.271 4.458) (layer F.SilkS) (width 0.12))
  (fp_line (start 9.311 -4.408) (end 9.311 4.408) (layer F.SilkS) (width 0.12))
  (fp_line (start 9.351 -4.358) (end 9.351 4.358) (layer F.SilkS) (width 0.12))
  (fp_line (start 9.391 -4.306) (end 9.391 4.306) (layer F.SilkS) (width 0.12))
  (fp_line (start 9.431 -4.254) (end 9.431 4.254) (layer F.SilkS) (width 0.12))
  (fp_line (start 9.471 -4.2) (end 9.471 4.2) (layer F.SilkS) (width 0.12))
  (fp_line (start 9.511 -4.146) (end 9.511 4.146) (layer F.SilkS) (width 0.12))
  (fp_line (start 9.551 -4.09) (end 9.551 4.09) (layer F.SilkS) (width 0.12))
  (fp_line (start 9.591 -4.033) (end 9.591 4.033) (layer F.SilkS) (width 0.12))
  (fp_line (start 9.631 -3.975) (end 9.631 3.975) (layer F.SilkS) (width 0.12))
  (fp_line (start 9.671 -3.916) (end 9.671 3.916) (layer F.SilkS) (width 0.12))
  (fp_line (start 9.711 -3.856) (end 9.711 3.856) (layer F.SilkS) (width 0.12))
  (fp_line (start 9.751 -3.794) (end 9.751 3.794) (layer F.SilkS) (width 0.12))
  (fp_line (start 9.791 -3.73) (end 9.791 3.73) (layer F.SilkS) (width 0.12))
  (fp_line (start 9.831 -3.666) (end 9.831 3.666) (layer F.SilkS) (width 0.12))
  (fp_line (start 9.871 -3.599) (end 9.871 3.599) (layer F.SilkS) (width 0.12))
  (fp_line (start 9.911 -3.531) (end 9.911 3.531) (layer F.SilkS) (width 0.12))
  (fp_line (start 9.951 -3.461) (end 9.951 3.461) (layer F.SilkS) (width 0.12))
  (fp_line (start 9.991 -3.389) (end 9.991 3.389) (layer F.SilkS) (width 0.12))
  (fp_line (start 10.031 -3.315) (end 10.031 3.315) (layer F.SilkS) (width 0.12))
  (fp_line (start 10.071 -3.24) (end 10.071 3.24) (layer F.SilkS) (width 0.12))
  (fp_line (start 10.111 -3.161) (end 10.111 3.161) (layer F.SilkS) (width 0.12))
  (fp_line (start 10.151 -3.08) (end 10.151 3.08) (layer F.SilkS) (width 0.12))
  (fp_line (start 10.191 -2.997) (end 10.191 2.997) (layer F.SilkS) (width 0.12))
  (fp_line (start 10.231 -2.911) (end 10.231 2.911) (layer F.SilkS) (width 0.12))
  (fp_line (start 10.271 -2.821) (end 10.271 2.821) (layer F.SilkS) (width 0.12))
  (fp_line (start 10.311 -2.728) (end 10.311 2.728) (layer F.SilkS) (width 0.12))
  (fp_line (start 10.351 -2.632) (end 10.351 2.632) (layer F.SilkS) (width 0.12))
  (fp_line (start 10.391 -2.53) (end 10.391 2.53) (layer F.SilkS) (width 0.12))
  (fp_line (start 10.431 -2.425) (end 10.431 2.425) (layer F.SilkS) (width 0.12))
  (fp_line (start 10.471 -2.313) (end 10.471 2.313) (layer F.SilkS) (width 0.12))
  (fp_line (start 10.511 -2.196) (end 10.511 2.196) (layer F.SilkS) (width 0.12))
  (fp_line (start 10.551 -2.071) (end 10.551 2.071) (layer F.SilkS) (width 0.12))
  (fp_line (start 10.591 -1.938) (end 10.591 1.938) (layer F.SilkS) (width 0.12))
  (fp_line (start 10.631 -1.794) (end 10.631 1.794) (layer F.SilkS) (width 0.12))
  (fp_line (start 10.671 -1.636) (end 10.671 1.636) (layer F.SilkS) (width 0.12))
  (fp_line (start 10.711 -1.461) (end 10.711 1.461) (layer F.SilkS) (width 0.12))
  (fp_line (start 10.751 -1.262) (end 10.751 1.262) (layer F.SilkS) (width 0.12))
  (fp_line (start 10.791 -1.025) (end 10.791 1.025) (layer F.SilkS) (width 0.12))
  (fp_line (start 10.831 -0.714) (end 10.831 0.714) (layer F.SilkS) (width 0.12))
  (fp_line (start -3.869543 -3.995) (end -2.469543 -3.995) (layer F.SilkS) (width 0.12))
  (fp_line (start -3.169543 -4.695) (end -3.169543 -3.295) (layer F.SilkS) (width 0.12))
  (fp_text user "${REFERENCE}" (at 3.75 0) (layer F.Fab)
    (effects (font (size 1 1) (thickness 0.15)))
  )
  (pad "2" thru_hole circle (at 7.5 0) (size 2.4 2.4) (drill 1.2) (layers *.Cu *.Mask) (tstamp 0141abf5-a659-488c-ba0b-224eca93f77d))
  (pad "1" thru_hole rect (at 0 0) (size 2.4 2.4) (drill 1.2) (layers *.Cu *.Mask) (tstamp 8b754c2e-0248-4799-9f5a-79cdaf0ba5c6))
  (model "${KICADLIB}/model/passive/CAPPR750-1450X2000.step"
    (offset (xyz 3.75 0 29))
    (scale (xyz 1 1 1))
    (rotate (xyz 0 0 0))
  )
)
