(module "wakefield-vette_624-25ABT4E" (layer "F.Cu") (tedit 5FA46319)
  (fp_text reference "REF**" (at 0 -10 unlocked) (layer "F.SilkS") hide
    (effects (font (size 1 1) (thickness 0.15)))
    (tstamp 8b9338c8-3ce9-444c-b38f-8bddade71e7c)
  )
  (fp_text value "wakefield-vette_624-25ABT4E" (at 0 1 unlocked) (layer "F.Fab") hide
    (effects (font (size 1 1) (thickness 0.15)))
    (tstamp 2a5582c1-fe94-4681-a597-9864d08bb2a1)
  )
  (fp_text user "${REFERENCE}" (at 0 0 unlocked) (layer "F.Fab")
    (effects (font (size 1 1) (thickness 0.15)))
    (tstamp f4b2a8a0-dde5-437c-84ea-d29ef1849c2a)
  )
  (fp_rect (start -10.5 -10.5) (end 10.5 10.5) (layer "F.Fab") (width 0.1) (tstamp 274e3efb-4bd7-40a2-a2dc-caaf500a6c60))
  (model "${KICADLIB}/model/mechanical/wakefield_624-25ABT4E.step"
    (offset (xyz 0 0 0))
    (scale (xyz 1 1 1))
    (rotate (xyz -90 0 0))
  )
)
