(footprint "PinSocket_1x02_P2.54mm_Vertical" (version 20211014) (generator pcbnew)
  (layer "F.Cu")
  (tedit 6116C93D)
  (descr "Through hole straight socket strip, 1x02, 2.54mm pitch, single row (from Kicad 4.0.7), script generated")
  (tags "Through hole socket strip THT 1x02 2.54mm single row")
  (attr through_hole)
  (fp_text reference "REF**" (at 0 -2.77) (layer "F.SilkS")
    (effects (font (size 1 1) (thickness 0.15)))
    (tstamp ffbc01c6-0a9c-4514-894d-22247104cd9e)
  )
  (fp_text value "PinSocket_1x02_P2.54mm_Vertical" (at 0 5.31) (layer "F.Fab") hide
    (effects (font (size 1 1) (thickness 0.15)))
    (tstamp a834fdf6-805d-45f2-bc5a-b56c5162445d)
  )
  (fp_text user "^" (at -2.14 -0.01 270 unlocked) (layer "F.SilkS")
    (effects (font (size 1 1) (thickness 0.15)))
    (tstamp 54de2777-8cfa-4286-bd1e-13634bd4bfbf)
  )
  (fp_text user "${REFERENCE}" (at 0 1.27 90) (layer "F.Fab")
    (effects (font (size 1 1) (thickness 0.15)))
    (tstamp 9a13a048-c0c1-4ce9-aa66-727ebe120ee8)
  )
  (fp_line (start -1.33 1.27) (end 1.33 1.27) (layer "F.SilkS") (width 0.12) (tstamp 09ad649b-cb64-47bf-b3d8-f7a8e3c1e706))
  (fp_line (start -1.33 3.87) (end 1.33 3.87) (layer "F.SilkS") (width 0.12) (tstamp 0fb84e0f-f580-45d8-be72-8466212ade79))
  (fp_line (start 0 -1.33) (end 1.33 -1.33) (layer "F.SilkS") (width 0.12) (tstamp 339bc43e-b3eb-4858-985d-0cdd8de226da))
  (fp_line (start 1.33 -1.33) (end 1.33 0) (layer "F.SilkS") (width 0.12) (tstamp 9b1db3fd-5b9f-43a6-b760-ab6d522e4e22))
  (fp_line (start -1.33 1.27) (end -1.33 3.87) (layer "F.SilkS") (width 0.12) (tstamp a460abf7-aa16-4dcf-a761-e23ba8b3119d))
  (fp_line (start 1.33 1.27) (end 1.33 3.87) (layer "F.SilkS") (width 0.12) (tstamp aa571886-ccd3-4685-8b06-cd224d697f28))
  (fp_line (start 1.75 4.3) (end -1.8 4.3) (layer "F.CrtYd") (width 0.05) (tstamp 3bb72435-479c-4f9c-9e9a-a08f8eb1b37a))
  (fp_line (start -1.8 4.3) (end -1.8 -1.8) (layer "F.CrtYd") (width 0.05) (tstamp 3c658969-b6b9-4ca2-816e-a9818167c6e2))
  (fp_line (start -1.8 -1.8) (end 1.75 -1.8) (layer "F.CrtYd") (width 0.05) (tstamp 62dc6238-18c8-46b8-953d-e8f8fbf19ecb))
  (fp_line (start 1.75 -1.8) (end 1.75 4.3) (layer "F.CrtYd") (width 0.05) (tstamp 7248c0c9-3c81-4b45-954d-2b2938ac4625))
  (fp_line (start 0.635 -1.27) (end 1.27 -0.635) (layer "F.Fab") (width 0.1) (tstamp 2e30c07b-0bc0-417b-b1fd-8c9ca6e21b89))
  (fp_line (start -1.27 3.81) (end -1.27 -1.27) (layer "F.Fab") (width 0.1) (tstamp 418609fc-e5d1-4287-9631-853c642f6fae))
  (fp_line (start -1.27 -1.27) (end 0.635 -1.27) (layer "F.Fab") (width 0.1) (tstamp b8f00d6f-5691-4bd3-93de-bf0a05503c8c))
  (fp_line (start 1.27 3.81) (end -1.27 3.81) (layer "F.Fab") (width 0.1) (tstamp e300daa9-4e89-496b-85a3-6dd8bca6df85))
  (fp_line (start 1.27 -0.635) (end 1.27 3.81) (layer "F.Fab") (width 0.1) (tstamp f37eaafa-c1ab-41d1-bf13-7c4396ff1311))
  (pad "1" thru_hole rect (at 0 0) (size 1.7 1.7) (drill 1) (layers *.Cu *.Mask) (tstamp a9bb19cb-b723-4695-a598-f506f94c10a6))
  (pad "2" thru_hole oval (at 0 2.54) (size 1.7 1.7) (drill 1) (layers *.Cu *.Mask) (tstamp cf776481-55a5-4135-b921-259ba89ec9c0))
  (model "${KICADLIB}/model/connector/PinSocket_1x02_P2.54mm_Vertical.step"
    (offset (xyz 0 0 0))
    (scale (xyz 1 1 1))
    (rotate (xyz 0 0 0))
  )
)
