(footprint "QFN50P200X150-9" (version 20210424) (generator pcbnew) (layer "F.Cu")
  (tedit 60CA472A)
  (fp_text reference "REF**" (at 0 -1.875 unlocked) (layer "F.SilkS")
    (effects (font (size 1 1) (thickness 0.15)))
    (tstamp c3305568-4b1a-4091-bae4-dee77f2246b4)
  )
  (fp_text value "QFN50P200X150-9" (at 0.25 1.775 unlocked) (layer "F.Fab") hide
    (effects (font (size 1 1) (thickness 0.15)))
    (tstamp 6747cd9e-c168-4499-9e8b-62968c4a0afe)
  )
  (fp_text user "^" (at -1.7 -0.25 270 unlocked) (layer "F.SilkS")
    (effects (font (size 1 1) (thickness 0.15)))
    (tstamp ee013a2b-0de9-4eb3-a9fc-a4bd49920b66)
  )
  (fp_text user "${REFERENCE}" (at 0 0 90 unlocked) (layer "F.Fab")
    (effects (font (size 0.35 0.35) (thickness 0.0875)))
    (tstamp b60e6474-11e2-441e-84c8-bc2abf357e76)
  )
  (fp_line (start 0.75 -1) (end 0.75 -0.425) (layer "F.SilkS") (width 0.1) (tstamp 0945bc35-58ca-4a73-88a9-a6e016d6c32d))
  (fp_line (start 0.75 1) (end 0.75 0.925) (layer "F.SilkS") (width 0.1) (tstamp 4546b057-f5f5-4f54-9315-e99b8e887233))
  (fp_line (start -0.75 1) (end -0.75 0.925) (layer "F.SilkS") (width 0.1) (tstamp 45c4236f-e9b9-4277-9b1d-282f644e2d04))
  (fp_line (start -0.75 -1) (end -0.75 -0.425) (layer "F.SilkS") (width 0.1) (tstamp 58880f99-9990-403b-9b7f-b0ff1cfc34d0))
  (fp_line (start 0.7 -1) (end 0.75 -1) (layer "F.SilkS") (width 0.1) (tstamp 93567eea-5daf-41c9-b3cb-0dd8f1ac8682))
  (fp_line (start -0.75 1) (end 0.75 1) (layer "F.SilkS") (width 0.1) (tstamp d91bc4e1-5923-413d-83a0-7e10dcae4417))
  (fp_line (start -0.7 -1) (end -0.75 -1) (layer "F.SilkS") (width 0.1) (tstamp de67bcad-0250-4c94-832f-da87679a5cf6))
  (fp_rect (start -1 -1.25) (end 1 1.25) (layer "F.CrtYd") (width 0.05) (fill none) (tstamp 0cbafb50-32dd-4299-8da8-74fb988c94e2))
  (fp_line (start 0.75 -1) (end 0.225 -1) (layer "F.Fab") (width 0.1) (tstamp 16f3d391-4bed-4109-9cb8-672c0fa02272))
  (fp_line (start 0.75 -1) (end 0.75 1) (layer "F.Fab") (width 0.1) (tstamp 4f7f9de9-dcd5-41fa-b754-00a02bc65f97))
  (fp_line (start -0.75 1) (end -0.75 -0.75) (layer "F.Fab") (width 0.1) (tstamp 69e1c0e8-3202-4675-8325-52811e466434))
  (fp_line (start 0.75 1) (end -0.75 1) (layer "F.Fab") (width 0.1) (tstamp 6c23f8a5-8680-4f5e-ace6-e5a4989f54ac))
  (fp_line (start -0.75 -0.75) (end -0.5 -1) (layer "F.Fab") (width 0.1) (tstamp b2828ef8-082e-4566-bff4-005efd6a1b51))
  (fp_line (start -0.5 -1) (end 0.75 -1) (layer "F.Fab") (width 0.1) (tstamp cd268254-b8bb-4cce-aa56-bcb35105098b))
  (pad "1" smd roundrect (at -0.625 -0.25) (size 0.65 0.2) (layers "F.Cu" "F.Paste" "F.Mask") (roundrect_rratio 0.25)
    (chamfer_ratio 0.5) (chamfer top_right) (tstamp 3e43f39c-5a19-40ac-8666-5d07b6d3314b))
  (pad "2" smd roundrect (at -0.625 0.25) (size 0.65 0.2) (layers "F.Cu" "F.Paste" "F.Mask") (roundrect_rratio 0.25) (tstamp 54d83ba4-597d-4dd2-a165-c571ed101e0d))
  (pad "3" smd roundrect (at -0.625 0.75) (size 0.65 0.2) (layers "F.Cu" "F.Paste" "F.Mask") (roundrect_rratio 0.25) (tstamp fb6c2d0d-0926-4ddc-abb4-4eed8d0cbd7d))
  (pad "4" smd roundrect (at 0.45 0.75) (size 1 0.2) (layers "F.Cu" "F.Paste" "F.Mask") (roundrect_rratio 0.25) (tstamp c785aae3-ad19-4e04-8a25-72aa573b638c))
  (pad "5" smd roundrect (at 0.625 0.25) (size 0.65 0.2) (layers "F.Cu" "F.Paste" "F.Mask") (roundrect_rratio 0.25) (tstamp a578c333-18ca-485e-a91a-edd1c695b2d7))
  (pad "6" smd roundrect (at 0.45 -0.25) (size 1 0.2) (layers "F.Cu" "F.Paste" "F.Mask") (roundrect_rratio 0.25) (tstamp 5649b5e2-348b-4b5c-b0d3-bdec1bc51c5a))
  (pad "7" smd roundrect (at 0.5 -0.925 90) (size 0.55 0.25) (layers "F.Cu" "F.Paste" "F.Mask") (roundrect_rratio 0.25) (tstamp 56ad8587-de28-467f-8924-417ac55f560d))
  (pad "8" smd roundrect (at 0 -0.925 90) (size 0.55 0.25) (layers "F.Cu" "F.Paste" "F.Mask") (roundrect_rratio 0.25) (tstamp 8a9f3af9-bb2c-419d-a07f-d20c899e405f))
  (pad "9" smd roundrect (at -0.5 -0.925 90) (size 0.55 0.25) (layers "F.Cu" "F.Paste" "F.Mask") (roundrect_rratio 0.25) (tstamp 81bb0f98-a42e-462f-86e7-93badc81b22d))
  (model "${KICADLIB}/model/QFN/QFN50P200X150-9.step"
    (offset (xyz 0 0 0))
    (scale (xyz 1 1 1))
    (rotate (xyz 0 0 0))
  )
)
