(footprint "QFN50P500X500-30_SIC47x" (version 20210606) (generator pcbnew) (layer "F.Cu")
  (tedit 60D92968)
  (fp_text reference "REF**" (at 0 -3.525 unlocked) (layer "F.SilkS")
    (effects (font (size 1 1) (thickness 0.15)))
    (tstamp 2f407110-e820-41b9-babf-00c65922775d)
  )
  (fp_text value "QFN50P500X500-30_SIC47x" (at 0 1 unlocked) (layer "F.Fab") hide
    (effects (font (size 1 1) (thickness 0.15)))
    (tstamp 2d9bee4c-7343-4eac-bff3-f6cfd87a7116)
  )
  (fp_text user "^" (at -3.6 -1.7 270 unlocked) (layer "F.SilkS")
    (effects (font (size 1 1) (thickness 0.15)))
    (tstamp b6bd7317-bd7f-4356-8374-504a7c4fca3e)
  )
  (fp_text user "${REFERENCE}" (at 0 0) (layer "F.Fab")
    (effects (font (size 0.8 0.8) (thickness 0.15)))
    (tstamp 3e629aaf-ff1c-4cc2-9262-7c90e5a513e5)
  )
  (fp_line (start -2.5 0.475) (end -2.5 1.025) (layer "F.SilkS") (width 0.1) (tstamp 0fc29f7a-cd42-4485-89b0-f08665d1370a))
  (fp_line (start 1.975 -2.5) (end 2.5 -2.5) (layer "F.SilkS") (width 0.1) (tstamp 204dad8f-a380-416f-8d82-6b87d2fbb324))
  (fp_line (start -0.65 2.5) (end 0.025 2.5) (layer "F.SilkS") (width 0.1) (tstamp 431f735c-abc0-4288-b6a1-a2d277860b52))
  (fp_line (start 2.5 2.125) (end 2.5 2.5) (layer "F.SilkS") (width 0.1) (tstamp 7a3ed759-e4ac-48dc-a1dc-634b0508f260))
  (fp_line (start 2.5 2.5) (end 1.475 2.5) (layer "F.SilkS") (width 0.1) (tstamp 8cf96b38-4cad-4012-939e-38c895c20fa0))
  (fp_line (start 2.5 -2.5) (end 2.5 -1.975) (layer "F.SilkS") (width 0.1) (tstamp 949feda4-62d4-4889-81ca-bb140596c7d8))
  (fp_line (start -1.975 -2.5) (end -2.5 -2.5) (layer "F.SilkS") (width 0.1) (tstamp 9548a7a3-7a22-4464-8bd1-a41685fda62f))
  (fp_line (start -2.5 1.975) (end -2.5 2.5) (layer "F.SilkS") (width 0.1) (tstamp a6718054-d366-4eea-b398-cacbe1d5fd4b))
  (fp_line (start -2.5 2.5) (end -1.75 2.5) (layer "F.SilkS") (width 0.1) (tstamp c9823e22-92a8-423d-af23-be37e6a7d863))
  (fp_line (start -2.5 -2.5) (end -2.5 -1.925) (layer "F.SilkS") (width 0.1) (tstamp f71d160a-dc8f-435b-aeaf-f11394d583b4))
  (fp_rect (start -3 -3) (end 3 3) (layer "F.CrtYd") (width 0.05) (fill none) (tstamp be46b616-8262-480f-898a-de5ffd76ef64))
  (fp_line (start -2 -2.5) (end 2.5 -2.5) (layer "F.Fab") (width 0.1) (tstamp 071c78df-27f1-4529-b924-aaa14e5d0a59))
  (fp_line (start -2.5 2.5) (end -2.5 -2) (layer "F.Fab") (width 0.1) (tstamp 9679fae5-d9aa-40d1-a7f9-f391781e2204))
  (fp_line (start 2.5 -2.5) (end 2.5 2.5) (layer "F.Fab") (width 0.1) (tstamp a9c4bd39-b53c-47bf-b651-b57ebd9c33f3))
  (fp_line (start -2 -2.5) (end -2.5 -2) (layer "F.Fab") (width 0.1) (tstamp b0e8f654-56f6-40ad-bf9b-29a0842e664f))
  (fp_line (start 2.5 2.5) (end -2.5 2.5) (layer "F.Fab") (width 0.1) (tstamp c9e19788-f24b-4a1a-95cf-e4bccf98c52c))
  (pad "" smd roundrect (at -1.2 0.175) (size 0.975 1) (layers "F.Paste") (roundrect_rratio 0.25) (tstamp 28658863-6373-4b5d-b7bb-70d3dcc64999))
  (pad "" smd roundrect (at -1.2 -1.15) (size 1 1) (layers "F.Paste") (roundrect_rratio 0.25) (tstamp 33a88174-bd69-46b6-8bc1-2f7f9a360a52))
  (pad "" smd roundrect (at 1.4 1.375) (size 0.925 1) (layers "F.Paste") (roundrect_rratio 0.25) (tstamp 46f8e73b-3694-4d9a-a60d-710fa82e7448))
  (pad "" smd roundrect (at 0 -1.15) (size 1 1) (layers "F.Paste") (roundrect_rratio 0.25) (tstamp 6c86d1f2-01c1-48a2-8727-5e0c5e93aef0))
  (pad "" smd roundrect (at -1.175 1.375) (size 0.95 1) (layers "F.Paste") (roundrect_rratio 0.25) (tstamp adba7375-9995-493f-aaf1-682ebcef3308))
  (pad "" smd roundrect (at 1.2 -1.15) (size 1 1) (layers "F.Paste") (roundrect_rratio 0.25) (tstamp bfc828c6-6c96-4b35-8781-a35765a05b97))
  (pad "" smd roundrect (at 0.475 0.175) (size 1 1) (layers "F.Paste") (roundrect_rratio 0.25) (tstamp e25f1974-4941-4ce8-9a05-4a003a99b4bb))
  (pad "" smd roundrect (at 0.2 1.375) (size 1 1) (layers "F.Paste") (roundrect_rratio 0.25) (tstamp eeb50c23-2521-4267-841b-28255dcf467d))
  (pad "1" smd rect (at -2.45 -1.7) (size 0.8 0.3) (layers "F.Cu" "F.Paste" "F.Mask") (tstamp 79b761dd-f372-4ff7-9bf2-4a9a134b9302))
  (pad "2" smd rect (at -2.45 -1.05) (size 0.8 0.3) (layers "F.Cu" "F.Paste" "F.Mask") (tstamp 66045e66-7737-4663-a40f-3dc894f4b75b))
  (pad "3" smd rect (at -2.45 -0.4) (size 0.8 0.3) (layers "F.Cu" "F.Paste" "F.Mask") (tstamp 7d9c926f-bbea-4691-8693-b7e56f7e6dba))
  (pad "4" smd rect (at -2.45 0.25) (size 0.8 0.3) (layers "F.Cu" "F.Paste" "F.Mask") (tstamp ae379df6-47b4-42d2-80ee-b56812de80f8))
  (pad "5" smd rect (at -2.45 1.25) (size 0.8 0.3) (layers "F.Cu" "F.Paste" "F.Mask") (tstamp 51a704f2-3740-4e28-bd0c-8c3299973762))
  (pad "6" smd rect (at -2.45 1.75) (size 0.8 0.3) (layers "F.Cu" "F.Paste" "F.Mask") (tstamp efcd9361-8926-4a77-b715-ff15bb2031ec))
  (pad "7" smd rect (at -1.525 2.45 270) (size 0.8 0.3) (layers "F.Cu" "F.Paste" "F.Mask") (tstamp 8f279c90-7062-4269-9cdb-cd435b3d8311))
  (pad "8" smd rect (at -0.875 2.45 270) (size 0.8 0.3) (layers "F.Cu" "F.Paste" "F.Mask") (tstamp dc1d0e77-3531-4373-9f32-71e9696110fe))
  (pad "9" smd rect (at 0.25 2.45 270) (size 0.8 0.3) (layers "F.Cu" "F.Paste" "F.Mask") (tstamp 83fa4bcd-f1e6-45df-b9cb-06af9c4c67a3))
  (pad "10" smd rect (at 0.75 2.45 270) (size 0.8 0.3) (layers "F.Cu" "F.Paste" "F.Mask") (tstamp 11f81c87-e3ca-421b-b0f6-d48d563bf660))
  (pad "11" smd rect (at 1.25 2.45 270) (size 0.8 0.3) (layers "F.Cu" "F.Paste" "F.Mask") (tstamp 02f4e994-8961-4871-9c78-ff7e665d4c23))
  (pad "12" smd rect (at 2.45 1.9 180) (size 0.8 0.3) (layers "F.Cu" "F.Paste" "F.Mask") (tstamp 3a2a78ba-c0b7-48ce-8b8a-7958b62db9c8))
  (pad "12" smd rect (at 2.175 1.4) (size 0.25 1.3) (layers "F.Cu" "F.Mask") (tstamp 84000bc3-ec56-4837-b555-9a05d901a33d))
  (pad "13" smd rect (at 2.45 1.4 180) (size 0.8 0.3) (layers "F.Cu" "F.Paste" "F.Mask") (tstamp 14140df7-f855-428e-9b1d-1436189666b0))
  (pad "14" smd rect (at 2.45 0.9 180) (size 0.8 0.3) (layers "F.Cu" "F.Paste" "F.Mask") (tstamp 27c6af37-83c3-4d01-8916-baa42540ea43))
  (pad "15" smd rect (at 2.1 0.25 180) (size 1.4 0.3) (layers "F.Cu" "F.Paste" "F.Mask") (tstamp 68a44601-431e-45bb-a9d2-cc8bc4fbd6bf))
  (pad "16" smd rect (at 2.4 -0.25 180) (size 0.8 0.3) (layers "F.Cu" "F.Paste" "F.Mask") (tstamp 47aa6d78-70f4-47e8-90f8-dd4ca5826ecd))
  (pad "17" smd rect (at 2.4 -0.75 180) (size 0.8 0.3) (layers "F.Cu" "F.Paste" "F.Mask") (tstamp 4e9677ee-2db1-4912-a6f4-a24fd7437f52))
  (pad "18" smd rect (at 2.4 -1.25 180) (size 0.8 0.3) (layers "F.Cu" "F.Paste" "F.Mask") (tstamp 19d5d529-4e0b-4c06-ae09-1553229fcf25))
  (pad "19" smd rect (at 2.4 -1.75 180) (size 0.8 0.3) (layers "F.Cu" "F.Paste" "F.Mask") (tstamp 7a771fc3-39d3-4135-8043-2031ff4a7b80))
  (pad "20" smd rect (at 1.75 -2.45 270) (size 0.8 0.3) (layers "F.Cu" "F.Paste" "F.Mask") (tstamp 6f51bafa-9ca1-46e5-bf07-3e62da6e09d0))
  (pad "21" smd rect (at 1.25 -2.45 270) (size 0.8 0.3) (layers "F.Cu" "F.Paste" "F.Mask") (tstamp a618bb8f-0ba4-4906-96f3-4289bdb5806e))
  (pad "22" smd rect (at 0.75 -2.45 90) (size 0.8 0.3) (layers "F.Cu" "F.Paste" "F.Mask") (tstamp 9c976828-1c33-4ecf-8235-31281a14781b))
  (pad "23" smd rect (at 0.25 -2.45 90) (size 0.8 0.3) (layers "F.Cu" "F.Paste" "F.Mask") (tstamp 93a860ab-2178-4d9a-80f6-1b40822fa3d6))
  (pad "24" smd rect (at -0.25 -2.45 90) (size 0.8 0.3) (layers "F.Cu" "F.Paste" "F.Mask") (tstamp 08ac0ac0-b66f-4cc4-a5bc-79216f6ed68c))
  (pad "25" smd rect (at -0.75 -2.45 90) (size 0.8 0.3) (layers "F.Cu" "F.Paste" "F.Mask") (tstamp 9c95db12-d19f-473a-87fe-366c7047b9ce))
  (pad "26" smd rect (at -1.25 -2.45 90) (size 0.8 0.3) (layers "F.Cu" "F.Paste" "F.Mask") (tstamp 4958a91f-ff1f-460f-9309-fd54083f5b8e))
  (pad "27" smd rect (at -1.75 -2.45 270) (size 0.8 0.3) (layers "F.Cu" "F.Paste" "F.Mask") (tstamp 5861e170-1252-45a4-9f2e-5a7c07c331a5))
  (pad "28" smd rect (at 0 -1.2 90) (size 1.2 3.4) (layers "F.Cu" "F.Mask") (tstamp 2e4ff7f0-59a9-42e2-95ca-90bc1c12fdfe))
  (pad "29" smd rect (at -1.2 0.95) (size 1.1 2.8) (layers "F.Cu" "F.Mask") (tstamp d74bf577-fe91-4bc6-9d9c-6343ef24545e))
  (pad "30" smd rect (at 0.45 1) (size 1.5 2.7) (layers "F.Cu" "F.Mask") (tstamp 021d3575-6438-4f45-a241-a9a5b24f22f9))
  (pad "30" smd rect (at 0.8 1.45) (size 2.2 1.8) (layers "F.Cu" "F.Mask") (tstamp dd96272c-4330-4f8c-aba6-515a5beede01))
  (model "${KICADLIB}/model/QFN/QFN50P500X500-30-SIC47x.step"
    (offset (xyz 0 0 0))
    (scale (xyz 1 1 1))
    (rotate (xyz 0 0 180))
  )
)
