(footprint "aquaman_harpoon_shield" (version 20210824) (generator pcbnew) (layer "F.Cu")
  (tedit 6140A225)
  (attr board_only exclude_from_pos_files exclude_from_bom)
  (fp_text reference "G***" (at 0 0) (layer "F.SilkS") hide
    (effects (font (size 1.524 1.524) (thickness 0.3)))
    (tstamp d5cd4695-be58-40c3-ada1-ac4e3c51c6e9)
  )
  (fp_text value "LOGO" (at 0.75 0) (layer "F.SilkS") hide
    (effects (font (size 1.524 1.524) (thickness 0.3)))
    (tstamp 78cef396-bb94-41ee-989a-4d3e554c44aa)
  )
  (fp_arc (start -7.410111 -18.066406) (end -8.870425 -6.35) (angle -46.1) (layer "F.SilkS") (width 0.4) (tstamp 253e5ab8-8df9-4953-8032-72483b568daf))
  (fp_arc (start -2.166509 -1.820814) (end 0.019575 10.16) (angle -101.9) (layer "F.SilkS") (width 0.4) (tstamp 319a8e2b-a2f8-4605-b5d1-6324344ed002))
  (fp_arc (start 2.20566 -1.820813) (end 0.019575 10.16) (angle 101.9) (layer "F.SilkS") (width 0.4) (tstamp 4532f0c6-02b8-41a4-92a9-e762dee732ab))
  (fp_arc (start 6.680056 -15.481955) (end 9.106044 -6.43041) (angle 60.3) (layer "F.SilkS") (width 0.4) (tstamp c7d336f3-a000-4b5d-afcf-8d5d5d43e9d3))
  (fp_poly (pts
      (xy 0.228836 -1.028267)
      (xy 0.210796 -1.010227)
      (xy 0.192757 -1.028267)
      (xy 0.210796 -1.046307)
    ) (layer "F.SilkS") (width 0) (fill solid) (tstamp 00ee435b-90df-4b82-b6a2-e95a5f0dc963))
  (fp_poly (pts
      (xy -7.73573 -2.613024)
      (xy -7.54115 -2.569313)
      (xy -7.510112 -2.560539)
      (xy -7.321909 -2.507699)
      (xy -7.083433 -2.443471)
      (xy -6.808973 -2.371456)
      (xy -6.512819 -2.295258)
      (xy -6.209261 -2.218479)
      (xy -5.912587 -2.144721)
      (xy -5.637088 -2.077586)
      (xy -5.397053 -2.020678)
      (xy -5.206771 -1.977597)
      (xy -5.148769 -1.965247)
      (xy -4.953821 -1.92669)
      (xy -4.767892 -1.894524)
      (xy -4.581671 -1.86811)
      (xy -4.385846 -1.846808)
      (xy -4.171109 -1.829977)
      (xy -3.928148 -1.816979)
      (xy -3.647653 -1.807172)
      (xy -3.320313 -1.799918)
      (xy -2.936818 -1.794576)
      (xy -2.621448 -1.791561)
      (xy -2.266324 -1.788468)
      (xy -1.974387 -1.785302)
      (xy -1.736666 -1.781532)
      (xy -1.544188 -1.776627)
      (xy -1.387984 -1.770057)
      (xy -1.259082 -1.761292)
      (xy -1.148512 -1.7498)
      (xy -1.047301 -1.735052)
      (xy -0.946479 -1.716516)
      (xy -0.837075 -1.693662)
      (xy -0.788873 -1.683187)
      (xy -0.297789 -1.558066)
      (xy 0.128899 -1.410126)
      (xy 0.496106 -1.23662)
      (xy 0.808749 -1.0348)
      (xy 1.071743 -0.801917)
      (xy 1.290004 -0.535223)
      (xy 1.305821 -0.512135)
      (xy 1.452144 -0.253963)
      (xy 1.535273 0.000793)
      (xy 1.560837 0.270403)
      (xy 1.560064 0.31297)
      (xy 1.535998 0.572215)
      (xy 1.475632 0.78993)
      (xy 1.369783 0.986817)
      (xy 1.209272 1.183577)
      (xy 1.144211 1.250544)
      (xy 1.014447 1.387015)
      (xy 0.931438 1.490326)
      (xy 0.899256 1.555203)
      (xy 0.900196 1.566582)
      (xy 0.942687 1.626313)
      (xy 1.028523 1.684404)
      (xy 1.166803 1.745661)
      (xy 1.366623 1.81489)
      (xy 1.375625 1.817766)
      (xy 1.663101 1.909661)
      (xy 1.889411 1.981466)
      (xy 2.062468 2.033943)
      (xy 2.190187 2.067856)
      (xy 2.280482 2.083968)
      (xy 2.341266 2.083043)
      (xy 2.380454 2.065842)
      (xy 2.405959 2.033129)
      (xy 2.425695 1.985668)
      (xy 2.447577 1.924222)
      (xy 2.448703 1.921236)
      (xy 2.520415 1.755548)
      (xy 2.589705 1.651521)
      (xy 2.66473 1.599439)
      (xy 2.727959 1.588634)
      (xy 2.792109 1.595905)
      (xy 2.916022 1.616916)
      (xy 3.089095 1.649416)
      (xy 3.300726 1.691153)
      (xy 3.540311 1.739876)
      (xy 3.79725 1.793334)
      (xy 4.060938 1.849276)
      (xy 4.320774 1.90545)
      (xy 4.566156 1.959606)
      (xy 4.78648 2.009491)
      (xy 4.971145 2.052856)
      (xy 5.109547 2.087447)
      (xy 5.191085 2.111015)
      (xy 5.195296 2.112527)
      (xy 5.314142 2.175822)
      (xy 5.365102 2.2476)
      (xy 5.375135 2.277664)
      (xy 5.394981 2.298877)
      (xy 5.435588 2.312638)
      (xy 5.507902 2.320349)
      (xy 5.622872 2.323411)
      (xy 5.791444 2.323225)
      (xy 5.945872 2.321925)
      (xy 6.506677 2.316719)
      (xy 6.506677 3.918445)
      (xy 6.506272 4.315938)
      (xy 6.504958 4.646434)
      (xy 6.502592 4.915091)
      (xy 6.499026 5.127067)
      (xy 6.494117 5.287521)
      (xy 6.487718 5.401609)
      (xy 6.479685 5.474491)
      (xy 6.469871 5.511324)
      (xy 6.461578 5.518416)
      (xy 6.40823 5.505474)
      (xy 6.307244 5.472731)
      (xy 6.178195 5.426629)
      (xy 6.145882 5.414541)
      (xy 6.018655 5.362948)
      (xy 5.845121 5.287584)
      (xy 5.643647 5.196676)
      (xy 5.432603 5.098452)
      (xy 5.317423 5.043481)
      (xy 5.107275 4.94345)
      (xy 4.951082 4.872799)
      (xy 4.838666 4.827837)
      (xy 4.759849 4.804874)
      (xy 4.704452 4.800216)
      (xy 4.667991 4.807961)
      (xy 4.615208 4.817409)
      (xy 4.543422 4.808818)
      (xy 4.440016 4.778779)
      (xy 4.292369 4.723883)
      (xy 4.161507 4.671127)
      (xy 3.957242 4.587865)
      (xy 3.73498 4.49816)
      (xy 3.52603 4.414609)
      (xy 3.403836 4.366289)
      (xy 3.054535 4.22828)
      (xy 2.768179 4.113166)
      (xy 2.54 4.018909)
      (xy 2.365229 3.943468)
      (xy 2.239099 3.884804)
      (xy 2.156839 3.840878)
      (xy 2.124445 3.819113)
      (xy 2.025603 3.698897)
      (xy 1.988864 3.545381)
      (xy 2.015076 3.363407)
      (xy 2.028118 3.325002)
      (xy 2.160488 3.325002)
      (xy 2.166824 3.380578)
      (xy 2.19269 3.400216)
      (xy 2.226448 3.361739)
      (xy 2.263354 3.27808)
      (xy 2.298669 3.162168)
      (xy 2.327649 3.026933)
      (xy 2.344739 2.895406)
      (xy 2.354405 2.768956)
      (xy 2.354694 2.703894)
      (xy 2.343259 2.689792)
      (xy 2.317753 2.71622)
      (xy 2.307473 2.729863)
      (xy 2.268386 2.809364)
      (xy 2.229153 2.931722)
      (xy 2.194764 3.073843)
      (xy 2.170212 3.212634)
      (xy 2.160488 3.325002)
      (xy 2.028118 3.325002)
      (xy 2.034541 3.30609)
      (xy 2.078443 3.189496)
      (xy 2.098337 3.126809)
      (xy 2.0954 3.104313)
      (xy 2.070809 3.108292)
      (xy 2.050853 3.115888)
      (xy 2.004328 3.117965)
      (xy 1.996734 3.104506)
      (xy 1.965818 3.075607)
      (xy 1.889109 3.03857)
      (xy 1.790666 3.003361)
      (xy 1.696925 2.980339)
      (xy 1.634046 2.95834)
      (xy 1.571133 2.927567)
      (xy 1.502351 2.896027)
      (xy 1.384743 2.84823)
      (xy 1.237561 2.791842)
      (xy 1.142785 2.756974)
      (xy 1.102252 2.742045)
      (xy 2.177132 2.742045)
      (xy 2.190333 2.771743)
      (xy 2.201185 2.766098)
      (xy 2.205503 2.72328)
      (xy 2.201185 2.717992)
      (xy 2.179735 2.722945)
      (xy 2.177132 2.742045)
      (xy 1.102252 2.742045)
      (xy 0.984075 2.698518)
      (xy 0.780253 2.621971)
      (xy 0.580367 2.545957)
      (xy 2.501848 2.545957)
      (xy 2.514689 2.609803)
      (xy 2.567597 2.632297)
      (xy 2.605668 2.633807)
      (xy 2.696972 2.651332)
      (xy 2.753775 2.687168)
      (xy 2.809939 2.72119)
      (xy 2.866431 2.703938)
      (xy 2.919439 2.686521)
      (xy 2.934673 2.722012)
      (xy 2.934802 2.729952)
      (xy 2.945229 2.77021)
      (xy 2.975372 2.751986)
      (xy 3.024854 2.733098)
      (xy 3.108051 2.754954)
      (xy 3.14675 2.77183)
      (xy 3.235975 2.817962)
      (xy 3.294037 2.856997)
      (xy 3.300584 2.863926)
      (xy 3.34658 2.8788)
      (xy 3.359942 2.873153)
      (xy 3.401218 2.880899)
      (xy 3.41784 2.906897)
      (xy 3.454304 2.943568)
      (xy 3.477321 2.939664)
      (xy 3.533451 2.939719)
      (xy 3.566194 2.958523)
      (xy 3.627111 2.983406)
      (xy 3.654812 2.977539)
      (xy 3.689184 2.978934)
      (xy 3.692473 2.992473)
      (xy 3.711734 3.024977)
      (xy 3.719532 3.024954)
      (xy 3.774155 3.030825)
      (xy 3.800711 3.038873)
      (xy 3.882967 3.066059)
      (xy 3.9924 3.099094)
      (xy 4.102613 3.130395)
      (xy 4.187209 3.15238)
      (xy 4.215626 3.158051)
      (xy 4.319231 3.176142)
      (xy 4.413895 3.204464)
      (xy 4.475352 3.234785)
      (xy 4.486223 3.249829)
      (xy 4.517324 3.266526)
      (xy 4.594 3.265361)
      (xy 4.612501 3.262777)
      (xy 4.705465 3.257681)
      (xy 4.741796 3.283289)
      (xy 4.742965 3.290033)
      (xy 4.75301 3.302429)
      (xy 4.76365 3.274219)
      (xy 4.793727 3.229119)
      (xy 5.099575 3.229119)
      (xy 5.117615 3.247159)
      (xy 5.135654 3.229119)
      (xy 5.117615 3.211079)
      (xy 5.099575 3.229119)
      (xy 4.793727 3.229119)
      (xy 4.799392 3.220625)
      (xy 4.82611 3.211079)
      (xy 4.876199 3.182385)
      (xy 4.91478 3.1299)
      (xy 4.940449 3.089294)
      (xy 4.941671 3.106113)
      (xy 4.943742 3.184128)
      (xy 4.954717 3.210206)
      (xy 4.988033 3.227389)
      (xy 5.020901 3.188617)
      (xy 5.046261 3.109789)
      (xy 5.057052 3.006805)
      (xy 5.0567 2.980536)
      (xy 5.04977 2.899986)
      (xy 5.038793 2.865)
      (xy 5.035987 2.865766)
      (xy 4.99862 2.858409)
      (xy 4.917476 2.823335)
      (xy 4.828978 2.778125)
      (xy 4.724629 2.726746)
      (xy 4.64677 2.697811)
      (xy 4.616118 2.696336)
      (xy 4.595903 2.69094)
      (xy 4.594461 2.67811)
      (xy 4.562309 2.649564)
      (xy 4.48091 2.623077)
      (xy 4.43166 2.613814)
      (xy 4.329666 2.592548)
      (xy 4.261363 2.567229)
      (xy 4.248769 2.556896)
      (xy 4.205901 2.540477)
      (xy 4.195093 2.545149)
      (xy 4.163609 2.541497)
      (xy 4.162863 2.537595)
      (xy 4.281772 2.537595)
      (xy 4.286724 2.559044)
      (xy 4.305825 2.561648)
      (xy 4.335522 2.548447)
      (xy 4.329878 2.537595)
      (xy 4.28706 2.533277)
      (xy 4.281772 2.537595)
      (xy 4.162863 2.537595)
      (xy 4.161507 2.530495)
      (xy 4.13129 2.4952)
      (xy 4.038638 2.457937)
      (xy 3.880546 2.417814)
      (xy 3.654009 2.373942)
      (xy 3.604823 2.365423)
      (xy 3.460109 2.338032)
      (xy 3.344122 2.311021)
      (xy 3.274132 2.288644)
      (xy 3.262067 2.280979)
      (xy 3.213743 2.25626)
      (xy 3.151814 2.245824)
      (xy 3.078901 2.228009)
      (xy 3.049513 2.20223)
      (xy 3.015325 2.18021)
      (xy 3.003669 2.184847)
      (xy 2.950672 2.187111)
      (xy 2.863037 2.166217)
      (xy 2.845533 2.160196)
      (xy 2.758262 2.134664)
      (xy 2.702952 2.14572)
      (xy 2.645665 2.200561)
      (xy 2.643493 2.203036)
      (xy 2.538449 2.368318)
      (xy 2.501857 2.543138)
      (xy 2.501848 2.545957)
      (xy 0.580367 2.545957)
      (xy 0.55335 2.535683)
      (xy 0.325395 2.448004)
      (xy 0.233442 2.412306)
      (xy -0.003663 2.320083)
      (xy -0.263696 2.219144)
      (xy -0.519311 2.120092)
      (xy -0.743163 2.033531)
      (xy -0.799431 2.011817)
      (xy -1.167022 1.868245)
      (xy -1.566252 1.709203)
      (xy -1.707629 1.651888)
      (xy -0.184385 1.651888)
      (xy -0.179636 1.655143)
      (xy -0.118921 1.682391)
      (xy -0.089437 1.706221)
      (xy -0.039975 1.735331)
      (xy 0.058134 1.780943)
      (xy 0.185587 1.835279)
      (xy 0.323078 1.890559)
      (xy 0.451305 1.939005)
      (xy 0.550963 1.97284)
      (xy 0.600861 1.984375)
      (xy 0.646762 1.997621)
      (xy 0.733214 2.03111)
      (xy 0.779442 2.050646)
      (xy 1.108849 2.179842)
      (xy 1.503444 2.309891)
      (xy 1.555237 2.325588)
      (xy 1.676203 2.36576)
      (xy 1.760718 2.401272)
      (xy 1.793864 2.425638)
      (xy 1.792761 2.428878)
      (xy 1.801246 2.449451)
      (xy 1.837383 2.455445)
      (xy 1.917423 2.468978)
      (xy 2.021023 2.49932)
      (xy 2.032813 2.503523)
      (xy 2.144738 2.538655)
      (xy 2.211878 2.541575)
      (xy 2.253845 2.512631)
      (xy 2.257758 2.507528)
      (xy 2.285048 2.433853)
      (xy 2.26946 2.370277)
      (xy 2.221239 2.34517)
      (xy 2.140483 2.325498)
      (xy 2.085941 2.297071)
      (xy 2.014762 2.262889)
      (xy 1.899711 2.221438)
      (xy 1.780257 2.185795)
      (xy 1.630024 2.143853)
      (xy 1.482405 2.100279)
      (xy 1.392931 2.072144)
      (xy 1.271666 2.035751)
      (xy 1.1602 2.008034)
      (xy 1.137502 2.003591)
      (xy 1.033521 1.978689)
      (xy 0.907948 1.939869)
      (xy 0.788027 1.896511)
      (xy 0.701006 1.857996)
      (xy 0.682945 1.847099)
      (xy 0.625706 1.818425)
      (xy 0.531037 1.781341)
      (xy 0.499433 1.770338)
      (xy 0.380638 1.719338)
      (xy 0.325047 1.66952)
      (xy 0.336407 1.624705)
      (xy 0.347999 1.616064)
      (xy 0.347632 1.599706)
      (xy 0.29169 1.592136)
      (xy 0.196195 1.593129)
      (xy 0.077167 1.602463)
      (xy -0.049374 1.619916)
      (xy -0.0598 1.621738)
      (xy -0.145956 1.639318)
      (xy -0.184385 1.651888)
      (xy -1.707629 1.651888)
      (xy -1.962784 1.548447)
      (xy -2.205364 1.448497)
      (xy -2.297503 1.411667)
      (xy -2.358218 1.390039)
      (xy -2.367722 1.387784)
      (xy -2.410964 1.371135)
      (xy -2.45909 1.346295)
      (xy -2.551462 1.307166)
      (xy -2.603408 1.293454)
      (xy -2.671103 1.27338)
      (xy -2.693607 1.25901)
      (xy -2.734966 1.235293)
      (xy -2.83533 1.188586)
      (xy -2.986575 1.122368)
      (xy -3.180577 1.040116)
      (xy -3.409212 0.94531)
      (xy -3.664356 0.841428)
      (xy -3.739914 0.810998)
      (xy -3.887657 0.74938)
      (xy -4.011278 0.693624)
      (xy -4.094552 0.651282)
      (xy -4.11958 0.6343)
      (xy -4.181417 0.584389)
      (xy -4.223662 0.557923)
      (xy -4.276099 0.510518)
      (xy -4.279981 0.46747)
      (xy -4.239014 0.450994)
      (xy -4.190265 0.422314)
      (xy -4.181888 0.405895)
      (xy -4.190767 0.365095)
      (xy -4.205941 0.360795)
      (xy -4.2406 0.331621)
      (xy -4.245027 0.306676)
      (xy -4.269349 0.258063)
      (xy -4.290127 0.251409)
      (xy -4.315059 0.239496)
      (xy -4.289991 0.213093)
      (xy -4.232895 0.181939)
      (xy -4.161739 0.155773)
      (xy -4.094496 0.144332)
      (xy -4.092505 0.144318)
      (xy -4.024979 0.155806)
      (xy -3.903188 0.187605)
      (xy -3.740806 0.235713)
      (xy -3.551507 0.29613)
      (xy -3.404869 0.345472)
      (xy -2.982066 0.486939)
      (xy -2.613903 0.600625)
      (xy -2.289328 0.688605)
      (xy -1.997289 0.752951)
      (xy -1.726731 0.795738)
      (xy -1.466603 0.819038)
      (xy -1.205851 0.824924)
      (xy -0.933422 0.815471)
      (xy -0.90767 0.813921)
      (xy -0.498773 0.771409)
      (xy -0.154579 0.698697)
      (xy 0.124673 0.595878)
      (xy 0.338742 0.463046)
      (xy 0.487388 0.300294)
      (xy 0.511344 0.260378)
      (xy 0.560677 0.165038)
      (xy 0.576173 0.105043)
      (xy 0.560415 0.053444)
      (xy 0.535134 0.012399)
      (xy 0.501191 -0.0492)
      (xy 0.514536 -0.059587)
      (xy 0.52275 -0.055813)
      (xy 0.537615 -0.054413)
      (xy 0.502371 -0.089804)
      (xy 0.424684 -0.155544)
      (xy 0.312219 -0.245191)
      (xy 0.172641 -0.352304)
      (xy 0.146475 -0.372007)
      (xy 0.095803 -0.403857)
      (xy 0.523877 -0.403857)
      (xy 0.559002 -0.316816)
      (xy 0.588127 -0.259705)
      (xy 0.647383 -0.140043)
      (xy 0.699824 -0.021992)
      (xy 0.705386 -0.008174)
      (xy 0.757443 0.080033)
      (xy 0.807851 0.101805)
      (xy 0.842786 0.059882)
      (xy 0.849035 -0.036628)
      (xy 0.822366 -0.136403)
      (xy 0.753033 -0.239254)
      (xy 0.677657 -0.31882)
      (xy 0.582737 -0.40455)
      (xy 0.531633 -0.432999)
      (xy 0.523877 -0.403857)
      (xy 0.095803 -0.403857)
      (xy -0.018771 -0.475873)
      (xy -0.23667 -0.583314)
      (xy -0.488542 -0.687022)
      (xy -0.755709 -0.779687)
      (xy -1.019489 -0.854)
      (xy -1.169596 -0.886976)
      (xy -1.296524 -0.9064)
      (xy -1.460644 -0.924377)
      (xy -1.649157 -0.940312)
      (xy -1.849264 -0.95361)
      (xy -2.048169 -0.963678)
      (xy -2.233072 -0.969921)
      (xy -2.391176 -0.971743)
      (xy -2.509682 -0.968551)
      (xy -2.575792 -0.959749)
      (xy -2.585214 -0.95274)
      (xy -2.566526 -0.906455)
      (xy -2.518705 -0.822731)
      (xy -2.47713 -0.757671)
      (xy -2.392122 -0.589325)
      (xy -2.3653 -0.435374)
      (xy -2.395172 -0.305277)
      (xy -2.480249 -0.208499)
      (xy -2.570297 -0.166115)
      (xy -2.630453 -0.170327)
      (xy -2.748674 -0.197986)
      (xy -2.915917 -0.246014)
      (xy -3.123141 -0.311333)
      (xy -3.361301 -0.390864)
      (xy -3.621357 -0.481529)
      (xy -3.894266 -0.58025)
      (xy -4.170985 -0.683948)
      (xy -4.442473 -0.789546)
      (xy -4.659942 -0.877496)
      (xy -4.78518 -0.928999)
      (xy -2.968065 -0.928999)
      (xy -2.96542 -0.900493)
      (xy -2.961169 -0.889052)
      (xy -2.928721 -0.844718)
      (xy -2.890294 -0.82593)
      (xy -2.874005 -0.843452)
      (xy -2.89794 -0.874545)
      (xy -2.92895 -0.902674)
      (xy -2.968065 -0.928999)
      (xy -4.78518 -0.928999)
      (xy -5.093468 -1.055779)
      (xy -5.462582 -1.206227)
      (xy -5.769133 -1.329573)
      (xy -6.01497 -1.426552)
      (xy -6.201944 -1.497897)
      (xy -6.331904 -1.544342)
      (xy -6.373721 -1.557751)
      (xy -6.492129 -1.598557)
      (xy -6.621985 -1.650391)
      (xy -6.644317 -1.660163)
      (xy -6.744574 -1.701121)
      (xy -6.888229 -1.755124)
      (xy -7.050091 -1.812808)
      (xy -7.113351 -1.834497)
      (xy -7.373812 -1.923458)
      (xy -7.571052 -1.992725)
      (xy -7.710648 -2.044367)
      (xy -7.798178 -2.080457)
      (xy -7.839218 -2.103066)
      (xy -7.841067 -2.104752)
      (xy -7.894367 -2.125735)
      (xy -7.927157 -2.128693)
      (xy -7.999242 -2.150396)
      (xy -8.073893 -2.197188)
      (xy -8.131935 -2.263069)
      (xy -8.138794 -2.297266)
      (xy -8.115639 -2.297266)
      (xy -8.083415 -2.297611)
      (xy -8.038296 -2.332045)
      (xy -8.03338 -2.346901)
      (xy -8.053587 -2.39218)
      (xy -8.092744 -2.386338)
      (xy -8.115393 -2.347464)
      (xy -8.115639 -2.297266)
      (xy -8.138794 -2.297266)
      (xy -8.149234 -2.349321)
      (xy -8.146685 -2.404645)
      (xy -8.14278 -2.428279)
      (xy -7.791731 -2.428279)
      (xy -7.761254 -2.407416)
      (xy -7.688312 -2.382589)
      (xy -7.592332 -2.361843)
      (xy -7.499218 -2.339001)
      (xy -7.441267 -2.311632)
      (xy -7.436127 -2.305952)
      (xy -7.387941 -2.28026)
      (xy -7.329829 -2.273011)
      (xy -7.25541 -2.261)
      (xy -7.224118 -2.241022)
      (xy -7.178615 -2.214459)
      (xy -7.091159 -2.189318)
      (xy -7.06865 -2.184936)
      (xy -6.940511 -2.155842)
      (xy -6.805021 -2.116254)
      (xy -6.788635 -2.110696)
      (xy -6.695925 -2.079855)
      (xy -6.546772 -2.031856)
      (xy -6.353743 -1.970632)
      (xy -6.129404 -1.900114)
      (xy -5.88632 -1.824233)
      (xy -5.637057 -1.746923)
      (xy -5.394182 -1.672114)
      (xy -5.170261 -1.603738)
      (xy -5.110937 -1.585757)
      (xy -4.904163 -1.523013)
      (xy -4.666458 -1.450588)
      (xy -4.435842 -1.380076)
      (xy -4.335226 -1.349206)
      (xy -4.160162 -1.295544)
      (xy -3.995542 -1.245316)
      (xy -3.862419 -1.204931)
      (xy -3.794033 -1.184402)
      (xy -3.691924 -1.149396)
      (xy -3.616752 -1.115423)
      (xy -3.605075 -1.107931)
      (xy -3.534756 -1.089476)
      (xy -3.505856 -1.095258)
      (xy -3.424693 -1.101746)
      (xy -3.394133 -1.094273)
      (xy -3.357695 -1.069726)
      (xy -3.385113 -1.041336)
      (xy -3.389765 -1.025354)
      (xy -3.331993 -1.02756)
      (xy -3.306959 -1.031355)
      (xy -3.229234 -1.040937)
      (xy -3.213002 -1.030888)
      (xy -3.2348 -1.009862)
      (xy -3.266915 -0.980209)
      (xy -3.236827 -0.984445)
      (xy -3.221207 -0.989407)
      (xy -3.14379 -0.990992)
      (xy -3.109121 -0.974645)
      (xy -3.07793 -0.965084)
      (xy -3.068139 -1.01472)
      (xy -3.068594 -1.042635)
      (xy -3.079134 -1.111416)
      (xy -3.099165 -1.131028)
      (xy -3.099502 -1.13083)
      (xy -3.125793 -1.139589)
      (xy -3.126562 -1.146824)
      (xy -3.092214 -1.213801)
      (xy -2.996009 -1.27644)
      (xy -2.848204 -1.332961)
      (xy -2.659054 -1.381582)
      (xy -2.438817 -1.420522)
      (xy -2.197749 -1.447999)
      (xy -1.946106 -1.462232)
      (xy -1.694146 -1.46144)
      (xy -1.452123 -1.443842)
      (xy -1.430823 -1.441329)
      (xy -0.881176 -1.343338)
      (xy -0.376236 -1.189148)
      (xy 0.083654 -0.978891)
      (xy 0.498146 -0.712697)
      (xy 0.502082 -0.709736)
      (xy 0.729019 -0.506915)
      (xy 0.887649 -0.292501)
      (xy 0.976393 -0.068768)
      (xy 0.987744 -0.009887)
      (xy 0.997841 0.100232)
      (xy 0.982469 0.187706)
      (xy 0.933642 0.28693)
      (xy 0.909562 0.326922)
      (xy 0.819202 0.447141)
      (xy 0.709778 0.557574)
      (xy 0.661659 0.595404)
      (xy 0.577604 0.659539)
      (xy 0.525638 0.710521)
      (xy 0.517473 0.726498)
      (xy 0.495078 0.750563)
      (xy 0.490413 0.749647)
      (xy 0.444402 0.762146)
      (xy 0.37094 0.803436)
      (xy 0.36903 0.804708)
      (xy 0.287766 0.845584)
      (xy 0.162491 0.893906)
      (xy 0.019219 0.939716)
      (xy 0.008234 0.94284)
      (xy -0.261396 0.996621)
      (xy -0.582803 1.02002)
      (xy -0.959115 1.012942)
      (xy -1.39346 0.975292)
      (xy -1.888966 0.906972)
      (xy -2.055323 0.879577)
      (xy -2.195839 0.853634)
      (xy -2.333018 0.823222)
      (xy -2.478177 0.784872)
      (xy -2.642634 0.735114)
      (xy -2.837708 0.670479)
      (xy -3.074716 0.587497)
      (xy -3.364976 0.482699)
      (xy -3.443291 0.454109)
      (xy -3.635156 0.385678)
      (xy -3.808086 0.327204)
      (xy -3.948664 0.282977)
      (xy -4.043473 0.25729)
      (xy -4.073394 0.252557)
      (xy -4.126835 0.262847)
      (xy -4.112461 0.293235)
      (xy -4.031543 0.342993)
      (xy -3.885356 0.411395)
      (xy -3.675172 0.497714)
      (xy -3.577556 0.535533)
      (xy -3.369917 0.615422)
      (xy -3.152029 0.700125)
      (xy -2.949872 0.779497)
      (xy -2.79045 0.842975)
      (xy -2.503303 0.95605)
      (xy -2.267799 1.041564)
      (xy -2.070318 1.102746)
      (xy -1.897245 1.142827)
      (xy -1.734961 1.165037)
      (xy -1.569848 1.172607)
      (xy -1.412783 1.169777)
      (xy -1.240163 1.167093)
      (xy -1.070582 1.171178)
      (xy -0.934462 1.181136)
      (xy -0.90767 1.184673)
      (xy -0.653073 1.210484)
      (xy -0.404408 1.212182)
      (xy -0.185682 1.190312)
      (xy -0.07784 1.165817)
      (xy 0.057741 1.123323)
      (xy 0.177366 1.079731)
      (xy 0.315606 1.022096)
      (xy 0.373154 0.996928)
      (xy 0.479456 0.938568)
      (xy 0.604008 0.852802)
      (xy 0.733985 0.750854)
      (xy 0.808908 0.685511)
      (xy 1.280215 0.685511)
      (xy 1.289466 0.705603)
      (xy 1.311223 0.667471)
      (xy 1.33701 0.583304)
      (xy 1.34223 0.541193)
      (xy 1.332979 0.521101)
      (xy 1.311223 0.559233)
      (xy 1.285435 0.6434)
      (xy 1.280215 0.685511)
      (xy 0.808908 0.685511)
      (xy 0.856562 0.64395)
      (xy 0.958917 0.543316)
      (xy 1.028223 0.460178)
      (xy 1.051656 0.40576)
      (xy 1.051259 0.403368)
      (xy 1.051424 0.402021)
      (xy 1.313229 0.402021)
      (xy 1.328134 0.459368)
      (xy 1.343096 0.469034)
      (xy 1.373559 0.4384)
      (xy 1.390962 0.385376)
      (xy 1.394066 0.288899)
      (xy 1.383437 0.234675)
      (xy 1.362525 0.188155)
      (xy 1.344238 0.209295)
      (xy 1.335571 0.231086)
      (xy 1.315418 0.316749)
      (xy 1.313229 0.402021)
      (xy 1.051424 0.402021)
      (xy 1.057036 0.356258)
      (xy 1.078415 0.268208)
      (xy 1.087979 0.234517)
      (xy 1.125172 0.008802)
      (xy 1.099408 -0.206553)
      (xy 1.009062 -0.413829)
      (xy 0.852508 -0.615305)
      (xy 0.628119 -0.813264)
      (xy 0.33427 -1.009985)
      (xy 0.111578 -1.134929)
      (xy -0.00354 -1.193484)
      (xy -0.089301 -1.232705)
      (xy -0.130421 -1.245724)
      (xy -0.131959 -1.244366)
      (xy -0.157515 -1.247219)
      (xy -0.215317 -1.279659)
      (xy -0.323906 -1.333078)
      (xy -0.486347 -1.39095)
      (xy -0.684914 -1.448605)
      (xy -0.901878 -1.50137)
      (xy -1.119513 -1.544575)
      (xy -1.320089 -1.573549)
      (xy -1.337752 -1.575406)
      (xy -1.454762 -1.583032)
      (xy -1.623727 -1.588586)
      (xy -1.824463 -1.59165)
      (xy -2.036785 -1.591801)
      (xy -2.098295 -1.591233)
      (xy -2.32419 -1.588579)
      (xy -2.595737 -1.585381)
      (xy -2.886433 -1.581952)
      (xy -3.169776 -1.578603)
      (xy -3.324575 -1.57677)
      (xy -3.864062 -1.58288)
      (xy -4.354675 -1.616189)
      (xy -4.815232 -1.678895)
      (xy -5.264549 -1.773195)
      (xy -5.471732 -1.827535)
      (xy -5.641981 -1.874638)
      (xy -5.814157 -1.921949)
      (xy -5.955703 -1.960525)
      (xy -5.976846 -1.966237)
      (xy -6.281684 -2.049093)
      (xy -6.54559 -2.12221)
      (xy -6.762037 -2.183719)
      (xy -6.924499 -2.231753)
      (xy -7.026447 -2.264444)
      (xy -7.050212 -2.273384)
      (xy -7.114114 -2.289386)
      (xy -7.131944 -2.263218)
      (xy -7.140053 -2.237881)
      (xy -7.161056 -2.263867)
      (xy -7.214491 -2.301405)
      (xy -7.320241 -2.343993)
      (xy -7.459324 -2.385568)
      (xy -7.612755 -2.420067)
      (xy -7.690624 -2.433014)
      (xy -7.771077 -2.438903)
      (xy -7.791731 -2.428279)
      (xy -8.14278 -2.428279)
      (xy -8.134654 -2.477462)
      (xy -7.913115 -2.477462)
      (xy -7.908162 -2.456013)
      (xy -7.889062 -2.453409)
      (xy -7.859364 -2.46661)
      (xy -7.865009 -2.477462)
      (xy -7.907827 -2.48178)
      (xy -7.913115 -2.477462)
      (xy -8.134654 -2.477462)
      (xy -8.129788 -2.506915)
      (xy -8.103274 -2.580685)
      (xy -8.097757 -2.588708)
      (xy -8.026817 -2.623334)
      (xy -7.90188 -2.631236)
    ) (layer "F.SilkS") (width 0) (fill solid) (tstamp 079b96a4-b0d3-4d03-be75-30d222437755))
  (fp_poly (pts
      (xy 2.814537 2.645833)
      (xy 2.818855 2.688651)
      (xy 2.814537 2.693939)
      (xy 2.793088 2.688987)
      (xy 2.790484 2.669886)
      (xy 2.803685 2.640189)
    ) (layer "F.SilkS") (width 0) (fill solid) (tstamp 2a8e3264-6e17-4a41-94a7-9534efdc48ae))
  (fp_poly (pts
      (xy 2.213211 3.337358)
      (xy 2.195171 3.355398)
      (xy 2.177132 3.337358)
      (xy 2.195171 3.319318)
    ) (layer "F.SilkS") (width 0) (fill solid) (tstamp 563da466-6fe1-494a-a435-fd51bcf43b76))
  (fp_poly (pts
      (xy -4.282212 0.306676)
      (xy -4.300176 0.365968)
      (xy -4.317187 0.396875)
      (xy -4.345775 0.425754)
      (xy -4.352161 0.414915)
      (xy -4.334197 0.355622)
      (xy -4.317187 0.324716)
      (xy -4.288598 0.295837)
    ) (layer "F.SilkS") (width 0) (fill solid) (tstamp 5893c2f5-f724-4e43-bff0-b061956d881d))
  (fp_poly (pts
      (xy 4.594461 2.976562)
      (xy 4.576421 2.994602)
      (xy 4.558382 2.976562)
      (xy 4.576421 2.958523)
    ) (layer "F.SilkS") (width 0) (fill solid) (tstamp 66a66104-be3e-496b-9a06-60e65ccc2e28))
  (fp_poly (pts
      (xy 3.475995 2.904403)
      (xy 3.457955 2.922443)
      (xy 3.439916 2.904403)
      (xy 3.457955 2.886364)
    ) (layer "F.SilkS") (width 0) (fill solid) (tstamp 707df1aa-447f-4fcb-b488-40e1324dc3ac))
  (fp_poly (pts
      (xy 4.778595 3.012253)
      (xy 4.845425 3.037548)
      (xy 4.863601 3.083719)
      (xy 4.826383 3.125846)
      (xy 4.810938 3.131833)
      (xy 4.77758 3.132895)
      (xy 4.783318 3.120368)
      (xy 4.780573 3.079839)
      (xy 4.750974 3.048909)
      (xy 4.716765 3.017893)
      (xy 4.743989 3.010369)
    ) (layer "F.SilkS") (width 0) (fill solid) (tstamp 786a4871-e994-4498-92fb-56cb62d43f76))
  (fp_poly (pts
      (xy 0.986507 1.60554)
      (xy 0.968467 1.623579)
      (xy 0.950427 1.60554)
      (xy 0.968467 1.5875)
    ) (layer "F.SilkS") (width 0) (fill solid) (tstamp 7ed2ceaa-945a-494b-a5c9-39cf443954d1))
  (fp_poly (pts
      (xy 4.66662 3.19304)
      (xy 4.64858 3.211079)
      (xy 4.630541 3.19304)
      (xy 4.64858 3.175)
    ) (layer "F.SilkS") (width 0) (fill solid) (tstamp 831c538e-215b-4e25-91a7-cb83409e035e))
)
