(footprint "PinHeader_2x07_P2.54mm_Vertical" (version 20211014) (generator pcbnew)
  (layer "F.Cu")
  (tedit 6116C8DB)
  (descr "Through hole straight pin header, 2x07, 2.54mm pitch, double rows")
  (tags "Through hole pin header THT 2x07 2.54mm double row")
  (attr through_hole)
  (fp_text reference "REF**" (at 1.27 -2.33) (layer "F.SilkS")
    (effects (font (size 1 1) (thickness 0.15)))
    (tstamp 1b3e9b0b-3faf-4797-bf4e-0e4de552b4ae)
  )
  (fp_text value "PinHeader_2x07_P2.54mm_Vertical" (at 1.27 17.57) (layer "F.Fab") hide
    (effects (font (size 1 1) (thickness 0.15)))
    (tstamp 58595bb3-b5a5-42fb-9973-237af8205aad)
  )
  (fp_text user "${REFERENCE}" (at 1.27 7.62 90) (layer "F.Fab")
    (effects (font (size 1 1) (thickness 0.15)))
    (tstamp 56507c81-8731-4ea6-8162-6f449c6bf67a)
  )
  (fp_line (start 1.27 1.27) (end 1.27 -1.33) (layer "F.SilkS") (width 0.12) (tstamp 06eb0524-6820-4add-8b78-d5f495b0df0b))
  (fp_line (start 1.27 -1.33) (end 3.87 -1.33) (layer "F.SilkS") (width 0.12) (tstamp 3e5fc211-8957-409a-8ea9-9f74e6884753))
  (fp_line (start -1.33 1.27) (end 1.27 1.27) (layer "F.SilkS") (width 0.12) (tstamp 477ca37b-0de1-42de-9430-ce4301489d4b))
  (fp_line (start -1.33 16.57) (end 3.87 16.57) (layer "F.SilkS") (width 0.12) (tstamp 85c36a70-c3cb-4c5f-81e0-14ba63a4a9e5))
  (fp_line (start -1.33 1.27) (end -1.33 16.57) (layer "F.SilkS") (width 0.12) (tstamp 89179a34-8d25-4201-827a-f6252b42c862))
  (fp_line (start -1.33 0) (end -1.33 -1.33) (layer "F.SilkS") (width 0.12) (tstamp 8b8b34be-298c-472b-a3d9-6af8001d606d))
  (fp_line (start 3.87 -1.33) (end 3.87 16.57) (layer "F.SilkS") (width 0.12) (tstamp ac770fa9-492e-4cbf-96b4-5717977ca51f))
  (fp_line (start -1.33 -1.33) (end 0 -1.33) (layer "F.SilkS") (width 0.12) (tstamp d74a1039-0119-4ce9-8a9b-b695a3666f32))
  (fp_line (start 4.35 -1.8) (end -1.8 -1.8) (layer "F.CrtYd") (width 0.05) (tstamp 2604dd38-cfd1-42b1-8199-157653482d0e))
  (fp_line (start -1.8 -1.8) (end -1.8 17.05) (layer "F.CrtYd") (width 0.05) (tstamp 4246a916-ceb0-4b54-be00-fcd8c77a8fc8))
  (fp_line (start 4.35 17.05) (end 4.35 -1.8) (layer "F.CrtYd") (width 0.05) (tstamp 4aeadda0-08e4-4167-be8b-68438202e073))
  (fp_line (start -1.8 17.05) (end 4.35 17.05) (layer "F.CrtYd") (width 0.05) (tstamp 6ae7a2cd-4f6e-4a2f-be42-7b6de2deeaa3))
  (fp_line (start -1.27 0) (end 0 -1.27) (layer "F.Fab") (width 0.1) (tstamp 0ac138ac-c49f-4e1c-a20e-b786c12a09a9))
  (fp_line (start 0 -1.27) (end 3.81 -1.27) (layer "F.Fab") (width 0.1) (tstamp 30ec03f6-6286-4242-865b-f2b1c5749403))
  (fp_line (start -1.27 16.51) (end -1.27 0) (layer "F.Fab") (width 0.1) (tstamp 7995977c-0611-45f2-94fa-3b046a765bc6))
  (fp_line (start 3.81 -1.27) (end 3.81 16.51) (layer "F.Fab") (width 0.1) (tstamp a67651a3-0af5-4ec8-bbd1-6ed27545f3ae))
  (fp_line (start 3.81 16.51) (end -1.27 16.51) (layer "F.Fab") (width 0.1) (tstamp c01a575e-0721-4efe-b523-31b349bdd9c7))
  (pad "1" thru_hole rect (at 0 0) (size 1.7 1.7) (drill 1) (layers *.Cu *.Mask) (tstamp 44f96ba0-2e6b-4145-9bca-55c9eaf1fdc2))
  (pad "2" thru_hole oval (at 2.54 0) (size 1.7 1.7) (drill 1) (layers *.Cu *.Mask) (tstamp 5f0a1ca8-9f91-4868-95fa-74eb0ad80e0c))
  (pad "3" thru_hole oval (at 0 2.54) (size 1.7 1.7) (drill 1) (layers *.Cu *.Mask) (tstamp 984c136d-fd12-4951-bed7-479afd0de38b))
  (pad "4" thru_hole oval (at 2.54 2.54) (size 1.7 1.7) (drill 1) (layers *.Cu *.Mask) (tstamp b6c2d422-3fff-4625-9164-85b4ba8c92cf))
  (pad "5" thru_hole oval (at 0 5.08) (size 1.7 1.7) (drill 1) (layers *.Cu *.Mask) (tstamp b9951f2b-c558-444c-85e9-3690bca4a1a1))
  (pad "6" thru_hole oval (at 2.54 5.08) (size 1.7 1.7) (drill 1) (layers *.Cu *.Mask) (tstamp 5276b95f-8470-43d2-a30a-055624ab2b18))
  (pad "7" thru_hole oval (at 0 7.62) (size 1.7 1.7) (drill 1) (layers *.Cu *.Mask) (tstamp 50227ef0-83c2-48e6-9052-fad6b7a20c12))
  (pad "8" thru_hole oval (at 2.54 7.62) (size 1.7 1.7) (drill 1) (layers *.Cu *.Mask) (tstamp 0a0e9ef2-90db-49ec-a12f-61a5c8104ec6))
  (pad "9" thru_hole oval (at 0 10.16) (size 1.7 1.7) (drill 1) (layers *.Cu *.Mask) (tstamp 890bfe24-11f8-489f-83da-a078502449f0))
  (pad "10" thru_hole oval (at 2.54 10.16) (size 1.7 1.7) (drill 1) (layers *.Cu *.Mask) (tstamp 341f5a28-023b-413e-9048-2b29c22a89a0))
  (pad "11" thru_hole oval (at 0 12.7) (size 1.7 1.7) (drill 1) (layers *.Cu *.Mask) (tstamp 8f3f8030-4426-41ee-9bd0-5e6ad555d27a))
  (pad "12" thru_hole oval (at 2.54 12.7) (size 1.7 1.7) (drill 1) (layers *.Cu *.Mask) (tstamp 99cc5231-1f97-4f4c-8f94-423e9f534a3e))
  (pad "13" thru_hole oval (at 0 15.24) (size 1.7 1.7) (drill 1) (layers *.Cu *.Mask) (tstamp 4bb8f5b0-6db2-4610-9e6f-f964bd169dd6))
  (pad "14" thru_hole oval (at 2.54 15.24) (size 1.7 1.7) (drill 1) (layers *.Cu *.Mask) (tstamp 64be501c-9d41-4d27-8ad8-22ec2d4024ef))
  (model "${KICADLIB}/model/connector/PinHeader_2x07_P2.54mm_Vertical.step"
    (offset (xyz 0 0 0))
    (scale (xyz 1 1 1))
    (rotate (xyz 0 0 0))
  )
)
