(footprint "CAPC0603" (version 20221018) (generator pcbnew)
  (layer "F.Cu")
  (descr "Capacitor SMD 0603 metric (0201 imperial)")
  (tags "capacitor")
  (attr smd)
  (fp_text reference "REF**" (at 0 -0.8) (layer "F.SilkS")
      (effects (font (size 0.75 0.75) (thickness 0.15)))
    (tstamp eef675e6-95bc-4db3-aab3-b5fe24c63496)
  )
  (fp_text value "CAPC0603" (at 0 1.05) (layer "F.Fab") hide
      (effects (font (size 1 1) (thickness 0.15)))
    (tstamp 937ba32a-5cff-4902-b4db-d7dccb52e48a)
  )
  (fp_text user "${REFERENCE}" (at 0 0) (layer "F.Fab")
      (effects (font (size 0.15 0.15) (thickness 0.02)))
    (tstamp 05f0fc05-8f34-4acd-9c61-3975ddbd86fa)
  )
  (fp_line (start -0.025 -0.15) (end 0.025 -0.15)
    (stroke (width 0.1) (type solid)) (layer "F.SilkS") (tstamp dee8046d-e05b-4466-8189-cf55c8cd5751))
  (fp_line (start -0.025 0.15) (end 0.025 0.15)
    (stroke (width 0.1) (type solid)) (layer "F.SilkS") (tstamp 8c12ac44-6864-4eaf-8891-5791a02d60ba))
  (fp_line (start -0.7 -0.35) (end 0.7 -0.35)
    (stroke (width 0.05) (type solid)) (layer "F.CrtYd") (tstamp 5780685e-0621-46b0-847c-50b2088095c0))
  (fp_line (start -0.7 0.35) (end -0.7 -0.35)
    (stroke (width 0.05) (type solid)) (layer "F.CrtYd") (tstamp 3373b0e8-dd17-4a1b-99b1-aa0e0ef121bb))
  (fp_line (start 0.7 -0.35) (end 0.7 0.35)
    (stroke (width 0.05) (type solid)) (layer "F.CrtYd") (tstamp 7628ee0b-31d3-49e7-a8be-13a5b5488244))
  (fp_line (start 0.7 0.35) (end -0.7 0.35)
    (stroke (width 0.05) (type solid)) (layer "F.CrtYd") (tstamp 5c81b7ce-3d4e-41a6-849c-3a3f70f16f9f))
  (fp_line (start -0.3 -0.15) (end 0.3 -0.15)
    (stroke (width 0.05) (type solid)) (layer "F.Fab") (tstamp 4584faf6-c9b6-40bd-bf62-e9667c72d6a6))
  (fp_line (start -0.3 0.15) (end -0.3 -0.15)
    (stroke (width 0.05) (type solid)) (layer "F.Fab") (tstamp 83e116ed-98f0-4b2d-9545-d72001ddd012))
  (fp_line (start 0.3 -0.15) (end 0.3 0.15)
    (stroke (width 0.05) (type solid)) (layer "F.Fab") (tstamp e0db9b65-e29c-470f-b9a3-1a20c6f9e490))
  (fp_line (start 0.3 0.15) (end -0.3 0.15)
    (stroke (width 0.05) (type solid)) (layer "F.Fab") (tstamp ca5bdda1-c417-4b76-ac1f-451dd1e0e465))
  (pad "" smd roundrect (at -0.345 0) (size 0.318 0.36) (layers "F.Paste") (roundrect_rratio 0.25) (tstamp 01c0bfeb-b986-4231-8c1f-ca39dc9569cc))
  (pad "" smd roundrect (at 0.345 0) (size 0.318 0.36) (layers "F.Paste") (roundrect_rratio 0.25) (tstamp 2490173f-df1f-4d08-83e8-f8eb11eef627))
  (pad "1" smd roundrect (at -0.32 0) (size 0.46 0.4) (layers "F.Cu" "F.Mask") (roundrect_rratio 0.125) (tstamp a44f2b46-7312-4d71-9eaa-ea547ae8d1fe))
  (pad "2" smd roundrect (at 0.32 0) (size 0.46 0.4) (layers "F.Cu" "F.Mask") (roundrect_rratio 0.125) (tstamp dd0afc82-bca5-4d79-a05c-db7bd117423f))
  (model "${KICADLIB}/model/passive/CAPC0603.step"
    (offset (xyz 0 0 0))
    (scale (xyz 1 1 1))
    (rotate (xyz 0 0 0))
  )
)
