(module "JST_SM12B-SRSS-TB" (layer F.Cu) (tedit 5E9496C7)
  (attr smd)
  (fp_text reference "REF**" (at 0 -3.95 unlocked) (layer F.SilkS)
    (effects (font (size 1 1) (thickness 0.15)))
  )
  (fp_text value "JST_SM12B-SRSS-TB" (at 0 0.3 unlocked) (layer F.Fab)
    (effects (font (size 1 1) (thickness 0.15)))
  )
  (fp_line (start -7.5 -3.6) (end -7.5 2.5) (layer F.CrtYd) (width 0.05))
  (fp_line (start 7.5 -3.6) (end -7.5 -3.6) (layer F.CrtYd) (width 0.05))
  (fp_line (start 7.5 2.5) (end 7.5 -3.6) (layer F.CrtYd) (width 0.05))
  (fp_line (start -7.5 2.5) (end 7.5 2.5) (layer F.CrtYd) (width 0.05))
  (fp_line (start 6 2.2) (end -6 2.2) (layer F.SilkS) (width 0.1))
  (fp_line (start 7 -2.1) (end 5.9 -2.1) (layer F.SilkS) (width 0.1))
  (fp_line (start 7 0.5) (end 7 -2.1) (layer F.SilkS) (width 0.1))
  (fp_line (start -7 -2.1) (end -7 0.5) (layer F.SilkS) (width 0.1))
  (fp_line (start -5.9 -2.1) (end -7 -2.1) (layer F.SilkS) (width 0.1))
  (fp_text user "^" (at 5.5 -3.95 180 unlocked) (layer F.SilkS)
    (effects (font (size 1 1) (thickness 0.15)))
  )
  (pad "12" smd rect (at -5.5 -2.45) (size 0.6 1.55) (layers "F.Cu" "F.Paste" "F.Mask") (tstamp c7db4a53-c3fe-464c-afa4-5f6f221e1346))
  (pad "11" smd rect (at -4.5 -2.45) (size 0.6 1.55) (layers "F.Cu" "F.Paste" "F.Mask") (tstamp 5c01204c-26c5-437e-b2db-58bdacbb8d76))
  (pad "10" smd rect (at -3.5 -2.45) (size 0.6 1.55) (layers "F.Cu" "F.Paste" "F.Mask") (tstamp 450ed3a5-a87c-4173-a70e-4846266b9e6c))
  (pad "9" smd rect (at -2.5 -2.45) (size 0.6 1.55) (layers "F.Cu" "F.Paste" "F.Mask") (tstamp 60d16525-0dd0-4283-9958-282142a418b6))
  (pad "8" smd rect (at -1.5 -2.45) (size 0.6 1.55) (layers "F.Cu" "F.Paste" "F.Mask") (tstamp fa58e803-47d1-4649-bacd-127a89027964))
  (pad "7" smd rect (at -0.5 -2.45) (size 0.6 1.55) (layers "F.Cu" "F.Paste" "F.Mask") (tstamp a2b0500c-0a31-4390-b35e-5c253a106f84))
  (pad "6" smd rect (at 0.5 -2.45) (size 0.6 1.55) (layers "F.Cu" "F.Paste" "F.Mask") (tstamp 3c5e88bb-cfb4-4017-9dc6-2e6e7a8ef1ae))
  (pad "5" smd rect (at 1.5 -2.45) (size 0.6 1.55) (layers "F.Cu" "F.Paste" "F.Mask") (tstamp 9352d58c-431b-41cf-9096-a3cd914b80f1))
  (pad "4" smd rect (at 2.5 -2.45) (size 0.6 1.55) (layers "F.Cu" "F.Paste" "F.Mask") (tstamp 0c5f826d-c4e7-446a-9599-dd7c06263b07))
  (pad "3" smd rect (at 3.5 -2.45) (size 0.6 1.55) (layers "F.Cu" "F.Paste" "F.Mask") (tstamp 655cdd66-1165-455b-bc71-60ec8f4a11b9))
  (pad "2" smd rect (at 4.5 -2.45) (size 0.6 1.55) (layers "F.Cu" "F.Paste" "F.Mask") (tstamp df3b975d-9a23-484b-bb3f-3206e80f4f58))
  (pad "1" smd rect (at 5.5 -2.45) (size 0.6 1.55) (layers "F.Cu" "F.Paste" "F.Mask") (tstamp 3041c03e-4d7b-4a7f-874f-325aa7207083))
  (pad "" smd rect (at -6.75 1.5) (size 1.2 1.8) (layers "F.Cu" "F.Paste" "F.Mask") (tstamp 6cb05f49-c3b5-42c7-a403-d6e8ec1fdae7))
  (pad "" smd rect (at 6.75 1.5) (size 1.2 1.8) (layers "F.Cu" "F.Paste" "F.Mask") (tstamp 14739ebe-ff9b-412c-9a79-4ebc67e1ee34))
  (model "${KICADLIB}/model/connector/JST_SM12B-SRSS-TB.STEP"
    (offset (xyz 0 1.75 -0.3))
    (scale (xyz 1 1 1))
    (rotate (xyz -90 0 0))
  )
)
