(module "CUI_PJ-069B-SMT-TR" (layer F.Cu) (tedit 5F565B55)
  (attr through_hole)
  (fp_text reference "REF**" (at -4.05 6.35 unlocked) (layer F.SilkS)
    (effects (font (size 1 1) (thickness 0.15)))
    (tstamp 3df134af-cb14-41bb-9980-c501437f4a8e)
  )
  (fp_text value "CUI_PJ-069B-SMT-TR" (at 0 6.3 unlocked) (layer F.Fab) hide
    (effects (font (size 1 1) (thickness 0.15)))
    (tstamp 3c80afe8-5fab-4af1-872f-9cd398e5a22c)
  )
  (fp_text user "^" (at -2.25 6.3 270 unlocked) (layer F.SilkS)
    (effects (font (size 1 1) (thickness 0.15)))
    (tstamp 7a07070d-a677-4c32-a616-27f3c7a367cb)
  )
  (fp_text user "${REFERENCE}" (at 0 0 unlocked) (layer F.Fab)
    (effects (font (size 1 1) (thickness 0.15)))
    (tstamp b365c915-ddd6-4da0-97a4-2ffaa6e69848)
  )
  (fp_line (start 4.25 -6.3) (end 6.6 -6.3) (layer Eco1.User) (width 0.1) (tstamp 2c5f17b9-9892-4902-aca6-d118a4e46d8e))
  (fp_line (start 4.25 -6.3) (end 4.25 4.8) (layer Eco1.User) (width 0.1) (tstamp 328d2767-6f91-4dcb-9e88-0faf46978fb3))
  (fp_line (start -5.95 -6.6) (end -5.95 4.8) (layer Eco1.User) (width 0.1) (tstamp 4e51e2e5-17b5-46fd-924e-df79cb27eb41))
  (fp_line (start -5.95 -6.6) (end -8.3 -6.6) (layer Eco1.User) (width 0.1) (tstamp 7d2b1dbf-05bb-4936-b3d2-f6d017e2c320))
  (fp_line (start 3.25 4.8) (end -4.95 4.8) (layer Eco1.User) (width 0.1) (tstamp bf4db811-5ad2-4d23-a677-a6316dc151aa))
  (fp_arc (start 3.75 4.8) (end 4.25 4.8) (angle 180) (layer Eco1.User) (width 0.1) (tstamp 1f3eb8e8-079a-4a95-8f8d-08fc500bb3e6))
  (fp_arc (start -5.45 4.8) (end -4.95 4.8) (angle 180) (layer Eco1.User) (width 0.1) (tstamp e862fb4e-6dd6-4b9a-a4b0-1a12ff6b32ce))
  (fp_rect (start -8.3 -7.7) (end 6.6 7.3) (layer F.CrtYd) (width 0.05) (tstamp 8510e5f2-22e3-40b2-a845-1b417af007e2))
  (fp_line (start -1 4.3) (end 0 3.3) (layer F.Fab) (width 0.1) (tstamp 33651430-6d5f-4322-b94d-07b364fce36d))
  (fp_line (start -5.796446 -7.502523) (end 4.103554 -7.502523) (layer F.Fab) (width 0.1) (tstamp 3c59faf4-1094-452e-8450-44088dd6f254))
  (fp_line (start -5.796446 4.297477) (end -1 4.297477) (layer F.Fab) (width 0.1) (tstamp 5a28f189-200b-4b23-92ff-f4262d3b8a44))
  (fp_line (start 0 3.3) (end 1 4.3) (layer F.Fab) (width 0.1) (tstamp 67e91c2c-af51-4711-8d82-7367c6b9a85f))
  (fp_line (start -5.796446 -7.502523) (end -5.796446 4.297477) (layer F.Fab) (width 0.1) (tstamp 728ec576-7a92-4e8b-a800-b00bb68e1a92))
  (fp_line (start 4.103554 4.297477) (end 1 4.3) (layer F.Fab) (width 0.1) (tstamp 90b762d9-c8a0-454a-bc7a-5de96a9a4ed2))
  (fp_line (start 4.103554 -7.502523) (end 4.103554 4.297477) (layer F.Fab) (width 0.1) (tstamp f18682b2-a2a8-4825-b4b3-1e082a5a418c))
  (pad "" thru_hole oval (at -7.2 -3.25) (size 1.8 3.2) (drill oval 1 2.4) (layers *.Cu *.Mask) (tstamp 3efe45c9-e99f-43dd-bc23-d1eac20bedfa))
  (pad "" thru_hole oval (at 5.5 -3.25) (size 1.8 3.2) (drill oval 1 2.4) (layers *.Cu *.Mask) (tstamp fb893b2a-9b00-48b9-8d31-4b6e0f9dfde5))
  (pad "1" thru_hole oval (at 0 6.3 90) (size 1.6 2.7) (drill oval 0.8 1.9) (layers *.Cu *.Mask) (tstamp 59788753-fc1a-42b6-a1fd-99bce5271dcf))
  (pad "2" thru_hole oval (at -7.2 3.4) (size 1.6 2.7) (drill oval 0.8 1.9) (layers *.Cu *.Mask) (tstamp e4fef896-e78d-48db-9747-ac2044c6ae70))
  (pad "3" thru_hole oval (at 5.5 3.6) (size 1.6 2.3) (drill oval 0.8 1.5) (layers *.Cu *.Mask) (tstamp 03c85c9d-447b-4493-b767-59f8e4e5b0ec))
  (model "${KICADLIB}/model/connector/CUI_PJ-069B-SMT-TR.step"
    (offset (xyz -0.85 7.5 -6.25))
    (scale (xyz 1 1 1))
    (rotate (xyz -90 0 180))
  )
)
