(footprint "SODIMM_DDR4STD" (version 20221018) (generator pcbnew)
  (layer "F.Cu")
  (fp_text reference "REF**" (at -3.525 5.325 unlocked) (layer "F.SilkS")
      (effects (font (size 1 1) (thickness 0.15)))
    (tstamp eba52f7d-d872-4829-a865-a55868813c47)
  )
  (fp_text value "SODIMM_DDR4STD" (at 0 4 unlocked) (layer "F.Fab") hide
      (effects (font (size 1 1) (thickness 0.15)))
    (tstamp 2b6a43d6-6811-4849-9e48-a5baf014d23f)
  )
  (fp_text user "2" (at 33 4.6 unlocked) (layer "B.SilkS")
      (effects (font (size 0.8 0.8) (thickness 0.15) italic) (justify mirror))
    (tstamp d862d1e5-07c2-4e5b-a871-54eaa15f3a87)
  )
  (fp_text user "260" (at -32.6 4.6 unlocked) (layer "B.SilkS")
      (effects (font (size 0.8 0.8) (thickness 0.15)) (justify mirror))
    (tstamp f8a12800-1d6d-495a-bd9a-b1a6643d6a77)
  )
  (fp_text user "1" (at 33.4 3.6 unlocked) (layer "F.SilkS")
      (effects (font (size 0.8 0.8) (thickness 0.15) italic))
    (tstamp 3a26e62e-2711-4fea-b8d0-ef44b27d77f2)
  )
  (fp_text user "259" (at -32.6 3.55 unlocked) (layer "F.SilkS")
      (effects (font (size 0.8 0.8) (thickness 0.15)))
    (tstamp c709f68a-2b37-4838-bf0a-514ce7c667a5)
  )
  (fp_line (start -30.9 4.2) (end -30.9 4.95)
    (stroke (width 0.1) (type solid)) (layer "B.SilkS") (tstamp 949a6bff-44f0-4393-85db-4cedeb3e7d2b))
  (fp_line (start -28.4 4.2) (end -28.4 4.95)
    (stroke (width 0.1) (type solid)) (layer "B.SilkS") (tstamp 06043f05-98d4-4124-80fc-631a01ce98c7))
  (fp_line (start -25.9 4.2) (end -25.9 4.95)
    (stroke (width 0.1) (type solid)) (layer "B.SilkS") (tstamp 249c384b-9f36-45c9-a108-0269140d9781))
  (fp_line (start -23.4 4.2) (end -23.4 4.95)
    (stroke (width 0.1) (type solid)) (layer "B.SilkS") (tstamp c9079fc9-3a13-4980-85e2-609189d26038))
  (fp_line (start -20.9 4.2) (end -20.9 4.95)
    (stroke (width 0.1) (type solid)) (layer "B.SilkS") (tstamp 8535da4d-cde6-4950-885c-41a9e1666229))
  (fp_line (start -18.4 4.2) (end -18.4 4.95)
    (stroke (width 0.1) (type solid)) (layer "B.SilkS") (tstamp 64017a40-9f97-4bad-8d8c-137ca4617e31))
  (fp_line (start -15.9 4.2) (end -15.9 4.95)
    (stroke (width 0.1) (type solid)) (layer "B.SilkS") (tstamp 759169e6-71a5-42df-be02-326db06d8508))
  (fp_line (start -13.4 4.2) (end -13.4 4.95)
    (stroke (width 0.1) (type solid)) (layer "B.SilkS") (tstamp c431b7a5-b52b-427c-87ff-f3f0f96b26be))
  (fp_line (start -10.9 4.2) (end -10.9 4.95)
    (stroke (width 0.1) (type solid)) (layer "B.SilkS") (tstamp d8748633-2d00-49dd-ba89-731aee597cdd))
  (fp_line (start -8.4 4.2) (end -8.4 4.95)
    (stroke (width 0.1) (type solid)) (layer "B.SilkS") (tstamp 9b6aecbb-8b4d-4901-bf4a-5ee752bdafc2))
  (fp_line (start -5.9 4.2) (end -5.9 4.95)
    (stroke (width 0.1) (type solid)) (layer "B.SilkS") (tstamp 705c69da-de05-41f2-a5ee-108c6055286b))
  (fp_line (start -1.4 4.2) (end -1.4 4.95)
    (stroke (width 0.1) (type solid)) (layer "B.SilkS") (tstamp 68dd8dd0-60fd-45f1-b34e-983afb716282))
  (fp_line (start 1.1 4.2) (end 1.1 4.95)
    (stroke (width 0.1) (type solid)) (layer "B.SilkS") (tstamp 5985bf07-f376-4e41-80c2-4bf5f65aa514))
  (fp_line (start 3.6 4.2) (end 3.6 4.95)
    (stroke (width 0.1) (type solid)) (layer "B.SilkS") (tstamp e83dd0de-a95b-4196-9dce-16a752050d94))
  (fp_line (start 6.1 4.2) (end 6.1 4.95)
    (stroke (width 0.1) (type solid)) (layer "B.SilkS") (tstamp 8f0b2b6c-e429-4ff1-8e50-a044fc71a898))
  (fp_line (start 8.6 4.2) (end 8.6 4.95)
    (stroke (width 0.1) (type solid)) (layer "B.SilkS") (tstamp db175c3e-ec4c-4af4-9bde-75a50dfa2d0b))
  (fp_line (start 11.1 4.2) (end 11.1 4.95)
    (stroke (width 0.1) (type solid)) (layer "B.SilkS") (tstamp dd49928f-c439-4337-96ef-d56a083e7552))
  (fp_line (start 13.6 4.2) (end 13.6 4.95)
    (stroke (width 0.1) (type solid)) (layer "B.SilkS") (tstamp 52f043df-2c98-404a-b56e-3de1b2142078))
  (fp_line (start 16.1 4.2) (end 16.1 4.95)
    (stroke (width 0.1) (type solid)) (layer "B.SilkS") (tstamp 0ea2f276-882d-49ce-9913-a1058517e279))
  (fp_line (start 18.6 4.2) (end 18.6 4.95)
    (stroke (width 0.1) (type solid)) (layer "B.SilkS") (tstamp eaa0cd95-93fc-4317-9266-74cb2d773adb))
  (fp_line (start 21.1 4.2) (end 21.1 4.95)
    (stroke (width 0.1) (type solid)) (layer "B.SilkS") (tstamp 836a05f0-56c0-4ab8-af47-8867c45b5bbc))
  (fp_line (start 23.6 4.2) (end 23.6 4.95)
    (stroke (width 0.1) (type solid)) (layer "B.SilkS") (tstamp b78da761-8e37-4e00-9be1-67b4921ce148))
  (fp_line (start 26.1 4.2) (end 26.1 4.95)
    (stroke (width 0.1) (type solid)) (layer "B.SilkS") (tstamp 06e2d54b-5b1e-4d3a-8891-4ef915f19319))
  (fp_line (start 28.6 4.2) (end 28.6 4.95)
    (stroke (width 0.1) (type solid)) (layer "B.SilkS") (tstamp 620d7957-d745-4a33-af14-9ff11202e612))
  (fp_line (start 31.1 4.2) (end 31.1 4.95)
    (stroke (width 0.1) (type solid)) (layer "B.SilkS") (tstamp 91b97d32-87f9-4e9c-9bfc-72cc46d3aeff))
  (fp_line (start -31.15 3.85) (end -31.15 3.1)
    (stroke (width 0.1) (type solid)) (layer "F.SilkS") (tstamp 288eff08-c2da-4160-838a-e74bf522e51c))
  (fp_line (start -28.65 3.85) (end -28.65 3.1)
    (stroke (width 0.1) (type solid)) (layer "F.SilkS") (tstamp aa71425a-73fe-4e54-a4ec-0149a55a4c5a))
  (fp_line (start -26.15 3.85) (end -26.15 3.1)
    (stroke (width 0.1) (type solid)) (layer "F.SilkS") (tstamp a3ae0c20-9e71-4743-adcd-e400ae06b142))
  (fp_line (start -23.65 3.85) (end -23.65 3.1)
    (stroke (width 0.1) (type solid)) (layer "F.SilkS") (tstamp 6c54af72-d963-4476-8626-e8cab34aaf64))
  (fp_line (start -21.15 3.85) (end -21.15 3.1)
    (stroke (width 0.1) (type solid)) (layer "F.SilkS") (tstamp 93cd6463-e0b0-4683-88b6-11fe07a82c82))
  (fp_line (start -18.65 3.85) (end -18.65 3.1)
    (stroke (width 0.1) (type solid)) (layer "F.SilkS") (tstamp 9e835494-064e-4b8a-ab60-e77183ea086e))
  (fp_line (start -16.15 3.85) (end -16.15 3.1)
    (stroke (width 0.1) (type solid)) (layer "F.SilkS") (tstamp 75cc486b-9127-4a4e-a4aa-067d43baf2f2))
  (fp_line (start -13.65 3.85) (end -13.65 3.1)
    (stroke (width 0.1) (type solid)) (layer "F.SilkS") (tstamp 8a913289-ff3b-4a4c-a42a-5a2638b08b58))
  (fp_line (start -11.15 3.85) (end -11.15 3.1)
    (stroke (width 0.1) (type solid)) (layer "F.SilkS") (tstamp ecdd8eb5-461c-4ef6-9071-0f423d9faa68))
  (fp_line (start -8.65 3.85) (end -8.65 3.1)
    (stroke (width 0.1) (type solid)) (layer "F.SilkS") (tstamp 390ca0de-2aba-40c7-825f-ea5c1183b855))
  (fp_line (start -6.15 3.85) (end -6.15 3.1)
    (stroke (width 0.1) (type solid)) (layer "F.SilkS") (tstamp 62d3d724-d9e7-49dd-9814-3d337052985e))
  (fp_line (start -1.65 3.875) (end -1.65 3.125)
    (stroke (width 0.1) (type solid)) (layer "F.SilkS") (tstamp ee6ee2cb-3cfc-456d-a12f-b9a2e6311f50))
  (fp_line (start 0.85 3.875) (end 0.85 3.125)
    (stroke (width 0.1) (type solid)) (layer "F.SilkS") (tstamp 5c3a28e5-3cd4-4de2-9bd3-39f93d981914))
  (fp_line (start 3.35 3.875) (end 3.35 3.125)
    (stroke (width 0.1) (type solid)) (layer "F.SilkS") (tstamp a2d670e3-a5ea-4209-b6f5-4c6f34df77bc))
  (fp_line (start 5.85 3.875) (end 5.85 3.125)
    (stroke (width 0.1) (type solid)) (layer "F.SilkS") (tstamp 326d1f62-0876-4006-bc46-f6b05eed9667))
  (fp_line (start 8.35 3.875) (end 8.35 3.125)
    (stroke (width 0.1) (type solid)) (layer "F.SilkS") (tstamp 838c3770-5037-47bf-98fd-ec4b35b4468c))
  (fp_line (start 10.85 3.875) (end 10.85 3.125)
    (stroke (width 0.1) (type solid)) (layer "F.SilkS") (tstamp 7dfc1ca8-cd1b-4aee-bc5f-763342f6ca68))
  (fp_line (start 13.35 3.875) (end 13.35 3.125)
    (stroke (width 0.1) (type solid)) (layer "F.SilkS") (tstamp c1ad7757-e82c-47a9-badc-56e461d749fd))
  (fp_line (start 15.85 3.875) (end 15.85 3.125)
    (stroke (width 0.1) (type solid)) (layer "F.SilkS") (tstamp d0f4f766-17a4-4fb1-8939-4f79c970f83c))
  (fp_line (start 18.35 3.875) (end 18.35 3.125)
    (stroke (width 0.1) (type solid)) (layer "F.SilkS") (tstamp 7ef7f313-0071-4472-b5ad-d207716a94a4))
  (fp_line (start 20.85 3.875) (end 20.85 3.125)
    (stroke (width 0.1) (type solid)) (layer "F.SilkS") (tstamp d2225943-c052-4bb0-aaea-ff0349680c3f))
  (fp_line (start 23.35 3.875) (end 23.35 3.125)
    (stroke (width 0.1) (type solid)) (layer "F.SilkS") (tstamp e29e34f9-cba3-430c-be0c-b32e63f6fb56))
  (fp_line (start 25.85 3.875) (end 25.85 3.125)
    (stroke (width 0.1) (type solid)) (layer "F.SilkS") (tstamp 1774ead8-158e-4368-8410-ea652d4e9d15))
  (fp_line (start 28.35 3.875) (end 28.35 3.125)
    (stroke (width 0.1) (type solid)) (layer "F.SilkS") (tstamp 3db0cf0a-38e3-4e3e-98a4-0dc977234ce4))
  (fp_line (start 30.85 3.875) (end 30.85 3.125)
    (stroke (width 0.1) (type solid)) (layer "F.SilkS") (tstamp 1cee2498-e80d-4140-95b7-7bb276b0c219))
  (fp_line (start -34.825 0.425) (end -34.825 18.025)
    (stroke (width 0.1) (type solid)) (layer "Dwgs.User") (tstamp 4ebddde6-e6ad-44a3-95c4-904e168d20b5))
  (fp_line (start -34.825 4.025) (end 34.775 4.025)
    (stroke (width 0.1) (type solid)) (layer "Dwgs.User") (tstamp f67b7e55-7a3c-4b45-98e0-ed0ab0f89ccc))
  (fp_line (start -34.825 18.025) (end -32.825 18.025)
    (stroke (width 0.1) (type solid)) (layer "Dwgs.User") (tstamp 827b725c-adc7-4693-9100-1922dd08c86d))
  (fp_line (start -34.825 22.025) (end -34.825 30.025)
    (stroke (width 0.1) (type solid)) (layer "Dwgs.User") (tstamp bd6b2848-e51f-4e4a-baee-020c9c53e169))
  (fp_line (start -34.825 22.025) (end -32.825 22.025)
    (stroke (width 0.1) (type solid)) (layer "Dwgs.User") (tstamp b9350955-c6c0-4b8d-874e-3911db76c065))
  (fp_line (start -34.825 30.025) (end 34.775 30.025)
    (stroke (width 0.1) (type solid)) (layer "Dwgs.User") (tstamp 3867448c-39db-452a-b3c9-c2e2462d6767))
  (fp_line (start -34.425 0.025) (end -34.825 0.425)
    (stroke (width 0.1) (type solid)) (layer "Dwgs.User") (tstamp 0194b8f2-ca00-4d62-809a-fb4c403247de))
  (fp_line (start -31.825 21.025) (end -31.825 19.025)
    (stroke (width 0.1) (type solid)) (layer "Dwgs.User") (tstamp f9c2d6c9-e26e-4e93-a1bf-d4b380e13d09))
  (fp_line (start -4.425 0.025) (end -34.425 0.025)
    (stroke (width 0.1) (type solid)) (layer "Dwgs.User") (tstamp 9f6346dc-0f15-43d0-badd-c1e6823dd130))
  (fp_line (start -4.025 0.425) (end -4.425 0.025)
    (stroke (width 0.1) (type solid)) (layer "Dwgs.User") (tstamp 37eb89c6-cc7d-4dee-bd07-4e6266b0e15f))
  (fp_line (start -4.025 0.425) (end -4.025 3.525)
    (stroke (width 0.1) (type solid)) (layer "Dwgs.User") (tstamp 8a6d8858-f8b6-499d-9173-a625a3ddba1c))
  (fp_line (start -3.025 0.425) (end -2.625 0.025)
    (stroke (width 0.1) (type solid)) (layer "Dwgs.User") (tstamp c5d549b6-edec-47d7-8c9a-728ee45f1103))
  (fp_line (start -3.025 3.525) (end -3.025 0.425)
    (stroke (width 0.1) (type solid)) (layer "Dwgs.User") (tstamp 8ad1e999-b38a-4e71-853a-5481df25bca0))
  (fp_line (start -2.625 0.025) (end 34.375 0.025)
    (stroke (width 0.1) (type solid)) (layer "Dwgs.User") (tstamp d103bebe-7e8f-4f4f-b210-e06b123a5c5d))
  (fp_line (start 31.775 19.025) (end 31.775 21.025)
    (stroke (width 0.1) (type solid)) (layer "Dwgs.User") (tstamp 2860e230-0ebd-47c5-9595-30cb3e99e7ee))
  (fp_line (start 34.375 0.025) (end 34.775 0.425)
    (stroke (width 0.1) (type solid)) (layer "Dwgs.User") (tstamp 4f5f4353-b4c5-420a-8eba-89d2c93ec36d))
  (fp_line (start 34.775 0.425) (end 34.775 18.025)
    (stroke (width 0.1) (type solid)) (layer "Dwgs.User") (tstamp 4d3e42fa-65df-4110-aa95-9dd1655b9a36))
  (fp_line (start 34.775 18.025) (end 32.775 18.025)
    (stroke (width 0.1) (type solid)) (layer "Dwgs.User") (tstamp 591694d6-dc8e-4172-a0e0-eeeece726305))
  (fp_line (start 34.775 22.025) (end 32.775 22.025)
    (stroke (width 0.1) (type solid)) (layer "Dwgs.User") (tstamp f1e7d510-3a07-4fa2-bb2e-3a1e15d199ae))
  (fp_line (start 34.775 22.025) (end 34.775 30.025)
    (stroke (width 0.1) (type solid)) (layer "Dwgs.User") (tstamp a3470463-f032-4ae7-b3f1-38cd70a29776))
  (fp_arc (start -32.825 18.025) (mid -32.117896 18.317893) (end -31.825003 19.024997)
    (stroke (width 0.1) (type solid)) (layer "Dwgs.User") (tstamp c07b4cfa-a424-46e3-a48b-47aeeb2ff0a0))
  (fp_arc (start -31.825 21.025) (mid -32.117893 21.732104) (end -32.824997 22.024997)
    (stroke (width 0.1) (type solid)) (layer "Dwgs.User") (tstamp c5e7e8bc-bdc3-45a4-9487-8cf32088b91e))
  (fp_arc (start -3.025 3.525) (mid -3.525 4.025) (end -4.025 3.525)
    (stroke (width 0.1) (type solid)) (layer "Dwgs.User") (tstamp 74a1e13a-0993-4aeb-aec4-194e0eab117b))
  (fp_arc (start 31.775 19.025) (mid 32.067893 18.317896) (end 32.774997 18.025003)
    (stroke (width 0.1) (type solid)) (layer "Dwgs.User") (tstamp 035b00c4-210b-483e-a6ec-5676e7aa0a44))
  (fp_arc (start 32.775 22.025) (mid 32.067896 21.732107) (end 31.775003 21.025003)
    (stroke (width 0.1) (type solid)) (layer "Dwgs.User") (tstamp aa7ffe42-5ae2-4cea-a68c-83c32c0dfaa8))
  (fp_rect (start -34.85 0) (end 34.8 5.1)
    (stroke (width 0.05) (type solid)) (fill none) (layer "F.CrtYd") (tstamp e4dd048c-d899-45c9-a79b-1bd0bafa83ad))
  (pad "" np_thru_hole circle (at -32.825 6.025) (size 1.8 1.8) (drill 1.8) (layers "F&B.Cu" "*.Mask") (tstamp 997e4797-bc91-4d51-83c1-0b6fb108c546))
  (pad "" np_thru_hole circle (at 32.775 6.025) (size 1.8 1.8) (drill 1.8) (layers "F&B.Cu" "*.Mask") (tstamp 1400cf05-d5ce-40db-b1d3-3a53f9cc3dd5))
  (pad "1" smd rect (at 33.35 1.6) (size 0.35 2.55) (layers "F.Cu" "F.Mask") (tstamp 8e332203-7718-44e5-8f17-56521507f9b6))
  (pad "2" smd rect (at 33.1 1.6) (size 0.35 2.55) (layers "B.Cu" "B.Mask") (tstamp 7aad96f5-a5a2-4708-a863-445abc96f97e))
  (pad "3" smd rect (at 32.85 1.6) (size 0.35 2.55) (layers "F.Cu" "F.Mask") (tstamp 6b937a6b-a987-4a53-abe7-37df573a237f))
  (pad "4" smd rect (at 32.6 1.6) (size 0.35 2.55) (layers "B.Cu" "B.Mask") (tstamp eb07f07d-3d07-4552-9262-626f0a2684f8))
  (pad "5" smd rect (at 32.35 1.6) (size 0.35 2.55) (layers "F.Cu" "F.Mask") (tstamp b9afc65b-b0e9-435c-ad26-eb50d9856f25))
  (pad "6" smd rect (at 32.1 1.6) (size 0.35 2.55) (layers "B.Cu" "B.Mask") (tstamp 80939120-698f-4707-804d-014807877423))
  (pad "7" smd rect (at 31.85 1.6) (size 0.35 2.55) (layers "F.Cu" "F.Mask") (tstamp a8996669-f231-46fc-a301-19583021910c))
  (pad "8" smd rect (at 31.6 1.6) (size 0.35 2.55) (layers "B.Cu" "B.Mask") (tstamp 427251d9-f141-4e96-8dca-14ead06301b8))
  (pad "9" smd rect (at 31.35 1.6) (size 0.35 2.55) (layers "F.Cu" "F.Mask") (tstamp bd42213d-bb30-48cb-be98-7075c12d0974))
  (pad "10" smd rect (at 31.1 1.6) (size 0.35 2.55) (layers "B.Cu" "B.Mask") (tstamp 2b0ab07a-5f37-4faa-8e49-d1f3071dfe13))
  (pad "11" smd rect (at 30.85 1.6) (size 0.35 2.55) (layers "F.Cu" "F.Mask") (tstamp 43c7c56d-95c6-426b-8c66-a5d8192273e9))
  (pad "12" smd rect (at 30.6 1.6) (size 0.35 2.55) (layers "B.Cu" "B.Mask") (tstamp 851e05f5-c74b-429b-99e1-63b6a9e615c6))
  (pad "13" smd rect (at 30.35 1.6) (size 0.35 2.55) (layers "F.Cu" "F.Mask") (tstamp 87d719b2-7500-49b1-b361-31159056cefa))
  (pad "14" smd rect (at 30.1 1.6) (size 0.35 2.55) (layers "B.Cu" "B.Mask") (tstamp 80fcae2d-5323-4e81-9a13-1e545c54caac))
  (pad "15" smd rect (at 29.85 1.6) (size 0.35 2.55) (layers "F.Cu" "F.Mask") (tstamp 4fad56de-4d5a-41cc-9e92-c43e2bf0d345))
  (pad "16" smd rect (at 29.6 1.6) (size 0.35 2.55) (layers "B.Cu" "B.Mask") (tstamp 9eedf6e7-b58e-4a0a-bddf-4189398dc71a))
  (pad "17" smd rect (at 29.35 1.6) (size 0.35 2.55) (layers "F.Cu" "F.Mask") (tstamp 0c40c47c-18de-44a7-bc76-04f065da247b))
  (pad "18" smd rect (at 29.1 1.6) (size 0.35 2.55) (layers "B.Cu" "B.Mask") (tstamp a3ec3e74-87db-4591-9741-67ec3899f2e3))
  (pad "19" smd rect (at 28.85 1.6) (size 0.35 2.55) (layers "F.Cu" "F.Mask") (tstamp 133b4d64-7377-4029-b2f7-fc060c8d059c))
  (pad "20" smd rect (at 28.6 1.6) (size 0.35 2.55) (layers "B.Cu" "B.Mask") (tstamp cd1a885c-7f78-4de5-baf7-b74c15b5a136))
  (pad "21" smd rect (at 28.35 1.6) (size 0.35 2.55) (layers "F.Cu" "F.Mask") (tstamp 8068cfba-64b0-4600-abdf-04af07cd89e0))
  (pad "22" smd rect (at 28.1 1.6) (size 0.35 2.55) (layers "B.Cu" "B.Mask") (tstamp 7684dedb-f7d2-48d1-ab87-b6e471a5181d))
  (pad "23" smd rect (at 27.85 1.6) (size 0.35 2.55) (layers "F.Cu" "F.Mask") (tstamp 3e83118e-6d94-4282-b423-bdc36cdf5d40))
  (pad "24" smd rect (at 27.6 1.6) (size 0.35 2.55) (layers "B.Cu" "B.Mask") (tstamp 9f13f1e3-0c62-4546-b842-726c889c8fb0))
  (pad "25" smd rect (at 27.35 1.6) (size 0.35 2.55) (layers "F.Cu" "F.Mask") (tstamp ddffd8bf-a555-4f44-a9b0-c30ddde69d6c))
  (pad "26" smd rect (at 27.1 1.6) (size 0.35 2.55) (layers "B.Cu" "B.Mask") (tstamp 50de54f4-0e9d-40ec-b8db-2d80788a61c8))
  (pad "27" smd rect (at 26.85 1.6) (size 0.35 2.55) (layers "F.Cu" "F.Mask") (tstamp 51049fbd-d3ac-46db-b2df-1f380f64cd54))
  (pad "28" smd rect (at 26.6 1.6) (size 0.35 2.55) (layers "B.Cu" "B.Mask") (tstamp df5d0420-903c-4d98-9abb-46c69aef1fef))
  (pad "29" smd rect (at 26.35 1.6) (size 0.35 2.55) (layers "F.Cu" "F.Mask") (tstamp 6db7dfd9-f76e-4a44-8cb3-4782dc878d7a))
  (pad "30" smd rect (at 26.1 1.6) (size 0.35 2.55) (layers "B.Cu" "B.Mask") (tstamp 4e85a371-d3f0-423f-9c0a-3f357633269a))
  (pad "31" smd rect (at 25.85 1.6) (size 0.35 2.55) (layers "F.Cu" "F.Mask") (tstamp 656bd7cf-6cb1-4fa5-8766-8abf0b9372b2))
  (pad "32" smd rect (at 25.6 1.6) (size 0.35 2.55) (layers "B.Cu" "B.Mask") (tstamp 5b1bb13d-2da4-44bf-8f09-fb3cd61243cb))
  (pad "33" smd rect (at 25.35 1.6) (size 0.35 2.55) (layers "F.Cu" "F.Mask") (tstamp ee7b40de-2111-445d-8a9d-7f92ca49171d))
  (pad "34" smd rect (at 25.1 1.6) (size 0.35 2.55) (layers "B.Cu" "B.Mask") (tstamp ae4cef8a-da77-409d-9c78-09fddeb2cfe6))
  (pad "35" smd rect (at 24.85 1.6) (size 0.35 2.55) (layers "F.Cu" "F.Mask") (tstamp 689e0a51-4fa2-49ac-8f59-8564a8b29f8a))
  (pad "36" smd rect (at 24.6 1.6) (size 0.35 2.55) (layers "B.Cu" "B.Mask") (tstamp 78134091-9b59-41d2-aa96-16969cf4021c))
  (pad "37" smd rect (at 24.35 1.6) (size 0.35 2.55) (layers "F.Cu" "F.Mask") (tstamp 5c1671bd-0f55-4c1e-a7f5-7ebc08268a8a))
  (pad "38" smd rect (at 24.1 1.6) (size 0.35 2.55) (layers "B.Cu" "B.Mask") (tstamp b23aae16-4d22-4ac1-b229-6bc7ea42a194))
  (pad "39" smd rect (at 23.85 1.6) (size 0.35 2.55) (layers "F.Cu" "F.Mask") (tstamp df3c4125-7936-436a-aaf0-3de256a5f000))
  (pad "40" smd rect (at 23.6 1.6) (size 0.35 2.55) (layers "B.Cu" "B.Mask") (tstamp 56cf4cf0-3df2-4b7d-b892-ddb0db9e7e4f))
  (pad "41" smd rect (at 23.35 1.6) (size 0.35 2.55) (layers "F.Cu" "F.Mask") (tstamp 53a319d4-9e51-43a7-915e-ba69dfa149ce))
  (pad "42" smd rect (at 23.1 1.6) (size 0.35 2.55) (layers "B.Cu" "B.Mask") (tstamp 7d7ab333-6dc8-4e61-b788-a597ad8ea2ae))
  (pad "43" smd rect (at 22.85 1.6) (size 0.35 2.55) (layers "F.Cu" "F.Mask") (tstamp bdb26412-ad19-4a0c-a162-20839415696a))
  (pad "44" smd rect (at 22.6 1.6) (size 0.35 2.55) (layers "B.Cu" "B.Mask") (tstamp 1ba195b0-ec22-4c25-83ed-3a32220fc95a))
  (pad "45" smd rect (at 22.35 1.6) (size 0.35 2.55) (layers "F.Cu" "F.Mask") (tstamp 6527af3e-64d2-4ab6-a666-d3af02463ddf))
  (pad "46" smd rect (at 22.1 1.6) (size 0.35 2.55) (layers "B.Cu" "B.Mask") (tstamp bf830691-a3ce-4f3e-8f25-53bd701baaa6))
  (pad "47" smd rect (at 21.85 1.6) (size 0.35 2.55) (layers "F.Cu" "F.Mask") (tstamp 75d63b95-e19c-438f-a5f2-9e75e6312764))
  (pad "48" smd rect (at 21.6 1.6) (size 0.35 2.55) (layers "B.Cu" "B.Mask") (tstamp 79c508b4-2ca6-4f01-9b9a-64daa40286e1))
  (pad "49" smd rect (at 21.35 1.6) (size 0.35 2.55) (layers "F.Cu" "F.Mask") (tstamp b0a45d0b-13f8-4b82-b5df-65a196aa47ef))
  (pad "50" smd rect (at 21.1 1.6) (size 0.35 2.55) (layers "B.Cu" "B.Mask") (tstamp 855d828a-3e8d-4fb6-8345-416e2c653580))
  (pad "51" smd rect (at 20.85 1.6) (size 0.35 2.55) (layers "F.Cu" "F.Mask") (tstamp b91cda03-c0c0-4975-8adb-ebea7a35c9c1))
  (pad "52" smd rect (at 20.6 1.6) (size 0.35 2.55) (layers "B.Cu" "B.Mask") (tstamp c068516f-23ef-4622-8de5-cac654dad228))
  (pad "53" smd rect (at 20.35 1.6) (size 0.35 2.55) (layers "F.Cu" "F.Mask") (tstamp 17b78b32-0b47-4885-be95-6fac18a687aa))
  (pad "54" smd rect (at 20.1 1.6) (size 0.35 2.55) (layers "B.Cu" "B.Mask") (tstamp 9c73302c-fc57-424e-9e27-d7dcfb26b507))
  (pad "55" smd rect (at 19.85 1.6) (size 0.35 2.55) (layers "F.Cu" "F.Mask") (tstamp 341ad384-3268-4dc6-afe8-07ccfd20e76d))
  (pad "56" smd rect (at 19.6 1.6) (size 0.35 2.55) (layers "B.Cu" "B.Mask") (tstamp 87760f6a-29b2-45a0-97e9-ec500707f1a4))
  (pad "57" smd rect (at 19.35 1.6) (size 0.35 2.55) (layers "F.Cu" "F.Mask") (tstamp f2a7b721-613a-4c70-805e-4fa0da00b361))
  (pad "58" smd rect (at 19.1 1.6) (size 0.35 2.55) (layers "B.Cu" "B.Mask") (tstamp 231ddf78-4a22-4114-8d90-07caece990d9))
  (pad "59" smd rect (at 18.85 1.6) (size 0.35 2.55) (layers "F.Cu" "F.Mask") (tstamp bdbf0be0-790f-430b-b7b1-df8f214e0af7))
  (pad "60" smd rect (at 18.6 1.6) (size 0.35 2.55) (layers "B.Cu" "B.Mask") (tstamp 0f94ce81-5a4a-40a9-8262-96a11a96b669))
  (pad "61" smd rect (at 18.35 1.6) (size 0.35 2.55) (layers "F.Cu" "F.Mask") (tstamp 19bf15c0-18ca-4df6-af0a-d66d6ce05437))
  (pad "62" smd rect (at 18.1 1.6) (size 0.35 2.55) (layers "B.Cu" "B.Mask") (tstamp 61d9a2db-e4d8-41ba-98ad-4879a0b1ad65))
  (pad "63" smd rect (at 17.85 1.6) (size 0.35 2.55) (layers "F.Cu" "F.Mask") (tstamp 4c06f7b4-3519-46dd-b194-e0dad8f5082f))
  (pad "64" smd rect (at 17.6 1.6) (size 0.35 2.55) (layers "B.Cu" "B.Mask") (tstamp 25645fce-e0e0-4538-bfee-3ba7cb45aa04))
  (pad "65" smd rect (at 17.35 1.6) (size 0.35 2.55) (layers "F.Cu" "F.Mask") (tstamp 06f32f46-b4f2-4c8b-a439-a8d69b53d8b5))
  (pad "66" smd rect (at 17.1 1.6) (size 0.35 2.55) (layers "B.Cu" "B.Mask") (tstamp 040bb35b-ab7b-4968-a472-0ea22937524d))
  (pad "67" smd rect (at 16.85 1.6) (size 0.35 2.55) (layers "F.Cu" "F.Mask") (tstamp 95c72698-6e54-498f-af5c-8fa1430eeeb8))
  (pad "68" smd rect (at 16.6 1.6) (size 0.35 2.55) (layers "B.Cu" "B.Mask") (tstamp 7cc6ad76-a384-457f-8663-90c38009cdfd))
  (pad "69" smd rect (at 16.35 1.6) (size 0.35 2.55) (layers "F.Cu" "F.Mask") (tstamp ad6c119c-09c0-4702-853c-467f1c0c4119))
  (pad "70" smd rect (at 16.1 1.6) (size 0.35 2.55) (layers "B.Cu" "B.Mask") (tstamp 15f871f0-5339-44e5-9632-4790e035e3d2))
  (pad "71" smd rect (at 15.85 1.6) (size 0.35 2.55) (layers "F.Cu" "F.Mask") (tstamp f5418a2b-49be-4435-88c0-ebdd54e983e1))
  (pad "72" smd rect (at 15.6 1.6) (size 0.35 2.55) (layers "B.Cu" "B.Mask") (tstamp 1722604b-0733-41bd-a2f4-29e43a82ea64))
  (pad "73" smd rect (at 15.35 1.6) (size 0.35 2.55) (layers "F.Cu" "F.Mask") (tstamp 73b24726-716d-4c8a-9514-9f224fb1fca6))
  (pad "74" smd rect (at 15.1 1.6) (size 0.35 2.55) (layers "B.Cu" "B.Mask") (tstamp 737245b5-796b-4550-86f2-6af3a3fbefb7))
  (pad "75" smd rect (at 14.85 1.6) (size 0.35 2.55) (layers "F.Cu" "F.Mask") (tstamp a9ab48fe-7541-408e-af1a-d85a359673c6))
  (pad "76" smd rect (at 14.6 1.6) (size 0.35 2.55) (layers "B.Cu" "B.Mask") (tstamp ba808874-7888-4f69-8015-7d21a896402f))
  (pad "77" smd rect (at 14.35 1.6) (size 0.35 2.55) (layers "F.Cu" "F.Mask") (tstamp 0f76ccea-6a98-4d38-96d5-296cc53f673b))
  (pad "78" smd rect (at 14.1 1.6) (size 0.35 2.55) (layers "B.Cu" "B.Mask") (tstamp 52ae658e-e604-41b4-a3d1-7179f86e8777))
  (pad "79" smd rect (at 13.85 1.6) (size 0.35 2.55) (layers "F.Cu" "F.Mask") (tstamp cc547659-1102-48f3-8392-1e632044be81))
  (pad "80" smd rect (at 13.6 1.6) (size 0.35 2.55) (layers "B.Cu" "B.Mask") (tstamp 7427914b-e8f0-4f78-ba76-f571e0e653fc))
  (pad "81" smd rect (at 13.35 1.6) (size 0.35 2.55) (layers "F.Cu" "F.Mask") (tstamp f21c898f-78ff-4364-8e3e-01394029f969))
  (pad "82" smd rect (at 13.1 1.6) (size 0.35 2.55) (layers "B.Cu" "B.Mask") (tstamp 06ab8fe4-5dfa-493d-b939-c599bdff5159))
  (pad "83" smd rect (at 12.85 1.6) (size 0.35 2.55) (layers "F.Cu" "F.Mask") (tstamp 4fb4a193-deb7-4d90-889b-9ae42650aa12))
  (pad "84" smd rect (at 12.6 1.6) (size 0.35 2.55) (layers "B.Cu" "B.Mask") (tstamp 85acd617-46a9-441b-b24f-beb46750211d))
  (pad "85" smd rect (at 12.35 1.6) (size 0.35 2.55) (layers "F.Cu" "F.Mask") (tstamp db85617e-fef5-45d7-ad9d-f7b61e3319ed))
  (pad "86" smd rect (at 12.1 1.6) (size 0.35 2.55) (layers "B.Cu" "B.Mask") (tstamp d6cad28f-29cb-45a6-b886-7dd4c09a08bb))
  (pad "87" smd rect (at 11.85 1.6) (size 0.35 2.55) (layers "F.Cu" "F.Mask") (tstamp 0a428f62-418c-4091-81f7-8c93872b4606))
  (pad "88" smd rect (at 11.6 1.6) (size 0.35 2.55) (layers "B.Cu" "B.Mask") (tstamp 4c214665-f3a4-44bb-9459-5e8e817abdbe))
  (pad "89" smd rect (at 11.35 1.6) (size 0.35 2.55) (layers "F.Cu" "F.Mask") (tstamp 3aa652ea-12de-48b7-a04f-dc0e08c7111d))
  (pad "90" smd rect (at 11.1 1.6) (size 0.35 2.55) (layers "B.Cu" "B.Mask") (tstamp d7a60849-ab60-41f3-8f38-ba9d2037f019))
  (pad "91" smd rect (at 10.85 1.6) (size 0.35 2.55) (layers "F.Cu" "F.Mask") (tstamp 18df1de7-7657-426f-b13c-682e15044f30))
  (pad "92" smd rect (at 10.6 1.6) (size 0.35 2.55) (layers "B.Cu" "B.Mask") (tstamp 0bf1b907-c681-461a-8b85-4bb31738eee7))
  (pad "93" smd rect (at 10.35 1.6) (size 0.35 2.55) (layers "F.Cu" "F.Mask") (tstamp 2a868378-00ab-48ae-a1c5-c2668c7473f4))
  (pad "94" smd rect (at 10.1 1.6) (size 0.35 2.55) (layers "B.Cu" "B.Mask") (tstamp 33187a8c-dcd8-423a-a9bb-b6d415024794))
  (pad "95" smd rect (at 9.85 1.6) (size 0.35 2.55) (layers "F.Cu" "F.Mask") (tstamp 797a20a5-eced-41f7-b0c6-c9d060015836))
  (pad "96" smd rect (at 9.6 1.6) (size 0.35 2.55) (layers "B.Cu" "B.Mask") (tstamp 0183ad98-2637-4673-8511-59dda31c5d5a))
  (pad "97" smd rect (at 9.35 1.6) (size 0.35 2.55) (layers "F.Cu" "F.Mask") (tstamp 7434e803-41df-413f-98bb-bc2f75272b83))
  (pad "98" smd rect (at 9.1 1.6) (size 0.35 2.55) (layers "B.Cu" "B.Mask") (tstamp 118ce022-e6d2-4ede-acb7-2e28c4b3c118))
  (pad "99" smd rect (at 8.85 1.6) (size 0.35 2.55) (layers "F.Cu" "F.Mask") (tstamp 3306f470-a854-4cb8-a050-ca9aa4114a78))
  (pad "100" smd rect (at 8.6 1.6) (size 0.35 2.55) (layers "B.Cu" "B.Mask") (tstamp 5c0fcc6b-672f-42de-b353-f366ce81a346))
  (pad "101" smd rect (at 8.35 1.6) (size 0.35 2.55) (layers "F.Cu" "F.Mask") (tstamp 59520116-a3e7-4658-924f-599f28b8d355))
  (pad "102" smd rect (at 8.1 1.6) (size 0.35 2.55) (layers "B.Cu" "B.Mask") (tstamp 1f7b2a9e-8adb-42f3-960e-1d27c66a2596))
  (pad "103" smd rect (at 7.85 1.6) (size 0.35 2.55) (layers "F.Cu" "F.Mask") (tstamp 4592b463-13a6-43af-b747-fe8c9c230efc))
  (pad "104" smd rect (at 7.6 1.6) (size 0.35 2.55) (layers "B.Cu" "B.Mask") (tstamp 4a5d1794-d11e-4ac8-b3a2-b83e8e188441))
  (pad "105" smd rect (at 7.35 1.6) (size 0.35 2.55) (layers "F.Cu" "F.Mask") (tstamp dd9e4716-939d-41e3-8c69-ff58a9d5ee98))
  (pad "106" smd rect (at 7.1 1.6) (size 0.35 2.55) (layers "B.Cu" "B.Mask") (tstamp 631cd963-788d-4892-ad0e-adcabd3de09e))
  (pad "107" smd rect (at 6.85 1.6) (size 0.35 2.55) (layers "F.Cu" "F.Mask") (tstamp 4e26c331-9bc9-4faa-bbbc-fbffa7f7a87f))
  (pad "108" smd rect (at 6.6 1.6) (size 0.35 2.55) (layers "B.Cu" "B.Mask") (tstamp d49277a5-8bb3-4a62-ba4d-9bea739c6155))
  (pad "109" smd rect (at 6.35 1.6) (size 0.35 2.55) (layers "F.Cu" "F.Mask") (tstamp 32c7dffb-b3a9-4154-ba94-bb479c091e9d))
  (pad "110" smd rect (at 6.1 1.6) (size 0.35 2.55) (layers "B.Cu" "B.Mask") (tstamp 81c10304-01ed-436b-9027-16810273ca2b))
  (pad "111" smd rect (at 5.85 1.6) (size 0.35 2.55) (layers "F.Cu" "F.Mask") (tstamp a770d375-65e9-430e-9e10-a68477dbe477))
  (pad "112" smd rect (at 5.6 1.6) (size 0.35 2.55) (layers "B.Cu" "B.Mask") (tstamp 9f573cd1-941f-409f-b956-646841a9a84e))
  (pad "113" smd rect (at 5.35 1.6) (size 0.35 2.55) (layers "F.Cu" "F.Mask") (tstamp a1e7ecec-e23b-4a9a-b1c7-d59b0866ccde))
  (pad "114" smd rect (at 5.1 1.6) (size 0.35 2.55) (layers "B.Cu" "B.Mask") (tstamp fed40dea-2555-4808-9d52-b4ae0d581e0d))
  (pad "115" smd rect (at 4.85 1.6) (size 0.35 2.55) (layers "F.Cu" "F.Mask") (tstamp 80e0a5a9-6139-49f1-9af3-d14a43fd54de))
  (pad "116" smd rect (at 4.6 1.6) (size 0.35 2.55) (layers "B.Cu" "B.Mask") (tstamp dbe5d003-2a0f-4b08-8c82-3c292e2c7b3d))
  (pad "117" smd rect (at 4.35 1.6) (size 0.35 2.55) (layers "F.Cu" "F.Mask") (tstamp 42eed8c1-05f6-4d8e-8ad9-ea84b9a68037))
  (pad "118" smd rect (at 4.1 1.6) (size 0.35 2.55) (layers "B.Cu" "B.Mask") (tstamp cd7cc944-98c5-41d3-bfca-e39593f1ebe0))
  (pad "119" smd rect (at 3.85 1.6) (size 0.35 2.55) (layers "F.Cu" "F.Mask") (tstamp ae420cc9-77c4-430d-a2f2-b0bbbf0b4452))
  (pad "120" smd rect (at 3.6 1.6) (size 0.35 2.55) (layers "B.Cu" "B.Mask") (tstamp 077e0e02-3706-4d0d-af51-6f2d363f2d78))
  (pad "121" smd rect (at 3.35 1.6) (size 0.35 2.55) (layers "F.Cu" "F.Mask") (tstamp bd2ac72c-fb1e-44c7-8745-b31f9bbbcc32))
  (pad "122" smd rect (at 3.1 1.6) (size 0.35 2.55) (layers "B.Cu" "B.Mask") (tstamp 33f8d35e-de69-4034-92d1-89d1adbc4507))
  (pad "123" smd rect (at 2.85 1.6) (size 0.35 2.55) (layers "F.Cu" "F.Mask") (tstamp 6a2164e9-d61e-48d4-ae5f-66771a79ad58))
  (pad "124" smd rect (at 2.6 1.6) (size 0.35 2.55) (layers "B.Cu" "B.Mask") (tstamp 5d16a0db-8aef-4708-918a-9c167ad3a271))
  (pad "125" smd rect (at 2.35 1.6) (size 0.35 2.55) (layers "F.Cu" "F.Mask") (tstamp 2b332806-b25d-4dc9-a87f-bb4fdedd0cb6))
  (pad "126" smd rect (at 2.1 1.6) (size 0.35 2.55) (layers "B.Cu" "B.Mask") (tstamp 0994a2ce-4711-45d3-800b-5e177286723f))
  (pad "127" smd rect (at 1.85 1.6) (size 0.35 2.55) (layers "F.Cu" "F.Mask") (tstamp b7d357db-6ee3-45ff-b365-0347d6680855))
  (pad "128" smd rect (at 1.6 1.6) (size 0.35 2.55) (layers "B.Cu" "B.Mask") (tstamp d49109ce-8489-4aca-b19c-ff93e736fb0c))
  (pad "129" smd rect (at 1.35 1.6) (size 0.35 2.55) (layers "F.Cu" "F.Mask") (tstamp f89d2fba-1516-48e8-b5fb-336b0e8505a5))
  (pad "130" smd rect (at 1.1 1.6) (size 0.35 2.55) (layers "B.Cu" "B.Mask") (tstamp ce5f0101-3fa2-4933-a9b5-22e5242cd714))
  (pad "131" smd rect (at 0.85 1.6) (size 0.35 2.55) (layers "F.Cu" "F.Mask") (tstamp be62827e-1eb4-4d61-8490-23d0d4c9da41))
  (pad "132" smd rect (at 0.6 1.6) (size 0.35 2.55) (layers "B.Cu" "B.Mask") (tstamp cc4cfb36-96c8-44ed-8b9e-26d81f384316))
  (pad "133" smd rect (at 0.35 1.6) (size 0.35 2.55) (layers "F.Cu" "F.Mask") (tstamp d7232b3d-a971-4b78-b19b-8e0d05a0464e))
  (pad "134" smd rect (at 0.1 1.6) (size 0.35 2.55) (layers "B.Cu" "B.Mask") (tstamp b6cb560e-1bb4-457d-8683-98ca52ea7f34))
  (pad "135" smd rect (at -0.15 1.6) (size 0.35 2.55) (layers "F.Cu" "F.Mask") (tstamp f5fdc91e-c8a5-4952-a645-4f01bb530bd0))
  (pad "136" smd rect (at -0.4 1.6) (size 0.35 2.55) (layers "B.Cu" "B.Mask") (tstamp f10f3dad-742c-4aea-b3c4-2f8d8d96729d))
  (pad "137" smd rect (at -0.65 1.6) (size 0.35 2.55) (layers "F.Cu" "F.Mask") (tstamp 9f4815d8-1369-44fd-8760-bb0dcfc48db3))
  (pad "138" smd rect (at -0.9 1.6) (size 0.35 2.55) (layers "B.Cu" "B.Mask") (tstamp 6170e0aa-8948-4673-b38f-36315e7e6bd2))
  (pad "139" smd rect (at -1.15 1.6) (size 0.35 2.55) (layers "F.Cu" "F.Mask") (tstamp 964c7b2b-5bf2-49d0-aa9a-c95529fb0bbd))
  (pad "140" smd rect (at -1.4 1.6) (size 0.35 2.55) (layers "B.Cu" "B.Mask") (tstamp acd98399-32d5-4316-9d4c-4210bc3f8dd3))
  (pad "141" smd rect (at -1.65 1.6) (size 0.35 2.55) (layers "F.Cu" "F.Mask") (tstamp d7bb2882-43eb-469a-9bbc-7f3e0cb50d2f))
  (pad "142" smd rect (at -1.9 1.6) (size 0.35 2.55) (layers "B.Cu" "B.Mask") (tstamp ebc47f91-2ae9-47bb-979d-687b1d7ce82d))
  (pad "143" smd rect (at -2.15 1.6) (size 0.35 2.55) (layers "F.Cu" "F.Mask") (tstamp bc3aa6c7-be27-404d-b956-0da6efa5e470))
  (pad "144" smd roundrect (at -2.4 1.6) (size 0.35 2.55) (layers "B.Cu" "B.Mask") (roundrect_rratio 0)
    (chamfer_ratio 0.2) (chamfer top_left) (tstamp 5999d82a-78f3-4ad9-99aa-953a0a384121))
  (pad "145" smd rect (at -4.65 1.6) (size 0.35 2.55) (layers "F.Cu" "F.Mask") (tstamp e8b5ce0f-59ef-4e94-a9d0-da7c28d10fe7))
  (pad "146" smd rect (at -4.9 1.6) (size 0.35 2.55) (layers "B.Cu" "B.Mask") (tstamp 4e370cec-b016-4711-b967-09b35e1b05c4))
  (pad "147" smd rect (at -5.15 1.6) (size 0.35 2.55) (layers "F.Cu" "F.Mask") (tstamp 24e7239c-db39-487e-97e9-1c35ea19bf15))
  (pad "148" smd rect (at -5.4 1.6) (size 0.35 2.55) (layers "B.Cu" "B.Mask") (tstamp 2fee74db-3901-4a7e-a2c9-39c77f714ffe))
  (pad "149" smd rect (at -5.65 1.6) (size 0.35 2.55) (layers "F.Cu" "F.Mask") (tstamp 42feea6d-0c1a-4162-abfc-4d341ce6c34f))
  (pad "150" smd rect (at -5.9 1.6) (size 0.35 2.55) (layers "B.Cu" "B.Mask") (tstamp 0bc35447-0512-4ba1-b5c0-00ac2be51fbe))
  (pad "151" smd rect (at -6.15 1.6) (size 0.35 2.55) (layers "F.Cu" "F.Mask") (tstamp b700ef76-fe3b-4f94-b9f0-c145278c0993))
  (pad "152" smd rect (at -6.4 1.6) (size 0.35 2.55) (layers "B.Cu" "B.Mask") (tstamp 536ab95b-bd61-464b-8f08-7342e6049d53))
  (pad "153" smd rect (at -6.65 1.6) (size 0.35 2.55) (layers "F.Cu" "F.Mask") (tstamp fc54147d-bd53-4210-8dd6-3578ce28f350))
  (pad "154" smd rect (at -6.9 1.6) (size 0.35 2.55) (layers "B.Cu" "B.Mask") (tstamp 1e17e385-cc91-4dfd-ad4b-97788292afb1))
  (pad "155" smd rect (at -7.15 1.6) (size 0.35 2.55) (layers "F.Cu" "F.Mask") (tstamp e93a5004-2e55-4fc2-8879-950462ed1faa))
  (pad "156" smd rect (at -7.4 1.6) (size 0.35 2.55) (layers "B.Cu" "B.Mask") (tstamp 2e572e24-5a9a-4457-acfb-52039bc84599))
  (pad "157" smd rect (at -7.65 1.6) (size 0.35 2.55) (layers "F.Cu" "F.Mask") (tstamp 0d7d687f-4e40-4718-91ba-7c0e87dff96e))
  (pad "158" smd rect (at -7.9 1.6) (size 0.35 2.55) (layers "B.Cu" "B.Mask") (tstamp 6989ac7f-e729-4be5-a8a5-8fe6909fddde))
  (pad "159" smd rect (at -8.15 1.6) (size 0.35 2.55) (layers "F.Cu" "F.Mask") (tstamp 9a712e48-1e21-47af-b55c-65a437fd4606))
  (pad "160" smd rect (at -8.4 1.6) (size 0.35 2.55) (layers "B.Cu" "B.Mask") (tstamp d25ea7ee-bd1f-47b6-8fbf-d6fb45c49943))
  (pad "161" smd rect (at -8.65 1.6) (size 0.35 2.55) (layers "F.Cu" "F.Mask") (tstamp e744dccf-0cac-42c5-9843-5ee522ea6a64))
  (pad "162" smd rect (at -8.9 1.6) (size 0.35 2.55) (layers "B.Cu" "B.Mask") (tstamp bfdbae2f-46fe-4d10-a737-60ff36512a3e))
  (pad "163" smd rect (at -9.15 1.6) (size 0.35 2.55) (layers "F.Cu" "F.Mask") (tstamp 566e4cb1-05df-49f3-b61f-922793061864))
  (pad "164" smd rect (at -9.4 1.6) (size 0.35 2.55) (layers "B.Cu" "B.Mask") (tstamp ff6e9090-714a-4eb5-b372-07f9b43f7d20))
  (pad "165" smd rect (at -9.65 1.6) (size 0.35 2.55) (layers "F.Cu" "F.Mask") (tstamp df8da5b5-7a4c-4c48-91e0-136b9abe5a95))
  (pad "166" smd rect (at -9.9 1.6) (size 0.35 2.55) (layers "B.Cu" "B.Mask") (tstamp 3e306179-cc70-4d11-8e67-95101d8f5f26))
  (pad "167" smd rect (at -10.15 1.6) (size 0.35 2.55) (layers "F.Cu" "F.Mask") (tstamp ccc23aaa-256a-43d5-be58-2b4b02413307))
  (pad "168" smd rect (at -10.4 1.6) (size 0.35 2.55) (layers "B.Cu" "B.Mask") (tstamp 608f0901-2159-43b2-9c12-1a392c0405ba))
  (pad "169" smd rect (at -10.65 1.6) (size 0.35 2.55) (layers "F.Cu" "F.Mask") (tstamp 4fe09486-790a-4ab0-a2e6-551ab4473afe))
  (pad "170" smd rect (at -10.9 1.6) (size 0.35 2.55) (layers "B.Cu" "B.Mask") (tstamp 726c69a3-a69a-4238-afb7-b4dbcada2e0f))
  (pad "171" smd rect (at -11.15 1.6) (size 0.35 2.55) (layers "F.Cu" "F.Mask") (tstamp cb28f2e9-d6ac-441e-b2e5-117e623171e9))
  (pad "172" smd rect (at -11.4 1.6) (size 0.35 2.55) (layers "B.Cu" "B.Mask") (tstamp f924ebfa-68ca-4c15-9900-093f0de22672))
  (pad "173" smd rect (at -11.65 1.6) (size 0.35 2.55) (layers "F.Cu" "F.Mask") (tstamp 340fc508-044e-4e7f-b162-b61d02ea94cd))
  (pad "174" smd rect (at -11.9 1.6) (size 0.35 2.55) (layers "B.Cu" "B.Mask") (tstamp 46fc61f4-a9ef-482e-9737-ed397c599a15))
  (pad "175" smd rect (at -12.15 1.6) (size 0.35 2.55) (layers "F.Cu" "F.Mask") (tstamp 9640450f-9c44-4bef-83e0-f57ea27d0e5a))
  (pad "176" smd rect (at -12.4 1.6) (size 0.35 2.55) (layers "B.Cu" "B.Mask") (tstamp 517ee4bb-5195-422d-ba2c-79cefd552dea))
  (pad "177" smd rect (at -12.65 1.6) (size 0.35 2.55) (layers "F.Cu" "F.Mask") (tstamp 75edb012-a097-4c3d-b97c-44250480ef59))
  (pad "178" smd rect (at -12.9 1.6) (size 0.35 2.55) (layers "B.Cu" "B.Mask") (tstamp 59a24c83-c551-4bfb-bae8-e3c4064ef438))
  (pad "179" smd rect (at -13.15 1.6) (size 0.35 2.55) (layers "F.Cu" "F.Mask") (tstamp 6ec06fe9-a80e-4519-826f-68792afa8567))
  (pad "180" smd rect (at -13.4 1.6) (size 0.35 2.55) (layers "B.Cu" "B.Mask") (tstamp e45d158f-bf99-4736-bf1d-f01af6379122))
  (pad "181" smd rect (at -13.65 1.6) (size 0.35 2.55) (layers "F.Cu" "F.Mask") (tstamp c007fb2f-e802-452a-a626-a41f1b3147ba))
  (pad "182" smd rect (at -13.9 1.6) (size 0.35 2.55) (layers "B.Cu" "B.Mask") (tstamp baa6da8a-9a98-48ba-ae7e-b6583b850f79))
  (pad "183" smd rect (at -14.15 1.6) (size 0.35 2.55) (layers "F.Cu" "F.Mask") (tstamp a1a94e36-0b2f-417a-b66b-7a782ca7ce5e))
  (pad "184" smd rect (at -14.4 1.6) (size 0.35 2.55) (layers "B.Cu" "B.Mask") (tstamp 46e7b271-1deb-40d1-b757-22f0de992cb5))
  (pad "185" smd rect (at -14.65 1.6) (size 0.35 2.55) (layers "F.Cu" "F.Mask") (tstamp aae4b1d9-69dc-45fd-a451-fc73a153c6b5))
  (pad "186" smd rect (at -14.9 1.6) (size 0.35 2.55) (layers "B.Cu" "B.Mask") (tstamp 69027595-cf66-4c77-ad33-45f0a026bb57))
  (pad "187" smd rect (at -15.15 1.6) (size 0.35 2.55) (layers "F.Cu" "F.Mask") (tstamp 69e965dd-c6a7-4f94-95c3-ce3aa40978dc))
  (pad "188" smd rect (at -15.4 1.6) (size 0.35 2.55) (layers "B.Cu" "B.Mask") (tstamp f9725c47-49f5-48bb-b05c-b08d01d48ce8))
  (pad "189" smd rect (at -15.65 1.6) (size 0.35 2.55) (layers "F.Cu" "F.Mask") (tstamp b6480890-238f-49ef-933c-ca993eb00b80))
  (pad "190" smd rect (at -15.9 1.6) (size 0.35 2.55) (layers "B.Cu" "B.Mask") (tstamp b325ad63-cb89-4ba6-acc2-97a819d854a3))
  (pad "191" smd rect (at -16.15 1.6) (size 0.35 2.55) (layers "F.Cu" "F.Mask") (tstamp 5829b4d8-ec1e-47a7-be3c-762019fbd3ed))
  (pad "192" smd rect (at -16.4 1.6) (size 0.35 2.55) (layers "B.Cu" "B.Mask") (tstamp 38f39f1d-c356-44c5-938c-eeee1ff72b63))
  (pad "193" smd rect (at -16.65 1.6) (size 0.35 2.55) (layers "F.Cu" "F.Mask") (tstamp 4ca1be11-6808-4b70-87f1-139037520a39))
  (pad "194" smd rect (at -16.9 1.6) (size 0.35 2.55) (layers "B.Cu" "B.Mask") (tstamp 44545704-ac92-4093-b8f7-0dcc46e5445b))
  (pad "195" smd rect (at -17.15 1.6) (size 0.35 2.55) (layers "F.Cu" "F.Mask") (tstamp c41c8796-5f77-4596-98b2-9aae487d3968))
  (pad "196" smd rect (at -17.4 1.6) (size 0.35 2.55) (layers "B.Cu" "B.Mask") (tstamp f9b6f7ab-b923-4ec7-8403-1ab6f9cab587))
  (pad "197" smd rect (at -17.65 1.6) (size 0.35 2.55) (layers "F.Cu" "F.Mask") (tstamp 32ddc333-4155-44fe-a885-91e8a85c8f11))
  (pad "198" smd rect (at -17.9 1.6) (size 0.35 2.55) (layers "B.Cu" "B.Mask") (tstamp f8334d2b-9de1-47b0-8f99-d79d21b96d15))
  (pad "199" smd rect (at -18.15 1.6) (size 0.35 2.55) (layers "F.Cu" "F.Mask") (tstamp 1f53239f-ea3d-4113-93d2-c465eb9975ea))
  (pad "200" smd rect (at -18.4 1.6) (size 0.35 2.55) (layers "B.Cu" "B.Mask") (tstamp f1996abb-90d9-4df9-b0e6-07aae3790d05))
  (pad "201" smd rect (at -18.65 1.6) (size 0.35 2.55) (layers "F.Cu" "F.Mask") (tstamp 87225277-8b60-457a-bb55-399fa38088e0))
  (pad "202" smd rect (at -18.9 1.6) (size 0.35 2.55) (layers "B.Cu" "B.Mask") (tstamp 938e6d01-9ded-4c30-abfe-a4e3bf420faf))
  (pad "203" smd rect (at -19.15 1.6) (size 0.35 2.55) (layers "F.Cu" "F.Mask") (tstamp 619653c0-0485-4a04-b3cb-305e28d2d972))
  (pad "204" smd rect (at -19.4 1.6) (size 0.35 2.55) (layers "B.Cu" "B.Mask") (tstamp db624013-07c7-428b-978d-39d487cb5fda))
  (pad "205" smd rect (at -19.65 1.6) (size 0.35 2.55) (layers "F.Cu" "F.Mask") (tstamp 9ee738eb-9f30-40ee-8cee-f38e60cd95bb))
  (pad "206" smd rect (at -19.9 1.6) (size 0.35 2.55) (layers "B.Cu" "B.Mask") (tstamp 49fb57b8-73a6-4997-a23e-1b053e4933ae))
  (pad "207" smd rect (at -20.15 1.6) (size 0.35 2.55) (layers "F.Cu" "F.Mask") (tstamp 79fec336-9a85-4b1d-a7c3-7c4b03cbdc3d))
  (pad "208" smd rect (at -20.4 1.6) (size 0.35 2.55) (layers "B.Cu" "B.Mask") (tstamp cf93fa69-968c-4cf3-8e05-8a6a6fa79f26))
  (pad "209" smd rect (at -20.65 1.6) (size 0.35 2.55) (layers "F.Cu" "F.Mask") (tstamp 16cdd559-7113-4f7b-9426-19dbd82bc737))
  (pad "210" smd rect (at -20.9 1.6) (size 0.35 2.55) (layers "B.Cu" "B.Mask") (tstamp 1dc98597-4fc3-46aa-b7a8-c3d3876c101e))
  (pad "211" smd rect (at -21.15 1.6) (size 0.35 2.55) (layers "F.Cu" "F.Mask") (tstamp bd7cda27-3711-4496-8e7c-a2fcab1c8ca6))
  (pad "212" smd rect (at -21.4 1.6) (size 0.35 2.55) (layers "B.Cu" "B.Mask") (tstamp 8a248c40-13c9-4914-9440-7503536a9037))
  (pad "213" smd rect (at -21.65 1.6) (size 0.35 2.55) (layers "F.Cu" "F.Mask") (tstamp 4d83cef6-9f7e-433e-9ac2-f9bc23c304af))
  (pad "214" smd rect (at -21.9 1.6) (size 0.35 2.55) (layers "B.Cu" "B.Mask") (tstamp 21b67c89-50aa-4045-af6e-cd2ebf1afd5e))
  (pad "215" smd rect (at -22.15 1.6) (size 0.35 2.55) (layers "F.Cu" "F.Mask") (tstamp 061762b8-89fd-4c36-949a-26264b21b4cd))
  (pad "216" smd rect (at -22.4 1.6) (size 0.35 2.55) (layers "B.Cu" "B.Mask") (tstamp 3b7afbb0-f819-430c-9f8b-fe719ed8ae01))
  (pad "217" smd rect (at -22.65 1.6) (size 0.35 2.55) (layers "F.Cu" "F.Mask") (tstamp d4a1a806-3d06-4511-9062-65a1a660c8e6))
  (pad "218" smd rect (at -22.9 1.6) (size 0.35 2.55) (layers "B.Cu" "B.Mask") (tstamp 652fac8a-724e-491b-a0e1-7218f4b0fec6))
  (pad "219" smd rect (at -23.15 1.6) (size 0.35 2.55) (layers "F.Cu" "F.Mask") (tstamp d7f5f1b1-2bf5-4120-9c96-663624cf0096))
  (pad "220" smd rect (at -23.4 1.6) (size 0.35 2.55) (layers "B.Cu" "B.Mask") (tstamp 4bba54cb-695b-4948-af67-4846a41b280b))
  (pad "221" smd rect (at -23.65 1.6) (size 0.35 2.55) (layers "F.Cu" "F.Mask") (tstamp c634cc29-2788-436d-a611-27c842add65a))
  (pad "222" smd rect (at -23.9 1.6) (size 0.35 2.55) (layers "B.Cu" "B.Mask") (tstamp 2b4fed94-d538-4d51-bf0a-6bf1da847987))
  (pad "223" smd rect (at -24.15 1.6) (size 0.35 2.55) (layers "F.Cu" "F.Mask") (tstamp e32bfe3c-96f5-47fc-8a49-b4860c68f5f2))
  (pad "224" smd rect (at -24.4 1.6) (size 0.35 2.55) (layers "B.Cu" "B.Mask") (tstamp a7c6653e-b7f2-462d-b1b8-64a62ecdedf6))
  (pad "225" smd rect (at -24.65 1.6) (size 0.35 2.55) (layers "F.Cu" "F.Mask") (tstamp abaa344f-103b-40a5-b1bf-af11275381a6))
  (pad "226" smd rect (at -24.9 1.6) (size 0.35 2.55) (layers "B.Cu" "B.Mask") (tstamp 180e2999-0649-4bee-bbf2-fb680081e9bf))
  (pad "227" smd rect (at -25.15 1.6) (size 0.35 2.55) (layers "F.Cu" "F.Mask") (tstamp a67722ee-77a2-4e52-9e69-6852a4365d73))
  (pad "228" smd rect (at -25.4 1.6) (size 0.35 2.55) (layers "B.Cu" "B.Mask") (tstamp b89ebfbd-3783-4f8b-8105-90e620d2cc5d))
  (pad "229" smd rect (at -25.65 1.6) (size 0.35 2.55) (layers "F.Cu" "F.Mask") (tstamp 6480ed4b-6c2c-4429-911f-b70166b15dda))
  (pad "230" smd rect (at -25.9 1.6) (size 0.35 2.55) (layers "B.Cu" "B.Mask") (tstamp 41bd331b-22ff-4048-b792-98ee2815d34f))
  (pad "231" smd rect (at -26.15 1.6) (size 0.35 2.55) (layers "F.Cu" "F.Mask") (tstamp 397d131e-0efb-4574-abea-809f14220578))
  (pad "232" smd rect (at -26.4 1.6) (size 0.35 2.55) (layers "B.Cu" "B.Mask") (tstamp 2afe062e-7096-4a44-a2ee-f767fe17aa69))
  (pad "233" smd rect (at -26.65 1.6) (size 0.35 2.55) (layers "F.Cu" "F.Mask") (tstamp 3623b28d-54ec-4da2-9862-33279f8805d3))
  (pad "234" smd rect (at -26.9 1.6) (size 0.35 2.55) (layers "B.Cu" "B.Mask") (tstamp 34742170-b3cf-4ed3-b731-4fabf5961577))
  (pad "235" smd rect (at -27.15 1.6) (size 0.35 2.55) (layers "F.Cu" "F.Mask") (tstamp 8c30fd70-52d0-4821-8eed-cd4933ddbf65))
  (pad "236" smd rect (at -27.4 1.6) (size 0.35 2.55) (layers "B.Cu" "B.Mask") (tstamp 26967ae9-ed26-435b-b4b4-6575197b5dfe))
  (pad "237" smd rect (at -27.65 1.6) (size 0.35 2.55) (layers "F.Cu" "F.Mask") (tstamp ea6c4176-69e4-47f0-adc0-b50a10b5273c))
  (pad "238" smd rect (at -27.9 1.6) (size 0.35 2.55) (layers "B.Cu" "B.Mask") (tstamp e2db114a-0408-4133-bce1-fa4aa0068a5f))
  (pad "239" smd rect (at -28.15 1.6) (size 0.35 2.55) (layers "F.Cu" "F.Mask") (tstamp 197e567d-1b5a-4435-9754-0bd47d9d0aed))
  (pad "240" smd rect (at -28.4 1.6) (size 0.35 2.55) (layers "B.Cu" "B.Mask") (tstamp f6a6c8b0-daf9-4dee-b4ac-c0bc82a85755))
  (pad "241" smd rect (at -28.65 1.6) (size 0.35 2.55) (layers "F.Cu" "F.Mask") (tstamp e17d5789-f668-48fe-8db6-de20d1ee1215))
  (pad "242" smd rect (at -28.9 1.6) (size 0.35 2.55) (layers "B.Cu" "B.Mask") (tstamp 9684482f-3bd0-4a71-a1ff-fd2efd0eeb42))
  (pad "243" smd rect (at -29.15 1.6) (size 0.35 2.55) (layers "F.Cu" "F.Mask") (tstamp 77d8caa4-797c-4252-a9a3-9cd745cd3036))
  (pad "244" smd rect (at -29.4 1.6) (size 0.35 2.55) (layers "B.Cu" "B.Mask") (tstamp aaa44602-68fa-479f-82df-a7f58da27693))
  (pad "245" smd rect (at -29.65 1.6) (size 0.35 2.55) (layers "F.Cu" "F.Mask") (tstamp a1e2d01a-9ac9-45a7-9678-fc65a63461f4))
  (pad "246" smd rect (at -29.9 1.6) (size 0.35 2.55) (layers "B.Cu" "B.Mask") (tstamp c33daf23-d79e-4758-af7e-9e84098249f1))
  (pad "247" smd rect (at -30.15 1.6) (size 0.35 2.55) (layers "F.Cu" "F.Mask") (tstamp 1b610dd8-73ad-403b-b92d-919f04e56f28))
  (pad "248" smd rect (at -30.4 1.6) (size 0.35 2.55) (layers "B.Cu" "B.Mask") (tstamp 027b92ce-64e7-4277-9fc6-eafb98ec6fd3))
  (pad "249" smd rect (at -30.65 1.6) (size 0.35 2.55) (layers "F.Cu" "F.Mask") (tstamp 78862306-5a82-49ae-a5dd-0472436a0073))
  (pad "250" smd rect (at -30.9 1.6) (size 0.35 2.55) (layers "B.Cu" "B.Mask") (tstamp b726ec5e-feeb-4a39-a232-0bc4fa3a592f))
  (pad "251" smd rect (at -31.15 1.6) (size 0.35 2.55) (layers "F.Cu" "F.Mask") (tstamp 3a5df92e-93cb-49b8-98f5-ffa3ef854a9f))
  (pad "252" smd rect (at -31.4 1.6) (size 0.35 2.55) (layers "B.Cu" "B.Mask") (tstamp 8bd1be9c-1371-46cb-84d8-7d592ffe0b3a))
  (pad "253" smd rect (at -31.65 1.6) (size 0.35 2.55) (layers "F.Cu" "F.Mask") (tstamp a5502ca0-1ee0-4b19-90ee-84d88d9ef553))
  (pad "254" smd rect (at -31.9 1.6) (size 0.35 2.55) (layers "B.Cu" "B.Mask") (tstamp df470f0f-2557-4286-8ca4-73c32b66b98a))
  (pad "255" smd rect (at -32.15 1.6) (size 0.35 2.55) (layers "F.Cu" "F.Mask") (tstamp 2d78d01f-b0a4-4a85-8e26-4fa8518554dd))
  (pad "256" smd rect (at -32.4 1.6) (size 0.35 2.55) (layers "B.Cu" "B.Mask") (tstamp 60711688-8da1-4d8f-bc92-8d3c0e9fccca))
  (pad "257" smd rect (at -32.65 1.6) (size 0.35 2.55) (layers "F.Cu" "F.Mask") (tstamp eabb27eb-5b0c-4d6a-a688-2899f0ccd4f2))
  (pad "258" smd rect (at -32.9 1.6) (size 0.35 2.55) (layers "B.Cu" "B.Mask") (tstamp dea7fc78-1e62-4f7c-84b2-1b3ad5d5679a))
  (pad "259" smd rect (at -33.15 1.6) (size 0.35 2.55) (layers "F.Cu" "F.Mask") (tstamp 20bf139d-eb5e-491a-a5db-94c5fccb9412))
  (pad "260" smd rect (at -33.4 1.6) (size 0.35 2.55) (layers "B.Cu" "B.Mask") (tstamp 83f21826-de83-471b-9314-31d44be73262))
  (model "${KICADLIB}/model/connector/TE_2309411-1.stp"
    (offset (xyz 0 -20.8 -2.8))
    (scale (xyz 1 1 1))
    (rotate (xyz -90 0 0))
  )
)
