(module "TQFP50P1000X1000-65" (layer F.Cu) (tedit 5F530B5E)
  (descr "LQFP, 64 Pin (https://www.analog.com/media/en/technical-documentation/data-sheets/adv7611.pdf), generated with kicad-footprint-generator ipc_gullwing_generator.py")
  (tags "LQFP QFP")
  (attr smd)
  (fp_text reference "REF**" (at 0 -7.4) (layer F.SilkS)
    (effects (font (size 1 1) (thickness 0.15)))
    (tstamp 5113f1e2-febe-4572-ac26-05a905cf37df)
  )
  (fp_text value "TQFP50P1000X1000-65" (at 0 7.4) (layer F.Fab) hide
    (effects (font (size 1 1) (thickness 0.15)))
    (tstamp 8ab083b8-e0e6-48b9-9d48-20197df1ad76)
  )
  (fp_text user "^" (at -7.2 -3.75 270 unlocked) (layer F.SilkS)
    (effects (font (size 1 1) (thickness 0.15)))
    (tstamp 35ffef4d-4c31-4bab-84b1-cefca3aa2ff9)
  )
  (fp_text user "${REFERENCE}" (at 0 0) (layer F.Fab)
    (effects (font (size 1 1) (thickness 0.15)))
    (tstamp cd5b51c1-ac67-42a0-85ad-e4f237ff257e)
  )
  (fp_line (start 5 5) (end 5 4) (layer F.SilkS) (width 0.1) (tstamp 01890934-20d5-42fd-926e-24837123914b))
  (fp_line (start -5 4) (end -5 5) (layer F.SilkS) (width 0.1) (tstamp 299dcfb7-e1e0-493d-a71a-523d5e3f2fc1))
  (fp_line (start 5 -4) (end 5 -5) (layer F.SilkS) (width 0.1) (tstamp 6899fa38-66ee-4ccd-92ec-3549ce73ee28))
  (fp_line (start -5 5) (end -4 5) (layer F.SilkS) (width 0.1) (tstamp 824fc9b6-0782-462a-8bb0-542fcd8d3d94))
  (fp_line (start 5 -5) (end 4 -5) (layer F.SilkS) (width 0.1) (tstamp a372f338-ecae-4501-b6a6-543d2c05fb9c))
  (fp_line (start 4 5) (end 5 5) (layer F.SilkS) (width 0.1) (tstamp d3aa1a08-d640-4fdd-90af-7603c91f7a96))
  (fp_line (start -4 -5) (end -5 -5) (layer F.SilkS) (width 0.1) (tstamp dc4605a6-4238-4e4a-be4f-fdebeea14794))
  (fp_line (start -5 -5) (end -5 -4) (layer F.SilkS) (width 0.1) (tstamp f56fd3de-e893-4149-846d-0eb68c670ea4))
  (fp_line (start -5.25 5.25) (end -5.25 4.15) (layer F.CrtYd) (width 0.05) (tstamp 249cc4f7-b0c6-42f2-bbfc-7716154e8f34))
  (fp_line (start 0 -6.7) (end -4.15 -6.7) (layer F.CrtYd) (width 0.05) (tstamp 3aa89a75-21b4-4ffa-9677-fbcbccfe27e7))
  (fp_line (start -4.15 6.7) (end -4.15 5.25) (layer F.CrtYd) (width 0.05) (tstamp 3ddcae1b-d191-4d61-b1be-566ddc772c51))
  (fp_line (start -6.7 -4.15) (end -6.7 0) (layer F.CrtYd) (width 0.05) (tstamp 45853164-63e7-4971-a842-385981eb5f5b))
  (fp_line (start 0 6.7) (end -4.15 6.7) (layer F.CrtYd) (width 0.05) (tstamp 48326835-520a-4f4b-8718-33af53e2db23))
  (fp_line (start 5.25 -4.15) (end 6.7 -4.15) (layer F.CrtYd) (width 0.05) (tstamp 6c4a9f87-5989-465b-ba04-897b60dfcb54))
  (fp_line (start 5.25 4.15) (end 6.7 4.15) (layer F.CrtYd) (width 0.05) (tstamp 8e561125-3082-4c8e-aacb-0f19f46f6b25))
  (fp_line (start -4.15 -6.7) (end -4.15 -5.25) (layer F.CrtYd) (width 0.05) (tstamp 8f10a926-e37d-4c59-aea0-40d3dd0723ce))
  (fp_line (start -5.25 -5.25) (end -5.25 -4.15) (layer F.CrtYd) (width 0.05) (tstamp 99259724-e4ee-433a-8ff1-c2524fcff904))
  (fp_line (start 5.25 5.25) (end 5.25 4.15) (layer F.CrtYd) (width 0.05) (tstamp 9b9d845f-2d7b-4b6f-913a-02a33bd0eb44))
  (fp_line (start 4.15 -6.7) (end 4.15 -5.25) (layer F.CrtYd) (width 0.05) (tstamp 9ce2b66e-c024-4c4a-a4f5-11767ab57118))
  (fp_line (start 4.15 5.25) (end 5.25 5.25) (layer F.CrtYd) (width 0.05) (tstamp 9d8298e2-f861-4144-989c-1096abc856fe))
  (fp_line (start -5.25 -4.15) (end -6.7 -4.15) (layer F.CrtYd) (width 0.05) (tstamp b061ad77-8201-4c47-a16a-e5252b986110))
  (fp_line (start 0 -6.7) (end 4.15 -6.7) (layer F.CrtYd) (width 0.05) (tstamp b7145e6d-5914-4c8d-9669-10f76345994c))
  (fp_line (start 4.15 -5.25) (end 5.25 -5.25) (layer F.CrtYd) (width 0.05) (tstamp c24ce551-c100-42f5-86e7-df444fdb73ef))
  (fp_line (start 5.25 -5.25) (end 5.25 -4.15) (layer F.CrtYd) (width 0.05) (tstamp c7e83d85-3ce5-4594-a84e-3a7106f17840))
  (fp_line (start -4.15 5.25) (end -5.25 5.25) (layer F.CrtYd) (width 0.05) (tstamp db1cf30a-2231-4651-b324-2ff4fd15c5b7))
  (fp_line (start 4.15 6.7) (end 4.15 5.25) (layer F.CrtYd) (width 0.05) (tstamp dbfcfa2b-6c8c-4a70-8baf-3c54223aff77))
  (fp_line (start -6.7 4.15) (end -6.7 0) (layer F.CrtYd) (width 0.05) (tstamp e0ad6762-f929-4efa-8866-d76743b0bd76))
  (fp_line (start 6.7 -4.15) (end 6.7 0) (layer F.CrtYd) (width 0.05) (tstamp e367eaf3-41a1-498a-9184-15757e56f80d))
  (fp_line (start 0 6.7) (end 4.15 6.7) (layer F.CrtYd) (width 0.05) (tstamp e44b05e8-b612-413f-8199-e93b55e7df37))
  (fp_line (start 6.7 4.15) (end 6.7 0) (layer F.CrtYd) (width 0.05) (tstamp ee1de1c7-9548-4f4d-ba29-f5a05cc633eb))
  (fp_line (start -4.15 -5.25) (end -5.25 -5.25) (layer F.CrtYd) (width 0.05) (tstamp eff8fd7d-3c1a-4940-a9be-272a90a742c2))
  (fp_line (start -5.25 4.15) (end -6.7 4.15) (layer F.CrtYd) (width 0.05) (tstamp f31c5705-03de-487c-81c5-db7933b75295))
  (fp_line (start -4 -5) (end 5 -5) (layer F.Fab) (width 0.1) (tstamp 2646381f-cd5c-44f3-8d4c-e7c77995a5f0))
  (fp_line (start -5 -4) (end -4 -5) (layer F.Fab) (width 0.1) (tstamp 31300998-1c62-470a-aa9f-a4d5db8a99ff))
  (fp_line (start 5 5) (end -5 5) (layer F.Fab) (width 0.1) (tstamp 3fc50ad5-e5d5-42d3-83c4-f4ec5728cc78))
  (fp_line (start -5 5) (end -5 -4) (layer F.Fab) (width 0.1) (tstamp 87eca3fc-e189-4f23-8ac9-235e8b70cf95))
  (fp_line (start 5 -5) (end 5 5) (layer F.Fab) (width 0.1) (tstamp caa3b154-ed34-40b1-9af8-11eb456723e7))
  (pad "" smd roundrect (at -1 0) (size 0.81 0.81) (layers "F.Paste") (roundrect_rratio 0.25) (tstamp 06ddd7ca-e961-4665-a6db-69052c3ccbba))
  (pad "" smd roundrect (at 0 0) (size 0.81 0.81) (layers "F.Paste") (roundrect_rratio 0.25) (tstamp 1722021a-55b2-4da5-9ed1-1145f2d72916))
  (pad "" smd roundrect (at 0 1) (size 0.81 0.81) (layers "F.Paste") (roundrect_rratio 0.25) (tstamp 244c915d-1bff-4945-9265-86566fe6c5cf))
  (pad "" smd roundrect (at 1 -1) (size 0.81 0.81) (layers "F.Paste") (roundrect_rratio 0.25) (tstamp 42062f42-2c3e-4e9b-98a4-0b9894c0365e))
  (pad "" smd roundrect (at 1 1) (size 0.81 0.81) (layers "F.Paste") (roundrect_rratio 0.25) (tstamp 592a5f85-4ca3-49fb-abb4-641f60524cd8))
  (pad "" smd roundrect (at -1 1) (size 0.81 0.81) (layers "F.Paste") (roundrect_rratio 0.25) (tstamp 6abf8fbe-52df-4ad9-81ff-9b96305239fa))
  (pad "" smd roundrect (at -1 -1) (size 0.81 0.81) (layers "F.Paste") (roundrect_rratio 0.25) (tstamp 82d8f962-ff16-4741-8143-328f68abfd14))
  (pad "" smd roundrect (at 0 -1) (size 0.81 0.81) (layers "F.Paste") (roundrect_rratio 0.25) (tstamp fa57733f-885f-4b11-9f33-6342a51bac32))
  (pad "" smd roundrect (at 1 0) (size 0.81 0.81) (layers "F.Paste") (roundrect_rratio 0.25) (tstamp fed808fe-fdc0-4758-bc77-9c7e42456f51))
  (pad "1" smd roundrect (at -5.675 -3.75) (size 1.55 0.3) (layers "F.Cu" "F.Paste" "F.Mask") (roundrect_rratio 0.25) (tstamp 8a07bc45-4cf9-4a76-8b72-6440be68b189))
  (pad "2" smd roundrect (at -5.675 -3.25) (size 1.55 0.3) (layers "F.Cu" "F.Paste" "F.Mask") (roundrect_rratio 0.25) (tstamp 37d53807-e4dc-4087-a53a-a664f3f06740))
  (pad "3" smd roundrect (at -5.675 -2.75) (size 1.55 0.3) (layers "F.Cu" "F.Paste" "F.Mask") (roundrect_rratio 0.25) (tstamp b4645e13-0969-4dce-bd48-a912718339e3))
  (pad "4" smd roundrect (at -5.675 -2.25) (size 1.55 0.3) (layers "F.Cu" "F.Paste" "F.Mask") (roundrect_rratio 0.25) (tstamp a4dfd102-c828-40f3-8eea-cadceb7559e7))
  (pad "5" smd roundrect (at -5.675 -1.75) (size 1.55 0.3) (layers "F.Cu" "F.Paste" "F.Mask") (roundrect_rratio 0.25) (tstamp 9c1443c5-9b70-403d-9770-6305961019a6))
  (pad "6" smd roundrect (at -5.675 -1.25) (size 1.55 0.3) (layers "F.Cu" "F.Paste" "F.Mask") (roundrect_rratio 0.25) (tstamp 419a6bf5-15a3-40c5-a4b1-0632f1c6ac88))
  (pad "7" smd roundrect (at -5.675 -0.75) (size 1.55 0.3) (layers "F.Cu" "F.Paste" "F.Mask") (roundrect_rratio 0.25) (tstamp ebb2af91-1bfb-4fc2-bcd7-00a1940b63c0))
  (pad "8" smd roundrect (at -5.675 -0.25) (size 1.55 0.3) (layers "F.Cu" "F.Paste" "F.Mask") (roundrect_rratio 0.25) (tstamp dc8d6257-f74c-47b3-910c-94fd20516667))
  (pad "9" smd roundrect (at -5.675 0.25) (size 1.55 0.3) (layers "F.Cu" "F.Paste" "F.Mask") (roundrect_rratio 0.25) (tstamp 8ea1b097-9579-429f-bf6a-b60fd4df4006))
  (pad "10" smd roundrect (at -5.675 0.75) (size 1.55 0.3) (layers "F.Cu" "F.Paste" "F.Mask") (roundrect_rratio 0.25) (tstamp 53c6fdc1-2bf9-4769-832a-daab07212ea1))
  (pad "11" smd roundrect (at -5.675 1.25) (size 1.55 0.3) (layers "F.Cu" "F.Paste" "F.Mask") (roundrect_rratio 0.25) (tstamp 53bf4173-465e-410e-b784-fbf02436f752))
  (pad "12" smd roundrect (at -5.675 1.75) (size 1.55 0.3) (layers "F.Cu" "F.Paste" "F.Mask") (roundrect_rratio 0.25) (tstamp 6db99bbc-6d53-42d9-90b0-add04f47ed23))
  (pad "13" smd roundrect (at -5.675 2.25) (size 1.55 0.3) (layers "F.Cu" "F.Paste" "F.Mask") (roundrect_rratio 0.25) (tstamp db5b434a-b310-42c9-a2eb-6a4ef0512734))
  (pad "14" smd roundrect (at -5.675 2.75) (size 1.55 0.3) (layers "F.Cu" "F.Paste" "F.Mask") (roundrect_rratio 0.25) (tstamp 7633d63d-9c1d-456c-bd62-1552b7e250ca))
  (pad "15" smd roundrect (at -5.675 3.25) (size 1.55 0.3) (layers "F.Cu" "F.Paste" "F.Mask") (roundrect_rratio 0.25) (tstamp 18bfecac-0164-4061-96f5-e65054c0435c))
  (pad "16" smd roundrect (at -5.675 3.75) (size 1.55 0.3) (layers "F.Cu" "F.Paste" "F.Mask") (roundrect_rratio 0.25) (tstamp 6e8387eb-4b98-44c9-a683-28cc3863a8b5))
  (pad "17" smd roundrect (at -3.75 5.675) (size 0.3 1.55) (layers "F.Cu" "F.Paste" "F.Mask") (roundrect_rratio 0.25) (tstamp 1e4fa75d-6fa6-4411-9188-1e683d44fe53))
  (pad "18" smd roundrect (at -3.25 5.675) (size 0.3 1.55) (layers "F.Cu" "F.Paste" "F.Mask") (roundrect_rratio 0.25) (tstamp 04dea9b0-0070-4fcd-a764-c96a5e37aeb5))
  (pad "19" smd roundrect (at -2.75 5.675) (size 0.3 1.55) (layers "F.Cu" "F.Paste" "F.Mask") (roundrect_rratio 0.25) (tstamp 2735d18e-bcb6-4b0d-a2d3-37b02a3f721e))
  (pad "20" smd roundrect (at -2.25 5.675) (size 0.3 1.55) (layers "F.Cu" "F.Paste" "F.Mask") (roundrect_rratio 0.25) (tstamp 4f349aaf-fe8d-4f35-bb26-95ef32f6b1e7))
  (pad "21" smd roundrect (at -1.75 5.675) (size 0.3 1.55) (layers "F.Cu" "F.Paste" "F.Mask") (roundrect_rratio 0.25) (tstamp 0453c9f1-e6c2-4449-b637-942d4ace0173))
  (pad "22" smd roundrect (at -1.25 5.675) (size 0.3 1.55) (layers "F.Cu" "F.Paste" "F.Mask") (roundrect_rratio 0.25) (tstamp 9a623206-c35a-4f10-bc65-edde249d2279))
  (pad "23" smd roundrect (at -0.75 5.675) (size 0.3 1.55) (layers "F.Cu" "F.Paste" "F.Mask") (roundrect_rratio 0.25) (tstamp 0dd975dd-b91a-4be2-9cef-a5278eb96f24))
  (pad "24" smd roundrect (at -0.25 5.675) (size 0.3 1.55) (layers "F.Cu" "F.Paste" "F.Mask") (roundrect_rratio 0.25) (tstamp 3551fd6d-d393-4a48-b637-54ba6a7aceee))
  (pad "25" smd roundrect (at 0.25 5.675) (size 0.3 1.55) (layers "F.Cu" "F.Paste" "F.Mask") (roundrect_rratio 0.25) (tstamp 99a3ab51-394b-48c7-9383-363baf24e047))
  (pad "26" smd roundrect (at 0.75 5.675) (size 0.3 1.55) (layers "F.Cu" "F.Paste" "F.Mask") (roundrect_rratio 0.25) (tstamp 838f2667-2c9d-484a-9258-ff379f9b0267))
  (pad "27" smd roundrect (at 1.25 5.675) (size 0.3 1.55) (layers "F.Cu" "F.Paste" "F.Mask") (roundrect_rratio 0.25) (tstamp 2804a37c-0a67-4e92-984f-774f996b161a))
  (pad "28" smd roundrect (at 1.75 5.675) (size 0.3 1.55) (layers "F.Cu" "F.Paste" "F.Mask") (roundrect_rratio 0.25) (tstamp 19bb633b-d58c-42ad-877d-9704e2421e8d))
  (pad "29" smd roundrect (at 2.25 5.675) (size 0.3 1.55) (layers "F.Cu" "F.Paste" "F.Mask") (roundrect_rratio 0.25) (tstamp a3e03cbd-ef6b-4e72-a848-8b7a675ecc17))
  (pad "30" smd roundrect (at 2.75 5.675) (size 0.3 1.55) (layers "F.Cu" "F.Paste" "F.Mask") (roundrect_rratio 0.25) (tstamp 33389e5b-5b5a-46d3-b290-05926bace2ab))
  (pad "31" smd roundrect (at 3.25 5.675) (size 0.3 1.55) (layers "F.Cu" "F.Paste" "F.Mask") (roundrect_rratio 0.25) (tstamp 45bbbdec-b67a-4db4-bb97-c78a0a718318))
  (pad "32" smd roundrect (at 3.75 5.675) (size 0.3 1.55) (layers "F.Cu" "F.Paste" "F.Mask") (roundrect_rratio 0.25) (tstamp 53b091c2-6182-402c-bd80-298f3fb30106))
  (pad "33" smd roundrect (at 5.675 3.75) (size 1.55 0.3) (layers "F.Cu" "F.Paste" "F.Mask") (roundrect_rratio 0.25) (tstamp 460ef2c3-87d8-445c-a16c-d19ed8e6158c))
  (pad "34" smd roundrect (at 5.675 3.25) (size 1.55 0.3) (layers "F.Cu" "F.Paste" "F.Mask") (roundrect_rratio 0.25) (tstamp 447e70f5-eaa0-4b70-8c95-6130609a4abc))
  (pad "35" smd roundrect (at 5.675 2.75) (size 1.55 0.3) (layers "F.Cu" "F.Paste" "F.Mask") (roundrect_rratio 0.25) (tstamp 1db586c4-bd64-4fb2-bb71-0603b26c8477))
  (pad "36" smd roundrect (at 5.675 2.25) (size 1.55 0.3) (layers "F.Cu" "F.Paste" "F.Mask") (roundrect_rratio 0.25) (tstamp ac8c4a67-39c2-40fd-9469-a5b4d2386a92))
  (pad "37" smd roundrect (at 5.675 1.75) (size 1.55 0.3) (layers "F.Cu" "F.Paste" "F.Mask") (roundrect_rratio 0.25) (tstamp 9402da0c-d160-4acd-84f7-1fcdff3c1cc5))
  (pad "38" smd roundrect (at 5.675 1.25) (size 1.55 0.3) (layers "F.Cu" "F.Paste" "F.Mask") (roundrect_rratio 0.25) (tstamp c781e3c3-859e-4aae-b67a-36c35829cb13))
  (pad "39" smd roundrect (at 5.675 0.75) (size 1.55 0.3) (layers "F.Cu" "F.Paste" "F.Mask") (roundrect_rratio 0.25) (tstamp 382083ef-3a6d-4652-8676-e0f62077fde4))
  (pad "40" smd roundrect (at 5.675 0.25) (size 1.55 0.3) (layers "F.Cu" "F.Paste" "F.Mask") (roundrect_rratio 0.25) (tstamp 5d8ad956-2132-4da4-bb84-b08704525d23))
  (pad "41" smd roundrect (at 5.675 -0.25) (size 1.55 0.3) (layers "F.Cu" "F.Paste" "F.Mask") (roundrect_rratio 0.25) (tstamp 5b5fbc66-0278-4245-9ab9-b0457596158a))
  (pad "42" smd roundrect (at 5.675 -0.75) (size 1.55 0.3) (layers "F.Cu" "F.Paste" "F.Mask") (roundrect_rratio 0.25) (tstamp aea96b5a-9e43-4b2c-947b-f1ebe2bc17d8))
  (pad "43" smd roundrect (at 5.675 -1.25) (size 1.55 0.3) (layers "F.Cu" "F.Paste" "F.Mask") (roundrect_rratio 0.25) (tstamp 03365acd-fabe-4b02-b9cc-75bb9212a241))
  (pad "44" smd roundrect (at 5.675 -1.75) (size 1.55 0.3) (layers "F.Cu" "F.Paste" "F.Mask") (roundrect_rratio 0.25) (tstamp 41c6d058-5ea2-4cdd-bca9-e974ffa050b9))
  (pad "45" smd roundrect (at 5.675 -2.25) (size 1.55 0.3) (layers "F.Cu" "F.Paste" "F.Mask") (roundrect_rratio 0.25) (tstamp 25d11118-3088-41da-ae7d-09e40c87c89a))
  (pad "46" smd roundrect (at 5.675 -2.75) (size 1.55 0.3) (layers "F.Cu" "F.Paste" "F.Mask") (roundrect_rratio 0.25) (tstamp 992a0294-fe57-4a68-b3c5-783c1017c8fa))
  (pad "47" smd roundrect (at 5.675 -3.25) (size 1.55 0.3) (layers "F.Cu" "F.Paste" "F.Mask") (roundrect_rratio 0.25) (tstamp cfa9c46a-4a43-4a96-b0e8-df4b90a9fb07))
  (pad "48" smd roundrect (at 5.675 -3.75) (size 1.55 0.3) (layers "F.Cu" "F.Paste" "F.Mask") (roundrect_rratio 0.25) (tstamp 3077aac6-d30e-4406-9fc3-2a228c197be9))
  (pad "49" smd roundrect (at 3.75 -5.675) (size 0.3 1.55) (layers "F.Cu" "F.Paste" "F.Mask") (roundrect_rratio 0.25) (tstamp d18b5468-d4bf-458b-89f7-ff037967e723))
  (pad "50" smd roundrect (at 3.25 -5.675) (size 0.3 1.55) (layers "F.Cu" "F.Paste" "F.Mask") (roundrect_rratio 0.25) (tstamp bfe8a48a-378d-4e13-adb0-e811788f162d))
  (pad "51" smd roundrect (at 2.75 -5.675) (size 0.3 1.55) (layers "F.Cu" "F.Paste" "F.Mask") (roundrect_rratio 0.25) (tstamp 61f1adbd-ae60-4b4e-a394-73d08a78c0c9))
  (pad "52" smd roundrect (at 2.25 -5.675) (size 0.3 1.55) (layers "F.Cu" "F.Paste" "F.Mask") (roundrect_rratio 0.25) (tstamp 45c6100b-c636-4189-a914-426556949e4f))
  (pad "53" smd roundrect (at 1.75 -5.675) (size 0.3 1.55) (layers "F.Cu" "F.Paste" "F.Mask") (roundrect_rratio 0.25) (tstamp b65f5e22-fe3e-407c-a48b-b93289f866e1))
  (pad "54" smd roundrect (at 1.25 -5.675) (size 0.3 1.55) (layers "F.Cu" "F.Paste" "F.Mask") (roundrect_rratio 0.25) (tstamp 2c5520ce-1b80-44b3-9499-23f236cdc988))
  (pad "55" smd roundrect (at 0.75 -5.675) (size 0.3 1.55) (layers "F.Cu" "F.Paste" "F.Mask") (roundrect_rratio 0.25) (tstamp 3859af23-0924-4efc-b0a1-37753da3a7eb))
  (pad "56" smd roundrect (at 0.25 -5.675) (size 0.3 1.55) (layers "F.Cu" "F.Paste" "F.Mask") (roundrect_rratio 0.25) (tstamp 1617939c-f9cc-4167-8f28-7c0addc47fd2))
  (pad "57" smd roundrect (at -0.25 -5.675) (size 0.3 1.55) (layers "F.Cu" "F.Paste" "F.Mask") (roundrect_rratio 0.25) (tstamp f5255292-331f-48e2-96b6-edb3454a4ba0))
  (pad "58" smd roundrect (at -0.75 -5.675) (size 0.3 1.55) (layers "F.Cu" "F.Paste" "F.Mask") (roundrect_rratio 0.25) (tstamp 37f8922b-3915-44bf-95c8-10fcc8fd2fad))
  (pad "59" smd roundrect (at -1.25 -5.675) (size 0.3 1.55) (layers "F.Cu" "F.Paste" "F.Mask") (roundrect_rratio 0.25) (tstamp 6347faa9-7ecb-4de4-84ce-ef2bfb98722c))
  (pad "60" smd roundrect (at -1.75 -5.675) (size 0.3 1.55) (layers "F.Cu" "F.Paste" "F.Mask") (roundrect_rratio 0.25) (tstamp 3eaba32b-58f3-4cd6-895b-ccce871dcd6a))
  (pad "61" smd roundrect (at -2.25 -5.675) (size 0.3 1.55) (layers "F.Cu" "F.Paste" "F.Mask") (roundrect_rratio 0.25) (tstamp 9f1763c5-0d3a-4c64-9a7e-adc3e71ce415))
  (pad "62" smd roundrect (at -2.75 -5.675) (size 0.3 1.55) (layers "F.Cu" "F.Paste" "F.Mask") (roundrect_rratio 0.25) (tstamp 1a20c662-9c81-42f3-882d-99e213cc14ce))
  (pad "63" smd roundrect (at -3.25 -5.675) (size 0.3 1.55) (layers "F.Cu" "F.Paste" "F.Mask") (roundrect_rratio 0.25) (tstamp a63966dd-ea06-4821-bee7-762fcb676745))
  (pad "64" smd roundrect (at -3.75 -5.675) (size 0.3 1.55) (layers "F.Cu" "F.Paste" "F.Mask") (roundrect_rratio 0.25) (tstamp dfd33b4e-7218-4222-b500-40240637747b))
  (pad "65" smd rect (at 0 0) (size 4 4) (layers "F.Cu" "F.Mask") (tstamp e82928fd-e12f-4e1d-92a7-7c0c18a88289))
  (model "${KICADLIB}/model/QFP/TQFP50P1000X1000-65.step"
    (offset (xyz 0 0 0))
    (scale (xyz 1 1 1))
    (rotate (xyz 0 0 0))
  )
)
