(footprint "PinHeader_1x18_P1.27mm_Vertical" (version 20211014) (generator pcbnew)
  (layer "F.Cu")
  (tedit 6116C83A)
  (descr "Through hole straight pin header, 1x18, 1.27mm pitch, single row")
  (tags "Through hole pin header THT 1x18 1.27mm single row")
  (attr through_hole)
  (fp_text reference "REF**" (at 0 -1.695) (layer "F.SilkS")
    (effects (font (size 1 1) (thickness 0.15)))
    (tstamp 90fa19a8-2538-4f58-a604-d2ce7f97bb47)
  )
  (fp_text value "PinHeader_1x18_P1.27mm_Vertical" (at 0 23.285) (layer "F.Fab") hide
    (effects (font (size 1 1) (thickness 0.15)))
    (tstamp 445e016f-e2c0-43c7-8079-408cd7910a6b)
  )
  (fp_text user "${REFERENCE}" (at 0 10.795 90) (layer "F.Fab")
    (effects (font (size 1 1) (thickness 0.15)))
    (tstamp 996448fa-7a78-475a-aef6-da89bfea20f5)
  )
  (fp_line (start -1.11 0) (end -1.11 -0.76) (layer "F.SilkS") (width 0.12) (tstamp 10bc9dd8-f0f5-4930-aaae-fc67ecd653aa))
  (fp_line (start 1.11 0.76) (end 1.11 22.285) (layer "F.SilkS") (width 0.12) (tstamp 2469c379-09cf-41ba-8e21-984ce381132c))
  (fp_line (start 0.563471 0.76) (end 1.11 0.76) (layer "F.SilkS") (width 0.12) (tstamp 2a48451e-c6e3-44e5-af6e-7aa492000796))
  (fp_line (start 0.30753 22.285) (end 1.11 22.285) (layer "F.SilkS") (width 0.12) (tstamp 3c11d23f-ef7b-444a-96f9-dbaa1a858234))
  (fp_line (start -1.11 22.285) (end -0.30753 22.285) (layer "F.SilkS") (width 0.12) (tstamp 8d02b5be-08eb-4a1c-8180-a83f46517180))
  (fp_line (start -1.11 -0.76) (end 0 -0.76) (layer "F.SilkS") (width 0.12) (tstamp 915a2c8f-1d75-4c6a-be05-473e55b57a5f))
  (fp_line (start -1.11 0.76) (end -0.563471 0.76) (layer "F.SilkS") (width 0.12) (tstamp d3f4ede4-20cb-44d9-af17-dd124fc19555))
  (fp_line (start -1.11 0.76) (end -1.11 22.285) (layer "F.SilkS") (width 0.12) (tstamp f8170da0-65ab-4dca-9279-8687333aaade))
  (fp_line (start -1.55 -1.15) (end -1.55 22.75) (layer "F.CrtYd") (width 0.05) (tstamp 002d2029-3e45-4664-ac16-80daf722f099))
  (fp_line (start 1.55 -1.15) (end -1.55 -1.15) (layer "F.CrtYd") (width 0.05) (tstamp 08c55848-3339-4373-a34a-07c481b004b9))
  (fp_line (start -1.55 22.75) (end 1.55 22.75) (layer "F.CrtYd") (width 0.05) (tstamp c7e0a8e7-2f74-4e49-8d06-ae756edf4357))
  (fp_line (start 1.55 22.75) (end 1.55 -1.15) (layer "F.CrtYd") (width 0.05) (tstamp e33f7a39-d9f4-4fff-93a9-ee3ed98ed40f))
  (fp_line (start -1.05 22.225) (end -1.05 -0.11) (layer "F.Fab") (width 0.1) (tstamp 29bb0d19-2b88-43eb-955a-d1098f0642f1))
  (fp_line (start 1.05 22.225) (end -1.05 22.225) (layer "F.Fab") (width 0.1) (tstamp bb66e07a-e90c-42f6-a05f-a8359f3b8e64))
  (fp_line (start -0.525 -0.635) (end 1.05 -0.635) (layer "F.Fab") (width 0.1) (tstamp c06ee758-fd9a-4dc5-8906-adb4daec0360))
  (fp_line (start -1.05 -0.11) (end -0.525 -0.635) (layer "F.Fab") (width 0.1) (tstamp cece4cbf-06f0-4374-b395-a3bf2a869569))
  (fp_line (start 1.05 -0.635) (end 1.05 22.225) (layer "F.Fab") (width 0.1) (tstamp e50530a1-eafd-42a2-abd7-a947fca9f5e1))
  (pad "1" thru_hole rect (at 0 0) (size 1 1) (drill 0.65) (layers *.Cu *.Mask) (tstamp fce35c36-384b-49f3-a38f-984dc4eb858f))
  (pad "2" thru_hole oval (at 0 1.27) (size 1 1) (drill 0.65) (layers *.Cu *.Mask) (tstamp d9b8a6c3-d497-4c09-99a9-f027dc3d01c8))
  (pad "3" thru_hole oval (at 0 2.54) (size 1 1) (drill 0.65) (layers *.Cu *.Mask) (tstamp 930cfb03-3fab-4f1e-aa3f-ab1834bafe2b))
  (pad "4" thru_hole oval (at 0 3.81) (size 1 1) (drill 0.65) (layers *.Cu *.Mask) (tstamp 0ca4cd4c-ceb5-43f7-b7c2-65e5d35d323f))
  (pad "5" thru_hole oval (at 0 5.08) (size 1 1) (drill 0.65) (layers *.Cu *.Mask) (tstamp 1df54931-bc19-4be8-9f00-5598105fb9f6))
  (pad "6" thru_hole oval (at 0 6.35) (size 1 1) (drill 0.65) (layers *.Cu *.Mask) (tstamp 87044d6c-4a90-46a3-bb02-0b6c15315fb3))
  (pad "7" thru_hole oval (at 0 7.62) (size 1 1) (drill 0.65) (layers *.Cu *.Mask) (tstamp 78218785-56af-4b44-869f-4125e069e427))
  (pad "8" thru_hole oval (at 0 8.89) (size 1 1) (drill 0.65) (layers *.Cu *.Mask) (tstamp 09c4704b-7375-4841-8861-1bd09571f0ab))
  (pad "9" thru_hole oval (at 0 10.16) (size 1 1) (drill 0.65) (layers *.Cu *.Mask) (tstamp 4dc87dd8-76b2-4360-b237-16c91fdf1917))
  (pad "10" thru_hole oval (at 0 11.43) (size 1 1) (drill 0.65) (layers *.Cu *.Mask) (tstamp f065e500-a073-408c-84a7-e177065aacd5))
  (pad "11" thru_hole oval (at 0 12.7) (size 1 1) (drill 0.65) (layers *.Cu *.Mask) (tstamp 72d16760-7a13-477b-8bac-d7de48afd21c))
  (pad "12" thru_hole oval (at 0 13.97) (size 1 1) (drill 0.65) (layers *.Cu *.Mask) (tstamp e8c72c18-d9c8-4136-b5bf-02969f25754d))
  (pad "13" thru_hole oval (at 0 15.24) (size 1 1) (drill 0.65) (layers *.Cu *.Mask) (tstamp 02c82447-ac5e-4547-a29a-a97ff14041e7))
  (pad "14" thru_hole oval (at 0 16.51) (size 1 1) (drill 0.65) (layers *.Cu *.Mask) (tstamp 4149b991-ea24-4f6b-b69b-a426c2ae2b00))
  (pad "15" thru_hole oval (at 0 17.78) (size 1 1) (drill 0.65) (layers *.Cu *.Mask) (tstamp 84fd4787-82d7-4f0b-838b-77be9cb10d0e))
  (pad "16" thru_hole oval (at 0 19.05) (size 1 1) (drill 0.65) (layers *.Cu *.Mask) (tstamp d42d9b33-0793-425e-840f-044f8945ccda))
  (pad "17" thru_hole oval (at 0 20.32) (size 1 1) (drill 0.65) (layers *.Cu *.Mask) (tstamp d625285a-3b55-4485-943f-a78c237ee833))
  (pad "18" thru_hole oval (at 0 21.59) (size 1 1) (drill 0.65) (layers *.Cu *.Mask) (tstamp 65ddc3bb-4f99-49b3-a206-0b80746cb39b))
  (model "${KICADLIB}/model/connector/PinHeader_1x18_P1.27mm_Vertical.step"
    (offset (xyz 0 0 0))
    (scale (xyz 1 1 1))
    (rotate (xyz 0 0 0))
  )
)
