(footprint "QFN40P180X260X55-16" (version 20211014) (generator pcbnew)
  (layer "F.Cu")
  (tedit 5EBAFC65)
  (attr smd)
  (fp_text reference "REF**" (at 0 -2.2) (layer "F.SilkS")
    (effects (font (size 1 1) (thickness 0.15)))
    (tstamp 5208d924-07b8-4d75-af5e-a3d15279092b)
  )
  (fp_text value "QFN40P180X260X55-16" (at 0 -3.5) (layer "F.Fab") hide
    (effects (font (size 1 1) (thickness 0.15)))
    (tstamp 4362a7a8-b2c9-4f5a-8cba-a8ce5cd38b99)
  )
  (fp_text user "^" (at -1.9 -0.6 270 unlocked) (layer "F.SilkS")
    (effects (font (size 1 1) (thickness 0.15)))
    (tstamp 0e82cf8e-9460-40d4-a170-9dd274da5886)
  )
  (fp_text user "${REFERENCE}" (at 0 0 90 unlocked) (layer "F.Fab")
    (effects (font (size 0.6 0.6) (thickness 0.1)))
    (tstamp 19e311fa-a525-4bb0-a54f-ec7a19302522)
  )
  (fp_line (start -0.9 -1.3) (end -0.9 -0.8) (layer "F.SilkS") (width 0.1) (tstamp 12f616fb-2489-4124-8af4-73d3d891fb04))
  (fp_line (start 0.8 1.3) (end 0.9 1.3) (layer "F.SilkS") (width 0.1) (tstamp 2494c924-806b-4a31-be52-530954e81f7c))
  (fp_line (start -0.9 1.3) (end -0.8 1.3) (layer "F.SilkS") (width 0.1) (tstamp 4e92a5c4-b07d-4594-af63-b93fdf75f54e))
  (fp_line (start -0.9 -1.3) (end -0.8 -1.3) (layer "F.SilkS") (width 0.1) (tstamp 55dc071c-7fcb-4bb2-bedc-9593ac2caf37))
  (fp_line (start 0.9 -1.3) (end 0.9 -0.8) (layer "F.SilkS") (width 0.1) (tstamp 8527a0de-cb5a-4311-b66c-c9cf1e559cb4))
  (fp_line (start -0.9 0.8) (end -0.9 1.3) (layer "F.SilkS") (width 0.1) (tstamp ea64846d-70eb-4ffd-a484-7a588cb4b554))
  (fp_line (start 0.9 -1.3) (end 0.8 -1.3) (layer "F.SilkS") (width 0.1) (tstamp f80fb87c-484c-4643-a1c6-5ec55b0eca13))
  (fp_line (start 0.9 1.3) (end 0.9 0.8) (layer "F.SilkS") (width 0.1) (tstamp ffbbf60b-87d5-40d4-96e1-8db9239e19eb))
  (fp_rect (start -1.3 1.7) (end 1.3 -1.7) (layer "F.CrtYd") (width 0.05) (fill none) (tstamp 80d25609-0f5b-4a70-bc1e-26c7c5eb8b61))
  (fp_line (start -0.9 -1) (end -0.6 -1.3) (layer "F.Fab") (width 0.1) (tstamp 49e63c99-6b18-4eed-ba97-6e8543155bd9))
  (fp_line (start 0.9 -1.3) (end 0.9 1.3) (layer "F.Fab") (width 0.1) (tstamp 4f492bed-f565-4ed2-9d9e-0e56dc086917))
  (fp_line (start -0.6 -1.3) (end 0.9 -1.3) (layer "F.Fab") (width 0.1) (tstamp 7a2d0057-8822-4324-afa3-c923a07bab33))
  (fp_line (start 0.9 1.3) (end -0.9 1.3) (layer "F.Fab") (width 0.1) (tstamp a48bf065-da67-49a7-8307-1666eda7b6b3))
  (fp_line (start -0.9 1.3) (end -0.9 -1) (layer "F.Fab") (width 0.1) (tstamp f62d735f-4511-414d-9812-e1d6f7bbe205))
  (pad "1" smd rect (at -0.79 -0.6) (size 0.8 0.225) (layers "F.Cu" "F.Paste" "F.Mask") (tstamp bf11c09a-9563-462a-a7b5-b112802d881e))
  (pad "2" smd rect (at -0.84 -0.2) (size 0.7 0.225) (layers "F.Cu" "F.Paste" "F.Mask") (tstamp f0817ece-ba20-4870-9e56-d53d5fb8194a))
  (pad "3" smd rect (at -0.84 0.2) (size 0.7 0.225) (layers "F.Cu" "F.Paste" "F.Mask") (tstamp 2c1837d4-b7d8-46b4-9b43-d9e043c9b7bb))
  (pad "4" smd rect (at -0.84 0.6) (size 0.7 0.225) (layers "F.Cu" "F.Paste" "F.Mask") (tstamp 32b0892a-0a14-4c4a-b711-50cbfff4c2a8))
  (pad "5" smd rect (at -0.6 1.24 90) (size 0.7 0.225) (layers "F.Cu" "F.Paste" "F.Mask") (tstamp 2e93f818-f404-42b1-95e8-0182a3cd9324))
  (pad "6" smd rect (at -0.2 1.24 90) (size 0.7 0.225) (layers "F.Cu" "F.Paste" "F.Mask") (tstamp cc8c22bc-9f76-42b5-a928-535c4a9db844))
  (pad "7" smd rect (at 0.2 1.24 90) (size 0.7 0.225) (layers "F.Cu" "F.Paste" "F.Mask") (tstamp cf111bd4-0546-4bdb-8565-4947e3db7cbb))
  (pad "8" smd rect (at 0.6 1.24 90) (size 0.7 0.225) (layers "F.Cu" "F.Paste" "F.Mask") (tstamp a688a66d-056e-41dc-96cb-ba3959e0bab2))
  (pad "9" smd rect (at 0.83 0.6) (size 0.7 0.225) (layers "F.Cu" "F.Paste" "F.Mask") (tstamp c0413906-0a97-402d-a1f5-c42ba85ae515))
  (pad "10" smd rect (at 0.83 0.2) (size 0.7 0.225) (layers "F.Cu" "F.Paste" "F.Mask") (tstamp 46cf2569-5fef-4e77-b5fb-4e8efcf518e5))
  (pad "11" smd rect (at 0.83 -0.2) (size 0.7 0.225) (layers "F.Cu" "F.Paste" "F.Mask") (tstamp 7bd1e926-14fd-455b-b2a5-184f7c1ae6db))
  (pad "12" smd rect (at 0.83 -0.6) (size 0.7 0.225) (layers "F.Cu" "F.Paste" "F.Mask") (tstamp e2210efd-589a-4702-96b3-681255ec1282))
  (pad "13" smd rect (at 0.6 -1.24 90) (size 0.7 0.225) (layers "F.Cu" "F.Paste" "F.Mask") (tstamp 4fac7f1d-4672-4c08-89e3-4fcc2d019e5f))
  (pad "14" smd rect (at 0.2 -1.24 90) (size 0.7 0.225) (layers "F.Cu" "F.Paste" "F.Mask") (tstamp 3b75b87e-f741-4ac5-91ff-78b05e06fa68))
  (pad "15" smd rect (at -0.2 -1.24 90) (size 0.7 0.225) (layers "F.Cu" "F.Paste" "F.Mask") (tstamp 98416d80-4ede-4aad-9185-97bbcbefcb5a))
  (pad "16" smd rect (at -0.6 -1.24 90) (size 0.7 0.225) (layers "F.Cu" "F.Paste" "F.Mask") (tstamp 67424120-de78-4e3a-bcc8-584005f3da9f))
  (model "${KICADLIB}/model/QFN/QFN40P180X260X55-16.step"
    (offset (xyz 0 0 0))
    (scale (xyz 1 1 1))
    (rotate (xyz 0 0 0))
  )
)
