ISO-10303-21;
HEADER;
FILE_DESCRIPTION (( 'STEP AP214' ),
    '1' );
FILE_NAME ('mill-max-0906-0-15-20-76-14-11-0.step',
    '2020-05-11T16:18:55',
    ( '' ),
    ( '' ),
    'SwSTEP 2.0',
    'SolidWorks 2019',
    '' );
FILE_SCHEMA (( 'AUTOMOTIVE_DESIGN' ));
ENDSEC;

DATA;
#1 = EDGE_LOOP ( 'NONE', ( #481, #48, #264, #661 ) ) ;
#2 = DIRECTION ( 'NONE',  ( -0.0000000000000000000, 0.0000000000000000000, 1.000000000000000000 ) ) ;
#3 = ORIENTED_EDGE ( 'NONE', *, *, #259, .T. ) ;
#4 = DIRECTION ( 'NONE',  ( -1.000000000000000000, -0.0000000000000000000, -0.0000000000000000000 ) ) ;
#5 = EDGE_CURVE ( 'NONE', #616, #663, #639, .T. ) ;
#6 = ADVANCED_FACE ( 'NONE', ( #214 ), #632, .T. ) ;
#7 = ORIENTED_EDGE ( 'NONE', *, *, #397, .T. ) ;
#8 = FACE_OUTER_BOUND ( 'NONE', #204, .T. ) ;
#9 = ORIENTED_EDGE ( 'NONE', *, *, #249, .T. ) ;
#10 = DIRECTION ( 'NONE',  ( 0.0000000000000000000, -1.000000000000000000, 0.0000000000000000000 ) ) ;
#11 = AXIS2_PLACEMENT_3D ( 'NONE', #123, #505, #172 ) ;
#12 = ORIENTED_EDGE ( 'NONE', *, *, #128, .T. ) ;
#13 = EDGE_CURVE ( 'NONE', #337, #508, #501, .T. ) ;
#14 = DIRECTION ( 'NONE',  ( -0.0000000000000000000, 0.0000000000000000000, 1.000000000000000000 ) ) ;
#15 = CARTESIAN_POINT ( 'NONE',  ( 0.1130000000000009330, 0.0000000000000000000, 0.03200000000000000067 ) ) ;
#16 = EDGE_LOOP ( 'NONE', ( #600, #555 ) ) ;
#17 = ADVANCED_FACE ( 'NONE', ( #409, #472 ), #24, .F. ) ;
#18 = DIRECTION ( 'NONE',  ( 0.0000000000000000000, 0.0000000000000000000, 1.000000000000000000 ) ) ;
#19 = CARTESIAN_POINT ( 'NONE',  ( 0.06600000000000109945, 0.0000000000000000000, 0.0000000000000000000 ) ) ;
#20 = ORIENTED_EDGE ( 'NONE', *, *, #62, .T. ) ;
#21 = DIRECTION ( 'NONE',  ( -1.000000000000000000, -0.0000000000000000000, -0.0000000000000000000 ) ) ;
#22 = EDGE_CURVE ( 'NONE', #162, #617, #478, .T. ) ;
#23 = AXIS2_PLACEMENT_3D ( 'NONE', #507, #688, #180 ) ;
#24 = PLANE ( 'NONE',  #315 ) ;
#25 = SURFACE_STYLE_USAGE ( .BOTH. , #558 ) ;
#26 = DIRECTION ( 'NONE',  ( 0.0000000000000000000, 0.0000000000000000000, 1.000000000000000000 ) ) ;
#27 = SPHERICAL_SURFACE ( 'NONE', #30, 0.02089999999999999844 ) ;
#28 = CARTESIAN_POINT ( 'NONE',  ( 0.0000000000000000000, 2.559511810217967774E-18, -0.02089999999999999844 ) ) ;
#29 = PLANE ( 'NONE',  #599 ) ;
#30 = AXIS2_PLACEMENT_3D ( 'NONE', #414, #574, #352 ) ;
#31 = LINE ( 'NONE', #404, #467 ) ;
#32 = CIRCLE ( 'NONE', #428, 0.008500000000000193165 ) ;
#33 = DIRECTION ( 'NONE',  ( 0.0000000000000000000, 0.0000000000000000000, 1.000000000000000000 ) ) ;
#34 = CARTESIAN_POINT ( 'NONE',  ( 0.1130000000000009330, 3.918869757271530830E-18, -0.03200000000000000067 ) ) ;
#35 = EDGE_CURVE ( 'NONE', #508, #137, #355, .T. ) ;
#36 = CARTESIAN_POINT ( 'NONE',  ( 0.1241961524226974228, 0.0000000000000000000, 0.0000000000000000000 ) ) ;
#37 = EDGE_CURVE ( 'NONE', #711, #155, #294, .T. ) ;
#38 = ORIENTED_EDGE ( 'NONE', *, *, #22, .T. ) ;
#39 = CARTESIAN_POINT ( 'NONE',  ( 0.008500000000000193165, -0.008500000000000194900, -1.040949779275273921E-18 ) ) ;
#40 = VERTEX_POINT ( 'NONE', #636 ) ;
#41 = CARTESIAN_POINT ( 'NONE',  ( 0.0000000000000000000, 1.040949779275274306E-18, -0.008500000000000196634 ) ) ;
#42 = AXIS2_PLACEMENT_3D ( 'NONE', #664, #370, #591 ) ;
#43 = DIRECTION ( 'NONE',  ( 0.0000000000000000000, 0.0000000000000000000, 1.000000000000000000 ) ) ;
#44 = DIMENSIONAL_EXPONENTS ( 1.000000000000000000, 0.0000000000000000000, 0.0000000000000000000, 0.0000000000000000000, 0.0000000000000000000, 0.0000000000000000000, 0.0000000000000000000 ) ;
#45 = EDGE_LOOP ( 'NONE', ( #586, #273, #147, #197 ) ) ;
#46 = SURFACE_STYLE_USAGE ( .BOTH. , #54 ) ;
#47 = ORIENTED_EDGE ( 'NONE', *, *, #694, .F. ) ;
#48 = ORIENTED_EDGE ( 'NONE', *, *, #179, .T. ) ;
#49 = DIRECTION ( 'NONE',  ( 0.0000000000000000000, -1.224646799147353207E-16, 1.000000000000000000 ) ) ;
#50 = CIRCLE ( 'NONE', #134, 0.02900000000000000147 ) ;
#51 = CARTESIAN_POINT ( 'NONE',  ( 0.0000000000000000000, 0.0000000000000000000, 0.03049999999999999586 ) ) ;
#52 = COLOUR_RGB ( '',1.000000000000000000, 0.8078431372549019773, 0.4980392156862745168 ) ;
#53 = EDGE_LOOP ( 'NONE', ( #210, #63, #141, #443 ) ) ;
#54 = SURFACE_SIDE_STYLE ('',( #489 ) ) ;
#55 = EDGE_CURVE ( 'NONE', #69, #619, #687, .T. ) ;
#56 = EDGE_LOOP ( 'NONE', ( #283, #139 ) ) ;
#57 = CARTESIAN_POINT ( 'NONE',  ( 0.08500000000000113021, 3.735172737399426715E-18, -0.03049999999999999586 ) ) ;
#58 = EDGE_CURVE ( 'NONE', #604, #589, #31, .T. ) ;
#59 = ORIENTED_EDGE ( 'NONE', *, *, #203, .F. ) ;
#60 = PLANE ( 'NONE',  #219 ) ;
#61 = ORIENTED_EDGE ( 'NONE', *, *, #645, .F. ) ;
#62 = EDGE_CURVE ( 'NONE', #135, #216, #340, .T. ) ;
#63 = ORIENTED_EDGE ( 'NONE', *, *, #13, .T. ) ;
#64 = FACE_OUTER_BOUND ( 'NONE', #550, .T. ) ;
#65 = VECTOR ( 'NONE', #545, 39.37007874015748143 ) ;
#66 = AXIS2_PLACEMENT_3D ( 'NONE', #650, #380, #2 ) ;
#67 = ORIENTED_EDGE ( 'NONE', *, *, #131, .F. ) ;
#68 = DIRECTION ( 'NONE',  ( -0.0000000000000000000, 0.0000000000000000000, -1.000000000000000000 ) ) ;
#69 = VERTEX_POINT ( 'NONE', #74 ) ;
#70 = CARTESIAN_POINT ( 'NONE',  ( 0.008500000000000193165, 1.040949779275274114E-18, -0.008500000000000193165 ) ) ;
#71 = SPHERICAL_SURFACE ( 'NONE', #23, 0.008500000000000194900 ) ;
#72 = AXIS2_PLACEMENT_3D ( 'NONE', #181, #360, #127 ) ;
#73 = AXIS2_PLACEMENT_3D ( 'NONE', #618, #68, #124 ) ;
#74 = CARTESIAN_POINT ( 'NONE',  ( 0.1851000000000010970, 2.559511810217967774E-18, -0.02089999999999999844 ) ) ;
#75 =( NAMED_UNIT ( * ) PLANE_ANGLE_UNIT ( ) SI_UNIT ( $, .RADIAN. ) );
#76 = EDGE_CURVE ( 'NONE', #536, #527, #229, .T. ) ;
#77 = DIRECTION ( 'NONE',  ( -0.0000000000000000000, 1.000000000000000000, 1.224646799147353207E-16 ) ) ;
#78 = APPLICATION_PROTOCOL_DEFINITION ( 'draft international standard', 'automotive_design', 1998, #657 ) ;
#79 = CARTESIAN_POINT ( 'NONE',  ( 0.008500000000000194900, -1.067128122525102820E-18, 0.0000000000000000000 ) ) ;
#80 = DIRECTION ( 'NONE',  ( 0.0000000000000000000, 0.0000000000000000000, -1.000000000000000000 ) ) ;
#81 = AXIS2_PLACEMENT_3D ( 'NONE', #456, #466, #460 ) ;
#82 = ADVANCED_FACE ( 'NONE', ( #178 ), #27, .T. ) ;
#83 = AXIS2_PLACEMENT_3D ( 'NONE', #665, #597, #268 ) ;
#84 = AXIS2_PLACEMENT_3D ( 'NONE', #693, #421, #138 ) ;
#85 =( GEOMETRIC_REPRESENTATION_CONTEXT ( 3 ) GLOBAL_UNCERTAINTY_ASSIGNED_CONTEXT ( ( #220 ) ) GLOBAL_UNIT_ASSIGNED_CONTEXT ( ( #587, #75, #129 ) ) REPRESENTATION_CONTEXT ( 'NONE', 'WORKASPACE' ) );
#86 = ORIENTED_EDGE ( 'NONE', *, *, #517, .T. ) ;
#87 = ORIENTED_EDGE ( 'NONE', *, *, #277, .T. ) ;
#88 = PRESENTATION_STYLE_ASSIGNMENT (( #46 ) ) ;
#89 = DIRECTION ( 'NONE',  ( -0.0000000000000000000, 0.0000000000000000000, 1.000000000000000000 ) ) ;
#90 = ORIENTED_EDGE ( 'NONE', *, *, #58, .F. ) ;
#91 = AXIS2_PLACEMENT_3D ( 'NONE', #491, #96, #705 ) ;
#92 = CARTESIAN_POINT ( 'NONE',  ( 0.1851000000000010970, -0.02089999999999999844, -2.559511810217967774E-18 ) ) ;
#93 = CARTESIAN_POINT ( 'NONE',  ( 0.1670000000000010920, 3.339360669782334632E-18, -0.02726794919243105686 ) ) ;
#94 = ORIENTED_EDGE ( 'NONE', *, *, #259, .F. ) ;
#95 =( LENGTH_UNIT ( ) NAMED_UNIT ( * ) SI_UNIT ( $, .METRE. ) );
#96 = DIRECTION ( 'NONE',  ( -1.000000000000000000, -0.0000000000000000000, -0.0000000000000000000 ) ) ;
#97 = VERTEX_POINT ( 'NONE', #245 ) ;
#98 = CYLINDRICAL_SURFACE ( 'NONE', #143, 0.03599999999999999728 ) ;
#99 = ORIENTED_EDGE ( 'NONE', *, *, #5, .T. ) ;
#100 = DIRECTION ( 'NONE',  ( -1.000000000000000000, -0.0000000000000000000, -0.0000000000000000000 ) ) ;
#101 = ADVANCED_FACE ( 'NONE', ( #300 ), #427, .F. ) ;
#102 = ORIENTED_EDGE ( 'NONE', *, *, #569, .F. ) ;
#103 = ADVANCED_FACE ( 'NONE', ( #122 ), #457, .T. ) ;
#104 = ORIENTED_EDGE ( 'NONE', *, *, #679, .T. ) ;
#105 = CIRCLE ( 'NONE', #341, 0.03200000000000000067 ) ;
#106 = CYLINDRICAL_SURFACE ( 'NONE', #316, 0.008500000000000196634 ) ;
#107 = AXIS2_PLACEMENT_3D ( 'NONE', #308, #526, #303 ) ;
#108 = CARTESIAN_POINT ( 'NONE',  ( 0.1851000000000010970, 0.0000000000000000000, 0.0000000000000000000 ) ) ;
#109 = CARTESIAN_POINT ( 'NONE',  ( 0.1851000000000010970, 0.0000000000000000000, 0.0000000000000000000 ) ) ;
#110 = VERTEX_POINT ( 'NONE', #485 ) ;
#111 = CARTESIAN_POINT ( 'NONE',  ( 0.0000000000000000000, 0.0000000000000000000, 0.0000000000000000000 ) ) ;
#112 = ORIENTED_EDGE ( 'NONE', *, *, #35, .T. ) ;
#113 =( NAMED_UNIT ( * ) SI_UNIT ( $, .STERADIAN. ) SOLID_ANGLE_UNIT ( ) );
#114 = DIRECTION ( 'NONE',  ( -1.000000000000000000, -0.0000000000000000000, -0.0000000000000000000 ) ) ;
#115 = ORIENTED_EDGE ( 'NONE', *, *, #336, .F. ) ;
#116 = DIRECTION ( 'NONE',  ( -1.000000000000000000, -0.0000000000000000000, -0.0000000000000000000 ) ) ;
#117 = DIRECTION ( 'NONE',  ( 0.0000000000000000000, 0.0000000000000000000, 1.000000000000000000 ) ) ;
#118 = CIRCLE ( 'NONE', #83, 0.02089999999999999844 ) ;
#119 = CIRCLE ( 'NONE', #201, 0.02089999999999999844 ) ;
#120 = ORIENTED_EDGE ( 'NONE', *, *, #126, .T. ) ;
#121 = DIRECTION ( 'NONE',  ( -1.000000000000000000, -0.0000000000000000000, -0.0000000000000000000 ) ) ;
#122 = FACE_OUTER_BOUND ( 'NONE', #247, .T. ) ;
#123 = CARTESIAN_POINT ( 'NONE',  ( 0.1851000000000010970, 0.0000000000000000000, 0.0000000000000000000 ) ) ;
#124 = DIRECTION ( 'NONE',  ( 0.0000000000000000000, 1.000000000000000000, 0.0000000000000000000 ) ) ;
#125 = DIRECTION ( 'NONE',  ( 0.0000000000000000000, 0.0000000000000000000, 1.000000000000000000 ) ) ;
#126 = EDGE_CURVE ( 'NONE', #287, #227, #535, .T. ) ;
#127 = DIRECTION ( 'NONE',  ( 0.0000000000000000000, 0.0000000000000000000, 1.000000000000000000 ) ) ;
#128 = EDGE_CURVE ( 'NONE', #135, #110, #272, .T. ) ;
#129 =( NAMED_UNIT ( * ) SI_UNIT ( $, .STERADIAN. ) SOLID_ANGLE_UNIT ( ) );
#130 = FACE_BOUND ( 'NONE', #530, .T. ) ;
#131 = EDGE_CURVE ( 'NONE', #604, #275, #418, .T. ) ;
#132 = DIRECTION ( 'NONE',  ( -1.000000000000000000, -0.0000000000000000000, -0.0000000000000000000 ) ) ;
#133 = CARTESIAN_POINT ( 'NONE',  ( 0.1851000000000010970, 0.0000000000000000000, 0.0000000000000000000 ) ) ;
#134 = AXIS2_PLACEMENT_3D ( 'NONE', #327, #426, #391 ) ;
#135 = VERTEX_POINT ( 'NONE', #442 ) ;
#136 = AXIS2_PLACEMENT_3D ( 'NONE', #620, #614, #671 ) ;
#137 = VERTEX_POINT ( 'NONE', #373 ) ;
#138 = DIRECTION ( 'NONE',  ( 0.0000000000000000000, 0.0000000000000000000, 1.000000000000000000 ) ) ;
#139 = ORIENTED_EDGE ( 'NONE', *, *, #492, .F. ) ;
#140 = FACE_OUTER_BOUND ( 'NONE', #16, .T. ) ;
#141 = ORIENTED_EDGE ( 'NONE', *, *, #444, .T. ) ;
#142 = AXIS2_PLACEMENT_3D ( 'NONE', #408, #276, #218 ) ;
#143 = AXIS2_PLACEMENT_3D ( 'NONE', #543, #655, #554 ) ;
#144 = PRODUCT_DEFINITION_FORMATION_WITH_SPECIFIED_SOURCE ( 'ANY', '', #400, .NOT_KNOWN. ) ;
#145 = ORIENTED_EDGE ( 'NONE', *, *, #194, .F. ) ;
#146 = FILL_AREA_STYLE_COLOUR ( '', #52 ) ;
#147 = ORIENTED_EDGE ( 'NONE', *, *, #192, .T. ) ;
#148 = EDGE_CURVE ( 'NONE', #69, #616, #118, .T. ) ;
#149 = EDGE_CURVE ( 'NONE', #40, #275, #551, .T. ) ;
#150 = DIMENSIONAL_EXPONENTS ( 1.000000000000000000, 0.0000000000000000000, 0.0000000000000000000, 0.0000000000000000000, 0.0000000000000000000, 0.0000000000000000000, 0.0000000000000000000 ) ;
#151 = ORIENTED_EDGE ( 'NONE', *, *, #438, .T. ) ;
#152 =( CONVERSION_BASED_UNIT ( 'INCH', #423 ) LENGTH_UNIT ( ) NAMED_UNIT ( #374 ) );
#153 = VERTEX_POINT ( 'NONE', #57 ) ;
#154 = DIRECTION ( 'NONE',  ( -1.000000000000000000, -0.0000000000000000000, -0.0000000000000000000 ) ) ;
#155 = VERTEX_POINT ( 'NONE', #658 ) ;
#156 = EDGE_CURVE ( 'NONE', #565, #589, #633, .T. ) ;
#157 = PRESENTATION_STYLE_ASSIGNMENT (( #25 ) ) ;
#158 = ORIENTED_EDGE ( 'NONE', *, *, #549, .F. ) ;
#159 = AXIS2_PLACEMENT_3D ( 'NONE', #463, #132, #125 ) ;
#160 = CARTESIAN_POINT ( 'NONE',  ( 0.1130000000000009330, 0.0000000000000000000, 0.0000000000000000000 ) ) ;
#161 = CIRCLE ( 'NONE', #563, 0.003000000000000000496 ) ;
#162 = VERTEX_POINT ( 'NONE', #335 ) ;
#163 =( LENGTH_UNIT ( ) NAMED_UNIT ( * ) SI_UNIT ( $, .METRE. ) );
#164 = ORIENTED_EDGE ( 'NONE', *, *, #333, .T. ) ;
#165 = LINE ( 'NONE', #351, #546 ) ;
#166 = ORIENTED_EDGE ( 'NONE', *, *, #237, .T. ) ;
#167 = CARTESIAN_POINT ( 'NONE',  ( 0.06900000000000110212, 0.0000000000000000000, 0.01150000000000020103 ) ) ;
#168 = DIRECTION ( 'NONE',  ( -1.000000000000000000, -0.0000000000000000000, -0.0000000000000000000 ) ) ;
#169 = ADVANCED_FACE ( 'NONE', ( #487 ), #602, .T. ) ;
#170 = UNCERTAINTY_MEASURE_WITH_UNIT (LENGTH_MEASURE( 1.000000000000000082E-05 ), #342, 'distance_accuracy_value', 'NONE');
#171 = ORIENTED_EDGE ( 'NONE', *, *, #177, .F. ) ;
#172 = DIRECTION ( 'NONE',  ( 0.0000000000000000000, 0.0000000000000000000, 1.000000000000000000 ) ) ;
#173 = DIRECTION ( 'NONE',  ( -1.000000000000000000, -0.0000000000000000000, -0.0000000000000000000 ) ) ;
#174 = CIRCLE ( 'NONE', #411, 0.02726794919243105686 ) ;
#175 = COLOUR_RGB ( '',1.000000000000000000, 0.8078431372549019773, 0.4980392156862745168 ) ;
#176 = DIRECTION ( 'NONE',  ( 0.0000000000000000000, 0.0000000000000000000, 1.000000000000000000 ) ) ;
#177 = EDGE_CURVE ( 'NONE', #499, #390, #105, .T. ) ;
#178 = FACE_OUTER_BOUND ( 'NONE', #425, .T. ) ;
#179 = EDGE_CURVE ( 'NONE', #275, #604, #50, .T. ) ;
#180 = DIRECTION ( 'NONE',  ( 0.0000000000000000000, 1.000000000000000000, 0.0000000000000000000 ) ) ;
#181 = CARTESIAN_POINT ( 'NONE',  ( 0.0000000000000000000, 0.0000000000000000000, 0.0000000000000000000 ) ) ;
#182 = PRODUCT_RELATED_PRODUCT_CATEGORY ( 'part', '', ( #400 ) ) ;
#183 = PRODUCT_CONTEXT ( 'NONE', #353, 'mechanical' ) ;
#184 = VECTOR ( 'NONE', #236, 39.37007874015748143 ) ;
#185 = CIRCLE ( 'NONE', #523, 0.03599999999999999728 ) ;
#186 = CIRCLE ( 'NONE', #642, 0.02090000000000000885 ) ;
#187 = DIRECTION ( 'NONE',  ( 0.0000000000000000000, 0.0000000000000000000, 1.000000000000000000 ) ) ;
#188 = CARTESIAN_POINT ( 'NONE',  ( 0.06600000000000109945, 1.408343819019480803E-18, -0.01150000000000020103 ) ) ;
#189 = VECTOR ( 'NONE', #410, 39.37007874015748143 ) ;
#190 = ORIENTED_EDGE ( 'NONE', *, *, #492, .T. ) ;
#191 = STYLED_ITEM ( 'NONE', ( #88 ), #552 ) ;
#192 = EDGE_CURVE ( 'NONE', #654, #527, #662, .T. ) ;
#193 = EDGE_LOOP ( 'NONE', ( #506, #493 ) ) ;
#194 = EDGE_CURVE ( 'NONE', #216, #153, #606, .T. ) ;
#195 = FACE_OUTER_BOUND ( 'NONE', #271, .T. ) ;
#196 = CARTESIAN_POINT ( 'NONE',  ( 0.1241961524226974228, 0.0000000000000000000, 0.0000000000000000000 ) ) ;
#197 = ORIENTED_EDGE ( 'NONE', *, *, #76, .F. ) ;
#198 = DIRECTION ( 'NONE',  ( -1.000000000000000000, -0.0000000000000000000, -0.0000000000000000000 ) ) ;
#199 = ORIENTED_EDGE ( 'NONE', *, *, #397, .F. ) ;
#200 = CIRCLE ( 'NONE', #596, 0.003000000000000000496 ) ;
#201 = AXIS2_PLACEMENT_3D ( 'NONE', #531, #435, #440 ) ;
#202 = DIRECTION ( 'NONE',  ( 0.0000000000000000000, 0.0000000000000000000, 1.000000000000000000 ) ) ;
#203 = EDGE_CURVE ( 'NONE', #287, #337, #32, .T. ) ;
#204 = EDGE_LOOP ( 'NONE', ( #503, #394, #609, #224, #208 ) ) ;
#205 = CARTESIAN_POINT ( 'NONE',  ( 0.008500000000000194900, -1.067128122525102820E-18, 0.0000000000000000000 ) ) ;
#206 = ORIENTED_EDGE ( 'NONE', *, *, #569, .T. ) ;
#207 = CARTESIAN_POINT ( 'NONE',  ( 0.1640000000000009783, 0.0000000000000000000, 0.02900000000000000147 ) ) ;
#208 = ORIENTED_EDGE ( 'NONE', *, *, #590, .T. ) ;
#209 = DIRECTION ( 'NONE',  ( -1.000000000000000000, -0.0000000000000000000, -0.0000000000000000000 ) ) ;
#210 = ORIENTED_EDGE ( 'NONE', *, *, #203, .T. ) ;
#211 = CARTESIAN_POINT ( 'NONE',  ( 0.06900000000000108824, 4.408728476930471028E-18, -0.03599999999999999728 ) ) ;
#212 = ORIENTED_EDGE ( 'NONE', *, *, #578, .F. ) ;
#213 = CARTESIAN_POINT ( 'NONE',  ( 0.1640000000000009783, 0.0000000000000000000, 0.0000000000000000000 ) ) ;
#214 = FACE_OUTER_BOUND ( 'NONE', #644, .T. ) ;
#215 = FACE_OUTER_BOUND ( 'NONE', #539, .T. ) ;
#216 = VERTEX_POINT ( 'NONE', #384 ) ;
#217 = VECTOR ( 'NONE', #100, 39.37007874015748143 ) ;
#218 = DIRECTION ( 'NONE',  ( 0.0000000000000000000, 0.0000000000000000000, 1.000000000000000000 ) ) ;
#219 = AXIS2_PLACEMENT_3D ( 'NONE', #405, #280, #570 ) ;
#220 = UNCERTAINTY_MEASURE_WITH_UNIT (LENGTH_MEASURE( 1.000000000000000082E-05 ), #587, 'distance_accuracy_value', 'NONE');
#221 = ORIENTED_EDGE ( 'NONE', *, *, #444, .F. ) ;
#222 = DIRECTION ( 'NONE',  ( 1.000000000000000000, 0.0000000000000000000, 0.0000000000000000000 ) ) ;
#223 = CARTESIAN_POINT ( 'NONE',  ( 0.08500000000000113021, 0.0000000000000000000, 0.0000000000000000000 ) ) ;
#224 = ORIENTED_EDGE ( 'NONE', *, *, #249, .F. ) ;
#225 = DIRECTION ( 'NONE',  ( 0.0000000000000000000, 0.0000000000000000000, 1.000000000000000000 ) ) ;
#226 = FACE_OUTER_BOUND ( 'NONE', #495, .T. ) ;
#227 = VERTEX_POINT ( 'NONE', #323 ) ;
#228 = CARTESIAN_POINT ( 'NONE',  ( 0.0000000000000000000, 0.0000000000000000000, 0.0000000000000000000 ) ) ;
#229 = CIRCLE ( 'NONE', #81, 0.03599999999999999728 ) ;
#230 = ADVANCED_FACE ( 'NONE', ( #541 ), #106, .T. ) ;
#231 = DIRECTION ( 'NONE',  ( -1.000000000000000000, -0.0000000000000000000, -0.0000000000000000000 ) ) ;
#232 = ADVANCED_FACE ( 'NONE', ( #320 ), #610, .T. ) ;
#233 = CIRCLE ( 'NONE', #136, 0.03049999999999999586 ) ;
#234 = CARTESIAN_POINT ( 'NONE',  ( 0.1130000000000009330, 0.0000000000000000000, 0.0000000000000000000 ) ) ;
#235 = LINE ( 'NONE', #446, #547 ) ;
#236 = DIRECTION ( 'NONE',  ( -1.000000000000000000, -0.0000000000000000000, -0.0000000000000000000 ) ) ;
#237 = EDGE_CURVE ( 'NONE', #623, #40, #174, .T. ) ;
#238 = DIRECTION ( 'NONE',  ( 0.0000000000000000000, 0.0000000000000000000, 1.000000000000000000 ) ) ;
#239 = SHAPE_DEFINITION_REPRESENTATION ( #286, #529 ) ;
#240 = DIRECTION ( 'NONE',  ( 0.0000000000000000000, 1.000000000000000000, 1.224646799147353207E-16 ) ) ;
#241 = DIRECTION ( 'NONE',  ( -1.000000000000000000, -0.0000000000000000000, -0.0000000000000000000 ) ) ;
#242 = CARTESIAN_POINT ( 'NONE',  ( 0.06900000000000108824, 0.03599999999999999728, 0.0000000000000000000 ) ) ;
#243 = AXIS2_PLACEMENT_3D ( 'NONE', #302, #581, #238 ) ;
#244 = AXIS2_PLACEMENT_3D ( 'NONE', #708, #660, #202 ) ;
#245 = CARTESIAN_POINT ( 'NONE',  ( 0.1670000000000010920, 0.0000000000000000000, 0.02089999999999999844 ) ) ;
#246 = DIRECTION ( 'NONE',  ( -0.9659258262890096924, 0.0000000000000000000, 0.2588190451027395089 ) ) ;
#247 = EDGE_LOOP ( 'NONE', ( #269, #3, #206, #649 ) ) ;
#248 = CARTESIAN_POINT ( 'NONE',  ( 0.0000000000000000000, 0.0000000000000000000, 0.0000000000000000000 ) ) ;
#249 = EDGE_CURVE ( 'NONE', #663, #97, #165, .T. ) ;
#250 = ADVANCED_FACE ( 'NONE', ( #673 ), #500, .T. ) ;
#251 = AXIS2_PLACEMENT_3D ( 'NONE', #295, #168, #461 ) ;
#252 = ORIENTED_EDGE ( 'NONE', *, *, #455, .T. ) ;
#253 = DIRECTION ( 'NONE',  ( 0.0000000000000000000, 0.0000000000000000000, 1.000000000000000000 ) ) ;
#254 = CARTESIAN_POINT ( 'NONE',  ( 0.0000000000000000000, 3.735172737399426715E-18, -0.03049999999999999586 ) ) ;
#255 = PRODUCT_DEFINITION ( 'UNKNOWN', '', #144, #378 ) ;
#256 = ORIENTED_EDGE ( 'NONE', *, *, #686, .F. ) ;
#257 = CARTESIAN_POINT ( 'NONE',  ( 0.1241961524226974228, 3.551475717527324911E-18, -0.02900000000000000147 ) ) ;
#258 = DIRECTION ( 'NONE',  ( 0.0000000000000000000, 0.0000000000000000000, 1.000000000000000000 ) ) ;
#259 = EDGE_CURVE ( 'NONE', #40, #623, #468, .T. ) ;
#260 = ORIENTED_EDGE ( 'NONE', *, *, #533, .T. ) ;
#261 = FACE_BOUND ( 'NONE', #439, .T. ) ;
#262 = DIRECTION ( 'NONE',  ( -1.000000000000000000, -0.0000000000000000000, -0.0000000000000000000 ) ) ;
#263 = AXIS2_PLACEMENT_3D ( 'NONE', #630, #682, #176 ) ;
#264 = ORIENTED_EDGE ( 'NONE', *, *, #58, .T. ) ;
#265 = AXIS2_PLACEMENT_3D ( 'NONE', #689, #582, #417 ) ;
#266 = STYLED_ITEM ( 'NONE', ( #157 ), #529 ) ;
#267 = LINE ( 'NONE', #41, #389 ) ;
#268 = DIRECTION ( 'NONE',  ( 0.0000000000000000000, 0.0000000000000000000, 1.000000000000000000 ) ) ;
#269 = ORIENTED_EDGE ( 'NONE', *, *, #149, .F. ) ;
#270 = PLANE ( 'NONE',  #66 ) ;
#271 = EDGE_LOOP ( 'NONE', ( #166, #647, #67, #102 ) ) ;
#272 = LINE ( 'NONE', #51, #445 ) ;
#273 = ORIENTED_EDGE ( 'NONE', *, *, #386, .T. ) ;
#274 = CARTESIAN_POINT ( 'NONE',  ( 0.08500000000000113021, 0.0000000000000000000, 0.03599999999999999728 ) ) ;
#275 = VERTEX_POINT ( 'NONE', #626 ) ;
#276 = DIRECTION ( 'NONE',  ( -1.000000000000000000, -0.0000000000000000000, -0.0000000000000000000 ) ) ;
#277 = EDGE_CURVE ( 'NONE', #654, #674, #185, .T. ) ;
#278 = ORIENTED_EDGE ( 'NONE', *, *, #55, .F. ) ;
#279 = AXIS2_PLACEMENT_3D ( 'NONE', #290, #114, #572 ) ;
#280 = DIRECTION ( 'NONE',  ( 1.000000000000000000, 0.0000000000000000000, 0.0000000000000000000 ) ) ;
#281 = DIRECTION ( 'NONE',  ( 0.0000000000000000000, 0.0000000000000000000, 1.000000000000000000 ) ) ;
#282 = CIRCLE ( 'NONE', #244, 0.02089999999999999844 ) ;
#283 = ORIENTED_EDGE ( 'NONE', *, *, #62, .F. ) ;
#284 = CARTESIAN_POINT ( 'NONE',  ( 0.1241961524226974228, 0.0000000000000000000, 0.0000000000000000000 ) ) ;
#285 = CARTESIAN_POINT ( 'NONE',  ( 0.06600000000000109945, 0.0000000000000000000, 0.0000000000000000000 ) ) ;
#286 = PRODUCT_DEFINITION_SHAPE ( 'NONE', 'NONE',  #255 ) ;
#287 = VERTEX_POINT ( 'NONE', #406 ) ;
#288 = EDGE_CURVE ( 'NONE', #617, #162, #583, .T. ) ;
#289 = CARTESIAN_POINT ( 'NONE',  ( 0.08500000000000113021, 4.408728476930471028E-18, -0.03599999999999999728 ) ) ;
#290 = CARTESIAN_POINT ( 'NONE',  ( 0.06900000000000108824, 0.0000000000000000000, 0.0000000000000000000 ) ) ;
#291 = UNCERTAINTY_MEASURE_WITH_UNIT (LENGTH_MEASURE( 1.000000000000000082E-05 ), #152, 'distance_accuracy_value', 'NONE');
#292 = DIRECTION ( 'NONE',  ( -1.000000000000000000, 0.0000000000000000000, -0.0000000000000000000 ) ) ;
#293 = FILL_AREA_STYLE ('',( #628 ) ) ;
#294 = CIRCLE ( 'NONE', #243, 0.01150000000000020103 ) ;
#295 = CARTESIAN_POINT ( 'NONE',  ( 0.1670000000000010920, 0.0000000000000000000, 0.0000000000000000000 ) ) ;
#296 = ADVANCED_FACE ( 'NONE', ( #226 ), #454, .T. ) ;
#297 = AXIS2_PLACEMENT_3D ( 'NONE', #631, #231, #403 ) ;
#298 = AXIS2_PLACEMENT_3D ( 'NONE', #36, #520, #588 ) ;
#299 = MECHANICAL_DESIGN_GEOMETRIC_PRESENTATION_REPRESENTATION (  '', ( #266 ), #85 ) ;
#300 = FACE_OUTER_BOUND ( 'NONE', #453, .T. ) ;
#301 = DIRECTION ( 'NONE',  ( -1.000000000000000000, -0.0000000000000000000, -0.0000000000000000000 ) ) ;
#302 = CARTESIAN_POINT ( 'NONE',  ( 0.06900000000000110212, 0.0000000000000000000, 0.0000000000000000000 ) ) ;
#303 = DIRECTION ( 'NONE',  ( 0.0000000000000000000, 0.0000000000000000000, 1.000000000000000000 ) ) ;
#304 = CARTESIAN_POINT ( 'NONE',  ( 0.1130000000000009330, 0.0000000000000000000, 0.0000000000000000000 ) ) ;
#305 = AXIS2_PLACEMENT_3D ( 'NONE', #534, #593, #43 ) ;
#306 = CIRCLE ( 'NONE', #265, 0.02089999999999999844 ) ;
#307 = AXIS2_PLACEMENT_3D ( 'NONE', #284, #458, #18 ) ;
#308 = CARTESIAN_POINT ( 'NONE',  ( 0.06900000000000110212, 0.0000000000000000000, 0.0000000000000000000 ) ) ;
#309 = ORIENTED_EDGE ( 'NONE', *, *, #694, .T. ) ;
#310 = EDGE_CURVE ( 'NONE', #390, #499, #640, .T. ) ;
#311 = CARTESIAN_POINT ( 'NONE',  ( 0.008500000000000194900, -1.067128122525102820E-18, 0.0000000000000000000 ) ) ;
#312 = ADVANCED_FACE ( 'NONE', ( #680 ), #502, .F. ) ;
#313 = ORIENTED_EDGE ( 'NONE', *, *, #192, .F. ) ;
#314 = DIRECTION ( 'NONE',  ( -1.000000000000000000, -0.0000000000000000000, -0.0000000000000000000 ) ) ;
#315 = AXIS2_PLACEMENT_3D ( 'NONE', #349, #292, #89 ) ;
#316 = AXIS2_PLACEMENT_3D ( 'NONE', #111, #154, #556 ) ;
#317 = ORIENTED_EDGE ( 'NONE', *, *, #679, .F. ) ;
#318 = CIRCLE ( 'NONE', #11, 0.02089999999999999844 ) ;
#319 = CARTESIAN_POINT ( 'NONE',  ( 0.1670000000000010920, 0.0000000000000000000, 0.02726794919243105686 ) ) ;
#320 = FACE_OUTER_BOUND ( 'NONE', #379, .T. ) ;
#321 = ORIENTED_EDGE ( 'NONE', *, *, #336, .T. ) ;
#322 = CARTESIAN_POINT ( 'NONE',  ( 0.1670000000000010920, 0.0000000000000000000, 0.02726794919243105686 ) ) ;
#323 = CARTESIAN_POINT ( 'NONE',  ( 1.067128122525102820E-18, -5.466532328874658591E-19, 0.0000000000000000000 ) ) ;
#324 = ORIENTED_EDGE ( 'NONE', *, *, #194, .T. ) ;
#325 = CARTESIAN_POINT ( 'NONE',  ( 0.1241961524226974228, 0.0000000000000000000, 0.0000000000000000000 ) ) ;
#326 = VERTEX_POINT ( 'NONE', #516 ) ;
#327 = CARTESIAN_POINT ( 'NONE',  ( 0.1640000000000009783, 0.0000000000000000000, 0.0000000000000000000 ) ) ;
#328 = EDGE_LOOP ( 'NONE', ( #430, #677 ) ) ;
#329 = AXIS2_PLACEMENT_3D ( 'NONE', #331, #615, #652 ) ;
#330 = ORIENTED_EDGE ( 'NONE', *, *, #365, .F. ) ;
#331 = CARTESIAN_POINT ( 'NONE',  ( 0.0000000000000000000, 0.0000000000000000000, 0.0000000000000000000 ) ) ;
#332 = ORIENTED_EDGE ( 'NONE', *, *, #148, .F. ) ;
#333 = EDGE_CURVE ( 'NONE', #674, #536, #629, .T. ) ;
#334 = EDGE_LOOP ( 'NONE', ( #145, #190, #12, #339 ) ) ;
#335 = CARTESIAN_POINT ( 'NONE',  ( 0.06600000000000109945, 1.224646799147377651E-18, -0.008500000000000200104 ) ) ;
#336 = EDGE_CURVE ( 'NONE', #617, #711, #200, .T. ) ;
#337 = VERTEX_POINT ( 'NONE', #70 ) ;
#338 = DIRECTION ( 'NONE',  ( -1.000000000000000000, -0.0000000000000000000, -0.0000000000000000000 ) ) ;
#339 = ORIENTED_EDGE ( 'NONE', *, *, #517, .F. ) ;
#340 = CIRCLE ( 'NONE', #707, 0.03049999999999999239 ) ;
#341 = AXIS2_PLACEMENT_3D ( 'NONE', #160, #198, #424 ) ;
#342 =( CONVERSION_BASED_UNIT ( 'INCH', #393 ) LENGTH_UNIT ( ) NAMED_UNIT ( #44 ) );
#343 = AXIS2_PLACEMENT_3D ( 'NONE', #304, #692, #528 ) ;
#344 = CARTESIAN_POINT ( 'NONE',  ( 0.1851000000000010970, 0.02089999999999999844, 0.0000000000000000000 ) ) ;
#345 = ADVANCED_FACE ( 'NONE', ( #64 ), #395, .T. ) ;
#346 = EDGE_LOOP ( 'NONE', ( #278, #542, #99, #9, #212 ) ) ;
#347 =( NAMED_UNIT ( * ) PLANE_ANGLE_UNIT ( ) SI_UNIT ( $, .RADIAN. ) );
#348 = CARTESIAN_POINT ( 'NONE',  ( 0.0000000000000000000, 4.408728476930471028E-18, -0.03599999999999999728 ) ) ;
#349 = CARTESIAN_POINT ( 'NONE',  ( 0.1670000000000010920, 0.02726794919243105686, 0.0000000000000000000 ) ) ;
#350 = CARTESIAN_POINT ( 'NONE',  ( 0.1851000000000010970, 0.0000000000000000000, 0.02089999999999999844 ) ) ;
#351 = CARTESIAN_POINT ( 'NONE',  ( 0.0000000000000000000, 0.0000000000000000000, 0.02089999999999999844 ) ) ;
#352 = DIRECTION ( 'NONE',  ( 0.0000000000000000000, 1.000000000000000000, 0.0000000000000000000 ) ) ;
#353 = APPLICATION_CONTEXT ( 'automotive_design' ) ;
#354 =( LENGTH_UNIT ( ) NAMED_UNIT ( * ) SI_UNIT ( $, .METRE. ) );
#355 = CIRCLE ( 'NONE', #305, 0.008500000000000193165 ) ;
#356 = DIRECTION ( 'NONE',  ( 0.0000000000000000000, 0.0000000000000000000, -1.000000000000000000 ) ) ;
#357 = AXIS2_PLACEMENT_3D ( 'NONE', #676, #621, #117 ) ;
#358 = DIRECTION ( 'NONE',  ( -1.000000000000000000, -0.0000000000000000000, -0.0000000000000000000 ) ) ;
#359 = DIRECTION ( 'NONE',  ( -0.0000000000000000000, 0.0000000000000000000, -1.000000000000000000 ) ) ;
#360 = DIRECTION ( 'NONE',  ( -1.000000000000000000, -0.0000000000000000000, -0.0000000000000000000 ) ) ;
#361 = DIRECTION ( 'NONE',  ( 0.0000000000000000000, 0.0000000000000000000, 1.000000000000000000 ) ) ;
#362 = DIRECTION ( 'NONE',  ( 0.0000000000000000000, 0.0000000000000000000, 1.000000000000000000 ) ) ;
#363 = SPHERICAL_SURFACE ( 'NONE', #653, 0.008500000000000194900 ) ;
#364 = AXIS2_PLACEMENT_3D ( 'NONE', #79, #635, #474 ) ;
#365 = EDGE_CURVE ( 'NONE', #527, #536, #697, .T. ) ;
#366 = EDGE_LOOP ( 'NONE', ( #544, #260, #477, #115 ) ) ;
#367 = ADVANCED_FACE ( 'NONE', ( #510 ), #71, .T. ) ;
#368 = DIRECTION ( 'NONE',  ( 0.0000000000000000000, 1.224646799147353207E-16, -1.000000000000000000 ) ) ;
#369 = ORIENTED_EDGE ( 'NONE', *, *, #156, .T. ) ;
#370 = DIRECTION ( 'NONE',  ( -1.000000000000000000, -0.0000000000000000000, -0.0000000000000000000 ) ) ;
#371 = VERTEX_POINT ( 'NONE', #344 ) ;
#372 = DIRECTION ( 'NONE',  ( -1.000000000000000000, -0.0000000000000000000, -0.0000000000000000000 ) ) ;
#373 = CARTESIAN_POINT ( 'NONE',  ( 0.008500000000000193165, 0.0000000000000000000, 0.008500000000000193165 ) ) ;
#374 = DIMENSIONAL_EXPONENTS ( 1.000000000000000000, 0.0000000000000000000, 0.0000000000000000000, 0.0000000000000000000, 0.0000000000000000000, 0.0000000000000000000, 0.0000000000000000000 ) ;
#375 = VECTOR ( 'NONE', #433, 39.37007874015748143 ) ;
#376 = ORIENTED_EDGE ( 'NONE', *, *, #549, .T. ) ;
#377 = DIRECTION ( 'NONE',  ( -0.8660254037844380415, 0.0000000000000000000, 0.5000000000000009992 ) ) ;
#378 = PRODUCT_DEFINITION_CONTEXT ( 'detailed design', #657, 'design' ) ;
#379 = EDGE_LOOP ( 'NONE', ( #20, #324, #256, #396 ) ) ;
#380 = DIRECTION ( 'NONE',  ( -1.000000000000000000, 0.0000000000000000000, -0.0000000000000000000 ) ) ;
#381 = EDGE_LOOP ( 'NONE', ( #392, #94 ) ) ;
#382 = DIRECTION ( 'NONE',  ( -0.0000000000000000000, 0.0000000000000000000, 1.000000000000000000 ) ) ;
#383 = EDGE_LOOP ( 'NONE', ( #317, #369, #557, #171 ) ) ;
#384 = CARTESIAN_POINT ( 'NONE',  ( 0.1130000000000009330, 3.735172737399426715E-18, -0.03049999999999999239 ) ) ;
#385 = AXIS2_PLACEMENT_3D ( 'NONE', #407, #358, #362 ) ;
#386 = EDGE_CURVE ( 'NONE', #674, #654, #690, .T. ) ;
#387 = ORIENTED_EDGE ( 'NONE', *, *, #455, .F. ) ;
#388 = AXIS2_PLACEMENT_3D ( 'NONE', #19, #121, #559 ) ;
#389 = VECTOR ( 'NONE', #314, 39.37007874015748143 ) ;
#390 = VERTEX_POINT ( 'NONE', #15 ) ;
#391 = DIRECTION ( 'NONE',  ( 0.0000000000000000000, 0.0000000000000000000, 1.000000000000000000 ) ) ;
#392 = ORIENTED_EDGE ( 'NONE', *, *, #237, .F. ) ;
#393 = LENGTH_MEASURE_WITH_UNIT ( LENGTH_MEASURE( 0.02539999999999999897 ), #163 );
#394 = ORIENTED_EDGE ( 'NONE', *, *, #55, .T. ) ;
#395 = SPHERICAL_SURFACE ( 'NONE', #73, 0.02089999999999999844 ) ;
#396 = ORIENTED_EDGE ( 'NONE', *, *, #128, .F. ) ;
#397 = EDGE_CURVE ( 'NONE', #617, #137, #452, .T. ) ;
#398 = DIRECTION ( 'NONE',  ( -1.000000000000000000, -0.0000000000000000000, -0.0000000000000000000 ) ) ;
#399 = ORIENTED_EDGE ( 'NONE', *, *, #288, .T. ) ;
#400 = PRODUCT ( 'mill-max-0906-0-15-20-76-14-11-0', 'mill-max-0906-0-15-20-76-14-11-0', '', ( #183 ) ) ;
#401 = CYLINDRICAL_SURFACE ( 'NONE', #504, 0.02089999999999999844 ) ;
#402 = CIRCLE ( 'NONE', #107, 0.01150000000000020103 ) ;
#403 = DIRECTION ( 'NONE',  ( 0.0000000000000000000, 0.0000000000000000000, 1.000000000000000000 ) ) ;
#404 = CARTESIAN_POINT ( 'NONE',  ( 0.0000000000000000000, 0.0000000000000000000, 0.02900000000000000147 ) ) ;
#405 = CARTESIAN_POINT ( 'NONE',  ( 0.1130000000000009330, 0.03049999999999999239, 0.0000000000000000000 ) ) ;
#406 = CARTESIAN_POINT ( 'NONE',  ( 0.008500000000000193165, 0.008500000000000193165, 0.0000000000000000000 ) ) ;
#407 = CARTESIAN_POINT ( 'NONE',  ( 0.008500000000000193165, 0.0000000000000000000, 0.0000000000000000000 ) ) ;
#408 = CARTESIAN_POINT ( 'NONE',  ( 0.08500000000000113021, 0.0000000000000000000, 0.0000000000000000000 ) ) ;
#409 = FACE_OUTER_BOUND ( 'NONE', #381, .T. ) ;
#410 = DIRECTION ( 'NONE',  ( -1.000000000000000000, -0.0000000000000000000, -0.0000000000000000000 ) ) ;
#411 = AXIS2_PLACEMENT_3D ( 'NONE', #483, #173, #449 ) ;
#412 = AXIS2_PLACEMENT_3D ( 'NONE', #675, #116, #225 ) ;
#413 = FACE_OUTER_BOUND ( 'NONE', #488, .T. ) ;
#414 = CARTESIAN_POINT ( 'NONE',  ( 0.1851000000000010970, 0.0000000000000000000, 0.0000000000000000000 ) ) ;
#415 = LINE ( 'NONE', #584, #479 ) ;
#416 = EDGE_CURVE ( 'NONE', #589, #390, #415, .T. ) ;
#417 = DIRECTION ( 'NONE',  ( 0.0000000000000000000, 0.0000000000000000000, 1.000000000000000000 ) ) ;
#418 = CIRCLE ( 'NONE', #561, 0.02900000000000000147 ) ;
#419 = CIRCLE ( 'NONE', #666, 0.02089999999999999844 ) ;
#420 = EDGE_LOOP ( 'NONE', ( #399, #376, #59, #703, #199 ) ) ;
#421 = DIRECTION ( 'NONE',  ( -1.000000000000000000, -0.0000000000000000000, -0.0000000000000000000 ) ) ;
#422 = ORIENTED_EDGE ( 'NONE', *, *, #533, .F. ) ;
#423 = LENGTH_MEASURE_WITH_UNIT ( LENGTH_MEASURE( 0.02539999999999999897 ), #95 );
#424 = DIRECTION ( 'NONE',  ( 0.0000000000000000000, 0.0000000000000000000, 1.000000000000000000 ) ) ;
#425 = EDGE_LOOP ( 'NONE', ( #387, #309, #441, #613 ) ) ;
#426 = DIRECTION ( 'NONE',  ( -1.000000000000000000, -0.0000000000000000000, -0.0000000000000000000 ) ) ;
#427 = TOROIDAL_SURFACE ( 'NONE', #263, 0.01150000000000020103, 0.003000000000000000062 ) ;
#428 = AXIS2_PLACEMENT_3D ( 'NONE', #713, #209, #436 ) ;
#429 =( GEOMETRIC_REPRESENTATION_CONTEXT ( 3 ) GLOBAL_UNCERTAINTY_ASSIGNED_CONTEXT ( ( #291 ) ) GLOBAL_UNIT_ASSIGNED_CONTEXT ( ( #152, #608, #601 ) ) REPRESENTATION_CONTEXT ( 'NONE', 'WORKASPACE' ) );
#430 = ORIENTED_EDGE ( 'NONE', *, *, #437, .T. ) ;
#431 = CARTESIAN_POINT ( 'NONE',  ( 0.1670000000000010920, 0.0000000000000000000, 0.0000000000000000000 ) ) ;
#432 = ORIENTED_EDGE ( 'NONE', *, *, #592, .T. ) ;
#433 = DIRECTION ( 'NONE',  ( -0.8660254037844380415, 6.123233995736778362E-17, -0.5000000000000009992 ) ) ;
#434 = ORIENTED_EDGE ( 'NONE', *, *, #37, .T. ) ;
#435 = DIRECTION ( 'NONE',  ( -1.000000000000000000, -0.0000000000000000000, -0.0000000000000000000 ) ) ;
#436 = DIRECTION ( 'NONE',  ( 0.0000000000000000000, 0.0000000000000000000, 1.000000000000000000 ) ) ;
#437 = EDGE_CURVE ( 'NONE', #97, #619, #306, .T. ) ;
#438 = EDGE_CURVE ( 'NONE', #275, #565, #519, .T. ) ;
#439 = EDGE_LOOP ( 'NONE', ( #594, #86 ) ) ;
#440 = DIRECTION ( 'NONE',  ( 0.0000000000000000000, 0.0000000000000000000, 1.000000000000000000 ) ) ;
#441 = ORIENTED_EDGE ( 'NONE', *, *, #590, .F. ) ;
#442 = CARTESIAN_POINT ( 'NONE',  ( 0.1130000000000009330, 0.0000000000000000000, 0.03049999999999999239 ) ) ;
#443 = ORIENTED_EDGE ( 'NONE', *, *, #126, .F. ) ;
#444 = EDGE_CURVE ( 'NONE', #508, #227, #681, .T. ) ;
#445 = VECTOR ( 'NONE', #4, 39.37007874015748143 ) ;
#446 = CARTESIAN_POINT ( 'NONE',  ( 0.1241961524226974228, 3.551475717527324911E-18, -0.02900000000000000147 ) ) ;
#447 = ORIENTED_EDGE ( 'NONE', *, *, #310, .T. ) ;
#448 = PRESENTATION_LAYER_ASSIGNMENT (  '', '', ( #266 ) ) ;
#449 = DIRECTION ( 'NONE',  ( 0.0000000000000000000, 0.0000000000000000000, 1.000000000000000000 ) ) ;
#450 = ORIENTED_EDGE ( 'NONE', *, *, #310, .F. ) ;
#451 = FACE_OUTER_BOUND ( 'NONE', #334, .T. ) ;
#452 = LINE ( 'NONE', #646, #189 ) ;
#453 = EDGE_LOOP ( 'NONE', ( #422, #562, #321, #434 ) ) ;
#454 = CYLINDRICAL_SURFACE ( 'NONE', #297, 0.02900000000000000147 ) ;
#455 = EDGE_CURVE ( 'NONE', #326, #616, #419, .T. ) ;
#456 = CARTESIAN_POINT ( 'NONE',  ( 0.06900000000000108824, 0.0000000000000000000, 0.0000000000000000000 ) ) ;
#457 = CONICAL_SURFACE ( 'NONE', #159, 0.02726794919243105686, 0.5235987755983000369 ) ;
#458 = DIRECTION ( 'NONE',  ( -1.000000000000000000, -0.0000000000000000000, -0.0000000000000000000 ) ) ;
#459 = DIRECTION ( 'NONE',  ( 0.0000000000000000000, 0.0000000000000000000, 1.000000000000000000 ) ) ;
#460 = DIRECTION ( 'NONE',  ( 0.0000000000000000000, 0.0000000000000000000, 1.000000000000000000 ) ) ;
#461 = DIRECTION ( 'NONE',  ( 0.0000000000000000000, 0.0000000000000000000, 1.000000000000000000 ) ) ;
#462 = ADVANCED_FACE ( 'NONE', ( #580 ), #363, .T. ) ;
#463 = CARTESIAN_POINT ( 'NONE',  ( 0.1670000000000010920, 0.0000000000000000000, 0.0000000000000000000 ) ) ;
#464 = EDGE_CURVE ( 'NONE', #155, #711, #402, .T. ) ;
#465 = DIRECTION ( 'NONE',  ( 0.0000000000000000000, 1.000000000000000000, 0.0000000000000000000 ) ) ;
#466 = DIRECTION ( 'NONE',  ( -1.000000000000000000, -0.0000000000000000000, -0.0000000000000000000 ) ) ;
#467 = VECTOR ( 'NONE', #241, 39.37007874015748143 ) ;
#468 = CIRCLE ( 'NONE', #251, 0.02726794919243105686 ) ;
#469 = CLOSED_SHELL ( 'NONE', ( #230, #312, #6, #232, #473, #296, #603, #670, #345, #462, #367, #82, #250, #17, #103, #490, #571, #643, #667, #560, #627, #515, #101, #169 ) ) ;
#470 = DIRECTION ( 'NONE',  ( 1.000000000000000000, 0.0000000000000000000, 0.0000000000000000000 ) ) ;
#471 = AXIS2_PLACEMENT_3D ( 'NONE', #325, #701, #253 ) ;
#472 = FACE_BOUND ( 'NONE', #328, .T. ) ;
#473 = ADVANCED_FACE ( 'NONE', ( #413 ), #514, .T. ) ;
#474 = DIRECTION ( 'NONE',  ( 0.0000000000000000000, 1.000000000000000000, 1.224646799147352961E-16 ) ) ;
#475 = DIRECTION ( 'NONE',  ( 1.000000000000000000, 0.0000000000000000000, 0.0000000000000000000 ) ) ;
#476 = FACE_OUTER_BOUND ( 'NONE', #193, .T. ) ;
#477 = ORIENTED_EDGE ( 'NONE', *, *, #464, .T. ) ;
#478 = CIRCLE ( 'NONE', #573, 0.008500000000000200104 ) ;
#479 = VECTOR ( 'NONE', #246, 39.37007874015748143 ) ;
#480 = AXIS2_PLACEMENT_3D ( 'NONE', #248, #301, #361 ) ;
#481 = ORIENTED_EDGE ( 'NONE', *, *, #438, .F. ) ;
#482 = FACE_OUTER_BOUND ( 'NONE', #383, .T. ) ;
#483 = CARTESIAN_POINT ( 'NONE',  ( 0.1670000000000010920, 0.0000000000000000000, 0.0000000000000000000 ) ) ;
#484 = ORIENTED_EDGE ( 'NONE', *, *, #13, .F. ) ;
#485 = CARTESIAN_POINT ( 'NONE',  ( 0.08500000000000113021, 0.0000000000000000000, 0.03049999999999999586 ) ) ;
#486 = ORIENTED_EDGE ( 'NONE', *, *, #131, .T. ) ;
#487 = FACE_OUTER_BOUND ( 'NONE', #607, .T. ) ;
#488 = EDGE_LOOP ( 'NONE', ( #696, #104, #450, #659 ) ) ;
#489 = SURFACE_STYLE_FILL_AREA ( #494 ) ;
#490 = ADVANCED_FACE ( 'NONE', ( #641 ), #698, .T. ) ;
#491 = CARTESIAN_POINT ( 'NONE',  ( 0.0000000000000000000, 0.0000000000000000000, 0.0000000000000000000 ) ) ;
#492 = EDGE_CURVE ( 'NONE', #216, #135, #634, .T. ) ;
#493 = ORIENTED_EDGE ( 'NONE', *, *, #76, .T. ) ;
#494 = FILL_AREA_STYLE ('',( #146 ) ) ;
#495 = EDGE_LOOP ( 'NONE', ( #486, #151, #672, #90 ) ) ;
#496 = DIRECTION ( 'NONE',  ( 1.000000000000000000, 0.0000000000000000000, 0.0000000000000000000 ) ) ;
#497 = DIRECTION ( 'NONE',  ( 0.0000000000000000000, 0.0000000000000000000, 1.000000000000000000 ) ) ;
#498 = FACE_BOUND ( 'NONE', #56, .T. ) ;
#499 = VERTEX_POINT ( 'NONE', #34 ) ;
#500 = CYLINDRICAL_SURFACE ( 'NONE', #512, 0.02089999999999999844 ) ;
#501 = CIRCLE ( 'NONE', #385, 0.008500000000000193165 ) ;
#502 = TOROIDAL_SURFACE ( 'NONE', #709, 0.01150000000000020103, 0.003000000000000000062 ) ;
#503 = ORIENTED_EDGE ( 'NONE', *, *, #645, .T. ) ;
#504 = AXIS2_PLACEMENT_3D ( 'NONE', #228, #625, #678 ) ;
#505 = DIRECTION ( 'NONE',  ( -1.000000000000000000, -0.0000000000000000000, -0.0000000000000000000 ) ) ;
#506 = ORIENTED_EDGE ( 'NONE', *, *, #365, .T. ) ;
#507 = CARTESIAN_POINT ( 'NONE',  ( 0.008500000000000194900, -1.067128122525102820E-18, 0.0000000000000000000 ) ) ;
#508 = VERTEX_POINT ( 'NONE', #39 ) ;
#509 = APPLICATION_PROTOCOL_DEFINITION ( 'draft international standard', 'automotive_design', 1998, #353 ) ;
#510 = FACE_OUTER_BOUND ( 'NONE', #548, .T. ) ;
#511 = DIRECTION ( 'NONE',  ( 0.0000000000000000000, 0.0000000000000000000, 1.000000000000000000 ) ) ;
#512 = AXIS2_PLACEMENT_3D ( 'NONE', #564, #338, #281 ) ;
#513 = SURFACE_STYLE_FILL_AREA ( #293 ) ;
#514 = CONICAL_SURFACE ( 'NONE', #298, 0.02900000000000000147, 0.2617993877993758933 ) ;
#515 = ADVANCED_FACE ( 'NONE', ( #130, #476 ), #29, .F. ) ;
#516 = CARTESIAN_POINT ( 'NONE',  ( 0.2060000000000010989, 1.279755905108983887E-18, 0.0000000000000000000 ) ) ;
#517 = EDGE_CURVE ( 'NONE', #153, #110, #612, .T. ) ;
#518 = CARTESIAN_POINT ( 'NONE',  ( 0.06600000000000109945, 0.0000000000000000000, 0.0000000000000000000 ) ) ;
#519 = LINE ( 'NONE', #637, #611 ) ;
#520 = DIRECTION ( 'NONE',  ( -1.000000000000000000, -0.0000000000000000000, -0.0000000000000000000 ) ) ;
#521 = DIRECTION ( 'NONE',  ( -1.000000000000000000, -0.0000000000000000000, -0.0000000000000000000 ) ) ;
#522 = CARTESIAN_POINT ( 'NONE',  ( 0.0000000000000000000, 0.0000000000000000000, 0.0000000000000000000 ) ) ;
#523 = AXIS2_PLACEMENT_3D ( 'NONE', #223, #398, #459 ) ;
#524 = CARTESIAN_POINT ( 'NONE',  ( 0.06900000000000108824, 0.0000000000000000000, 0.03599999999999999728 ) ) ;
#525 = MECHANICAL_DESIGN_GEOMETRIC_PRESENTATION_REPRESENTATION (  '', ( #191 ), #429 ) ;
#526 = DIRECTION ( 'NONE',  ( -1.000000000000000000, -0.0000000000000000000, -0.0000000000000000000 ) ) ;
#527 = VERTEX_POINT ( 'NONE', #524 ) ;
#528 = DIRECTION ( 'NONE',  ( 0.0000000000000000000, 0.0000000000000000000, 1.000000000000000000 ) ) ;
#529 = ADVANCED_BREP_SHAPE_REPRESENTATION ( 'mill-max-0906-0-15-20-76-14-11-0', ( #552, #669 ), #710 ) ;
#530 = EDGE_LOOP ( 'NONE', ( #656, #706 ) ) ;
#531 = CARTESIAN_POINT ( 'NONE',  ( 0.1851000000000010970, 0.0000000000000000000, 0.0000000000000000000 ) ) ;
#532 = VECTOR ( 'NONE', #521, 39.37007874015748143 ) ;
#533 = EDGE_CURVE ( 'NONE', #162, #155, #161, .T. ) ;
#534 = CARTESIAN_POINT ( 'NONE',  ( 0.008500000000000193165, 0.0000000000000000000, 0.0000000000000000000 ) ) ;
#535 = CIRCLE ( 'NONE', #651, 0.008500000000000193165 ) ;
#536 = VERTEX_POINT ( 'NONE', #211 ) ;
#537 = FACE_OUTER_BOUND ( 'NONE', #45, .T. ) ;
#538 = DIRECTION ( 'NONE',  ( -1.000000000000000000, -0.0000000000000000000, -0.0000000000000000000 ) ) ;
#539 = EDGE_LOOP ( 'NONE', ( #447, #700 ) ) ;
#540 = DIRECTION ( 'NONE',  ( 0.0000000000000000000, 0.0000000000000000000, 1.000000000000000000 ) ) ;
#541 = FACE_OUTER_BOUND ( 'NONE', #420, .T. ) ;
#542 = ORIENTED_EDGE ( 'NONE', *, *, #148, .T. ) ;
#543 = CARTESIAN_POINT ( 'NONE',  ( 0.0000000000000000000, 0.0000000000000000000, 0.0000000000000000000 ) ) ;
#544 = ORIENTED_EDGE ( 'NONE', *, *, #22, .F. ) ;
#545 = DIRECTION ( 'NONE',  ( -1.000000000000000000, -0.0000000000000000000, -0.0000000000000000000 ) ) ;
#546 = VECTOR ( 'NONE', #21, 39.37007874015748143 ) ;
#547 = VECTOR ( 'NONE', #684, 39.37007874015748143 ) ;
#548 = EDGE_LOOP ( 'NONE', ( #221, #112, #432, #120 ) ) ;
#550 = EDGE_LOOP ( 'NONE', ( #47, #252, #332, #61 ) ) ;
#549 = EDGE_CURVE ( 'NONE', #162, #337, #267, .T. ) ;
#551 = LINE ( 'NONE', #93, #375 ) ;
#552 = MANIFOLD_SOLID_BREP ( 'Revolve1', #469 ) ;
#553 = DIRECTION ( 'NONE',  ( -1.000000000000000000, -0.0000000000000000000, -0.0000000000000000000 ) ) ;
#554 = DIRECTION ( 'NONE',  ( 0.0000000000000000000, 0.0000000000000000000, 1.000000000000000000 ) ) ;
#555 = ORIENTED_EDGE ( 'NONE', *, *, #386, .F. ) ;
#556 = DIRECTION ( 'NONE',  ( 0.0000000000000000000, 0.0000000000000000000, 1.000000000000000000 ) ) ;
#557 = ORIENTED_EDGE ( 'NONE', *, *, #416, .T. ) ;
#558 = SURFACE_SIDE_STYLE ('',( #513 ) ) ;
#559 = DIRECTION ( 'NONE',  ( 0.0000000000000000000, 0.0000000000000000000, 1.000000000000000000 ) ) ;
#560 = ADVANCED_FACE ( 'NONE', ( #140, #261 ), #270, .F. ) ;
#561 = AXIS2_PLACEMENT_3D ( 'NONE', #213, #538, #702 ) ;
#562 = ORIENTED_EDGE ( 'NONE', *, *, #288, .F. ) ;
#563 = AXIS2_PLACEMENT_3D ( 'NONE', #188, #77, #49 ) ;
#564 = CARTESIAN_POINT ( 'NONE',  ( 0.0000000000000000000, 0.0000000000000000000, 0.0000000000000000000 ) ) ;
#565 = VERTEX_POINT ( 'NONE', #257 ) ;
#566 = CYLINDRICAL_SURFACE ( 'NONE', #412, 0.03049999999999999586 ) ;
#567 = CARTESIAN_POINT ( 'NONE',  ( 0.06600000000000109945, 0.0000000000000000000, 0.01150000000000020103 ) ) ;
#568 = DIRECTION ( 'NONE',  ( -1.000000000000000000, -0.0000000000000000000, -0.0000000000000000000 ) ) ;
#569 = EDGE_CURVE ( 'NONE', #623, #604, #712, .T. ) ;
#570 = DIRECTION ( 'NONE',  ( 0.0000000000000000000, 0.0000000000000000000, -1.000000000000000000 ) ) ;
#571 = ADVANCED_FACE ( 'NONE', ( #482 ), #576, .T. ) ;
#572 = DIRECTION ( 'NONE',  ( 0.0000000000000000000, 0.0000000000000000000, 1.000000000000000000 ) ) ;
#573 = AXIS2_PLACEMENT_3D ( 'NONE', #518, #579, #187 ) ;
#574 = DIRECTION ( 'NONE',  ( -0.0000000000000000000, 0.0000000000000000000, -1.000000000000000000 ) ) ;
#575 = LENGTH_MEASURE_WITH_UNIT ( LENGTH_MEASURE( 0.02539999999999999897 ), #354 );
#576 = CONICAL_SURFACE ( 'NONE', #471, 0.02900000000000000147, 0.2617993877993758933 ) ;
#577 = DIRECTION ( 'NONE',  ( -1.000000000000000000, -0.0000000000000000000, -0.0000000000000000000 ) ) ;
#578 = EDGE_CURVE ( 'NONE', #619, #97, #282, .T. ) ;
#579 = DIRECTION ( 'NONE',  ( -1.000000000000000000, -0.0000000000000000000, -0.0000000000000000000 ) ) ;
#580 = FACE_OUTER_BOUND ( 'NONE', #53, .T. ) ;
#581 = DIRECTION ( 'NONE',  ( -1.000000000000000000, -0.0000000000000000000, -0.0000000000000000000 ) ) ;
#582 = DIRECTION ( 'NONE',  ( -1.000000000000000000, -0.0000000000000000000, -0.0000000000000000000 ) ) ;
#583 = CIRCLE ( 'NONE', #388, 0.008500000000000200104 ) ;
#584 = CARTESIAN_POINT ( 'NONE',  ( 0.1241961524226974228, 0.0000000000000000000, 0.02900000000000000147 ) ) ;
#585 = CONICAL_SURFACE ( 'NONE', #691, 0.02726794919243105686, 0.5235987755983000369 ) ;
#586 = ORIENTED_EDGE ( 'NONE', *, *, #333, .F. ) ;
#587 =( CONVERSION_BASED_UNIT ( 'INCH', #575 ) LENGTH_UNIT ( ) NAMED_UNIT ( #150 ) );
#588 = DIRECTION ( 'NONE',  ( 0.0000000000000000000, 0.0000000000000000000, 1.000000000000000000 ) ) ;
#589 = VERTEX_POINT ( 'NONE', #595 ) ;
#590 = EDGE_CURVE ( 'NONE', #663, #371, #119, .T. ) ;
#591 = DIRECTION ( 'NONE',  ( 0.0000000000000000000, 0.0000000000000000000, 1.000000000000000000 ) ) ;
#592 = EDGE_CURVE ( 'NONE', #137, #287, #624, .T. ) ;
#593 = DIRECTION ( 'NONE',  ( -1.000000000000000000, -0.0000000000000000000, -0.0000000000000000000 ) ) ;
#594 = ORIENTED_EDGE ( 'NONE', *, *, #686, .T. ) ;
#595 = CARTESIAN_POINT ( 'NONE',  ( 0.1241961524226974228, 0.0000000000000000000, 0.02900000000000000147 ) ) ;
#596 = AXIS2_PLACEMENT_3D ( 'NONE', #567, #10, #356 ) ;
#597 = DIRECTION ( 'NONE',  ( -1.000000000000000000, -0.0000000000000000000, -0.0000000000000000000 ) ) ;
#598 = CIRCLE ( 'NONE', #307, 0.02900000000000000147 ) ;
#599 = AXIS2_PLACEMENT_3D ( 'NONE', #242, #470, #80 ) ;
#600 = ORIENTED_EDGE ( 'NONE', *, *, #277, .F. ) ;
#601 =( NAMED_UNIT ( * ) SI_UNIT ( $, .STERADIAN. ) SOLID_ANGLE_UNIT ( ) );
#602 = CYLINDRICAL_SURFACE ( 'NONE', #91, 0.008500000000000196634 ) ;
#603 = ADVANCED_FACE ( 'NONE', ( #195 ), #585, .T. ) ;
#604 = VERTEX_POINT ( 'NONE', #207 ) ;
#605 = CARTESIAN_POINT ( 'NONE',  ( 0.06600000000000109945, 0.0000000000000000000, 0.008500000000000200104 ) ) ;
#606 = LINE ( 'NONE', #254, #65 ) ;
#607 = EDGE_LOOP ( 'NONE', ( #158, #38, #7, #668, #484 ) ) ;
#608 =( NAMED_UNIT ( * ) PLANE_ANGLE_UNIT ( ) SI_UNIT ( $, .RADIAN. ) );
#609 = ORIENTED_EDGE ( 'NONE', *, *, #437, .F. ) ;
#610 = CYLINDRICAL_SURFACE ( 'NONE', #329, 0.03049999999999999586 ) ;
#611 = VECTOR ( 'NONE', #577, 39.37007874015748143 ) ;
#612 = CIRCLE ( 'NONE', #84, 0.03049999999999999586 ) ;
#613 = ORIENTED_EDGE ( 'NONE', *, *, #5, .F. ) ;
#614 = DIRECTION ( 'NONE',  ( -1.000000000000000000, -0.0000000000000000000, -0.0000000000000000000 ) ) ;
#615 = DIRECTION ( 'NONE',  ( -1.000000000000000000, -0.0000000000000000000, -0.0000000000000000000 ) ) ;
#616 = VERTEX_POINT ( 'NONE', #92 ) ;
#617 = VERTEX_POINT ( 'NONE', #605 ) ;
#618 = CARTESIAN_POINT ( 'NONE',  ( 0.1851000000000010970, 0.0000000000000000000, 0.0000000000000000000 ) ) ;
#619 = VERTEX_POINT ( 'NONE', #704 ) ;
#620 = CARTESIAN_POINT ( 'NONE',  ( 0.08500000000000113021, 0.0000000000000000000, 0.0000000000000000000 ) ) ;
#621 = DIRECTION ( 'NONE',  ( -1.000000000000000000, -0.0000000000000000000, -0.0000000000000000000 ) ) ;
#622 = AXIS2_PLACEMENT_3D ( 'NONE', #196, #262, #258 ) ;
#623 = VERTEX_POINT ( 'NONE', #319 ) ;
#624 = CIRCLE ( 'NONE', #42, 0.008500000000000193165 ) ;
#625 = DIRECTION ( 'NONE',  ( -1.000000000000000000, -0.0000000000000000000, -0.0000000000000000000 ) ) ;
#626 = CARTESIAN_POINT ( 'NONE',  ( 0.1640000000000009783, 3.551475717527324911E-18, -0.02900000000000000147 ) ) ;
#627 = ADVANCED_FACE ( 'NONE', ( #537 ), #98, .T. ) ;
#628 = FILL_AREA_STYLE_COLOUR ( '', #175 ) ;
#629 = LINE ( 'NONE', #348, #184 ) ;
#630 = CARTESIAN_POINT ( 'NONE',  ( 0.06600000000000109945, 0.0000000000000000000, 0.0000000000000000000 ) ) ;
#631 = CARTESIAN_POINT ( 'NONE',  ( 0.0000000000000000000, 0.0000000000000000000, 0.0000000000000000000 ) ) ;
#632 = CYLINDRICAL_SURFACE ( 'NONE', #72, 0.03599999999999999728 ) ;
#633 = CIRCLE ( 'NONE', #622, 0.02900000000000000147 ) ;
#634 = CIRCLE ( 'NONE', #343, 0.03049999999999999239 ) ;
#635 = DIRECTION ( 'NONE',  ( 0.0000000000000000000, 1.224646799147353207E-16, -1.000000000000000000 ) ) ;
#636 = CARTESIAN_POINT ( 'NONE',  ( 0.1670000000000010920, 3.445418193654829579E-18, -0.02726794919243105686 ) ) ;
#637 = CARTESIAN_POINT ( 'NONE',  ( 0.0000000000000000000, 3.551475717527324911E-18, -0.02900000000000000147 ) ) ;
#638 = EDGE_CURVE ( 'NONE', #589, #565, #598, .T. ) ;
#639 = CIRCLE ( 'NONE', #695, 0.02089999999999999844 ) ;
#640 = CIRCLE ( 'NONE', #357, 0.03200000000000000067 ) ;
#641 = FACE_OUTER_BOUND ( 'NONE', #1, .T. ) ;
#642 = AXIS2_PLACEMENT_3D ( 'NONE', #109, #14, #222 ) ;
#643 = ADVANCED_FACE ( 'NONE', ( #498, #215 ), #60, .F. ) ;
#644 = EDGE_LOOP ( 'NONE', ( #87, #164, #330, #313 ) ) ;
#645 = EDGE_CURVE ( 'NONE', #371, #69, #318, .T. ) ;
#646 = CARTESIAN_POINT ( 'NONE',  ( 0.0000000000000000000, 0.0000000000000000000, 0.008500000000000196634 ) ) ;
#647 = ORIENTED_EDGE ( 'NONE', *, *, #149, .T. ) ;
#648 = CARTESIAN_POINT ( 'NONE',  ( 0.0000000000000000000, 0.0000000000000000000, 0.03599999999999999728 ) ) ;
#649 = ORIENTED_EDGE ( 'NONE', *, *, #179, .F. ) ;
#650 = CARTESIAN_POINT ( 'NONE',  ( 0.08500000000000113021, 0.03599999999999999728, 0.0000000000000000000 ) ) ;
#651 = AXIS2_PLACEMENT_3D ( 'NONE', #205, #382, #496 ) ;
#652 = DIRECTION ( 'NONE',  ( 0.0000000000000000000, 0.0000000000000000000, 1.000000000000000000 ) ) ;
#653 = AXIS2_PLACEMENT_3D ( 'NONE', #311, #359, #465 ) ;
#654 = VERTEX_POINT ( 'NONE', #274 ) ;
#655 = DIRECTION ( 'NONE',  ( -1.000000000000000000, -0.0000000000000000000, -0.0000000000000000000 ) ) ;
#656 = ORIENTED_EDGE ( 'NONE', *, *, #37, .F. ) ;
#657 = APPLICATION_CONTEXT ( 'automotive_design' ) ;
#658 = CARTESIAN_POINT ( 'NONE',  ( 0.06900000000000110212, 1.408343819019480803E-18, -0.01150000000000020103 ) ) ;
#659 = ORIENTED_EDGE ( 'NONE', *, *, #416, .F. ) ;
#660 = DIRECTION ( 'NONE',  ( -1.000000000000000000, -0.0000000000000000000, -0.0000000000000000000 ) ) ;
#661 = ORIENTED_EDGE ( 'NONE', *, *, #156, .F. ) ;
#662 = LINE ( 'NONE', #648, #217 ) ;
#663 = VERTEX_POINT ( 'NONE', #350 ) ;
#664 = CARTESIAN_POINT ( 'NONE',  ( 0.008500000000000193165, 0.0000000000000000000, 0.0000000000000000000 ) ) ;
#665 = CARTESIAN_POINT ( 'NONE',  ( 0.1851000000000010970, 0.0000000000000000000, 0.0000000000000000000 ) ) ;
#666 = AXIS2_PLACEMENT_3D ( 'NONE', #133, #368, #240 ) ;
#667 = ADVANCED_FACE ( 'NONE', ( #451 ), #566, .T. ) ;
#668 = ORIENTED_EDGE ( 'NONE', *, *, #35, .F. ) ;
#669 = AXIS2_PLACEMENT_3D ( 'NONE', #522, #33, #475 ) ;
#670 = ADVANCED_FACE ( 'NONE', ( #8 ), #401, .T. ) ;
#671 = DIRECTION ( 'NONE',  ( 0.0000000000000000000, 0.0000000000000000000, 1.000000000000000000 ) ) ;
#672 = ORIENTED_EDGE ( 'NONE', *, *, #638, .F. ) ;
#673 = FACE_OUTER_BOUND ( 'NONE', #346, .T. ) ;
#674 = VERTEX_POINT ( 'NONE', #289 ) ;
#675 = CARTESIAN_POINT ( 'NONE',  ( 0.0000000000000000000, 0.0000000000000000000, 0.0000000000000000000 ) ) ;
#676 = CARTESIAN_POINT ( 'NONE',  ( 0.1130000000000009330, 0.0000000000000000000, 0.0000000000000000000 ) ) ;
#677 = ORIENTED_EDGE ( 'NONE', *, *, #578, .T. ) ;
#678 = DIRECTION ( 'NONE',  ( 0.0000000000000000000, 0.0000000000000000000, 1.000000000000000000 ) ) ;
#679 = EDGE_CURVE ( 'NONE', #565, #499, #235, .T. ) ;
#680 = FACE_OUTER_BOUND ( 'NONE', #366, .T. ) ;
#681 = CIRCLE ( 'NONE', #364, 0.008500000000000194900 ) ;
#682 = DIRECTION ( 'NONE',  ( -1.000000000000000000, -0.0000000000000000000, -0.0000000000000000000 ) ) ;
#683 = PRESENTATION_LAYER_ASSIGNMENT (  '', '', ( #191 ) ) ;
#684 = DIRECTION ( 'NONE',  ( -0.9659258262890096924, 3.169619151434443987E-17, -0.2588190451027395089 ) ) ;
#685 = DIRECTION ( 'NONE',  ( -1.000000000000000000, -0.0000000000000000000, -0.0000000000000000000 ) ) ;
#686 = EDGE_CURVE ( 'NONE', #110, #153, #233, .T. ) ;
#687 = LINE ( 'NONE', #28, #532 ) ;
#688 = DIRECTION ( 'NONE',  ( -0.0000000000000000000, 0.0000000000000000000, -1.000000000000000000 ) ) ;
#689 = CARTESIAN_POINT ( 'NONE',  ( 0.1670000000000010920, 0.0000000000000000000, 0.0000000000000000000 ) ) ;
#690 = CIRCLE ( 'NONE', #142, 0.03599999999999999728 ) ;
#691 = AXIS2_PLACEMENT_3D ( 'NONE', #431, #372, #540 ) ;
#692 = DIRECTION ( 'NONE',  ( -1.000000000000000000, -0.0000000000000000000, -0.0000000000000000000 ) ) ;
#693 = CARTESIAN_POINT ( 'NONE',  ( 0.08500000000000113021, 0.0000000000000000000, 0.0000000000000000000 ) ) ;
#694 = EDGE_CURVE ( 'NONE', #326, #371, #186, .T. ) ;
#695 = AXIS2_PLACEMENT_3D ( 'NONE', #108, #553, #497 ) ;
#696 = ORIENTED_EDGE ( 'NONE', *, *, #638, .T. ) ;
#697 = CIRCLE ( 'NONE', #279, 0.03599999999999999728 ) ;
#698 = CYLINDRICAL_SURFACE ( 'NONE', #480, 0.02900000000000000147 ) ;
#699 = VECTOR ( 'NONE', #377, 39.37007874015748143 ) ;
#700 = ORIENTED_EDGE ( 'NONE', *, *, #177, .T. ) ;
#701 = DIRECTION ( 'NONE',  ( -1.000000000000000000, -0.0000000000000000000, -0.0000000000000000000 ) ) ;
#702 = DIRECTION ( 'NONE',  ( 0.0000000000000000000, 0.0000000000000000000, 1.000000000000000000 ) ) ;
#703 = ORIENTED_EDGE ( 'NONE', *, *, #592, .F. ) ;
#704 = CARTESIAN_POINT ( 'NONE',  ( 0.1670000000000010920, 2.559511810217967774E-18, -0.02089999999999999844 ) ) ;
#705 = DIRECTION ( 'NONE',  ( 0.0000000000000000000, 0.0000000000000000000, 1.000000000000000000 ) ) ;
#706 = ORIENTED_EDGE ( 'NONE', *, *, #464, .F. ) ;
#707 = AXIS2_PLACEMENT_3D ( 'NONE', #234, #568, #511 ) ;
#708 = CARTESIAN_POINT ( 'NONE',  ( 0.1670000000000010920, 0.0000000000000000000, 0.0000000000000000000 ) ) ;
#709 = AXIS2_PLACEMENT_3D ( 'NONE', #285, #685, #26 ) ;
#710 =( GEOMETRIC_REPRESENTATION_CONTEXT ( 3 ) GLOBAL_UNCERTAINTY_ASSIGNED_CONTEXT ( ( #170 ) ) GLOBAL_UNIT_ASSIGNED_CONTEXT ( ( #342, #347, #113 ) ) REPRESENTATION_CONTEXT ( 'NONE', 'WORKASPACE' ) );
#711 = VERTEX_POINT ( 'NONE', #167 ) ;
#712 = LINE ( 'NONE', #322, #699 ) ;
#713 = CARTESIAN_POINT ( 'NONE',  ( 0.008500000000000193165, 0.0000000000000000000, 0.0000000000000000000 ) ) ;
ENDSEC;
END-ISO-10303-21;
