(footprint "ublox_LARA" (version 20221018) (generator pcbnew)
  (layer "F.Cu")
  (attr smd)
  (fp_text reference "REF**" (at 0 -13 unlocked) (layer "F.SilkS")
      (effects (font (size 1 1) (thickness 0.15)))
    (tstamp 772d682d-d439-46bc-8f3b-1ba9270115b9)
  )
  (fp_text value "ublox_LARA" (at 0 1 unlocked) (layer "F.Fab") hide
      (effects (font (size 1 1) (thickness 0.15)))
    (tstamp 69ce3c2f-5433-43de-bf6d-e3446b4e9c11)
  )
  (fp_text user "^" (at -11 12.95 unlocked) (layer "F.SilkS")
      (effects (font (size 1 1) (thickness 0.15)))
    (tstamp 2fb1a02b-ee18-41c3-9b3b-6a1f3fbf438c)
  )
  (fp_text user "${REFERENCE}" (at 0 0 unlocked) (layer "F.Fab")
      (effects (font (size 1 1) (thickness 0.15)))
    (tstamp 0df89058-b163-4a58-9c32-cb48fd9afb4b)
  )
  (fp_rect (start -13 -12) (end 13 12)
    (stroke (width 0.1) (type solid)) (fill none) (layer "F.SilkS") (tstamp c9d9033a-91a6-4938-b237-650701a96226))
  (fp_rect (start -13.25 -12.25) (end 13.25 12.25)
    (stroke (width 0.05) (type solid)) (fill none) (layer "F.CrtYd") (tstamp 8859225a-20a5-4835-a108-4f104d24ff0d))
  (fp_line (start -13 -12) (end 13 -12)
    (stroke (width 0.1) (type solid)) (layer "F.Fab") (tstamp d69fff29-6757-45e1-b0bf-60ada09dd073))
  (fp_line (start -13 11) (end -13 -12)
    (stroke (width 0.1) (type solid)) (layer "F.Fab") (tstamp 6ccc0b16-3439-42ae-8309-0b82730bb380))
  (fp_line (start -12 12) (end -13 11)
    (stroke (width 0.1) (type solid)) (layer "F.Fab") (tstamp 56112708-c801-47b6-b815-560a43da30a1))
  (fp_line (start 13 -12) (end 13 12)
    (stroke (width 0.1) (type solid)) (layer "F.Fab") (tstamp 96cb8aaa-0241-4c1a-9b11-371a8d400f73))
  (fp_line (start 13 12) (end -12 12)
    (stroke (width 0.1) (type solid)) (layer "F.Fab") (tstamp 4dd46e52-41d1-49ef-81a6-d51eb9af7462))
  (pad "" smd roundrect (at -12.1 7) (size 0.6 0.6) (layers "F.Cu" "F.Paste" "F.Mask") (roundrect_rratio 0.08333333333) (tstamp c89b818e-5a8f-4f34-8064-199bbba26807))
  (pad "1" smd roundrect (at -11 6.95 270) (size 1.5 0.8) (layers "F.Cu" "F.Paste" "F.Mask") (roundrect_rratio 0.0625) (tstamp a2c48875-0791-4b3f-a606-d714f32ae3d3))
  (pad "2" smd roundrect (at -9.9 6.95 270) (size 1.5 0.8) (layers "F.Cu" "F.Paste" "F.Mask") (roundrect_rratio 0.0625) (tstamp 25564039-7e8d-4a02-995a-5ba796d71cb4))
  (pad "3" smd roundrect (at -8.8 6.95 270) (size 1.5 0.8) (layers "F.Cu" "F.Paste" "F.Mask") (roundrect_rratio 0.0625) (tstamp de5d842f-0065-45af-bf7f-ef82758efbc1))
  (pad "4" smd roundrect (at -7.7 6.95 270) (size 1.5 0.8) (layers "F.Cu" "F.Paste" "F.Mask") (roundrect_rratio 0.0625) (tstamp 929ca464-d26c-4936-a501-68c45a141f5f))
  (pad "5" smd roundrect (at -6.6 6.95 270) (size 1.5 0.8) (layers "F.Cu" "F.Paste" "F.Mask") (roundrect_rratio 0.0625) (tstamp 8d0a8dbe-9372-4fe6-a785-dd30c0d74621))
  (pad "6" smd roundrect (at -5.5 6.95 270) (size 1.5 0.8) (layers "F.Cu" "F.Paste" "F.Mask") (roundrect_rratio 0.0625) (tstamp fb0f9b91-e5c4-4df6-99b8-ee68e52e690f))
  (pad "7" smd roundrect (at -4.4 6.95 270) (size 1.5 0.8) (layers "F.Cu" "F.Paste" "F.Mask") (roundrect_rratio 0.0625) (tstamp cc72cb50-da96-4815-b9d4-6cb4af6208fe))
  (pad "8" smd roundrect (at -3.3 6.95 270) (size 1.5 0.8) (layers "F.Cu" "F.Paste" "F.Mask") (roundrect_rratio 0.0625) (tstamp 3bcbbcde-ec03-41f1-8d2e-ab46786c1047))
  (pad "9" smd roundrect (at -2.2 6.95 270) (size 1.5 0.8) (layers "F.Cu" "F.Paste" "F.Mask") (roundrect_rratio 0.0625) (tstamp e52bb220-66c3-4130-84f1-be8a86e2902d))
  (pad "10" smd roundrect (at -1.1 6.95 270) (size 1.5 0.8) (layers "F.Cu" "F.Paste" "F.Mask") (roundrect_rratio 0.0625) (tstamp 184dc54c-14ad-4189-98d8-9bea99da6d8b))
  (pad "11" smd roundrect (at 0 6.95 270) (size 1.5 0.8) (layers "F.Cu" "F.Paste" "F.Mask") (roundrect_rratio 0.0625) (tstamp 56eeee84-53f4-4b02-aad7-6d6b3f39a255))
  (pad "12" smd roundrect (at 1.1 6.95 270) (size 1.5 0.8) (layers "F.Cu" "F.Paste" "F.Mask") (roundrect_rratio 0.0625) (tstamp 3aaa6030-dd05-4895-85ba-f81287c76d66))
  (pad "13" smd roundrect (at 2.2 6.95 270) (size 1.5 0.8) (layers "F.Cu" "F.Paste" "F.Mask") (roundrect_rratio 0.0625) (tstamp 945cb1c8-c456-4b4c-8168-25c77a791aec))
  (pad "14" smd roundrect (at 3.3 6.95 270) (size 1.5 0.8) (layers "F.Cu" "F.Paste" "F.Mask") (roundrect_rratio 0.0625) (tstamp 28f169fa-6b04-46a0-9f89-c974126f77e8))
  (pad "15" smd roundrect (at 4.4 6.95 270) (size 1.5 0.8) (layers "F.Cu" "F.Paste" "F.Mask") (roundrect_rratio 0.0625) (tstamp ba5d44da-c33e-4589-bf11-57493e2fd1cb))
  (pad "16" smd roundrect (at 5.5 6.95 270) (size 1.5 0.8) (layers "F.Cu" "F.Paste" "F.Mask") (roundrect_rratio 0.0625) (tstamp 4a963dec-5a7e-4fd4-9659-1fef983e1c53))
  (pad "17" smd roundrect (at 6.6 6.95 270) (size 1.5 0.8) (layers "F.Cu" "F.Paste" "F.Mask") (roundrect_rratio 0.0625) (tstamp ccb5339a-58e3-47d1-92c2-921d48560dab))
  (pad "18" smd roundrect (at 7.7 6.95 270) (size 1.5 0.8) (layers "F.Cu" "F.Paste" "F.Mask") (roundrect_rratio 0.0625) (tstamp 8b8b6d25-3798-4483-a1e1-6a40054484bc))
  (pad "19" smd roundrect (at 8.8 6.95 270) (size 1.5 0.8) (layers "F.Cu" "F.Paste" "F.Mask") (roundrect_rratio 0.0625) (tstamp b024ad69-4a1a-4c54-8b04-7ee3bbf246b6))
  (pad "20" smd roundrect (at 9.9 6.95 270) (size 1.5 0.8) (layers "F.Cu" "F.Paste" "F.Mask") (roundrect_rratio 0.0625) (tstamp 3cc195a5-c7af-46fc-9fd8-4f44dc1946be))
  (pad "21" smd roundrect (at 11 6.95 270) (size 1.5 0.8) (layers "F.Cu" "F.Paste" "F.Mask") (roundrect_rratio 0.0625) (tstamp b189e769-221e-4c31-84a9-adb8e6efc177))
  (pad "22" smd roundrect (at 11.95 5.5) (size 1.5 0.8) (layers "F.Cu" "F.Paste" "F.Mask") (roundrect_rratio 0.0625) (tstamp 72496576-2a91-494a-9028-0ce01472cf42))
  (pad "23" smd roundrect (at 11.95 4.4) (size 1.5 0.8) (layers "F.Cu" "F.Paste" "F.Mask") (roundrect_rratio 0.0625) (tstamp 8e94065e-a582-4d28-bd2f-57535b268b74))
  (pad "24" smd roundrect (at 11.95 3.3) (size 1.5 0.8) (layers "F.Cu" "F.Paste" "F.Mask") (roundrect_rratio 0.0625) (tstamp 495940e7-3d92-48f8-b2ea-f7cac9828432))
  (pad "25" smd roundrect (at 11.95 2.2) (size 1.5 0.8) (layers "F.Cu" "F.Paste" "F.Mask") (roundrect_rratio 0.0625) (tstamp d5d78079-8865-4208-9a01-93416ff1151f))
  (pad "26" smd roundrect (at 11.95 1.1) (size 1.5 0.8) (layers "F.Cu" "F.Paste" "F.Mask") (roundrect_rratio 0.0625) (tstamp d0c1ed6f-ea02-4744-b888-dc6e9d4a7943))
  (pad "27" smd roundrect (at 11.95 0) (size 1.5 0.8) (layers "F.Cu" "F.Paste" "F.Mask") (roundrect_rratio 0.0625) (tstamp 0903172f-8d81-4418-988b-00588a0dad12))
  (pad "28" smd roundrect (at 11.95 -1.1) (size 1.5 0.8) (layers "F.Cu" "F.Paste" "F.Mask") (roundrect_rratio 0.0625) (tstamp 5315340d-0132-49c9-909d-15d957cb27e5))
  (pad "29" smd roundrect (at 11.95 -2.2) (size 1.5 0.8) (layers "F.Cu" "F.Paste" "F.Mask") (roundrect_rratio 0.0625) (tstamp 0eb34618-74d0-442f-aa9c-0b82d61ed105))
  (pad "30" smd roundrect (at 11.95 -3.3) (size 1.5 0.8) (layers "F.Cu" "F.Paste" "F.Mask") (roundrect_rratio 0.0625) (tstamp 92a383c5-c4ab-4c35-aad9-cfc2c642f5cf))
  (pad "31" smd roundrect (at 11.95 -4.4) (size 1.5 0.8) (layers "F.Cu" "F.Paste" "F.Mask") (roundrect_rratio 0.0625) (tstamp 69a48ee7-347c-443c-9e5d-d4f319a0967f))
  (pad "32" smd roundrect (at 11.95 -5.5) (size 1.5 0.8) (layers "F.Cu" "F.Paste" "F.Mask") (roundrect_rratio 0.0625) (tstamp 369c7d23-e353-4745-875a-7f661633d4d4))
  (pad "33" smd roundrect (at 11 -6.95 270) (size 1.5 0.8) (layers "F.Cu" "F.Paste" "F.Mask") (roundrect_rratio 0.0625) (tstamp e9b89d17-6f09-4d7c-a0ac-7228c073487a))
  (pad "34" smd roundrect (at 9.9 -6.95 270) (size 1.5 0.8) (layers "F.Cu" "F.Paste" "F.Mask") (roundrect_rratio 0.0625) (tstamp 9341e627-6c58-43bf-803d-3d1c43bf112b))
  (pad "35" smd roundrect (at 8.8 -6.95 270) (size 1.5 0.8) (layers "F.Cu" "F.Paste" "F.Mask") (roundrect_rratio 0.0625) (tstamp f1114afe-ecc7-4a6b-a042-db8e6b5e8e41))
  (pad "36" smd roundrect (at 7.7 -6.95 270) (size 1.5 0.8) (layers "F.Cu" "F.Paste" "F.Mask") (roundrect_rratio 0.0625) (tstamp 394ffa39-28be-4088-84a0-842637034905))
  (pad "37" smd roundrect (at 6.6 -6.95 270) (size 1.5 0.8) (layers "F.Cu" "F.Paste" "F.Mask") (roundrect_rratio 0.0625) (tstamp 0f89fabd-ba2a-48a5-86ef-32bd2cfb261f))
  (pad "38" smd roundrect (at 5.5 -6.95 270) (size 1.5 0.8) (layers "F.Cu" "F.Paste" "F.Mask") (roundrect_rratio 0.0625) (tstamp bcf22f34-2ff4-4356-b5a6-e976916f3ec2))
  (pad "39" smd roundrect (at 4.4 -6.95 270) (size 1.5 0.8) (layers "F.Cu" "F.Paste" "F.Mask") (roundrect_rratio 0.0625) (tstamp 3803e902-fc0b-41bf-bc62-f5680c156b25))
  (pad "40" smd roundrect (at 3.3 -6.95 270) (size 1.5 0.8) (layers "F.Cu" "F.Paste" "F.Mask") (roundrect_rratio 0.0625) (tstamp 85191b76-6b36-46f8-b469-0c5a580f83c6))
  (pad "41" smd roundrect (at 2.2 -6.95 270) (size 1.5 0.8) (layers "F.Cu" "F.Paste" "F.Mask") (roundrect_rratio 0.0625) (tstamp 8172d20f-b4a9-44d9-a673-cbe42d42a166))
  (pad "42" smd roundrect (at 1.1 -6.95 270) (size 1.5 0.8) (layers "F.Cu" "F.Paste" "F.Mask") (roundrect_rratio 0.0625) (tstamp eea09975-f28b-4dd3-a642-bb889736b212))
  (pad "43" smd roundrect (at 0 -6.95 270) (size 1.5 0.8) (layers "F.Cu" "F.Paste" "F.Mask") (roundrect_rratio 0.0625) (tstamp 99f9c46e-2f27-4647-859a-f447672b3c94))
  (pad "44" smd roundrect (at -1.1 -6.95 270) (size 1.5 0.8) (layers "F.Cu" "F.Paste" "F.Mask") (roundrect_rratio 0.0625) (tstamp 7b325be5-3dcc-4c67-b700-b12e46e0a461))
  (pad "45" smd roundrect (at -2.2 -6.95 270) (size 1.5 0.8) (layers "F.Cu" "F.Paste" "F.Mask") (roundrect_rratio 0.0625) (tstamp 5f88f61c-164b-4b1e-a962-2033d106836a))
  (pad "46" smd roundrect (at -3.3 -6.95 270) (size 1.5 0.8) (layers "F.Cu" "F.Paste" "F.Mask") (roundrect_rratio 0.0625) (tstamp 1d5ec4fc-3760-44c9-9164-b77c0c78888c))
  (pad "47" smd roundrect (at -4.4 -6.95 270) (size 1.5 0.8) (layers "F.Cu" "F.Paste" "F.Mask") (roundrect_rratio 0.0625) (tstamp 8a468ad1-3b02-404c-9a22-5c5b09a9a1fb))
  (pad "48" smd roundrect (at -5.5 -6.95 270) (size 1.5 0.8) (layers "F.Cu" "F.Paste" "F.Mask") (roundrect_rratio 0.0625) (tstamp ccb92ed5-9cdd-40b9-9151-0bc8548083be))
  (pad "49" smd roundrect (at -6.6 -6.95 270) (size 1.5 0.8) (layers "F.Cu" "F.Paste" "F.Mask") (roundrect_rratio 0.0625) (tstamp 244c30bb-0976-4f0f-9f83-cb68224d17a9))
  (pad "50" smd roundrect (at -7.7 -6.95 270) (size 1.5 0.8) (layers "F.Cu" "F.Paste" "F.Mask") (roundrect_rratio 0.0625) (tstamp de0678b3-1fbd-4d78-a490-897f261c05e3))
  (pad "51" smd roundrect (at -8.8 -6.95 270) (size 1.5 0.8) (layers "F.Cu" "F.Paste" "F.Mask") (roundrect_rratio 0.0625) (tstamp 5146c7c2-6f01-4766-ab4c-ae729d7bafda))
  (pad "52" smd roundrect (at -9.9 -6.95 270) (size 1.5 0.8) (layers "F.Cu" "F.Paste" "F.Mask") (roundrect_rratio 0.0625) (tstamp 2c704254-6c65-4de0-ab95-f79f4f4dff3e))
  (pad "53" smd roundrect (at -11 -6.95 270) (size 1.5 0.8) (layers "F.Cu" "F.Paste" "F.Mask") (roundrect_rratio 0.0625) (tstamp f0cb88c8-cbbf-4701-812a-63b2a1a66976))
  (pad "54" smd roundrect (at -11.95 -5.5) (size 1.5 0.8) (layers "F.Cu" "F.Paste" "F.Mask") (roundrect_rratio 0.0625) (tstamp b98f4c1d-c216-40b7-a923-29ad11f15e9e))
  (pad "55" smd roundrect (at -11.95 -4.4) (size 1.5 0.8) (layers "F.Cu" "F.Paste" "F.Mask") (roundrect_rratio 0.0625) (tstamp 10410155-65c9-4eb7-80df-b5ad95d8f6be))
  (pad "56" smd roundrect (at -11.95 -3.3) (size 1.5 0.8) (layers "F.Cu" "F.Paste" "F.Mask") (roundrect_rratio 0.0625) (tstamp c35ae922-184b-4138-9f0a-00b88e700067))
  (pad "57" smd roundrect (at -11.95 -2.2) (size 1.5 0.8) (layers "F.Cu" "F.Paste" "F.Mask") (roundrect_rratio 0.0625) (tstamp db1ece31-a560-46bd-8280-1008e34c236f))
  (pad "58" smd roundrect (at -11.95 -1.1) (size 1.5 0.8) (layers "F.Cu" "F.Paste" "F.Mask") (roundrect_rratio 0.0625) (tstamp 448a82a2-3a72-453a-8ed0-c4aa6047a5b9))
  (pad "59" smd roundrect (at -11.95 0) (size 1.5 0.8) (layers "F.Cu" "F.Paste" "F.Mask") (roundrect_rratio 0.0625) (tstamp bd331b7e-4de0-4752-bbf2-95f7cb5c1e84))
  (pad "60" smd roundrect (at -11.95 1.1) (size 1.5 0.8) (layers "F.Cu" "F.Paste" "F.Mask") (roundrect_rratio 0.0625) (tstamp eb266468-1cf9-4601-8da9-d9d77aebaa4d))
  (pad "61" smd roundrect (at -11.95 2.2) (size 1.5 0.8) (layers "F.Cu" "F.Paste" "F.Mask") (roundrect_rratio 0.0625) (tstamp 3c4de296-3841-4077-9c53-e3978db894d3))
  (pad "62" smd roundrect (at -11.95 3.3) (size 1.5 0.8) (layers "F.Cu" "F.Paste" "F.Mask") (roundrect_rratio 0.0625) (tstamp 1b6efb4c-c7d8-4b33-8b3c-422a2f43e6ed))
  (pad "63" smd roundrect (at -11.95 4.4) (size 1.5 0.8) (layers "F.Cu" "F.Paste" "F.Mask") (roundrect_rratio 0.0625) (tstamp 171f8add-eea5-45a5-ba66-bbcb6165d29c))
  (pad "64" smd roundrect (at -11.95 5.5) (size 1.5 0.8) (layers "F.Cu" "F.Paste" "F.Mask") (roundrect_rratio 0.0625) (tstamp 85a92828-19bd-4174-9765-ff06a2b0c215))
  (pad "65" smd roundrect (at -10.25 5.25) (size 1.1 1.1) (layers "F.Cu" "F.Paste" "F.Mask") (roundrect_rratio 0.04545454545) (tstamp 5ad5854d-30a7-4c47-af52-ef195b80f8df))
  (pad "66" smd roundrect (at -10.25 3.15) (size 1.1 1.1) (layers "F.Cu" "F.Paste" "F.Mask") (roundrect_rratio 0.04545454545) (tstamp 54ebce32-d8e4-4d3c-811d-70773b8b26cc))
  (pad "67" smd roundrect (at -10.25 1.05) (size 1.1 1.1) (layers "F.Cu" "F.Paste" "F.Mask") (roundrect_rratio 0.04545454545) (tstamp 4e511889-dc2c-40c0-8b09-82bf571ffa85))
  (pad "68" smd roundrect (at -10.25 -1.05) (size 1.1 1.1) (layers "F.Cu" "F.Paste" "F.Mask") (roundrect_rratio 0.04545454545) (tstamp dc60661b-6e0c-4d26-abf7-f1fe6457de23))
  (pad "69" smd roundrect (at -10.25 -3.15) (size 1.1 1.1) (layers "F.Cu" "F.Paste" "F.Mask") (roundrect_rratio 0.04545454545) (tstamp 91224473-457a-4336-8e07-045788d57095))
  (pad "70" smd roundrect (at -10.25 -5.25) (size 1.1 1.1) (layers "F.Cu" "F.Paste" "F.Mask") (roundrect_rratio 0.04545454545) (tstamp ede0d4f3-743c-461c-af52-e8cb11497982))
  (pad "71" smd roundrect (at -8.45 5.25) (size 1.1 1.1) (layers "F.Cu" "F.Paste" "F.Mask") (roundrect_rratio 0.04545454545) (tstamp 44714088-76bb-4561-b10a-5e1dc27b5fad))
  (pad "72" smd roundrect (at -8.45 3.15) (size 1.1 1.1) (layers "F.Cu" "F.Paste" "F.Mask") (roundrect_rratio 0.04545454545) (tstamp e326a6fd-6b19-472a-b3f2-8bd150fa73ea))
  (pad "73" smd roundrect (at -8.45 1.05) (size 1.1 1.1) (layers "F.Cu" "F.Paste" "F.Mask") (roundrect_rratio 0.04545454545) (tstamp db672fe9-80d2-4d07-b575-4c3bb4439903))
  (pad "74" smd roundrect (at -8.45 -1.05) (size 1.1 1.1) (layers "F.Cu" "F.Paste" "F.Mask") (roundrect_rratio 0.04545454545) (tstamp 022736ed-eb78-452f-be7b-3b5f00720b99))
  (pad "75" smd roundrect (at -8.45 -3.15) (size 1.1 1.1) (layers "F.Cu" "F.Paste" "F.Mask") (roundrect_rratio 0.04545454545) (tstamp 21225233-a15a-4c5f-a671-924558a78f86))
  (pad "76" smd roundrect (at -8.45 -5.25) (size 1.1 1.1) (layers "F.Cu" "F.Paste" "F.Mask") (roundrect_rratio 0.04545454545) (tstamp a2e86cc9-cf33-4a41-b515-bd82d49c802b))
  (pad "77" smd roundrect (at -6.65 5.25) (size 1.1 1.1) (layers "F.Cu" "F.Paste" "F.Mask") (roundrect_rratio 0.04545454545) (tstamp afda2f08-d4ac-409f-b883-f9dcc5f211f4))
  (pad "78" smd roundrect (at -6.65 -5.25) (size 1.1 1.1) (layers "F.Cu" "F.Paste" "F.Mask") (roundrect_rratio 0.04545454545) (tstamp 04820983-f2c7-444f-b908-e24e077d3027))
  (pad "79" smd roundrect (at -3.05 5.25) (size 1.1 1.1) (layers "F.Cu" "F.Paste" "F.Mask") (roundrect_rratio 0.04545454545) (tstamp 45c2956b-fc36-40d6-acf2-e353c7554880))
  (pad "80" smd roundrect (at -3.05 -5.25) (size 1.1 1.1) (layers "F.Cu" "F.Paste" "F.Mask") (roundrect_rratio 0.04545454545) (tstamp ee95d7a8-823d-4922-a6f4-90b67e2129cb))
  (pad "81" smd roundrect (at 3.05 5.25) (size 1.1 1.1) (layers "F.Cu" "F.Paste" "F.Mask") (roundrect_rratio 0.04545454545) (tstamp 17c8cdf8-2a35-45a7-b5a2-a2bfc823b1e6))
  (pad "82" smd roundrect (at 3.05 -5.25) (size 1.1 1.1) (layers "F.Cu" "F.Paste" "F.Mask") (roundrect_rratio 0.04545454545) (tstamp 48fc42ef-21f8-42c4-8182-8800f8ea38fb))
  (pad "83" smd roundrect (at 6.65 5.25) (size 1.1 1.1) (layers "F.Cu" "F.Paste" "F.Mask") (roundrect_rratio 0.04545454545) (tstamp 97aeeea0-7c92-4ff7-806c-3f5290a355ea))
  (pad "84" smd roundrect (at 6.65 -5.25) (size 1.1 1.1) (layers "F.Cu" "F.Paste" "F.Mask") (roundrect_rratio 0.04545454545) (tstamp f39391b9-8dc7-4b55-82cb-89bb4469d15d))
  (pad "85" smd roundrect (at 8.45 5.25) (size 1.1 1.1) (layers "F.Cu" "F.Paste" "F.Mask") (roundrect_rratio 0.04545454545) (tstamp bfa5ef5a-d737-4e6d-8e5e-8c09a63d5def))
  (pad "86" smd roundrect (at 8.45 3.15) (size 1.1 1.1) (layers "F.Cu" "F.Paste" "F.Mask") (roundrect_rratio 0.04545454545) (tstamp 4088c1b9-9bd2-4f94-9683-11154b40db28))
  (pad "87" smd roundrect (at 8.45 1.05) (size 1.1 1.1) (layers "F.Cu" "F.Paste" "F.Mask") (roundrect_rratio 0.04545454545) (tstamp dc406c4b-37a8-49a3-9cdc-0e8bc3ef461e))
  (pad "88" smd roundrect (at 8.45 -1.05) (size 1.1 1.1) (layers "F.Cu" "F.Paste" "F.Mask") (roundrect_rratio 0.04545454545) (tstamp a350bdea-9f2b-497d-aa67-46d2678db3c9))
  (pad "89" smd roundrect (at 8.45 -3.15) (size 1.1 1.1) (layers "F.Cu" "F.Paste" "F.Mask") (roundrect_rratio 0.04545454545) (tstamp 28ccd529-2cd6-4a0f-8403-de07c85d823c))
  (pad "90" smd roundrect (at 8.45 -5.25) (size 1.1 1.1) (layers "F.Cu" "F.Paste" "F.Mask") (roundrect_rratio 0.04545454545) (tstamp 17ff8347-ce2c-4386-89dd-2413c8ace28a))
  (pad "91" smd roundrect (at 10.25 5.25) (size 1.1 1.1) (layers "F.Cu" "F.Paste" "F.Mask") (roundrect_rratio 0.04545454545) (tstamp e021d51d-25c5-4770-970d-bd4ee63db038))
  (pad "92" smd roundrect (at 10.25 3.15) (size 1.1 1.1) (layers "F.Cu" "F.Paste" "F.Mask") (roundrect_rratio 0.04545454545) (tstamp 13de7476-1f22-4068-8811-1b4133c7df59))
  (pad "93" smd roundrect (at 10.25 1.05) (size 1.1 1.1) (layers "F.Cu" "F.Paste" "F.Mask") (roundrect_rratio 0.04545454545) (tstamp efec9560-42aa-4b5e-95ff-2060fd1b4250))
  (pad "94" smd roundrect (at 10.25 -1.05) (size 1.1 1.1) (layers "F.Cu" "F.Paste" "F.Mask") (roundrect_rratio 0.04545454545) (tstamp 28837891-980d-4149-95dc-82f5f8978bac))
  (pad "95" smd roundrect (at 10.25 -3.15) (size 1.1 1.1) (layers "F.Cu" "F.Paste" "F.Mask") (roundrect_rratio 0.04545454545) (tstamp 9b34b34f-d7e4-429f-ad30-7dd45f9b1b3b))
  (pad "96" smd roundrect (at 10.25 -5.25) (size 1.1 1.1) (layers "F.Cu" "F.Paste" "F.Mask") (roundrect_rratio 0.04545454545) (tstamp 62e94267-0622-4e8c-8a47-e48844da806d))
  (pad "97" smd roundrect (at -6.65 1.05) (size 1.1 1.1) (layers "F.Cu" "F.Paste" "F.Mask") (roundrect_rratio 0.04545454545) (tstamp 771f834a-899f-4cea-9ab7-a39513c05ed1))
  (pad "98" smd roundrect (at -6.65 -1.05) (size 1.1 1.1) (layers "F.Cu" "F.Paste" "F.Mask") (roundrect_rratio 0.04545454545) (tstamp eccadc83-8f14-4a47-a7aa-43c66a57a18c))
  (pad "99" smd roundrect (at 6.65 1.05) (size 1.1 1.1) (layers "F.Cu" "F.Paste" "F.Mask") (roundrect_rratio 0.04545454545) (tstamp 7dd38129-23d3-4692-9d92-319b3f2bcfca))
  (pad "100" smd roundrect (at 6.65 -1.05) (size 1.1 1.1) (layers "F.Cu" "F.Paste" "F.Mask") (roundrect_rratio 0.04545454545) (tstamp 9ca386cc-b766-4d6a-9f81-cb498d5920bc))
  (model "${KICADLIB}/model/SoM/ublox_LARA.step"
    (offset (xyz 0.15 -0.65 -23.3))
    (scale (xyz 1 1 1))
    (rotate (xyz 0 0 -90))
  )
)
