(footprint "QFN50P500X500-33"
	(version 20240108)
	(generator "pcbnew")
	(generator_version "8.0")
	(layer "F.Cu")
	(property "Reference" "REF**"
		(at 0 -3.45 0)
		(layer "F.SilkS")
		(uuid "c971e5f2-a676-4bb5-989b-208e20818e19")
		(effects
			(font
				(size 0.8 0.8)
				(thickness 0.15)
			)
		)
	)
	(property "Value" "QFN50P500X500-33"
		(at 0 3.9 0)
		(layer "F.Fab")
		(hide yes)
		(uuid "bc033fad-dc5f-4cf2-b5d7-86223590de2c")
		(effects
			(font
				(size 1 1)
				(thickness 0.15)
			)
		)
	)
	(property "Footprint" "QFN50P500X500-33"
		(at 0 5.45 0)
		(unlocked yes)
		(layer "F.Fab")
		(hide yes)
		(uuid "189107ee-c726-4cb6-a966-d495284589eb")
		(effects
			(font
				(size 1.27 1.27)
			)
		)
	)
	(property "Datasheet" ""
		(at 0 0 0)
		(unlocked yes)
		(layer "F.Fab")
		(hide yes)
		(uuid "81cd7611-d425-42e4-84e1-d99f91eeb7d5")
		(effects
			(font
				(size 1.27 1.27)
			)
		)
	)
	(property "Description" ""
		(at 0 0 0)
		(unlocked yes)
		(layer "F.Fab")
		(hide yes)
		(uuid "5e001067-6fb7-41ce-9d59-e452442eeec0")
		(effects
			(font
				(size 1.27 1.27)
			)
		)
	)
	(attr smd)
	(fp_line
		(start -2.5 -2.5)
		(end -1.95 -2.5)
		(stroke
			(width 0.1)
			(type solid)
		)
		(layer "F.SilkS")
		(uuid "4680df04-d5f7-4149-b220-a506a77440e8")
	)
	(fp_line
		(start -2.5 -1.95)
		(end -2.5 -2.5)
		(stroke
			(width 0.1)
			(type solid)
		)
		(layer "F.SilkS")
		(uuid "51720867-04dd-467c-b2d0-04ae9fd23907")
	)
	(fp_line
		(start -2.5 2.5)
		(end -2.5 1.950002)
		(stroke
			(width 0.1)
			(type solid)
		)
		(layer "F.SilkS")
		(uuid "df8415b5-0adb-4b2e-9fc9-8d33ec2b9cc1")
	)
	(fp_line
		(start -1.95 2.500001)
		(end -2.5 2.5)
		(stroke
			(width 0.1)
			(type solid)
		)
		(layer "F.SilkS")
		(uuid "94ed3a81-6696-4630-986c-b772c7a788b5")
	)
	(fp_line
		(start 1.95 -2.500001)
		(end 2.5 -2.5)
		(stroke
			(width 0.1)
			(type solid)
		)
		(layer "F.SilkS")
		(uuid "a5b1fd87-6191-4e50-81ba-fab554105378")
	)
	(fp_line
		(start 2.5 -2.5)
		(end 2.5 -1.950002)
		(stroke
			(width 0.1)
			(type solid)
		)
		(layer "F.SilkS")
		(uuid "e2608c9d-ad69-451e-ae1f-879924d66bef")
	)
	(fp_line
		(start 2.5 2.5)
		(end 1.950002 2.5)
		(stroke
			(width 0.1)
			(type solid)
		)
		(layer "F.SilkS")
		(uuid "8bf27ae7-7101-4092-9e30-74a4ad7b063d")
	)
	(fp_line
		(start 2.500001 1.95)
		(end 2.5 2.5)
		(stroke
			(width 0.1)
			(type solid)
		)
		(layer "F.SilkS")
		(uuid "1bd3213a-1fda-462a-9130-92944203d28a")
	)
	(fp_rect
		(start -3 -3)
		(end 3 3)
		(stroke
			(width 0.05)
			(type default)
		)
		(fill none)
		(layer "F.CrtYd")
		(uuid "ff6269e0-335d-46b3-a7e8-c8e2cedf1c91")
	)
	(fp_poly
		(pts
			(xy 2.5 2.5) (xy -2.5 2.5) (xy -2.5 -2.1) (xy -2.05 -2.5) (xy 2.5 -2.5)
		)
		(stroke
			(width 0.1)
			(type solid)
		)
		(fill none)
		(layer "F.Fab")
		(uuid "69347472-25f2-4b11-be90-abb6895d4924")
	)
	(fp_text user "^"
		(at -3.65 -1.75 -90)
		(unlocked yes)
		(layer "F.SilkS")
		(uuid "40203cd0-fe76-4520-b75d-344664c48234")
		(effects
			(font
				(size 1 1)
				(thickness 0.15)
			)
		)
	)
	(fp_text user "${REFERENCE}"
		(at 0 0 0)
		(layer "F.Fab")
		(uuid "aaaa7562-4673-4b69-86a8-4cdc5d411aea")
		(effects
			(font
				(size 1 1)
				(thickness 0.15)
			)
		)
	)
	(pad "" smd roundrect
		(at -0.9 -0.9)
		(size 1.4 1.4)
		(layers "F.Paste")
		(roundrect_rratio 0.0303030303)
		(solder_paste_margin -0.1)
		(uuid "268a8682-1066-4168-95ae-2b0e891fb0ba")
	)
	(pad "" smd roundrect
		(at -0.9 0.9)
		(size 1.4 1.4)
		(layers "F.Paste")
		(roundrect_rratio 0.0303030303)
		(solder_paste_margin -0.1)
		(uuid "e4b75009-4b22-4366-8b31-3e75fefe2ee8")
	)
	(pad "" smd roundrect
		(at 0.9 -0.9)
		(size 1.4 1.4)
		(layers "F.Paste")
		(roundrect_rratio 0.0303030303)
		(solder_paste_margin -0.1)
		(uuid "c3da2ee3-9c4f-49e3-ab4d-a38b4561cb8a")
	)
	(pad "" smd roundrect
		(at 0.9 0.9)
		(size 1.4 1.4)
		(layers "F.Paste")
		(roundrect_rratio 0.0303030303)
		(solder_paste_margin -0.1)
		(uuid "58e61ee4-01a2-40ab-aa5e-9dd5f80743e5")
	)
	(pad "1" smd roundrect
		(at -2.5 -1.75 90)
		(size 0.25 0.8)
		(layers "F.Cu" "F.Paste" "F.Mask")
		(roundrect_rratio 0.2)
		(uuid "8a0a7b31-f91a-4603-811b-bea6cae1cd1d")
	)
	(pad "2" smd roundrect
		(at -2.5 -1.25 90)
		(size 0.25 0.8)
		(layers "F.Cu" "F.Paste" "F.Mask")
		(roundrect_rratio 0.2)
		(uuid "cff99080-35b1-444b-877a-a8dbf25a30c4")
	)
	(pad "3" smd roundrect
		(at -2.5 -0.75 90)
		(size 0.25 0.8)
		(layers "F.Cu" "F.Paste" "F.Mask")
		(roundrect_rratio 0.2)
		(uuid "ddda8465-9d52-41be-9772-84bc695386fc")
	)
	(pad "4" smd roundrect
		(at -2.5 -0.25 90)
		(size 0.25 0.8)
		(layers "F.Cu" "F.Paste" "F.Mask")
		(roundrect_rratio 0.2)
		(uuid "f32deac8-1785-42d8-86db-b5dfe202366c")
	)
	(pad "5" smd roundrect
		(at -2.5 0.25 90)
		(size 0.25 0.8)
		(layers "F.Cu" "F.Paste" "F.Mask")
		(roundrect_rratio 0.2)
		(uuid "a64b2510-6ae7-4fa4-8a36-4a3602c13ccb")
	)
	(pad "6" smd roundrect
		(at -2.5 0.75 90)
		(size 0.25 0.8)
		(layers "F.Cu" "F.Paste" "F.Mask")
		(roundrect_rratio 0.2)
		(uuid "2fa7ce9a-3b7b-4e72-bb09-9920f5adc13b")
	)
	(pad "7" smd roundrect
		(at -2.5 1.25 90)
		(size 0.25 0.8)
		(layers "F.Cu" "F.Paste" "F.Mask")
		(roundrect_rratio 0.2)
		(uuid "db7b85dc-9aa8-4ae0-8e7a-1b2d24f8f020")
	)
	(pad "8" smd roundrect
		(at -2.5 1.75 90)
		(size 0.25 0.8)
		(layers "F.Cu" "F.Paste" "F.Mask")
		(roundrect_rratio 0.2)
		(uuid "35641146-5e6b-4c2c-8559-ef38c6b9d101")
	)
	(pad "9" smd roundrect
		(at -1.75 2.5)
		(size 0.25 0.8)
		(layers "F.Cu" "F.Paste" "F.Mask")
		(roundrect_rratio 0.2)
		(uuid "54b81d95-4e8e-4198-b156-c3e995372dae")
	)
	(pad "10" smd roundrect
		(at -1.25 2.5)
		(size 0.25 0.8)
		(layers "F.Cu" "F.Paste" "F.Mask")
		(roundrect_rratio 0.2)
		(uuid "a44b2635-d134-46e0-ba53-d5b03ff476a8")
	)
	(pad "11" smd roundrect
		(at -0.75 2.5)
		(size 0.25 0.8)
		(layers "F.Cu" "F.Paste" "F.Mask")
		(roundrect_rratio 0.2)
		(uuid "a0003344-9e91-4470-89cc-f13868fe2996")
	)
	(pad "12" smd roundrect
		(at -0.25 2.5)
		(size 0.25 0.8)
		(layers "F.Cu" "F.Paste" "F.Mask")
		(roundrect_rratio 0.2)
		(uuid "b677b0e6-b438-4813-8a8a-1c4916f0c0bd")
	)
	(pad "13" smd roundrect
		(at 0.25 2.5)
		(size 0.25 0.8)
		(layers "F.Cu" "F.Paste" "F.Mask")
		(roundrect_rratio 0.2)
		(uuid "c73ff8ef-0ccd-46c4-a2db-539c9e22c3cf")
	)
	(pad "14" smd roundrect
		(at 0.75 2.5)
		(size 0.25 0.8)
		(layers "F.Cu" "F.Paste" "F.Mask")
		(roundrect_rratio 0.2)
		(uuid "c75910fa-6e56-4d0e-adbf-8f22d3e1c243")
	)
	(pad "15" smd roundrect
		(at 1.25 2.5)
		(size 0.25 0.8)
		(layers "F.Cu" "F.Paste" "F.Mask")
		(roundrect_rratio 0.2)
		(uuid "78957f95-1eb5-4679-8f0b-f083a1a75dba")
	)
	(pad "16" smd roundrect
		(at 1.75 2.5)
		(size 0.25 0.8)
		(layers "F.Cu" "F.Paste" "F.Mask")
		(roundrect_rratio 0.2)
		(uuid "7d6118d3-f489-4196-b53f-faf3b91e2c54")
	)
	(pad "17" smd roundrect
		(at 2.5 1.75 90)
		(size 0.25 0.8)
		(layers "F.Cu" "F.Paste" "F.Mask")
		(roundrect_rratio 0.2)
		(uuid "6bfc3f43-a7f4-47f5-8c92-aa897e8e0129")
	)
	(pad "18" smd roundrect
		(at 2.5 1.25 90)
		(size 0.25 0.8)
		(layers "F.Cu" "F.Paste" "F.Mask")
		(roundrect_rratio 0.2)
		(uuid "2675a8ce-154e-4083-8f25-11f4abf18586")
	)
	(pad "19" smd roundrect
		(at 2.5 0.75 90)
		(size 0.25 0.8)
		(layers "F.Cu" "F.Paste" "F.Mask")
		(roundrect_rratio 0.2)
		(uuid "7d1c4142-2c15-4ffd-95c3-f20bbd8b84d4")
	)
	(pad "20" smd roundrect
		(at 2.5 0.25 90)
		(size 0.25 0.8)
		(layers "F.Cu" "F.Paste" "F.Mask")
		(roundrect_rratio 0.2)
		(uuid "97ec92f1-0ab7-48d7-bd76-9d4c5760f261")
	)
	(pad "21" smd roundrect
		(at 2.5 -0.25 90)
		(size 0.25 0.8)
		(layers "F.Cu" "F.Paste" "F.Mask")
		(roundrect_rratio 0.2)
		(uuid "45ee7244-13ce-49a5-a68c-33224f98c26f")
	)
	(pad "22" smd roundrect
		(at 2.5 -0.75 90)
		(size 0.25 0.8)
		(layers "F.Cu" "F.Paste" "F.Mask")
		(roundrect_rratio 0.2)
		(uuid "942f5c1d-01ac-479d-9ae9-13160bf5e50e")
	)
	(pad "23" smd roundrect
		(at 2.5 -1.25 90)
		(size 0.25 0.8)
		(layers "F.Cu" "F.Paste" "F.Mask")
		(roundrect_rratio 0.2)
		(uuid "1827bcd6-506d-4126-ae89-1c6b1c7df74d")
	)
	(pad "24" smd roundrect
		(at 2.5 -1.75 90)
		(size 0.25 0.8)
		(layers "F.Cu" "F.Paste" "F.Mask")
		(roundrect_rratio 0.2)
		(uuid "ca72e816-b1aa-4d2a-966d-02f2ab4072a4")
	)
	(pad "25" smd roundrect
		(at 1.75 -2.5)
		(size 0.25 0.8)
		(layers "F.Cu" "F.Paste" "F.Mask")
		(roundrect_rratio 0.2)
		(uuid "017df4c0-f58b-40aa-be89-9a037a9f0111")
	)
	(pad "26" smd roundrect
		(at 1.25 -2.5)
		(size 0.25 0.8)
		(layers "F.Cu" "F.Paste" "F.Mask")
		(roundrect_rratio 0.2)
		(uuid "bd9934a8-9f34-4c98-afae-8ca6a56aba1e")
	)
	(pad "27" smd roundrect
		(at 0.75 -2.5)
		(size 0.25 0.8)
		(layers "F.Cu" "F.Paste" "F.Mask")
		(roundrect_rratio 0.2)
		(uuid "459e355a-bb3c-4aec-bc97-6360fe0e2254")
	)
	(pad "28" smd roundrect
		(at 0.25 -2.5)
		(size 0.25 0.8)
		(layers "F.Cu" "F.Paste" "F.Mask")
		(roundrect_rratio 0.2)
		(uuid "9c5025e6-aa70-4a9a-a0d1-cfec68daf36c")
	)
	(pad "29" smd roundrect
		(at -0.25 -2.5)
		(size 0.25 0.8)
		(layers "F.Cu" "F.Paste" "F.Mask")
		(roundrect_rratio 0.2)
		(uuid "1d66bcbd-85ef-4341-864d-c486d75654aa")
	)
	(pad "30" smd roundrect
		(at -0.75 -2.5)
		(size 0.25 0.8)
		(layers "F.Cu" "F.Paste" "F.Mask")
		(roundrect_rratio 0.2)
		(uuid "4847440a-004b-4a71-b00a-9aad480f2f00")
	)
	(pad "31" smd roundrect
		(at -1.25 -2.5)
		(size 0.25 0.8)
		(layers "F.Cu" "F.Paste" "F.Mask")
		(roundrect_rratio 0.2)
		(uuid "61271056-5338-4daf-a29a-2ee8f09ad470")
	)
	(pad "32" smd roundrect
		(at -1.75 -2.5)
		(size 0.25 0.8)
		(layers "F.Cu" "F.Paste" "F.Mask")
		(roundrect_rratio 0.2)
		(uuid "79acba92-79db-4277-8dde-bd79e38ceefd")
	)
	(pad "33" smd roundrect
		(at 0 0)
		(size 3.3 3.3)
		(layers "F.Cu" "F.Mask")
		(roundrect_rratio 0.01515151515)
		(solder_paste_margin -0.1)
		(uuid "6f00c91a-53ed-42e1-848d-5032448e5a2b")
	)
	(model "${KICADLIB}/model/QFN/QFN50P500X500-33.step"
		(offset
			(xyz 0 0 0)
		)
		(scale
			(xyz 1 1 1)
		)
		(rotate
			(xyz 0 0 0)
		)
	)
)
