(module SPEC-110-TH (layer F.Cu) (tedit 5AB3AA3C)
  (fp_text reference REF** (at 0 -11.5) (layer F.SilkS)
    (effects (font (size 1 1) (thickness 0.15)))
  )
  (fp_text value SPEC-110-TH (at 0 -13) (layer F.Fab)
    (effects (font (size 1 1) (thickness 0.15)))
  )
  (fp_line (start -10.408 -10.408) (end 10.408 -10.408) (layer F.SilkS) (width 0.15))
  (fp_line (start 10.408 -10.408) (end 10.408 10.408) (layer F.SilkS) (width 0.15))
  (fp_line (start 10.408 10.408) (end -10.408 10.408) (layer F.SilkS) (width 0.15))
  (fp_line (start -10.408 10.408) (end -10.408 -10.408) (layer F.SilkS) (width 0.15))
  (pad 1 thru_hole circle (at -1 8.89) (size 1.4 1.4) (drill 0.8) (layers *.Cu *.Mask))
  (pad 2 thru_hole circle (at -8.89 1) (size 1.4 1.4) (drill 0.8) (layers *.Cu *.Mask))
  (pad 3 thru_hole circle (at -8.89 -1) (size 1.4 1.4) (drill 0.8) (layers *.Cu *.Mask))
  (pad 4 thru_hole circle (at -1 -8.89) (size 1.4 1.4) (drill 0.8) (layers *.Cu *.Mask))
  (pad 5 thru_hole circle (at 1 -8.89) (size 1.4 1.4) (drill 0.8) (layers *.Cu *.Mask))
  (pad 6 thru_hole circle (at 1 8.89) (size 1.4 1.4) (drill 0.8) (layers *.Cu *.Mask))
  (model ${KICADLIB}/model/other/SPEC-110-TH.step
    (at (xyz 0 0 0))
    (scale (xyz 1 1 1))
    (rotate (xyz 0 0 0))
  )
)
