(footprint "PinHeader_2x16_P1.27mm_Vertical_SMD" (version 20210824) (generator pcbnew) (layer "F.Cu")
  (tedit 613262A4)
  (descr "surface-mounted straight pin header, 2x16, 1.27mm pitch, double rows")
  (tags "Surface mounted pin header SMD 2x16 1.27mm double row")
  (attr smd)
  (fp_text reference "REF**" (at 0 -11.22) (layer "F.SilkS")
    (effects (font (size 1 1) (thickness 0.15)))
    (tstamp 9a38e256-13bb-40ee-9dde-0dc588e5194b)
  )
  (fp_text value "PinHeader_2x16_P1.27mm_Vertical_SMD" (at 0 11.22) (layer "F.Fab") hide
    (effects (font (size 1 1) (thickness 0.15)))
    (tstamp 90295ae3-7ed8-453e-901d-fb1aef20ab0e)
  )
  (fp_text user "^" (at -4 -9.5 270 unlocked) (layer "F.SilkS")
    (effects (font (size 1 1) (thickness 0.15)))
    (tstamp c661a752-c838-43ab-b20f-306e53e16953)
  )
  (fp_text user "${REFERENCE}" (at 0 0 90) (layer "F.Fab")
    (effects (font (size 1 1) (thickness 0.15)))
    (tstamp 09d28861-929a-40b8-8628-1d76f5bebb4f)
  )
  (fp_line (start -1.765 -10.22) (end 1.765 -10.22) (layer "F.SilkS") (width 0.12) (tstamp 4aed2208-a4a4-4bd7-a9b5-0d5fea9086d8))
  (fp_line (start 1.765 10.155) (end 1.765 10.22) (layer "F.SilkS") (width 0.12) (tstamp 88f0c490-a0f3-47c1-b8f0-05fc064ebcd2))
  (fp_line (start -1.765 -10.22) (end -1.765 -10.155) (layer "F.SilkS") (width 0.12) (tstamp 9325ccec-a54d-4b9b-a0f0-84734814ee32))
  (fp_line (start -1.765 10.155) (end -1.765 10.22) (layer "F.SilkS") (width 0.12) (tstamp f06b7365-a6af-4e2d-9589-d1eaddfa7f02))
  (fp_line (start -1.765 10.22) (end 1.765 10.22) (layer "F.SilkS") (width 0.12) (tstamp f9dd1bda-73b6-4301-9562-a6a133f613b8))
  (fp_line (start 1.765 -10.22) (end 1.765 -10.155) (layer "F.SilkS") (width 0.12) (tstamp ff6fd489-91f2-4301-b50a-daa8fbafecbc))
  (fp_rect (start -3.8 -10.7) (end 3.8 10.8) (layer "F.CrtYd") (width 0.05) (fill none) (tstamp 3b70df16-9111-4473-b90b-d806d4fa034c))
  (fp_line (start 2.75 8.455) (end 1.705 8.455) (layer "F.Fab") (width 0.1) (tstamp 0000c99a-5a84-46a0-b470-cf32a084e168))
  (fp_line (start 2.75 6.785) (end 2.75 7.185) (layer "F.Fab") (width 0.1) (tstamp 0424db1d-2f0e-4376-9585-05a92a8c2e4f))
  (fp_line (start -2.75 9.325) (end -2.75 9.725) (layer "F.Fab") (width 0.1) (tstamp 0533670b-f41e-4120-b347-1748c1f5b769))
  (fp_line (start -1.705 -2.105) (end -2.75 -2.105) (layer "F.Fab") (width 0.1) (tstamp 05d4c0cd-bb81-47ab-8546-e1a7ac845de0))
  (fp_line (start 2.75 0.835) (end 1.705 0.835) (layer "F.Fab") (width 0.1) (tstamp 06ca3132-e07e-41fe-bacc-7ea19e9581a5))
  (fp_line (start 1.705 -8.455) (end 2.75 -8.455) (layer "F.Fab") (width 0.1) (tstamp 0b916431-40d4-47eb-8e94-10523c393286))
  (fp_line (start -2.75 -9.725) (end -2.75 -9.325) (layer "F.Fab") (width 0.1) (tstamp 10061a08-ee45-4341-b445-05899a8fcda2))
  (fp_line (start 2.75 0.435) (end 2.75 0.835) (layer "F.Fab") (width 0.1) (tstamp 1267ac54-630d-4b0c-b1af-2a7fc7789ab8))
  (fp_line (start 2.75 -6.785) (end 1.705 -6.785) (layer "F.Fab") (width 0.1) (tstamp 1290de86-9630-4886-8ae3-ad54c3686adc))
  (fp_line (start 2.75 5.915) (end 1.705 5.915) (layer "F.Fab") (width 0.1) (tstamp 17a3441a-66d9-4d09-b720-6f43b9056d5b))
  (fp_line (start -2.75 -5.515) (end -1.705 -5.515) (layer "F.Fab") (width 0.1) (tstamp 1b2fa105-ad21-4242-8825-cdd8a60092d0))
  (fp_line (start -2.75 -2.975) (end -1.705 -2.975) (layer "F.Fab") (width 0.1) (tstamp 1ec3f88a-c9b1-44f0-9588-144dc2d50c34))
  (fp_line (start 1.705 10.16) (end -1.705 10.16) (layer "F.Fab") (width 0.1) (tstamp 1fbedbf9-afaf-457d-972d-3b3747c625d2))
  (fp_line (start -2.75 -1.705) (end -1.705 -1.705) (layer "F.Fab") (width 0.1) (tstamp 1feb704d-0113-48c6-8945-6a20513df2ac))
  (fp_line (start -2.75 -8.055) (end -1.705 -8.055) (layer "F.Fab") (width 0.1) (tstamp 2207a39a-9589-45b5-bb60-829957da2256))
  (fp_line (start -1.705 -9.725) (end -1.27 -10.16) (layer "F.Fab") (width 0.1) (tstamp 23cd2282-37d5-4648-880a-79333a5ba745))
  (fp_line (start 1.705 -4.645) (end 2.75 -4.645) (layer "F.Fab") (width 0.1) (tstamp 23efb197-85d2-4807-9e24-ad812573e47e))
  (fp_line (start 1.705 -10.16) (end 1.705 10.16) (layer "F.Fab") (width 0.1) (tstamp 26823362-3829-4966-9337-dc9366c7efec))
  (fp_line (start 2.75 8.055) (end 2.75 8.455) (layer "F.Fab") (width 0.1) (tstamp 29f515cb-96f0-4f19-85aa-674e9305c457))
  (fp_line (start 1.705 6.785) (end 2.75 6.785) (layer "F.Fab") (width 0.1) (tstamp 2ae2fff7-d508-4e10-8cc3-0728777dcca7))
  (fp_line (start -1.705 9.325) (end -2.75 9.325) (layer "F.Fab") (width 0.1) (tstamp 2ba89a66-df64-46b6-9c23-1338786dfe98))
  (fp_line (start 2.75 -8.455) (end 2.75 -8.055) (layer "F.Fab") (width 0.1) (tstamp 2ee1f547-740c-4130-ba0d-f7059911a790))
  (fp_line (start 2.75 -1.705) (end 1.705 -1.705) (layer "F.Fab") (width 0.1) (tstamp 32eec766-5f19-4b47-9c36-17ed5c3ac9b6))
  (fp_line (start -2.75 0.435) (end -2.75 0.835) (layer "F.Fab") (width 0.1) (tstamp 43c2234b-5230-4bfd-8da7-a3ca4b9f053b))
  (fp_line (start 2.75 -5.515) (end 1.705 -5.515) (layer "F.Fab") (width 0.1) (tstamp 466fc2c8-7923-42b2-9db9-f2c756038e77))
  (fp_line (start -2.75 -2.105) (end -2.75 -1.705) (layer "F.Fab") (width 0.1) (tstamp 47235b92-3389-49fa-80f2-2d3cadd1441c))
  (fp_line (start -1.705 -7.185) (end -2.75 -7.185) (layer "F.Fab") (width 0.1) (tstamp 47e8d779-8511-4a88-8091-b254da57f377))
  (fp_line (start 1.705 1.705) (end 2.75 1.705) (layer "F.Fab") (width 0.1) (tstamp 4a12c660-d00c-48a5-a105-74d0cf6ea3b7))
  (fp_line (start -2.75 -3.375) (end -2.75 -2.975) (layer "F.Fab") (width 0.1) (tstamp 4b26d489-5ee5-44bd-ad4f-b4075014e087))
  (fp_line (start -1.705 -9.725) (end -2.75 -9.725) (layer "F.Fab") (width 0.1) (tstamp 50d4f8e6-347b-4510-b242-3af3349202a6))
  (fp_line (start -1.705 0.435) (end -2.75 0.435) (layer "F.Fab") (width 0.1) (tstamp 528b50d0-c415-4611-ab2c-a8af48ee49a7))
  (fp_line (start -1.705 -8.455) (end -2.75 -8.455) (layer "F.Fab") (width 0.1) (tstamp 53b19bb7-da45-4e0c-9fac-26ff2f775932))
  (fp_line (start 1.705 8.055) (end 2.75 8.055) (layer "F.Fab") (width 0.1) (tstamp 54138d24-60b1-40d0-910b-bc55f7eece88))
  (fp_line (start 2.75 9.325) (end 2.75 9.725) (layer "F.Fab") (width 0.1) (tstamp 55495072-01f1-4ca3-b92a-e446e24eabf0))
  (fp_line (start 2.75 5.515) (end 2.75 5.915) (layer "F.Fab") (width 0.1) (tstamp 5d4ed263-7c72-4e97-ac5c-5b12978d2d22))
  (fp_line (start -2.75 -4.645) (end -2.75 -4.245) (layer "F.Fab") (width 0.1) (tstamp 5e3542f9-27b2-42a2-b16f-e5d0bfb0daeb))
  (fp_line (start 1.705 -9.725) (end 2.75 -9.725) (layer "F.Fab") (width 0.1) (tstamp 5f03e66f-4d7f-4912-ae07-a6ea1dab9451))
  (fp_line (start 2.75 -7.185) (end 2.75 -6.785) (layer "F.Fab") (width 0.1) (tstamp 5fb6e062-4ca7-4f27-a115-3400897672ef))
  (fp_line (start -2.75 8.455) (end -1.705 8.455) (layer "F.Fab") (width 0.1) (tstamp 5fe688cf-4084-40a6-aa90-e53ce26ae966))
  (fp_line (start 2.75 9.725) (end 1.705 9.725) (layer "F.Fab") (width 0.1) (tstamp 6031d00a-cebb-45f2-bb74-1753a840cace))
  (fp_line (start -2.75 2.105) (end -1.705 2.105) (layer "F.Fab") (width 0.1) (tstamp 60cb99d3-798a-404f-bdb1-1663f8683925))
  (fp_line (start 1.705 2.975) (end 2.75 2.975) (layer "F.Fab") (width 0.1) (tstamp 616a674b-65f1-4975-8a3c-36677e5b9427))
  (fp_line (start 2.75 1.705) (end 2.75 2.105) (layer "F.Fab") (width 0.1) (tstamp 69546a87-68cd-4186-af80-320deacb6281))
  (fp_line (start -2.75 7.185) (end -1.705 7.185) (layer "F.Fab") (width 0.1) (tstamp 69fe8064-ddc1-4260-a0ab-4c0471dafb68))
  (fp_line (start 2.75 4.645) (end 1.705 4.645) (layer "F.Fab") (width 0.1) (tstamp 6a34f671-c37f-4843-8164-dafcd7f808df))
  (fp_line (start 2.75 2.975) (end 2.75 3.375) (layer "F.Fab") (width 0.1) (tstamp 6a89168a-3fd7-45c5-9cea-49bad8322706))
  (fp_line (start -2.75 5.915) (end -1.705 5.915) (layer "F.Fab") (width 0.1) (tstamp 6c93628e-9d8d-4551-bf27-b34eec760623))
  (fp_line (start -2.75 -0.835) (end -2.75 -0.435) (layer "F.Fab") (width 0.1) (tstamp 6cec05bd-8cc1-4d18-a403-5beb7f79cb0e))
  (fp_line (start -2.75 -0.435) (end -1.705 -0.435) (layer "F.Fab") (width 0.1) (tstamp 6d28581d-3b46-4376-9807-1ba573a37c56))
  (fp_line (start -2.75 3.375) (end -1.705 3.375) (layer "F.Fab") (width 0.1) (tstamp 70aa7c22-3e30-40c5-8b50-5a8ac39ae5cf))
  (fp_line (start 1.705 9.325) (end 2.75 9.325) (layer "F.Fab") (width 0.1) (tstamp 72f75c40-576d-4179-b146-c73463391543))
  (fp_line (start 1.705 -2.105) (end 2.75 -2.105) (layer "F.Fab") (width 0.1) (tstamp 748775c3-4e76-4352-836a-e52dc0c11ca5))
  (fp_line (start 1.705 -7.185) (end 2.75 -7.185) (layer "F.Fab") (width 0.1) (tstamp 78dc0f49-b2b1-43ce-acaf-c32137553c3b))
  (fp_line (start -2.75 4.645) (end -1.705 4.645) (layer "F.Fab") (width 0.1) (tstamp 79bdad92-9f64-48f7-9e70-d6aca6a856ce))
  (fp_line (start 1.705 -5.915) (end 2.75 -5.915) (layer "F.Fab") (width 0.1) (tstamp 7a94a402-65a8-4ae8-a28e-b649c5f90098))
  (fp_line (start -1.705 -5.915) (end -2.75 -5.915) (layer "F.Fab") (width 0.1) (tstamp 7d70d57d-3186-4bac-a382-b5a12f9adc56))
  (fp_line (start -2.75 4.245) (end -2.75 4.645) (layer "F.Fab") (width 0.1) (tstamp 864cd98c-556d-4739-a5ad-ebf67db58420))
  (fp_line (start -1.705 8.055) (end -2.75 8.055) (layer "F.Fab") (width 0.1) (tstamp 8fb42439-de35-414a-97f3-7f5f2e9165d9))
  (fp_line (start 1.705 -3.375) (end 2.75 -3.375) (layer "F.Fab") (width 0.1) (tstamp 929d3e14-49bb-4311-bb43-c5dc21b448cc))
  (fp_line (start 2.75 3.375) (end 1.705 3.375) (layer "F.Fab") (width 0.1) (tstamp 92cef55e-be65-4687-81e9-f01bf472077e))
  (fp_line (start -1.705 4.245) (end -2.75 4.245) (layer "F.Fab") (width 0.1) (tstamp 937964b7-47be-46c1-977f-f720798c7bb2))
  (fp_line (start -2.75 1.705) (end -2.75 2.105) (layer "F.Fab") (width 0.1) (tstamp 985e0a79-3830-4c2a-b987-da09cd2917fc))
  (fp_line (start -2.75 0.835) (end -1.705 0.835) (layer "F.Fab") (width 0.1) (tstamp 99df991c-ac6f-4989-9013-8e7e03c5f9ae))
  (fp_line (start -2.75 6.785) (end -2.75 7.185) (layer "F.Fab") (width 0.1) (tstamp 9ca7ae6e-758a-4023-b8e0-77f6c95abd98))
  (fp_line (start 1.705 0.435) (end 2.75 0.435) (layer "F.Fab") (width 0.1) (tstamp 9cda8684-4d95-414d-8614-d48c1e869ce3))
  (fp_line (start -2.75 8.055) (end -2.75 8.455) (layer "F.Fab") (width 0.1) (tstamp 9db6db54-25ed-4a02-9650-9d7a9646ad2c))
  (fp_line (start 2.75 -9.725) (end 2.75 -9.325) (layer "F.Fab") (width 0.1) (tstamp a0deae25-1d4c-41d4-9d2c-0248c55ed36a))
  (fp_line (start -2.75 2.975) (end -2.75 3.375) (layer "F.Fab") (width 0.1) (tstamp a6d43e36-7440-43c2-9f7d-ab6436a0b2ae))
  (fp_line (start -2.75 -9.325) (end -1.705 -9.325) (layer "F.Fab") (width 0.1) (tstamp aaa2a8d6-7b9e-44ed-bdc4-82df449a4d16))
  (fp_line (start -2.75 5.515) (end -2.75 5.915) (layer "F.Fab") (width 0.1) (tstamp aaf05a56-24ac-4b71-bcc0-c0d53752afe9))
  (fp_line (start 2.75 -5.915) (end 2.75 -5.515) (layer "F.Fab") (width 0.1) (tstamp ab2676c3-382a-4d1a-b90c-57f636d21e6f))
  (fp_line (start -1.705 5.515) (end -2.75 5.515) (layer "F.Fab") (width 0.1) (tstamp ab78bf6e-8e97-45fc-932a-607aa19d0dd7))
  (fp_line (start 1.705 5.515) (end 2.75 5.515) (layer "F.Fab") (width 0.1) (tstamp acdd6d3e-d31e-4462-b293-b9c0fd71e9f0))
  (fp_line (start 2.75 7.185) (end 1.705 7.185) (layer "F.Fab") (width 0.1) (tstamp ad8a92a6-c36e-46b4-9577-81617dfa0c06))
  (fp_line (start -2.75 9.725) (end -1.705 9.725) (layer "F.Fab") (width 0.1) (tstamp b5b0387b-280e-4679-a75a-7c35bfdc2408))
  (fp_line (start -2.75 -4.245) (end -1.705 -4.245) (layer "F.Fab") (width 0.1) (tstamp b8f838e7-c748-4f45-bd4f-11fcce2c8341))
  (fp_line (start 1.705 4.245) (end 2.75 4.245) (layer "F.Fab") (width 0.1) (tstamp ba164b5c-e2f6-4500-af1d-863b711b6d53))
  (fp_line (start -1.27 -10.16) (end 1.705 -10.16) (layer "F.Fab") (width 0.1) (tstamp bbeb9fec-0cec-4f43-9236-cd0955a81132))
  (fp_line (start -1.705 6.785) (end -2.75 6.785) (layer "F.Fab") (width 0.1) (tstamp bd7aa7cb-0b62-4c1b-a71d-63c52e6fc2d0))
  (fp_line (start -1.705 -3.375) (end -2.75 -3.375) (layer "F.Fab") (width 0.1) (tstamp be15defb-a3d4-416e-826c-72490f022df1))
  (fp_line (start -1.705 2.975) (end -2.75 2.975) (layer "F.Fab") (width 0.1) (tstamp c1768c0e-0f6e-45f6-9463-527e488e3a46))
  (fp_line (start 2.75 4.245) (end 2.75 4.645) (layer "F.Fab") (width 0.1) (tstamp c34f8301-53f7-4070-a007-3e25117c860d))
  (fp_line (start -1.705 -0.835) (end -2.75 -0.835) (layer "F.Fab") (width 0.1) (tstamp c7765c3a-de75-4ee1-8140-ab406d6976b5))
  (fp_line (start -2.75 -8.455) (end -2.75 -8.055) (layer "F.Fab") (width 0.1) (tstamp cc515742-12a3-49f1-b7d9-279f400af19f))
  (fp_line (start -2.75 -7.185) (end -2.75 -6.785) (layer "F.Fab") (width 0.1) (tstamp cd25d6eb-3343-4afb-b953-52bd04cf37c6))
  (fp_line (start 2.75 -2.105) (end 2.75 -1.705) (layer "F.Fab") (width 0.1) (tstamp cd2d7b0f-2509-4c86-924c-e8980d2decd0))
  (fp_line (start 2.75 -0.435) (end 1.705 -0.435) (layer "F.Fab") (width 0.1) (tstamp d07acf16-a6c6-413e-9e62-32cd9eb89ec9))
  (fp_line (start -1.705 10.16) (end -1.705 -9.725) (layer "F.Fab") (width 0.1) (tstamp d0f04c6d-fa81-4879-a930-556879e42fc6))
  (fp_line (start 2.75 -4.645) (end 2.75 -4.245) (layer "F.Fab") (width 0.1) (tstamp d448452b-ba3c-42b2-9fd8-84dabb31060d))
  (fp_line (start 2.75 2.105) (end 1.705 2.105) (layer "F.Fab") (width 0.1) (tstamp dd981579-7c2d-4be4-9e47-647725f1ac53))
  (fp_line (start 2.75 -9.325) (end 1.705 -9.325) (layer "F.Fab") (width 0.1) (tstamp e3e980f3-c726-447f-abaa-2ee1c66a6f9b))
  (fp_line (start 2.75 -3.375) (end 2.75 -2.975) (layer "F.Fab") (width 0.1) (tstamp e66fe56c-64ff-4678-a118-42dcc33efcd6))
  (fp_line (start 2.75 -8.055) (end 1.705 -8.055) (layer "F.Fab") (width 0.1) (tstamp ed0cea50-b0b5-4963-8d94-0937f5159106))
  (fp_line (start 2.75 -0.835) (end 2.75 -0.435) (layer "F.Fab") (width 0.1) (tstamp f4fe2658-c275-453d-838b-15eeddf7030d))
  (fp_line (start 1.705 -0.835) (end 2.75 -0.835) (layer "F.Fab") (width 0.1) (tstamp f6eb5bdd-345a-4101-a033-d63f17cb0d17))
  (fp_line (start -1.705 -4.645) (end -2.75 -4.645) (layer "F.Fab") (width 0.1) (tstamp f7f3a3ee-9d64-49bb-98d5-ec78f1a4ba95))
  (fp_line (start 2.75 -2.975) (end 1.705 -2.975) (layer "F.Fab") (width 0.1) (tstamp f8a47c54-21ca-48c2-9e54-ded46811abc2))
  (fp_line (start 2.75 -4.245) (end 1.705 -4.245) (layer "F.Fab") (width 0.1) (tstamp f929c9ed-7566-4bf9-a841-bd373ac16d60))
  (fp_line (start -1.705 1.705) (end -2.75 1.705) (layer "F.Fab") (width 0.1) (tstamp fb0cc46b-e779-43df-8686-1bbf55e05533))
  (fp_line (start -2.75 -5.915) (end -2.75 -5.515) (layer "F.Fab") (width 0.1) (tstamp fdbacae7-bd75-4b0e-b727-b547dff60e68))
  (fp_line (start -2.75 -6.785) (end -1.705 -6.785) (layer "F.Fab") (width 0.1) (tstamp fdd841f1-14e0-404b-8974-34113d06a707))
  (pad "1" smd rect (at -1.95 -9.525) (size 2.4 0.74) (layers "F.Cu" "F.Paste" "F.Mask") (tstamp c40c5dcb-ca31-4b45-bf46-49490e3c2090))
  (pad "2" smd rect (at 1.95 -9.525) (size 2.4 0.74) (layers "F.Cu" "F.Paste" "F.Mask") (tstamp 8baacbc5-17bf-4376-bc54-1ce3f58bdc05))
  (pad "3" smd rect (at -1.95 -8.255) (size 2.4 0.74) (layers "F.Cu" "F.Paste" "F.Mask") (tstamp b9cb358b-f320-4f7b-b45c-dd3d721f3ee0))
  (pad "4" smd rect (at 1.95 -8.255) (size 2.4 0.74) (layers "F.Cu" "F.Paste" "F.Mask") (tstamp 1ffe7cf0-2874-4a49-b80c-d0ae9b2336cc))
  (pad "5" smd rect (at -1.95 -6.985) (size 2.4 0.74) (layers "F.Cu" "F.Paste" "F.Mask") (tstamp 48103496-8671-45f8-8c1c-cff1d2aec185))
  (pad "6" smd rect (at 1.95 -6.985) (size 2.4 0.74) (layers "F.Cu" "F.Paste" "F.Mask") (tstamp 0376904e-5749-4f8d-a8e8-db7e22acffcf))
  (pad "7" smd rect (at -1.95 -5.715) (size 2.4 0.74) (layers "F.Cu" "F.Paste" "F.Mask") (tstamp 0c980137-5e9d-48b3-9003-ac1af5d7f14d))
  (pad "8" smd rect (at 1.95 -5.715) (size 2.4 0.74) (layers "F.Cu" "F.Paste" "F.Mask") (tstamp cdfd56e5-4ecd-4493-965c-c350f9f19691))
  (pad "9" smd rect (at -1.95 -4.445) (size 2.4 0.74) (layers "F.Cu" "F.Paste" "F.Mask") (tstamp 17687cce-1683-49e7-879d-5d9a3d4831d6))
  (pad "10" smd rect (at 1.95 -4.445) (size 2.4 0.74) (layers "F.Cu" "F.Paste" "F.Mask") (tstamp b07724b3-14da-4a48-a480-cf89f2bfc829))
  (pad "11" smd rect (at -1.95 -3.175) (size 2.4 0.74) (layers "F.Cu" "F.Paste" "F.Mask") (tstamp 25f5357e-f4df-416e-a33d-abf86fb0afca))
  (pad "12" smd rect (at 1.95 -3.175) (size 2.4 0.74) (layers "F.Cu" "F.Paste" "F.Mask") (tstamp edb10aaa-af33-408e-a414-fc08d6c58887))
  (pad "13" smd rect (at -1.95 -1.905) (size 2.4 0.74) (layers "F.Cu" "F.Paste" "F.Mask") (tstamp 99497d23-21c2-4e0e-bbef-d5c7c3593c58))
  (pad "14" smd rect (at 1.95 -1.905) (size 2.4 0.74) (layers "F.Cu" "F.Paste" "F.Mask") (tstamp ca17ce69-54dc-4e6d-9acd-2b00b730de40))
  (pad "15" smd rect (at -1.95 -0.635) (size 2.4 0.74) (layers "F.Cu" "F.Paste" "F.Mask") (tstamp 2d89521a-3851-4fec-949f-1435a2ce735e))
  (pad "16" smd rect (at 1.95 -0.635) (size 2.4 0.74) (layers "F.Cu" "F.Paste" "F.Mask") (tstamp bc7f5154-2c55-4ac1-b63e-a8cb8b436f54))
  (pad "17" smd rect (at -1.95 0.635) (size 2.4 0.74) (layers "F.Cu" "F.Paste" "F.Mask") (tstamp a3b5bca1-8f5a-4593-a156-cfb02e764360))
  (pad "18" smd rect (at 1.95 0.635) (size 2.4 0.74) (layers "F.Cu" "F.Paste" "F.Mask") (tstamp 83de40f3-b7bb-4aee-b9ae-8c92b308e8ad))
  (pad "19" smd rect (at -1.95 1.905) (size 2.4 0.74) (layers "F.Cu" "F.Paste" "F.Mask") (tstamp 4039b2d8-e67e-4c7b-b02e-db9854d0c22b))
  (pad "20" smd rect (at 1.95 1.905) (size 2.4 0.74) (layers "F.Cu" "F.Paste" "F.Mask") (tstamp 729b71ad-d3c0-4b45-b2b8-12fea3b25f6e))
  (pad "21" smd rect (at -1.95 3.175) (size 2.4 0.74) (layers "F.Cu" "F.Paste" "F.Mask") (tstamp 518ea3cc-823a-4de4-b156-74cf230604e4))
  (pad "22" smd rect (at 1.95 3.175) (size 2.4 0.74) (layers "F.Cu" "F.Paste" "F.Mask") (tstamp efb4d689-a677-424b-bb85-85fa33eac756))
  (pad "23" smd rect (at -1.95 4.445) (size 2.4 0.74) (layers "F.Cu" "F.Paste" "F.Mask") (tstamp 3e8eb4cc-1665-423c-91d1-0e3398307ae3))
  (pad "24" smd rect (at 1.95 4.445) (size 2.4 0.74) (layers "F.Cu" "F.Paste" "F.Mask") (tstamp a8aa963c-da9b-4b89-8f1b-26075170f579))
  (pad "25" smd rect (at -1.95 5.715) (size 2.4 0.74) (layers "F.Cu" "F.Paste" "F.Mask") (tstamp 59bf05d2-b795-4d95-8d78-749d317c2115))
  (pad "26" smd rect (at 1.95 5.715) (size 2.4 0.74) (layers "F.Cu" "F.Paste" "F.Mask") (tstamp 34a81183-014f-44bf-987a-6512492aad09))
  (pad "27" smd rect (at -1.95 6.985) (size 2.4 0.74) (layers "F.Cu" "F.Paste" "F.Mask") (tstamp 3703a654-1237-4121-8e13-5d89b177c4e9))
  (pad "28" smd rect (at 1.95 6.985) (size 2.4 0.74) (layers "F.Cu" "F.Paste" "F.Mask") (tstamp 929d5e61-2bf1-45a6-9d50-50598a9edc9a))
  (pad "29" smd rect (at -1.95 8.255) (size 2.4 0.74) (layers "F.Cu" "F.Paste" "F.Mask") (tstamp 4a013f61-c08d-45cf-90c8-a7f3b3d4c65c))
  (pad "30" smd rect (at 1.95 8.255) (size 2.4 0.74) (layers "F.Cu" "F.Paste" "F.Mask") (tstamp cd559a73-7b14-46d1-842d-3986fee387e2))
  (pad "31" smd rect (at -1.95 9.525) (size 2.4 0.74) (layers "F.Cu" "F.Paste" "F.Mask") (tstamp 8b14f407-1b83-4395-b7cb-985236b4eb94))
  (pad "32" smd rect (at 1.95 9.525) (size 2.4 0.74) (layers "F.Cu" "F.Paste" "F.Mask") (tstamp 63e836d6-9660-4fc0-b845-bc331dd71126))
  (model "${KICADLIB}/model/connector/PinHeader_2x16_P1.27mm_Vertical_SMD.step"
    (offset (xyz 0 0 0))
    (scale (xyz 1 1 1))
    (rotate (xyz 0 0 0))
  )
)
