(footprint "Omron_G6K-2G" (version 20210126) (generator pcbnew) (layer "F.Cu")
  (tedit 60366ADE)
  (attr smd)
  (fp_text reference "REF**" (at 0 -4.4 unlocked) (layer "F.SilkS")
    (effects (font (size 1 1) (thickness 0.15)))
    (tstamp 3d38b7bc-dc6b-409b-a4aa-d6caeb36d33f)
  )
  (fp_text value "Omron_G6K-2G" (at 0 1 unlocked) (layer "F.Fab") hide
    (effects (font (size 1 1) (thickness 0.15)))
    (tstamp aecdd174-21b5-4c07-bae2-b418c21d95fa)
  )
  (fp_text user "^" (at -3.8 4.5 unlocked) (layer "F.SilkS")
    (effects (font (size 1 1) (thickness 0.15)))
    (tstamp a8ab62e5-78ca-4238-b6d4-0b2fa34de180)
  )
  (fp_text user "${REFERENCE}" (at 0 0 unlocked) (layer "F.Fab")
    (effects (font (size 1 1) (thickness 0.15)))
    (tstamp d334e667-f589-4f9a-bf42-375e20c1294e)
  )
  (fp_line (start -5 3.25) (end -4.35 3.25) (layer "F.SilkS") (width 0.12) (tstamp 3423c502-c7aa-4ddc-9781-052c8d725862))
  (fp_line (start 4.35 3.25) (end 5 3.25) (layer "F.SilkS") (width 0.12) (tstamp 35051dbe-3c24-4603-ad0b-b3e141a6242e))
  (fp_line (start 3.25 -3.25) (end 1.85 -3.25) (layer "F.SilkS") (width 0.12) (tstamp 48a62db7-7ce3-4dd2-8fb2-fe33c888a2db))
  (fp_line (start -1.8 -3.25) (end -3.25 -3.25) (layer "F.SilkS") (width 0.12) (tstamp 4e6a6536-736c-40d4-bb19-5db7ebcebd05))
  (fp_line (start -4.35 -3.25) (end -5 -3.25) (layer "F.SilkS") (width 0.12) (tstamp 72f03c07-632b-4616-8b6f-673c5ee0008f))
  (fp_line (start -5 -3.25) (end -5 3.25) (layer "F.SilkS") (width 0.12) (tstamp 7c996eb1-9fd5-4df4-95c8-9eb39f3be3dd))
  (fp_line (start 0.75 -3.25) (end -0.7 -3.25) (layer "F.SilkS") (width 0.12) (tstamp 85c9e067-7784-43f4-8ff5-9f3d03ce374d))
  (fp_line (start 5 3.25) (end 5 -3.25) (layer "F.SilkS") (width 0.12) (tstamp 993d135d-765c-4d72-9c3c-8c56705d0dc6))
  (fp_line (start -3.25 3.25) (end -1.85 3.25) (layer "F.SilkS") (width 0.12) (tstamp bce4ac21-7a01-4a22-8a21-cc008f9553f7))
  (fp_line (start 5 -3.25) (end 4.4 -3.25) (layer "F.SilkS") (width 0.12) (tstamp c0d393ca-6cde-4256-9deb-ef227edf2e65))
  (fp_line (start -0.7 3.25) (end 0.7 3.25) (layer "F.SilkS") (width 0.12) (tstamp e506b97c-dd44-4679-978b-ef5a5590daf4))
  (fp_line (start 1.85 3.25) (end 3.25 3.25) (layer "F.SilkS") (width 0.12) (tstamp f038439c-679b-4017-abd4-13e901ceccfe))
  (fp_rect (start -5.3 -3.9) (end 5.2 3.9) (layer "F.CrtYd") (width 0.05) (fill none) (tstamp 99c3145d-3847-4957-9a4f-8467cf376832))
  (fp_line (start -5 2.65) (end -5 -3.25) (layer "F.Fab") (width 0.1) (tstamp 0061d77c-8147-45c7-9767-7fbe89c7c07a))
  (fp_line (start 5 3.25) (end -4.4 3.25) (layer "F.Fab") (width 0.1) (tstamp 095f05e3-ff46-42fe-b094-2ab32aaae1de))
  (fp_line (start -5 -3.25) (end 5 -3.25) (layer "F.Fab") (width 0.1) (tstamp 40f81f98-e93e-4724-b520-ecf9f7d1705b))
  (fp_line (start -4.4 3.25) (end -5 2.65) (layer "F.Fab") (width 0.1) (tstamp 52995b23-a375-462c-9491-42e3d8c4fd50))
  (fp_line (start 5 -3.25) (end 5 3.25) (layer "F.Fab") (width 0.1) (tstamp ec6f2387-eed8-46df-af31-bbea1017033a))
  (pad "1" smd rect (at -3.81 2.85) (size 1 1.8) (layers "F.Cu" "F.Paste" "F.Mask")
    (solder_mask_margin -0.2) (tstamp 36056809-627f-4e3a-a6f6-6376058c8f6d))
  (pad "2" smd rect (at -1.27 2.85) (size 1 1.8) (layers "F.Cu" "F.Paste" "F.Mask")
    (solder_mask_margin -0.2) (tstamp 4ef54265-95f2-465e-8538-0881c2ba57ea))
  (pad "3" smd rect (at 1.27 2.85) (size 1 1.8) (layers "F.Cu" "F.Paste" "F.Mask")
    (solder_mask_margin -0.2) (tstamp 5f1b85a5-bdda-439e-9de2-41dd31b6362f))
  (pad "4" smd rect (at 3.81 2.85) (size 1 1.8) (layers "F.Cu" "F.Paste" "F.Mask")
    (solder_mask_margin -0.2) (tstamp 151aed6c-8f2b-4502-9571-45ce489877c7))
  (pad "5" smd rect (at 3.81 -2.85) (size 1 1.8) (layers "F.Cu" "F.Paste" "F.Mask")
    (solder_mask_margin -0.2) (tstamp 3da641da-a024-46de-a4c2-c68090e4da13))
  (pad "6" smd rect (at 1.27 -2.85) (size 1 1.8) (layers "F.Cu" "F.Paste" "F.Mask")
    (solder_mask_margin -0.2) (tstamp 73d71b7c-fadb-420f-aeb0-0d00ba65b90b))
  (pad "7" smd rect (at -1.27 -2.85) (size 1 1.8) (layers "F.Cu" "F.Paste" "F.Mask")
    (solder_mask_margin -0.2) (tstamp e738b924-dc27-4926-a022-fd2dcd92cf84))
  (pad "8" smd rect (at -3.81 -2.85) (size 1 1.8) (layers "F.Cu" "F.Paste" "F.Mask")
    (solder_mask_margin -0.2) (tstamp 1dadd3c8-5025-4398-a3a1-0df84617fc1b))
  (model "${KICADLIB}/model/mechanical/Omron_G6K_2G.step"
    (offset (xyz -3.815 0 0))
    (scale (xyz 1 1 1))
    (rotate (xyz -90 0 0))
  )
)
