(footprint "PinHeader_2x40_P2.54mm_Vertical_SMD" (version 20211014) (generator pcbnew)
  (layer "F.Cu")
  (tedit 61324525)
  (descr "surface-mounted straight pin header, 2x40, 2.54mm pitch, double rows")
  (tags "Surface mounted pin header SMD 2x40 2.54mm double row")
  (attr smd)
  (fp_text reference "REF**" (at 0 -51.86) (layer "F.SilkS")
    (effects (font (size 1 1) (thickness 0.15)))
    (tstamp 1d1a08d0-043d-4363-ae9b-10a5e7a7fe9d)
  )
  (fp_text value "PinHeader_2x40_P2.54mm_Vertical_SMD" (at 0 51.86) (layer "F.Fab") hide
    (effects (font (size 1 1) (thickness 0.15)))
    (tstamp 4f63d2fa-0ebd-4024-8aa1-15d40ef9aed2)
  )
  (fp_text user "^" (at -5 -49.6 270 unlocked) (layer "F.SilkS")
    (effects (font (size 1 1) (thickness 0.15)))
    (tstamp be977378-ab61-484c-af10-a9965fcebfe7)
  )
  (fp_text user "${REFERENCE}" (at 0 0 90) (layer "F.Fab")
    (effects (font (size 1 1) (thickness 0.15)))
    (tstamp a42fe7f6-157b-4675-aec3-8975c33f79ea)
  )
  (fp_line (start 2.6 14.73) (end 2.6 15.75) (layer "F.SilkS") (width 0.12) (tstamp 043934ee-7cc8-46ad-89e5-c99e116bf099))
  (fp_line (start -2.6 -46.23) (end -2.6 -45.21) (layer "F.SilkS") (width 0.12) (tstamp 0ac52a21-26a7-4e38-b48e-238e47984123))
  (fp_line (start -2.6 -15.75) (end -2.6 -14.73) (layer "F.SilkS") (width 0.12) (tstamp 0bdddf7f-62b7-46f9-8de3-488488f5449f))
  (fp_line (start 2.6 -20.83) (end 2.6 -19.81) (layer "F.SilkS") (width 0.12) (tstamp 1205c98c-fd1f-4009-99c6-dbc332b3c9bc))
  (fp_line (start -2.6 14.73) (end -2.6 15.75) (layer "F.SilkS") (width 0.12) (tstamp 174bca5b-9f72-45a7-aea5-643f07230273))
  (fp_line (start -2.6 -28.45) (end -2.6 -27.43) (layer "F.SilkS") (width 0.12) (tstamp 190ddb7a-8405-4144-bf8d-e7a4e6a784dc))
  (fp_line (start 2.6 40.13) (end 2.6 41.15) (layer "F.SilkS") (width 0.12) (tstamp 26a9d96d-c6bd-400f-925d-a20a325b2d68))
  (fp_line (start -2.6 -3.05) (end -2.6 -2.03) (layer "F.SilkS") (width 0.12) (tstamp 289a1066-c4b8-4d9d-a480-c1a80e5c2a44))
  (fp_line (start -2.6 22.35) (end -2.6 23.37) (layer "F.SilkS") (width 0.12) (tstamp 2b2990ac-876b-4bf3-bf31-de733658329a))
  (fp_line (start -2.6 32.51) (end -2.6 33.53) (layer "F.SilkS") (width 0.12) (tstamp 2ea9249d-64dd-4426-b0cf-9cea304389a3))
  (fp_line (start -2.6 35.05) (end -2.6 36.07) (layer "F.SilkS") (width 0.12) (tstamp 2fc44f76-f076-4256-95c2-e052e2c73e12))
  (fp_line (start -2.6 -0.51) (end -2.6 0.51) (layer "F.SilkS") (width 0.12) (tstamp 31fcebf4-a095-4227-9002-b11692e1ebbb))
  (fp_line (start -2.6 40.13) (end -2.6 41.15) (layer "F.SilkS") (width 0.12) (tstamp 33e5bf2a-d9fd-47de-80a9-d1a3cc01a337))
  (fp_line (start -2.6 45.21) (end -2.6 46.23) (layer "F.SilkS") (width 0.12) (tstamp 3b84ca6c-aec9-4279-9a2e-4ec3966492ae))
  (fp_line (start 2.6 -30.99) (end 2.6 -29.97) (layer "F.SilkS") (width 0.12) (tstamp 3b884c69-6b0c-4b9d-9fe5-ef71859a44d8))
  (fp_line (start -2.6 47.75) (end -2.6 48.77) (layer "F.SilkS") (width 0.12) (tstamp 3bbad087-b594-4538-8ed5-c6e21974e365))
  (fp_line (start 2.6 -8.13) (end 2.6 -7.11) (layer "F.SilkS") (width 0.12) (tstamp 3fd0dff5-abb3-4621-b534-ecc035f13ce3))
  (fp_line (start -2.6 -48.77) (end -2.6 -47.75) (layer "F.SilkS") (width 0.12) (tstamp 449cf583-a35d-4ef5-97da-6dc8d6280ade))
  (fp_line (start 2.6 27.43) (end 2.6 28.45) (layer "F.SilkS") (width 0.12) (tstamp 453281c0-0fec-4373-915c-4116a383fbcb))
  (fp_line (start 2.6 -25.91) (end 2.6 -24.89) (layer "F.SilkS") (width 0.12) (tstamp 4a793584-df99-4227-8693-3af370ffff6b))
  (fp_line (start -2.6 37.59) (end -2.6 38.61) (layer "F.SilkS") (width 0.12) (tstamp 4b47b21c-188d-40a7-b109-395f08a8575f))
  (fp_line (start -2.6 4.57) (end -2.6 5.59) (layer "F.SilkS") (width 0.12) (tstamp 4bd23b4a-de32-42c1-a156-435b7672840e))
  (fp_line (start 2.6 50.29) (end 2.6 50.86) (layer "F.SilkS") (width 0.12) (tstamp 50523889-f008-466d-981b-49d06726268b))
  (fp_line (start -2.6 -18.29) (end -2.6 -17.27) (layer "F.SilkS") (width 0.12) (tstamp 50b4a648-c4c3-4ef9-b8b4-642ef50411b3))
  (fp_line (start -2.6 -25.91) (end -2.6 -24.89) (layer "F.SilkS") (width 0.12) (tstamp 51071944-ace5-49a5-9388-a11d62e3cf1a))
  (fp_line (start -2.6 17.27) (end -2.6 18.29) (layer "F.SilkS") (width 0.12) (tstamp 5de97cb4-7485-4018-9da8-f1a7a9fab8b6))
  (fp_line (start -2.6 19.81) (end -2.6 20.83) (layer "F.SilkS") (width 0.12) (tstamp 5ec8d924-aba5-46b5-8ab8-91733887645b))
  (fp_line (start -2.6 24.89) (end -2.6 25.91) (layer "F.SilkS") (width 0.12) (tstamp 65bab70f-706f-46c9-90e0-527426cb0a85))
  (fp_line (start -2.6 -33.53) (end -2.6 -32.51) (layer "F.SilkS") (width 0.12) (tstamp 66b491bd-cf8e-4aa7-afdb-a026e2bd7fa8))
  (fp_line (start 2.6 -23.37) (end 2.6 -22.35) (layer "F.SilkS") (width 0.12) (tstamp 6789db1f-ed41-44ce-8022-1065e7f84337))
  (fp_line (start -2.6 50.29) (end -2.6 50.86) (layer "F.SilkS") (width 0.12) (tstamp 69c3a200-b9ac-4565-8247-9d4b9b052850))
  (fp_line (start 2.6 -3.05) (end 2.6 -2.03) (layer "F.SilkS") (width 0.12) (tstamp 6fdb223a-f7d4-4c78-935e-0364f14f9450))
  (fp_line (start -2.6 -23.37) (end -2.6 -22.35) (layer "F.SilkS") (width 0.12) (tstamp 7a3babd5-6b12-4b82-bc56-85fc20fce189))
  (fp_line (start -2.6 -50.86) (end -2.6 -50.29) (layer "F.SilkS") (width 0.12) (tstamp 7cb02b14-b7d2-4c67-a007-1911e02fcd1d))
  (fp_line (start 2.6 -43.69) (end 2.6 -42.67) (layer "F.SilkS") (width 0.12) (tstamp 7d0455cf-1257-422c-8aee-a50033d7bfd9))
  (fp_line (start -2.6 -38.61) (end -2.6 -37.59) (layer "F.SilkS") (width 0.12) (tstamp 7f86bf03-8324-4fc5-acd5-2e215369be69))
  (fp_line (start 2.6 9.65) (end 2.6 10.67) (layer "F.SilkS") (width 0.12) (tstamp 8492724b-3e7a-43c0-aba1-ffabd1b0731f))
  (fp_line (start 2.6 42.67) (end 2.6 43.69) (layer "F.SilkS") (width 0.12) (tstamp 8ea4a646-4635-4993-8c81-083e126d0b4a))
  (fp_line (start -2.6 -36.07) (end -2.6 -35.05) (layer "F.SilkS") (width 0.12) (tstamp 9b44d59a-2ead-4a56-bbdf-4d6295a53747))
  (fp_line (start 2.6 24.89) (end 2.6 25.91) (layer "F.SilkS") (width 0.12) (tstamp a09e57bc-60cf-408f-bb31-fcdfae3f7c8f))
  (fp_line (start -2.6 9.65) (end -2.6 10.67) (layer "F.SilkS") (width 0.12) (tstamp a1d5c578-7aff-4583-b945-6704ba0eef9f))
  (fp_line (start 2.6 -18.29) (end 2.6 -17.27) (layer "F.SilkS") (width 0.12) (tstamp a3c10e47-5cc9-4c12-84b8-74a0c2467976))
  (fp_line (start 2.6 22.35) (end 2.6 23.37) (layer "F.SilkS") (width 0.12) (tstamp a9285399-b7b5-4f30-8a04-60affe7b0dfd))
  (fp_line (start 2.6 -36.07) (end 2.6 -35.05) (layer "F.SilkS") (width 0.12) (tstamp a96a7952-9367-4c95-a706-57247f0092a6))
  (fp_line (start 2.6 32.51) (end 2.6 33.53) (layer "F.SilkS") (width 0.12) (tstamp aa3a9d46-c92b-4984-980a-a2a78aa0774c))
  (fp_line (start 2.6 45.21) (end 2.6 46.23) (layer "F.SilkS") (width 0.12) (tstamp aa77a34c-1f5f-466e-b7ef-9e05cc767485))
  (fp_line (start -2.6 2.03) (end -2.6 3.05) (layer "F.SilkS") (width 0.12) (tstamp af09e22d-459a-49e7-900d-8e1643aec123))
  (fp_line (start 2.6 7.11) (end 2.6 8.13) (layer "F.SilkS") (width 0.12) (tstamp b2799bb3-ad19-4888-acba-2262fa75260e))
  (fp_line (start -2.6 29.97) (end -2.6 30.99) (layer "F.SilkS") (width 0.12) (tstamp b30990b7-ae51-483c-be97-3d36da42ffa8))
  (fp_line (start 2.6 -10.67) (end 2.6 -9.65) (layer "F.SilkS") (width 0.12) (tstamp b34988cb-8ca3-4720-88d9-d03ffd547807))
  (fp_line (start 2.6 -48.77) (end 2.6 -47.75) (layer "F.SilkS") (width 0.12) (tstamp b3e82eaf-2f54-4e15-9b25-c8e3436967b3))
  (fp_line (start -2.6 27.43) (end -2.6 28.45) (layer "F.SilkS") (width 0.12) (tstamp b5ae2b20-87c7-4bf9-bf9c-83002f8d0da4))
  (fp_line (start -2.6 -41.15) (end -2.6 -40.13) (layer "F.SilkS") (width 0.12) (tstamp b7f4e0e5-5f57-4005-b6d7-b660e4d0f8ee))
  (fp_line (start 2.6 -15.75) (end 2.6 -14.73) (layer "F.SilkS") (width 0.12) (tstamp b8570d00-5b09-480d-84c4-4bb59ab3e1ce))
  (fp_line (start -2.6 12.19) (end -2.6 13.21) (layer "F.SilkS") (width 0.12) (tstamp bac5260f-63c1-4f80-a885-66a0048eae59))
  (fp_line (start -2.6 -5.59) (end -2.6 -4.57) (layer "F.SilkS") (width 0.12) (tstamp badce148-4d30-4625-b009-7b40ca440a73))
  (fp_line (start 2.6 47.75) (end 2.6 48.77) (layer "F.SilkS") (width 0.12) (tstamp c04c250b-3d89-4ec8-9b46-68eacebe8cdd))
  (fp_line (start 2.6 -5.59) (end 2.6 -4.57) (layer "F.SilkS") (width 0.12) (tstamp c089582f-ffc2-4041-a45d-9fd8e6b07338))
  (fp_line (start 2.6 -46.23) (end 2.6 -45.21) (layer "F.SilkS") (width 0.12) (tstamp c281f443-8842-48d8-b3ee-c378ad6fb653))
  (fp_line (start -2.6 7.11) (end -2.6 8.13) (layer "F.SilkS") (width 0.12) (tstamp c5070d16-8198-41cd-8827-33d3be5066e1))
  (fp_line (start -2.6 42.67) (end -2.6 43.69) (layer "F.SilkS") (width 0.12) (tstamp c6f40e02-14c9-4bd8-8dc1-35878493c473))
  (fp_line (start -2.6 -13.21) (end -2.6 -12.19) (layer "F.SilkS") (width 0.12) (tstamp c85144c9-f2ea-454f-9e4b-86cfbfb46efd))
  (fp_line (start 2.6 2.03) (end 2.6 3.05) (layer "F.SilkS") (width 0.12) (tstamp cbfb4b01-4a7c-45af-b317-508c4be395fb))
  (fp_line (start 2.6 17.27) (end 2.6 18.29) (layer "F.SilkS") (width 0.12) (tstamp cd7c8b8d-ac2c-47b3-843b-92fae786dc46))
  (fp_line (start 2.6 35.05) (end 2.6 36.07) (layer "F.SilkS") (width 0.12) (tstamp d4add251-6f3b-473c-82b4-da786f090ea6))
  (fp_line (start 2.6 -13.21) (end 2.6 -12.19) (layer "F.SilkS") (width 0.12) (tstamp d4b92196-9d7f-41b2-90e7-c06de2011c33))
  (fp_line (start -2.6 -10.67) (end -2.6 -9.65) (layer "F.SilkS") (width 0.12) (tstamp d6e812e7-0509-49f7-9993-bfabe70dc10a))
  (fp_line (start 2.6 -33.53) (end 2.6 -32.51) (layer "F.SilkS") (width 0.12) (tstamp d79c7f18-3bb9-4749-a23c-669e8fcefd33))
  (fp_line (start -2.6 -43.69) (end -2.6 -42.67) (layer "F.SilkS") (width 0.12) (tstamp d7a21a94-f067-43c2-a6b3-57591ec600c1))
  (fp_line (start -2.6 -50.86) (end 2.6 -50.86) (layer "F.SilkS") (width 0.12) (tstamp d81c42e3-a6b4-470a-acfb-6616384699f9))
  (fp_line (start -2.6 50.86) (end 2.6 50.86) (layer "F.SilkS") (width 0.12) (tstamp d8503aa2-a50d-4e06-911f-f0d14f2b4aca))
  (fp_line (start 2.6 -50.86) (end 2.6 -50.29) (layer "F.SilkS") (width 0.12) (tstamp dac7da24-ad2b-4161-bfdc-d76a3be38c04))
  (fp_line (start 2.6 19.81) (end 2.6 20.83) (layer "F.SilkS") (width 0.12) (tstamp dbb74487-dcd0-4b59-a529-ff91aee3a701))
  (fp_line (start 2.6 -0.51) (end 2.6 0.51) (layer "F.SilkS") (width 0.12) (tstamp e29a0eb6-d1a0-46ae-bf60-71f62e3c51d8))
  (fp_line (start -2.6 -8.13) (end -2.6 -7.11) (layer "F.SilkS") (width 0.12) (tstamp e42f2450-4bd3-4e5a-8b9d-5831a2983e80))
  (fp_line (start 2.6 -28.45) (end 2.6 -27.43) (layer "F.SilkS") (width 0.12) (tstamp e7844e85-7295-4a47-a4bd-b52d5105f685))
  (fp_line (start 2.6 4.57) (end 2.6 5.59) (layer "F.SilkS") (width 0.12) (tstamp e98e8cf4-26b9-475b-95fa-4a322bdd3e4b))
  (fp_line (start 2.6 29.97) (end 2.6 30.99) (layer "F.SilkS") (width 0.12) (tstamp ec6a4f46-725c-47d0-915c-9b1faee0e155))
  (fp_line (start 2.6 12.19) (end 2.6 13.21) (layer "F.SilkS") (width 0.12) (tstamp ec6dea93-6545-4446-a757-f6da7359d4c9))
  (fp_line (start -2.6 -30.99) (end -2.6 -29.97) (layer "F.SilkS") (width 0.12) (tstamp f1f836bd-869c-4cc2-82dd-55b0b0863a4c))
  (fp_line (start 2.6 -41.15) (end 2.6 -40.13) (layer "F.SilkS") (width 0.12) (tstamp f20d3b01-25b8-47f1-bf47-597ed8df04d1))
  (fp_line (start 2.6 -38.61) (end 2.6 -37.59) (layer "F.SilkS") (width 0.12) (tstamp f2f34c9c-351c-46df-bd6c-c20c7dab26a5))
  (fp_line (start 2.6 37.59) (end 2.6 38.61) (layer "F.SilkS") (width 0.12) (tstamp fca90b57-ed36-4e84-92f2-af799819e026))
  (fp_line (start -2.6 -20.83) (end -2.6 -19.81) (layer "F.SilkS") (width 0.12) (tstamp fe1fbb0d-5b66-419b-9d96-d0b24d3e3732))
  (fp_rect (start -4.8 51.4) (end 4.8 -51.4) (layer "F.CrtYd") (width 0.05) (fill none) (tstamp 96e0bb8b-7859-4b78-94cb-d2be24a4fdd7))
  (fp_line (start -2.54 -32.07) (end -3.6 -32.07) (layer "F.Fab") (width 0.1) (tstamp 0031f4a6-8d34-4453-a9a3-15268b82bf0a))
  (fp_line (start 3.6 -26.35) (end 2.54 -26.35) (layer "F.Fab") (width 0.1) (tstamp 01bc511f-aa88-4854-8638-00b9d06ae1fd))
  (fp_line (start 3.6 0.95) (end 3.6 1.59) (layer "F.Fab") (width 0.1) (tstamp 031709e4-34d2-4894-adce-21741599763a))
  (fp_line (start -3.6 6.03) (end -3.6 6.67) (layer "F.Fab") (width 0.1) (tstamp 031733c4-efea-42bb-984c-f98aa8d58954))
  (fp_line (start 2.54 -6.67) (end 3.6 -6.67) (layer "F.Fab") (width 0.1) (tstamp 036fd7a2-e6b0-4956-a82c-84946f95025d))
  (fp_line (start 3.6 -32.07) (end 3.6 -31.43) (layer "F.Fab") (width 0.1) (tstamp 0439aad1-cb0c-44d8-bbd6-0a99eef4c906))
  (fp_line (start -3.6 11.11) (end -3.6 11.75) (layer "F.Fab") (width 0.1) (tstamp 05c5e906-491e-4b84-b154-69a5554647b5))
  (fp_line (start -3.6 -41.59) (end -2.54 -41.59) (layer "F.Fab") (width 0.1) (tstamp 06171fbf-8325-47d0-bc26-f113bae598c7))
  (fp_line (start -3.6 3.49) (end -3.6 4.13) (layer "F.Fab") (width 0.1) (tstamp 0881c659-776f-4e19-8785-094c969e0a06))
  (fp_line (start 3.6 -8.57) (end 2.54 -8.57) (layer "F.Fab") (width 0.1) (tstamp 08d39606-eb58-4cdc-890e-035c23441118))
  (fp_line (start -3.6 6.67) (end -2.54 6.67) (layer "F.Fab") (width 0.1) (tstamp 09180795-0325-44bf-8c40-dd4868fe6728))
  (fp_line (start 3.6 -13.65) (end 2.54 -13.65) (layer "F.Fab") (width 0.1) (tstamp 09687c4f-78b6-48ca-979f-91bfb223ccab))
  (fp_line (start -2.54 28.89) (end -3.6 28.89) (layer "F.Fab") (width 0.1) (tstamp 0a4ae17d-94bc-4995-b714-a60683aa1884))
  (fp_line (start 2.54 -32.07) (end 3.6 -32.07) (layer "F.Fab") (width 0.1) (tstamp 0a4e7868-c559-48ba-832f-e7721f49681e))
  (fp_line (start -3.6 49.85) (end -2.54 49.85) (layer "F.Fab") (width 0.1) (tstamp 0d6fb4c3-5c26-4c86-8225-94c8787514c1))
  (fp_line (start 2.54 -9.21) (end 3.6 -9.21) (layer "F.Fab") (width 0.1) (tstamp 0db216fa-5d02-4561-83be-a9f823bff397))
  (fp_line (start 3.6 -49.85) (end 3.6 -49.21) (layer "F.Fab") (width 0.1) (tstamp 0e849c5a-d681-45e2-ba99-fcce95eb71d1))
  (fp_line (start 3.6 -23.81) (end 2.54 -23.81) (layer "F.Fab") (width 0.1) (tstamp 10b0d8e4-526b-4896-ba6b-d34b3171e1cc))
  (fp_line (start -2.54 -6.67) (end -3.6 -6.67) (layer "F.Fab") (width 0.1) (tstamp 10c55d51-c005-4911-a2d8-b3f67e7a93f0))
  (fp_line (start 3.6 -37.15) (end 3.6 -36.51) (layer "F.Fab") (width 0.1) (tstamp 10dcca05-330f-4070-8fe3-eb4d988c30f2))
  (fp_line (start -3.6 -26.99) (end -3.6 -26.35) (layer "F.Fab") (width 0.1) (tstamp 11941f61-a7ec-4a01-a0f4-fdc30f7fbf69))
  (fp_line (start 2.54 -42.23) (end 3.6 -42.23) (layer "F.Fab") (width 0.1) (tstamp 11afd801-1e20-43ab-838f-a6f1d14190f5))
  (fp_line (start -3.6 -0.95) (end -2.54 -0.95) (layer "F.Fab") (width 0.1) (tstamp 1334514c-bef2-45e1-b184-26f142744094))
  (fp_line (start 2.54 26.35) (end 3.6 26.35) (layer "F.Fab") (width 0.1) (tstamp 14e46405-f7a0-461b-80c2-28c41334f0b5))
  (fp_line (start -3.6 -11.75) (end -3.6 -11.11) (layer "F.Fab") (width 0.1) (tstamp 163af7f9-9047-4916-a374-3afdd0741d9a))
  (fp_line (start -3.6 -34.61) (end -3.6 -33.97) (layer "F.Fab") (width 0.1) (tstamp 1758a8d8-ac78-4cdc-ab44-5bda4c74baf1))
  (fp_line (start -3.6 -13.65) (end -2.54 -13.65) (layer "F.Fab") (width 0.1) (tstamp 17801f5f-fcd7-4e4a-bb4f-8fc8ee8bedd3))
  (fp_line (start 3.6 -47.31) (end 3.6 -46.67) (layer "F.Fab") (width 0.1) (tstamp 17c52381-9366-4f4a-97d3-c602bd4af477))
  (fp_line (start -2.54 21.27) (end -3.6 21.27) (layer "F.Fab") (width 0.1) (tstamp 1874d617-0b5a-4829-8fbd-197cdea20efb))
  (fp_line (start -2.54 49.21) (end -3.6 49.21) (layer "F.Fab") (width 0.1) (tstamp 18bf5949-9a7d-4128-8044-300043b5194e))
  (fp_line (start -3.6 -4.13) (end -3.6 -3.49) (layer "F.Fab") (width 0.1) (tstamp 195cfd24-a3d3-420f-a025-184d61392116))
  (fp_line (start -2.54 -34.61) (end -3.6 -34.61) (layer "F.Fab") (width 0.1) (tstamp 1a351162-fa5c-4356-bb46-d1ac79628900))
  (fp_line (start 3.6 -36.51) (end 2.54 -36.51) (layer "F.Fab") (width 0.1) (tstamp 1cc30d44-e4be-44c2-8bfd-e21b17500527))
  (fp_line (start 3.6 -6.03) (end 2.54 -6.03) (layer "F.Fab") (width 0.1) (tstamp 1d3396d7-760e-4dab-8af6-5201aec9caf2))
  (fp_line (start -2.54 3.49) (end -3.6 3.49) (layer "F.Fab") (width 0.1) (tstamp 20924087-9e79-4e67-aa65-0dbb94b874a3))
  (fp_line (start -2.54 8.57) (end -3.6 8.57) (layer "F.Fab") (width 0.1) (tstamp 20984f94-9445-4609-aecb-7d6daaf79548))
  (fp_line (start -3.6 -18.73) (end -2.54 -18.73) (layer "F.Fab") (width 0.1) (tstamp 213cdde9-ec3d-46fe-be0a-8c1a89f98334))
  (fp_line (start 3.6 29.53) (end 2.54 29.53) (layer "F.Fab") (width 0.1) (tstamp 2205caa1-3130-4d79-9052-935d83e580c0))
  (fp_line (start 3.6 8.57) (end 3.6 9.21) (layer "F.Fab") (width 0.1) (tstamp 224099b8-d67f-4be9-8961-fba73d043015))
  (fp_line (start 2.54 -11.75) (end 3.6 -11.75) (layer "F.Fab") (width 0.1) (tstamp 22521d93-c3ad-437c-b007-093d7b656089))
  (fp_line (start -2.54 -16.83) (end -3.6 -16.83) (layer "F.Fab") (width 0.1) (tstamp 237198a2-1d46-4f66-a483-9c0c0dd68bb6))
  (fp_line (start 3.6 42.23) (end 2.54 42.23) (layer "F.Fab") (width 0.1) (tstamp 23803b03-09be-4459-9ccc-c07433086c58))
  (fp_line (start -1.59 -50.8) (end 2.54 -50.8) (layer "F.Fab") (width 0.1) (tstamp 23efb8b0-a035-4c1f-abaa-02ef25eb7447))
  (fp_line (start -3.6 44.77) (end -2.54 44.77) (layer "F.Fab") (width 0.1) (tstamp 27baff24-a4ed-4343-b8a2-ab0cf7355093))
  (fp_line (start 2.54 41.59) (end 3.6 41.59) (layer "F.Fab") (width 0.1) (tstamp 2944eebb-05ae-489d-97b5-f088b299fc1c))
  (fp_line (start 3.6 13.65) (end 3.6 14.29) (layer "F.Fab") (width 0.1) (tstamp 2af4bd6b-c076-467e-bb72-69346684af65))
  (fp_line (start 3.6 -44.13) (end 2.54 -44.13) (layer "F.Fab") (width 0.1) (tstamp 2be3c099-6aa1-4c76-a984-4e6bbdde74cf))
  (fp_line (start -3.6 -36.51) (end -2.54 -36.51) (layer "F.Fab") (width 0.1) (tstamp 2cc46475-f0d2-4f0c-bfd2-687646b8b43e))
  (fp_line (start -2.54 -24.45) (end -3.6 -24.45) (layer "F.Fab") (width 0.1) (tstamp 303fbcd1-a7cc-4f1f-8c24-314cba7147e7))
  (fp_line (start 3.6 -49.21) (end 2.54 -49.21) (layer "F.Fab") (width 0.1) (tstamp 32cc5b50-6323-4906-ad25-8b3953843185))
  (fp_line (start 3.6 -16.83) (end 3.6 -16.19) (layer "F.Fab") (width 0.1) (tstamp 32eb8ae6-5cb1-4546-b711-41b39f03e762))
  (fp_line (start -3.6 19.37) (end -2.54 19.37) (layer "F.Fab") (width 0.1) (tstamp 335e9d2d-7fd0-43b8-96fd-9623b03db85e))
  (fp_line (start -3.6 -42.23) (end -3.6 -41.59) (layer "F.Fab") (width 0.1) (tstamp 339996c8-14ec-4368-bafc-a2fff40428f2))
  (fp_line (start -3.6 -31.43) (end -2.54 -31.43) (layer "F.Fab") (width 0.1) (tstamp 34ee91ca-f285-4208-b88a-efdb873eaa38))
  (fp_line (start 3.6 -16.19) (end 2.54 -16.19) (layer "F.Fab") (width 0.1) (tstamp 35c71493-d573-4af8-a7f4-3cf10afac9b9))
  (fp_line (start 3.6 -29.53) (end 3.6 -28.89) (layer "F.Fab") (width 0.1) (tstamp 38f155a4-6931-4a0d-82ab-3dc6d3b1d940))
  (fp_line (start -2.54 6.03) (end -3.6 6.03) (layer "F.Fab") (width 0.1) (tstamp 39e333a2-f88e-4095-ba07-cb5f4035e6a9))
  (fp_line (start 2.54 21.27) (end 3.6 21.27) (layer "F.Fab") (width 0.1) (tstamp 3f3d6f04-1c00-4cdc-b0fe-850151d0e11d))
  (fp_line (start -2.54 -37.15) (end -3.6 -37.15) (layer "F.Fab") (width 0.1) (tstamp 41d8398b-5049-4c1b-9a6a-b7c23f2ae453))
  (fp_line (start 2.54 -21.91) (end 3.6 -21.91) (layer "F.Fab") (width 0.1) (tstamp 41eddf53-0cb1-45fe-ac54-ff69a4afaa74))
  (fp_line (start 2.54 39.05) (end 3.6 39.05) (layer "F.Fab") (width 0.1) (tstamp 4205c71e-eb14-48a5-b183-1c94d3171f3a))
  (fp_line (start 3.6 -34.61) (end 3.6 -33.97) (layer "F.Fab") (width 0.1) (tstamp 44542ee1-e815-4250-9dac-7807099beea4))
  (fp_line (start 3.6 47.31) (end 2.54 47.31) (layer "F.Fab") (width 0.1) (tstamp 453e5926-9422-49c3-b1ff-47ee2f8ab7e6))
  (fp_line (start -3.6 39.05) (end -3.6 39.69) (layer "F.Fab") (width 0.1) (tstamp 46ec9bbd-5451-478d-9afb-0f3f3a096962))
  (fp_line (start 2.54 3.49) (end 3.6 3.49) (layer "F.Fab") (width 0.1) (tstamp 47401a5d-03f7-4623-ac69-00cf48d70dfd))
  (fp_line (start -3.6 26.35) (end -3.6 26.99) (layer "F.Fab") (width 0.1) (tstamp 47dc7562-9043-41b8-ad02-b1630e27a60c))
  (fp_line (start -2.54 44.13) (end -3.6 44.13) (layer "F.Fab") (width 0.1) (tstamp 48d32cd1-c8c4-4855-a48f-3dc145f62303))
  (fp_line (start -3.6 -16.19) (end -2.54 -16.19) (layer "F.Fab") (width 0.1) (tstamp 494b1eca-2415-4da9-826a-5781303353d9))
  (fp_line (start -2.54 -39.69) (end -3.6 -39.69) (layer "F.Fab") (width 0.1) (tstamp 49b75ef6-e0f9-4ca4-81a7-e45d9982416e))
  (fp_line (start -3.6 16.19) (end -3.6 16.83) (layer "F.Fab") (width 0.1) (tstamp 4a6df10d-5e7c-4f76-98f5-e2d44449a41d))
  (fp_line (start -3.6 21.91) (end -2.54 21.91) (layer "F.Fab") (width 0.1) (tstamp 4c330ff7-1d12-49e1-90d3-e6d6f1fbf9e8))
  (fp_line (start -2.54 33.97) (end -3.6 33.97) (layer "F.Fab") (width 0.1) (tstamp 4c9bfcef-7f6f-45cc-b699-15f0045c681b))
  (fp_line (start 3.6 -44.77) (end 3.6 -44.13) (layer "F.Fab") (width 0.1) (tstamp 4d4f0571-5448-45f0-92f9-0ccd2e362d9f))
  (fp_line (start 3.6 11.11) (end 3.6 11.75) (layer "F.Fab") (width 0.1) (tstamp 504a88b4-acbd-44b8-a476-23476504ebee))
  (fp_line (start -3.6 -3.49) (end -2.54 -3.49) (layer "F.Fab") (width 0.1) (tstamp 52b862ea-ab2b-4465-bd8a-8ef37b82689a))
  (fp_line (start -3.6 -47.31) (end -3.6 -46.67) (layer "F.Fab") (width 0.1) (tstamp 5304425e-cffd-40ae-9c92-d2925348b3d8))
  (fp_line (start -2.54 -42.23) (end -3.6 -42.23) (layer "F.Fab") (width 0.1) (tstamp 568983e5-f69b-4819-9ddf-baad86325dc0))
  (fp_line (start 3.6 49.21) (end 3.6 49.85) (layer "F.Fab") (width 0.1) (tstamp 5847b949-08f6-4636-aa3d-5b4952c4aa53))
  (fp_line (start -2.54 13.65) (end -3.6 13.65) (layer "F.Fab") (width 0.1) (tstamp 59475174-e401-46d7-a332-465a32e74b1e))
  (fp_line (start 3.6 33.97) (end 3.6 34.61) (layer "F.Fab") (width 0.1) (tstamp 5a424a6f-2699-45a8-b257-f5f30ba2eec3))
  (fp_line (start 3.6 46.67) (end 3.6 47.31) (layer "F.Fab") (width 0.1) (tstamp 5a6be6c2-54de-4ad0-a8fe-24a495cf0b20))
  (fp_line (start -3.6 11.75) (end -2.54 11.75) (layer "F.Fab") (width 0.1) (tstamp 5acacc4b-9b3d-49ba-a2a8-bbf37bab5529))
  (fp_line (start 2.54 23.81) (end 3.6 23.81) (layer "F.Fab") (width 0.1) (tstamp 5cf243a5-aa3f-460d-a958-500f8824680d))
  (fp_line (start -2.54 -11.75) (end -3.6 -11.75) (layer "F.Fab") (width 0.1) (tstamp 5d5be05e-f6fd-40e3-9227-8bfd0cdad362))
  (fp_line (start -3.6 -24.45) (end -3.6 -23.81) (layer "F.Fab") (width 0.1) (tstamp 5d73f440-f0d7-4ecc-8c75-8a46061aac7b))
  (fp_line (start 3.6 -42.23) (end 3.6 -41.59) (layer "F.Fab") (width 0.1) (tstamp 5e2372f7-8040-4591-a220-4b8330f932f6))
  (fp_line (start -2.54 -9.21) (end -3.6 -9.21) (layer "F.Fab") (width 0.1) (tstamp 5e5391e7-5371-4e62-a611-16c9be7c6228))
  (fp_line (start -3.6 -32.07) (end -3.6 -31.43) (layer "F.Fab") (width 0.1) (tstamp 5e9e69d8-4055-4389-9342-03d7184a2dc1))
  (fp_line (start -3.6 -6.67) (end -3.6 -6.03) (layer "F.Fab") (width 0.1) (tstamp 5eb0860b-c0db-4ba4-bf27-d02821499473))
  (fp_line (start -3.6 49.21) (end -3.6 49.85) (layer "F.Fab") (width 0.1) (tstamp 5ed9bd2f-e427-4d3e-9735-b4a56a6b1cfc))
  (fp_line (start -3.6 8.57) (end -3.6 9.21) (layer "F.Fab") (width 0.1) (tstamp 5f16d6e8-7a38-4f15-bc17-9b17281850a4))
  (fp_line (start 3.6 36.51) (end 3.6 37.15) (layer "F.Fab") (width 0.1) (tstamp 5fb963aa-3d00-4e9e-87db-a1421d00c8d8))
  (fp_line (start -3.6 -8.57) (end -2.54 -8.57) (layer "F.Fab") (width 0.1) (tstamp 614d1e56-5145-4166-b50d-33399647fd79))
  (fp_line (start 3.6 -41.59) (end 2.54 -41.59) (layer "F.Fab") (width 0.1) (tstamp 62494877-a6a1-48aa-b1b8-c1194e6272dc))
  (fp_line (start -2.54 11.11) (end -3.6 11.11) (layer "F.Fab") (width 0.1) (tstamp 62f15a3f-c70d-4221-a334-3f59cdeb3ea8))
  (fp_line (start -3.6 4.13) (end -2.54 4.13) (layer "F.Fab") (width 0.1) (tstamp 634f4b4a-7728-4f6a-8df0-c015038dee34))
  (fp_line (start -3.6 -39.05) (end -2.54 -39.05) (layer "F.Fab") (width 0.1) (tstamp 63b0f544-c874-431e-9f37-ca7c665c0636))
  (fp_line (start -3.6 31.43) (end -3.6 32.07) (layer "F.Fab") (width 0.1) (tstamp 64f39ea6-6dcc-4e3a-97a5-2dc0ffc9d4b1))
  (fp_line (start 2.54 31.43) (end 3.6 31.43) (layer "F.Fab") (width 0.1) (tstamp 650b3831-5048-4e23-bc99-e582360cdd57))
  (fp_line (start 3.6 44.77) (end 2.54 44.77) (layer "F.Fab") (width 0.1) (tstamp 663667bb-8a62-4632-a09b-7122cb392c4c))
  (fp_line (start 2.54 -19.37) (end 3.6 -19.37) (layer "F.Fab") (width 0.1) (tstamp 6890d382-43ac-4379-8b86-a7513c052fe9))
  (fp_line (start -3.6 -26.35) (end -2.54 -26.35) (layer "F.Fab") (width 0.1) (tstamp 689117f9-ba15-4565-9c79-72a34cdcaf03))
  (fp_line (start 3.6 21.91) (end 2.54 21.91) (layer "F.Fab") (width 0.1) (tstamp 6a3e44d1-e397-4f52-82ca-46144ef7815a))
  (fp_line (start 3.6 26.99) (end 2.54 26.99) (layer "F.Fab") (width 0.1) (tstamp 6a8fd090-62ba-4d15-8b5d-fcfab94fe352))
  (fp_line (start -3.6 -49.85) (end -3.6 -49.21) (layer "F.Fab") (width 0.1) (tstamp 6c00eefa-6ab5-4dba-ac90-d081bdd0bea3))
  (fp_line (start -3.6 -33.97) (end -2.54 -33.97) (layer "F.Fab") (width 0.1) (tstamp 6db25b47-5bf9-42de-b284-602edd46b1cd))
  (fp_line (start 3.6 -4.13) (end 3.6 -3.49) (layer "F.Fab") (width 0.1) (tstamp 6e11db33-c71e-4310-8e05-1c44b5a3d8fd))
  (fp_line (start 2.54 -16.83) (end 3.6 -16.83) (layer "F.Fab") (width 0.1) (tstamp 6ead8d25-a9fb-4578-bf37-e4084805cf61))
  (fp_line (start -3.6 -16.83) (end -3.6 -16.19) (layer "F.Fab") (width 0.1) (tstamp 6fbbd2ba-d694-42fa-9521-fe73fc801a60))
  (fp_line (start -3.6 46.67) (end -3.6 47.31) (layer "F.Fab") (width 0.1) (tstamp 6fe78dc2-70ac-418a-afd2-b22a09134130))
  (fp_line (start 2.54 33.97) (end 3.6 33.97) (layer "F.Fab") (width 0.1) (tstamp 714ffe3d-4df9-4522-8a61-9d90255f4e78))
  (fp_line (start -3.6 -14.29) (end -3.6 -13.65) (layer "F.Fab") (width 0.1) (tstamp 73b6963f-8441-4115-adbd-a9d3833a4448))
  (fp_line (start 3.6 41.59) (end 3.6 42.23) (layer "F.Fab") (width 0.1) (tstamp 78d3ec30-664b-4dd6-ae21-06dcbbc3aced))
  (fp_line (start 3.6 1.59) (end 2.54 1.59) (layer "F.Fab") (width 0.1) (tstamp 78ff2add-0a87-413f-8cbd-b5ad6fae1394))
  (fp_line (start 3.6 4.13) (end 2.54 4.13) (layer "F.Fab") (width 0.1) (tstamp 79a0ffc3-ceee-40a9-a960-5e39f9595b9a))
  (fp_line (start 2.54 18.73) (end 3.6 18.73) (layer "F.Fab") (width 0.1) (tstamp 79d8a954-98bb-452d-9879-9ad819891b39))
  (fp_line (start -3.6 18.73) (end -3.6 19.37) (layer "F.Fab") (width 0.1) (tstamp 7a4919b1-7212-4a72-8ea9-247773fa2a94))
  (fp_line (start 2.54 -24.45) (end 3.6 -24.45) (layer "F.Fab") (width 0.1) (tstamp 7ab5fed7-e849-4a06-9325-f640b3174c24))
  (fp_line (start 2.54 11.11) (end 3.6 11.11) (layer "F.Fab") (width 0.1) (tstamp 7b235b88-c69f-4281-9b0a-f281443bc220))
  (fp_line (start 3.6 -14.29) (end 3.6 -13.65) (layer "F.Fab") (width 0.1) (tstamp 7b5dd328-248b-4a21-81ba-7211851bc18a))
  (fp_line (start 3.6 -11.11) (end 2.54 -11.11) (layer "F.Fab") (width 0.1) (tstamp 7b9861e6-83be-47bf-815d-1073079c516b))
  (fp_line (start -3.6 -1.59) (end -3.6 -0.95) (layer "F.Fab") (width 0.1) (tstamp 7ecaf918-25b5-4351-b236-c3a4b6c4bcf3))
  (fp_line (start -3.6 -39.69) (end -3.6 -39.05) (layer "F.Fab") (width 0.1) (tstamp 7fa53b97-3cc3-4481-8439-e4a6aa1ee82a))
  (fp_line (start 3.6 39.05) (end 3.6 39.69) (layer "F.Fab") (width 0.1) (tstamp 7fc7308f-092f-4afc-9f8a-89ada4e18a9b))
  (fp_line (start -3.6 -9.21) (end -3.6 -8.57) (layer "F.Fab") (width 0.1) (tstamp 80592f3a-5e52-4dda-aede-f622600589c0))
  (fp_line (start -2.54 0.95) (end -3.6 0.95) (layer "F.Fab") (width 0.1) (tstamp 80f8fd4d-5c31-4735-a074-bd884d7078d0))
  (fp_line (start -3.6 -23.81) (end -2.54 -23.81) (layer "F.Fab") (width 0.1) (tstamp 82efc585-9971-48b0-949d-bffde3468f2d))
  (fp_line (start 2.54 -4.13) (end 3.6 -4.13) (layer "F.Fab") (width 0.1) (tstamp 846ec4f2-1aab-4225-a8a2-0d40d35ba1e0))
  (fp_line (start 3.6 -39.05) (end 2.54 -39.05) (layer "F.Fab") (width 0.1) (tstamp 859c0414-c483-41ca-91bd-b7e171c65688))
  (fp_line (start 3.6 3.49) (end 3.6 4.13) (layer "F.Fab") (width 0.1) (tstamp 85a32a2f-8cbb-47fd-8be4-a8838d96a509))
  (fp_line (start -2.54 -14.29) (end -3.6 -14.29) (layer "F.Fab") (width 0.1) (tstamp 862aecf4-d786-4578-a2f6-e6f29ed4cbbc))
  (fp_line (start 3.6 16.83) (end 2.54 16.83) (layer "F.Fab") (width 0.1) (tstamp 862f1c80-1591-408c-a42d-6ad18e0dde67))
  (fp_line (start -3.6 -21.27) (end -2.54 -21.27) (layer "F.Fab") (width 0.1) (tstamp 8681e6fa-e4a2-4fb8-8dcf-916c96072e72))
  (fp_line (start 3.6 -19.37) (end 3.6 -18.73) (layer "F.Fab") (width 0.1) (tstamp 87bfe47e-95e7-45a3-b937-a9e493e70039))
  (fp_line (start 3.6 -46.67) (end 2.54 -46.67) (layer "F.Fab") (width 0.1) (tstamp 87d65f05-955c-4816-90cb-d49ca9c33bfd))
  (fp_line (start 2.54 8.57) (end 3.6 8.57) (layer "F.Fab") (width 0.1) (tstamp 87eff986-aa57-492d-9a4e-f309a0366ed5))
  (fp_line (start -3.6 -37.15) (end -3.6 -36.51) (layer "F.Fab") (width 0.1) (tstamp 88071661-5a46-4add-8ccc-ddf3e6a5dcc8))
  (fp_line (start -3.6 -46.67) (end -2.54 -46.67) (layer "F.Fab") (width 0.1) (tstamp 887c5fdb-4191-463c-a806-1db4bc894f7c))
  (fp_line (start 3.6 -21.91) (end 3.6 -21.27) (layer "F.Fab") (width 0.1) (tstamp 88f52871-df56-43b8-aa2d-9885afa6aabd))
  (fp_line (start 2.54 49.21) (end 3.6 49.21) (layer "F.Fab") (width 0.1) (tstamp 89590cb2-097b-4e95-a141-f63e9b7fa502))
  (fp_line (start 3.6 -24.45) (end 3.6 -23.81) (layer "F.Fab") (width 0.1) (tstamp 8a1a6488-90af-4ebb-87b4-0e2296a0a12f))
  (fp_line (start 3.6 28.89) (end 3.6 29.53) (layer "F.Fab") (width 0.1) (tstamp 8d49d32e-6789-48c8-af32-fff142eecabb))
  (fp_line (start -3.6 21.27) (end -3.6 21.91) (layer "F.Fab") (width 0.1) (tstamp 8deb8719-609d-4afa-9733-8337a617ef67))
  (fp_line (start 2.54 13.65) (end 3.6 13.65) (layer "F.Fab") (width 0.1) (tstamp 8e186aa7-1345-43e5-b152-b109af25c593))
  (fp_line (start 2.54 -39.69) (end 3.6 -39.69) (layer "F.Fab") (width 0.1) (tstamp 8ed74b6e-6fa5-4e49-ab23-68797ce1a3de))
  (fp_line (start 3.6 -0.95) (end 2.54 -0.95) (layer "F.Fab") (width 0.1) (tstamp 8f1649e6-ce94-482b-be0d-024c0f777b31))
  (fp_line (start -2.54 41.59) (end -3.6 41.59) (layer "F.Fab") (width 0.1) (tstamp 8f9f93e4-d5aa-4200-bc01-3736c664b8d8))
  (fp_line (start -3.6 -21.91) (end -3.6 -21.27) (layer "F.Fab") (width 0.1) (tstamp 9144a792-4dc7-4f7a-91a6-1c0b2bdb9e36))
  (fp_line (start 3.6 37.15) (end 2.54 37.15) (layer "F.Fab") (width 0.1) (tstamp 91c00e47-a637-49e3-b479-05688b7836bd))
  (fp_line (start 2.54 46.67) (end 3.6 46.67) (layer "F.Fab") (width 0.1) (tstamp 94040eb1-1ac7-4644-af38-37639bd4e2d9))
  (fp_line (start 3.6 -21.27) (end 2.54 -21.27) (layer "F.Fab") (width 0.1) (tstamp 96ed073c-1b62-47db-9e90-432d32aebd2e))
  (fp_line (start 3.6 32.07) (end 2.54 32.07) (layer "F.Fab") (width 0.1) (tstamp 979aaf97-7825-4b9e-8a45-dbc54df9ad1f))
  (fp_line (start 3.6 16.19) (end 3.6 16.83) (layer "F.Fab") (width 0.1) (tstamp 984fd886-57ef-42f8-be8c-bac3eeacf5c7))
  (fp_line (start 3.6 -18.73) (end 2.54 -18.73) (layer "F.Fab") (width 0.1) (tstamp 9a5f11b2-8337-4a34-983c-76110fc0901d))
  (fp_line (start -3.6 28.89) (end -3.6 29.53) (layer "F.Fab") (width 0.1) (tstamp 9f1859da-d447-4a9f-a377-31dd4e2b46f4))
  (fp_line (start 3.6 9.21) (end 2.54 9.21) (layer "F.Fab") (width 0.1) (tstamp a2926cdd-3c82-41f3-9906-ea2292a5af59))
  (fp_line (start 2.54 16.19) (end 3.6 16.19) (layer "F.Fab") (width 0.1) (tstamp a2bd0c3c-6350-4235-8513-c5b5aa39035d))
  (fp_line (start -2.54 -1.59) (end -3.6 -1.59) (layer "F.Fab") (width 0.1) (tstamp a39a7d50-d0b4-46f9-9d86-e35f16231f63))
  (fp_line (start -2.54 -44.77) (end -3.6 -44.77) (layer "F.Fab") (width 0.1) (tstamp a3b0e92f-ed4a-4a3a-a403-304c1f9d5035))
  (fp_line (start 2.54 -29.53) (end 3.6 -29.53) (layer "F.Fab") (width 0.1) (tstamp a40926cd-e5b6-43af-8fa6-ef8c53ba73ca))
  (fp_line (start -3.6 23.81) (end -3.6 24.45) (layer "F.Fab") (width 0.1) (tstamp a43a39bf-14a4-4a4d-b3e1-1090c4abd375))
  (fp_line (start 2.54 -14.29) (end 3.6 -14.29) (layer "F.Fab") (width 0.1) (tstamp a6aa8dee-0efd-4f31-b8f8-2ea3ade28af4))
  (fp_line (start 3.6 -28.89) (end 2.54 -28.89) (layer "F.Fab") (width 0.1) (tstamp a6af7aa2-3c24-4699-880f-b3ab6082e710))
  (fp_line (start 2.54 36.51) (end 3.6 36.51) (layer "F.Fab") (width 0.1) (tstamp a76144cb-fc1e-4db1-8b74-061d49d8e639))
  (fp_line (start -3.6 -49.21) (end -2.54 -49.21) (layer "F.Fab") (width 0.1) (tstamp aa910708-4509-4a23-8d1d-33655a7e2fc4))
  (fp_line (start 2.54 -34.61) (end 3.6 -34.61) (layer "F.Fab") (width 0.1) (tstamp ab19b19c-35a0-485b-95c5-f9dd9193a54c))
  (fp_line (start -2.54 18.73) (end -3.6 18.73) (layer "F.Fab") (width 0.1) (tstamp ace5e153-0b79-457d-9b3a-b0bf792794b8))
  (fp_line (start 2.54 -49.85) (end 3.6 -49.85) (layer "F.Fab") (width 0.1) (tstamp aff18e68-db07-4cbc-aca9-3d627b659445))
  (fp_line (start 3.6 49.85) (end 2.54 49.85) (layer "F.Fab") (width 0.1) (tstamp b1a91164-399c-4cac-88eb-c44c9cebd7f1))
  (fp_line (start 3.6 -11.75) (end 3.6 -11.11) (layer "F.Fab") (width 0.1) (tstamp b492ac6b-41ab-48e7-9f58-fd44682b9795))
  (fp_line (start 3.6 -26.99) (end 3.6 -26.35) (layer "F.Fab") (width 0.1) (tstamp b504a331-ec27-47de-96d1-74cbfd74656f))
  (fp_line (start -3.6 0.95) (end -3.6 1.59) (layer "F.Fab") (width 0.1) (tstamp b5794ea5-db49-49a1-8ad2-466354259378))
  (fp_line (start -3.6 42.23) (end -2.54 42.23) (layer "F.Fab") (width 0.1) (tstamp b6f8015a-5289-417d-8014-b9eef6cdd17a))
  (fp_line (start -2.54 -49.85) (end -1.59 -50.8) (layer "F.Fab") (width 0.1) (tstamp b95c1f5d-ee2b-4ba4-b9be-3d13050a720a))
  (fp_line (start 2.54 -37.15) (end 3.6 -37.15) (layer "F.Fab") (width 0.1) (tstamp ba85668c-f7fc-4c24-aaa4-a54d29c7392a))
  (fp_line (start 3.6 19.37) (end 2.54 19.37) (layer "F.Fab") (width 0.1) (tstamp bbcad7d6-fc9d-459b-8f9d-ff655401e38f))
  (fp_line (start -3.6 24.45) (end -2.54 24.45) (layer "F.Fab") (width 0.1) (tstamp bc0598ac-927c-4209-ab9c-e0710c079eb5))
  (fp_line (start -2.54 -26.99) (end -3.6 -26.99) (layer "F.Fab") (width 0.1) (tstamp bca2c9bc-7e52-4d1e-83ad-f2129888cb5b))
  (fp_line (start -3.6 33.97) (end -3.6 34.61) (layer "F.Fab") (width 0.1) (tstamp bea2410a-d4d6-4b62-aff6-1e98004bca9b))
  (fp_line (start -2.54 23.81) (end -3.6 23.81) (layer "F.Fab") (width 0.1) (tstamp c1014c8b-b12d-44ed-a89d-6faae5b1bbdc))
  (fp_line (start -3.6 34.61) (end -2.54 34.61) (layer "F.Fab") (width 0.1) (tstamp c16dc7ca-415e-43c7-8186-fb9a29a4d398))
  (fp_line (start -3.6 39.69) (end -2.54 39.69) (layer "F.Fab") (width 0.1) (tstamp c1d798ee-979d-468f-9932-d5cd41532ebb))
  (fp_line (start 3.6 11.75) (end 2.54 11.75) (layer "F.Fab") (width 0.1) (tstamp c2e86d5f-e30f-416d-8001-594f9d89c225))
  (fp_line (start -3.6 47.31) (end -2.54 47.31) (layer "F.Fab") (width 0.1) (tstamp c6d7f6a2-d651-43d3-ab1b-393b4fb017bb))
  (fp_line (start -3.6 9.21) (end -2.54 9.21) (layer "F.Fab") (width 0.1) (tstamp c74e9f20-a42f-4943-b05c-eb5626f70ada))
  (fp_line (start 2.54 6.03) (end 3.6 6.03) (layer "F.Fab") (width 0.1) (tstamp c7c514e2-bff3-4527-9cfc-e6a4f7b3730c))
  (fp_line (start -3.6 -29.53) (end -3.6 -28.89) (layer "F.Fab") (width 0.1) (tstamp c7f14ed4-74e3-493c-a65b-8abd5b0f0e0b))
  (fp_line (start -3.6 32.07) (end -2.54 32.07) (layer "F.Fab") (width 0.1) (tstamp c83e7f7d-0be4-4f5a-96d6-9f7b2635e0d1))
  (fp_line (start -2.54 -47.31) (end -3.6 -47.31) (layer "F.Fab") (width 0.1) (tstamp c91da9ec-e5e1-4ce3-86a4-d8f920c6f86f))
  (fp_line (start 3.6 6.03) (end 3.6 6.67) (layer "F.Fab") (width 0.1) (tstamp c95b7248-0287-4141-b267-ea46e70d4c08))
  (fp_line (start -2.54 -4.13) (end -3.6 -4.13) (layer "F.Fab") (width 0.1) (tstamp cb4ebe27-1712-4f85-90e8-a128ee01cf3c))
  (fp_line (start -3.6 13.65) (end -3.6 14.29) (layer "F.Fab") (width 0.1) (tstamp cb7f82f9-31ca-4790-99a7-0c31c069d637))
  (fp_line (start -3.6 26.99) (end -2.54 26.99) (layer "F.Fab") (width 0.1) (tstamp cbf7524a-c9f4-48c6-b2fb-257d9870fcfa))
  (fp_line (start 3.6 31.43) (end 3.6 32.07) (layer "F.Fab") (width 0.1) (tstamp cc10c7bc-a85d-4462-9ed4-edf7550851d4))
  (fp_line (start -2.54 -49.85) (end -3.6 -49.85) (layer "F.Fab") (width 0.1) (tstamp cda92abd-5fcd-4d02-9094-d0520fa084d6))
  (fp_line (start -3.6 -6.03) (end -2.54 -6.03) (layer "F.Fab") (width 0.1) (tstamp cdcc0605-16b0-4478-b8b4-9492e34a2787))
  (fp_line (start -3.6 -44.13) (end -2.54 -44.13) (layer "F.Fab") (width 0.1) (tstamp cf5a687b-1443-435d-b32e-3fb6ac34dfdb))
  (fp_line (start -2.54 -21.91) (end -3.6 -21.91) (layer "F.Fab") (width 0.1) (tstamp cff9071c-5afa-45bf-a72f-231b5418d2de))
  (fp_line (start 3.6 -31.43) (end 2.54 -31.43) (layer "F.Fab") (width 0.1) (tstamp d0706ff4-fa56-463f-8697-f04e530ed215))
  (fp_line (start -2.54 39.05) (end -3.6 39.05) (layer "F.Fab") (width 0.1) (tstamp d0acb74f-c49d-4688-8436-8a0f3465c613))
  (fp_line (start -3.6 -28.89) (end -2.54 -28.89) (layer "F.Fab") (width 0.1) (tstamp d2cfbf7b-8981-4aa3-88a4-f0a985d21f14))
  (fp_line (start 2.54 -1.59) (end 3.6 -1.59) (layer "F.Fab") (width 0.1) (tstamp d57ae740-9852-41d4-9583-15786fc091c8))
  (fp_line (start -3.6 44.13) (end -3.6 44.77) (layer "F.Fab") (width 0.1) (tstamp d58f60fb-c597-4975-8dac-f71dbacc7b01))
  (fp_line (start -3.6 16.83) (end -2.54 16.83) (layer "F.Fab") (width 0.1) (tstamp d5f6538f-afc6-4882-af80-e3a81d515ab2))
  (fp_line (start 3.6 21.27) (end 3.6 21.91) (layer "F.Fab") (width 0.1) (tstamp d61f7a44-f205-40ae-95ee-326ef256e038))
  (fp_line (start 2.54 -47.31) (end 3.6 -47.31) (layer "F.Fab") (width 0.1) (tstamp d62c299b-0b1b-422c-8aac-923443341923))
  (fp_line (start 3.6 44.13) (end 3.6 44.77) (layer "F.Fab") (width 0.1) (tstamp d669fe61-ee40-400a-be07-1eace1e8252c))
  (fp_line (start -2.54 46.67) (end -3.6 46.67) (layer "F.Fab") (width 0.1) (tstamp d809409a-7bc0-4b1b-aa48-7b067dd9e329))
  (fp_line (start 2.54 -26.99) (end 3.6 -26.99) (layer "F.Fab") (width 0.1) (tstamp d840472d-bf85-4533-bbe7-460cb5529bed))
  (fp_line (start 2.54 44.13) (end 3.6 44.13) (layer "F.Fab") (width 0.1) (tstamp da070be3-818b-4d85-9584-0017c6e07f46))
  (fp_line (start 3.6 -33.97) (end 2.54 -33.97) (layer "F.Fab") (width 0.1) (tstamp da4c385b-5117-48a1-8fd6-b06079da4271))
  (fp_line (start 2.54 0.95) (end 3.6 0.95) (layer "F.Fab") (width 0.1) (tstamp daa58b8c-4394-436f-9928-2566091e50fb))
  (fp_line (start 2.54 -50.8) (end 2.54 50.8) (layer "F.Fab") (width 0.1) (tstamp daead48a-88bc-4555-b4c6-41705e1f5f36))
  (fp_line (start -3.6 1.59) (end -2.54 1.59) (layer "F.Fab") (width 0.1) (tstamp dc3a78a7-68a5-480a-9b39-d0a31ca4aae3))
  (fp_line (start 3.6 -3.49) (end 2.54 -3.49) (layer "F.Fab") (width 0.1) (tstamp deb59148-8ba0-4434-a035-27c9f8188cbb))
  (fp_line (start 3.6 -39.69) (end 3.6 -39.05) (layer "F.Fab") (width 0.1) (tstamp df2c9a7d-c977-48f3-9245-4cbdf9d30b8e))
  (fp_line (start 2.54 28.89) (end 3.6 28.89) (layer "F.Fab") (width 0.1) (tstamp e3a0d9bb-d365-4a0a-a556-eced24c0d215))
  (fp_line (start 3.6 6.67) (end 2.54 6.67) (layer "F.Fab") (width 0.1) (tstamp e3ef4118-ac64-4626-8948-7dbb72641250))
  (fp_line (start 3.6 -9.21) (end 3.6 -8.57) (layer "F.Fab") (width 0.1) (tstamp e4f3dc3c-0875-4ecd-bfbf-514ffe2fe450))
  (fp_line (start -2.54 -19.37) (end -3.6 -19.37) (layer "F.Fab") (width 0.1) (tstamp e5a2e793-bb0d-498b-a5c1-4ced56f9f4dc))
  (fp_line (start -2.54 -29.53) (end -3.6 -29.53) (layer "F.Fab") (width 0.1) (tstamp e8960ca6-4f9a-4d35-8cf6-7a3d2f3f716c))
  (fp_line (start -2.54 26.35) (end -3.6 26.35) (layer "F.Fab") (width 0.1) (tstamp eb4cad45-da2e-4435-81c8-432eba5d71d5))
  (fp_line (start 3.6 24.45) (end 2.54 24.45) (layer "F.Fab") (width 0.1) (tstamp eea15a1e-1864-49d6-9a11-77c01de04723))
  (fp_line (start 3.6 26.35) (end 3.6 26.99) (layer "F.Fab") (width 0.1) (tstamp effb600f-e1d9-4bfa-8097-8c40db912d1f))
  (fp_line (start 2.54 50.8) (end -2.54 50.8) (layer "F.Fab") (width 0.1) (tstamp f140cd45-5817-4414-8d9d-6e0e5c85ad1c))
  (fp_line (start -3.6 37.15) (end -2.54 37.15) (layer "F.Fab") (width 0.1) (tstamp f199db7e-0ac4-4939-8eb5-24ff2ed59db6))
  (fp_line (start -2.54 31.43) (end -3.6 31.43) (layer "F.Fab") (width 0.1) (tstamp f1a8e8ee-feb8-40df-a730-62b3c3d38b84))
  (fp_line (start 3.6 -6.67) (end 3.6 -6.03) (layer "F.Fab") (width 0.1) (tstamp f20e744b-5505-4180-b81e-af80dac58e92))
  (fp_line (start -3.6 41.59) (end -3.6 42.23) (layer "F.Fab") (width 0.1) (tstamp f34564b5-94ea-4aa3-ba7c-5a236b7cb34f))
  (fp_line (start 3.6 -1.59) (end 3.6 -0.95) (layer "F.Fab") (width 0.1) (tstamp f54c3d48-9d6f-4e84-ba90-a3d65ba176c9))
  (fp_line (start -3.6 -11.11) (end -2.54 -11.11) (layer "F.Fab") (width 0.1) (tstamp f593739a-49de-4ea8-9e82-a18c3788809c))
  (fp_line (start -3.6 -44.77) (end -3.6 -44.13) (layer "F.Fab") (width 0.1) (tstamp f5c75603-5bde-4dff-878b-7d00f86c1032))
  (fp_line (start -2.54 50.8) (end -2.54 -49.85) (layer "F.Fab") (width 0.1) (tstamp f6a78a74-6d4f-4488-abb9-7e43fbc94690))
  (fp_line (start 3.6 23.81) (end 3.6 24.45) (layer "F.Fab") (width 0.1) (tstamp f791295e-dffb-49b1-8e9b-3ffad778cdc7))
  (fp_line (start 3.6 34.61) (end 2.54 34.61) (layer "F.Fab") (width 0.1) (tstamp f90bde00-a9bd-4955-90e8-82dbd7afb53a))
  (fp_line (start 3.6 14.29) (end 2.54 14.29) (layer "F.Fab") (width 0.1) (tstamp f942bc68-d08b-42ea-9b56-443f3fece346))
  (fp_line (start -3.6 14.29) (end -2.54 14.29) (layer "F.Fab") (width 0.1) (tstamp f97d431a-0b84-493a-8157-74003f3a0ad8))
  (fp_line (start -3.6 36.51) (end -3.6 37.15) (layer "F.Fab") (width 0.1) (tstamp fa4e628f-36ed-4d4c-9522-06cfee0450cc))
  (fp_line (start 3.6 39.69) (end 2.54 39.69) (layer "F.Fab") (width 0.1) (tstamp fad99e8b-5c8f-4a65-b95a-677b1ceab2f3))
  (fp_line (start -2.54 16.19) (end -3.6 16.19) (layer "F.Fab") (width 0.1) (tstamp fc0db8f5-41ff-4c60-8907-c770d2d765e0))
  (fp_line (start 3.6 18.73) (end 3.6 19.37) (layer "F.Fab") (width 0.1) (tstamp fc971156-1cf6-4566-8ffa-7243a4460e83))
  (fp_line (start -3.6 29.53) (end -2.54 29.53) (layer "F.Fab") (width 0.1) (tstamp fd908e8a-5478-4af4-86e0-8ab3060f3c55))
  (fp_line (start -2.54 36.51) (end -3.6 36.51) (layer "F.Fab") (width 0.1) (tstamp fdc2b199-319e-41bb-833d-c684e4e80705))
  (fp_line (start 2.54 -44.77) (end 3.6 -44.77) (layer "F.Fab") (width 0.1) (tstamp fee1de1c-3b8a-4308-8ff3-8ae38f1c50b7))
  (fp_line (start -3.6 -19.37) (end -3.6 -18.73) (layer "F.Fab") (width 0.1) (tstamp ffcddbc6-a183-41b4-ad0a-28349645cb2f))
  (pad "1" smd rect (at -2.525 -49.53) (size 3.15 1) (layers "F.Cu" "F.Paste" "F.Mask") (tstamp d8d81350-bb97-4d68-95a9-a4867c4b73e6))
  (pad "2" smd rect (at 2.525 -49.53) (size 3.15 1) (layers "F.Cu" "F.Paste" "F.Mask") (tstamp 168101c6-ed4f-404e-b67d-ab5fbc3d4c60))
  (pad "3" smd rect (at -2.525 -46.99) (size 3.15 1) (layers "F.Cu" "F.Paste" "F.Mask") (tstamp cd65ad5a-4ab0-40d1-84b7-35359d97e27a))
  (pad "4" smd rect (at 2.525 -46.99) (size 3.15 1) (layers "F.Cu" "F.Paste" "F.Mask") (tstamp a416c0cd-e324-4448-ab81-b779558907a7))
  (pad "5" smd rect (at -2.525 -44.45) (size 3.15 1) (layers "F.Cu" "F.Paste" "F.Mask") (tstamp d6fdcde3-4032-4d87-9a68-2886b8dd4348))
  (pad "6" smd rect (at 2.525 -44.45) (size 3.15 1) (layers "F.Cu" "F.Paste" "F.Mask") (tstamp 16051dfe-41d2-4cfb-9339-e17ca86a63de))
  (pad "7" smd rect (at -2.525 -41.91) (size 3.15 1) (layers "F.Cu" "F.Paste" "F.Mask") (tstamp f0ff6785-a04a-41cd-8ef6-aef46c0c94ed))
  (pad "8" smd rect (at 2.525 -41.91) (size 3.15 1) (layers "F.Cu" "F.Paste" "F.Mask") (tstamp a6c98781-ac5c-47eb-9ccf-e7bb0bd7cdba))
  (pad "9" smd rect (at -2.525 -39.37) (size 3.15 1) (layers "F.Cu" "F.Paste" "F.Mask") (tstamp 5a10a162-eac7-404d-a2cc-2c94d6b9d434))
  (pad "10" smd rect (at 2.525 -39.37) (size 3.15 1) (layers "F.Cu" "F.Paste" "F.Mask") (tstamp ba04c9c4-0c87-4650-89db-cf902c70a9dc))
  (pad "11" smd rect (at -2.525 -36.83) (size 3.15 1) (layers "F.Cu" "F.Paste" "F.Mask") (tstamp d855fccf-f184-4740-80f6-e5dcb42d462c))
  (pad "12" smd rect (at 2.525 -36.83) (size 3.15 1) (layers "F.Cu" "F.Paste" "F.Mask") (tstamp 2f8f910b-46e4-4632-bb83-9bde302bc4ad))
  (pad "13" smd rect (at -2.525 -34.29) (size 3.15 1) (layers "F.Cu" "F.Paste" "F.Mask") (tstamp 619c4135-25c8-4dfd-9ca3-90b478dd7582))
  (pad "14" smd rect (at 2.525 -34.29) (size 3.15 1) (layers "F.Cu" "F.Paste" "F.Mask") (tstamp f6305397-4476-4a79-815e-c2c7e7a0ce7d))
  (pad "15" smd rect (at -2.525 -31.75) (size 3.15 1) (layers "F.Cu" "F.Paste" "F.Mask") (tstamp 38b93bb7-c87e-46d8-a91a-2be675657b9f))
  (pad "16" smd rect (at 2.525 -31.75) (size 3.15 1) (layers "F.Cu" "F.Paste" "F.Mask") (tstamp 1f215cce-331f-4de7-b7cc-b3c4ffd04907))
  (pad "17" smd rect (at -2.525 -29.21) (size 3.15 1) (layers "F.Cu" "F.Paste" "F.Mask") (tstamp cbcfe2f6-861e-4ed9-bf3d-9c56b841d06b))
  (pad "18" smd rect (at 2.525 -29.21) (size 3.15 1) (layers "F.Cu" "F.Paste" "F.Mask") (tstamp e7b8332c-0b1f-4c09-b81e-39d892893501))
  (pad "19" smd rect (at -2.525 -26.67) (size 3.15 1) (layers "F.Cu" "F.Paste" "F.Mask") (tstamp 50362e06-ed20-4eba-a61c-5187fbcca3c4))
  (pad "20" smd rect (at 2.525 -26.67) (size 3.15 1) (layers "F.Cu" "F.Paste" "F.Mask") (tstamp eeca284d-7b4b-4efa-99a4-193469f32997))
  (pad "21" smd rect (at -2.525 -24.13) (size 3.15 1) (layers "F.Cu" "F.Paste" "F.Mask") (tstamp 420fe2be-daa8-498a-bea8-068e31f9ee98))
  (pad "22" smd rect (at 2.525 -24.13) (size 3.15 1) (layers "F.Cu" "F.Paste" "F.Mask") (tstamp 3e48a6b8-4ad3-41e7-b8ec-b974f396934a))
  (pad "23" smd rect (at -2.525 -21.59) (size 3.15 1) (layers "F.Cu" "F.Paste" "F.Mask") (tstamp af285f74-dc5c-4064-9196-41a52058a45d))
  (pad "24" smd rect (at 2.525 -21.59) (size 3.15 1) (layers "F.Cu" "F.Paste" "F.Mask") (tstamp 3b8b3914-9aed-4fed-b31f-afcd4591c34c))
  (pad "25" smd rect (at -2.525 -19.05) (size 3.15 1) (layers "F.Cu" "F.Paste" "F.Mask") (tstamp 1a81a6e8-bcf2-4e02-8a55-4d0a74a0b617))
  (pad "26" smd rect (at 2.525 -19.05) (size 3.15 1) (layers "F.Cu" "F.Paste" "F.Mask") (tstamp 4099ce0e-6e37-4514-afa2-2c6531531c72))
  (pad "27" smd rect (at -2.525 -16.51) (size 3.15 1) (layers "F.Cu" "F.Paste" "F.Mask") (tstamp 4d79d993-3b7c-41a9-9b13-9a144da9aae2))
  (pad "28" smd rect (at 2.525 -16.51) (size 3.15 1) (layers "F.Cu" "F.Paste" "F.Mask") (tstamp 34a0a358-d612-4d01-bfea-7efb6aa97109))
  (pad "29" smd rect (at -2.525 -13.97) (size 3.15 1) (layers "F.Cu" "F.Paste" "F.Mask") (tstamp 5cf312bc-6eb1-4bf8-b8be-44ec42c1488c))
  (pad "30" smd rect (at 2.525 -13.97) (size 3.15 1) (layers "F.Cu" "F.Paste" "F.Mask") (tstamp 7453756c-3e4b-4620-829e-eed1a1b93f25))
  (pad "31" smd rect (at -2.525 -11.43) (size 3.15 1) (layers "F.Cu" "F.Paste" "F.Mask") (tstamp 3e71b914-5863-4346-ae6c-de2bc5384bf9))
  (pad "32" smd rect (at 2.525 -11.43) (size 3.15 1) (layers "F.Cu" "F.Paste" "F.Mask") (tstamp 5e20b1c1-ca1b-4586-9b4d-279752747038))
  (pad "33" smd rect (at -2.525 -8.89) (size 3.15 1) (layers "F.Cu" "F.Paste" "F.Mask") (tstamp f79ff8e3-36dc-435a-8c93-4625119a13f9))
  (pad "34" smd rect (at 2.525 -8.89) (size 3.15 1) (layers "F.Cu" "F.Paste" "F.Mask") (tstamp 9800664c-381b-4fb9-9348-c5a0cc640c17))
  (pad "35" smd rect (at -2.525 -6.35) (size 3.15 1) (layers "F.Cu" "F.Paste" "F.Mask") (tstamp b4547882-9a6c-496d-a4bd-8362211a7547))
  (pad "36" smd rect (at 2.525 -6.35) (size 3.15 1) (layers "F.Cu" "F.Paste" "F.Mask") (tstamp d1ecf492-7373-4cfc-9964-e99187b7ee98))
  (pad "37" smd rect (at -2.525 -3.81) (size 3.15 1) (layers "F.Cu" "F.Paste" "F.Mask") (tstamp 1b498570-590e-4b84-8f17-e1f831637da1))
  (pad "38" smd rect (at 2.525 -3.81) (size 3.15 1) (layers "F.Cu" "F.Paste" "F.Mask") (tstamp edba3b7c-b619-4876-823f-f09c5ae830bf))
  (pad "39" smd rect (at -2.525 -1.27) (size 3.15 1) (layers "F.Cu" "F.Paste" "F.Mask") (tstamp 2559a279-312e-4920-93f2-8302f17d4db1))
  (pad "40" smd rect (at 2.525 -1.27) (size 3.15 1) (layers "F.Cu" "F.Paste" "F.Mask") (tstamp 885fd766-6297-4f21-9eeb-d3e690282804))
  (pad "41" smd rect (at -2.525 1.27) (size 3.15 1) (layers "F.Cu" "F.Paste" "F.Mask") (tstamp ac70c6c9-023d-45f6-bf55-cd0312456c1d))
  (pad "42" smd rect (at 2.525 1.27) (size 3.15 1) (layers "F.Cu" "F.Paste" "F.Mask") (tstamp fedd19b0-728d-4add-8e28-7419ac17cd51))
  (pad "43" smd rect (at -2.525 3.81) (size 3.15 1) (layers "F.Cu" "F.Paste" "F.Mask") (tstamp 06ea21b6-0ef4-48ee-9774-80181c57e9d8))
  (pad "44" smd rect (at 2.525 3.81) (size 3.15 1) (layers "F.Cu" "F.Paste" "F.Mask") (tstamp be9592d6-748d-4c69-b219-f7d0e89ffd59))
  (pad "45" smd rect (at -2.525 6.35) (size 3.15 1) (layers "F.Cu" "F.Paste" "F.Mask") (tstamp cf0b5079-c265-4155-85c0-0fac73a5306d))
  (pad "46" smd rect (at 2.525 6.35) (size 3.15 1) (layers "F.Cu" "F.Paste" "F.Mask") (tstamp 79d79f16-8492-48e4-9f10-d4507633bde7))
  (pad "47" smd rect (at -2.525 8.89) (size 3.15 1) (layers "F.Cu" "F.Paste" "F.Mask") (tstamp 487cb3b1-fd84-4472-b951-4ed579d67107))
  (pad "48" smd rect (at 2.525 8.89) (size 3.15 1) (layers "F.Cu" "F.Paste" "F.Mask") (tstamp 4d0008c8-aa1f-4322-a1ff-cf900573e3fb))
  (pad "49" smd rect (at -2.525 11.43) (size 3.15 1) (layers "F.Cu" "F.Paste" "F.Mask") (tstamp d742aff9-0268-4db6-b512-e88084443184))
  (pad "50" smd rect (at 2.525 11.43) (size 3.15 1) (layers "F.Cu" "F.Paste" "F.Mask") (tstamp 3c8b30a6-a92d-4e32-ab9e-98444df8ee3e))
  (pad "51" smd rect (at -2.525 13.97) (size 3.15 1) (layers "F.Cu" "F.Paste" "F.Mask") (tstamp f00aa5db-1fb8-46b4-9ddb-a1d5302d8612))
  (pad "52" smd rect (at 2.525 13.97) (size 3.15 1) (layers "F.Cu" "F.Paste" "F.Mask") (tstamp 3a6528b1-2f42-4508-be8d-9de8ea53a3cb))
  (pad "53" smd rect (at -2.525 16.51) (size 3.15 1) (layers "F.Cu" "F.Paste" "F.Mask") (tstamp a7ac0628-63d4-4225-92a8-36c5efa728e7))
  (pad "54" smd rect (at 2.525 16.51) (size 3.15 1) (layers "F.Cu" "F.Paste" "F.Mask") (tstamp b82995ac-414c-4407-baad-55ea48c78bd0))
  (pad "55" smd rect (at -2.525 19.05) (size 3.15 1) (layers "F.Cu" "F.Paste" "F.Mask") (tstamp d4d008e1-1c78-4b58-b478-100b8a2f44bb))
  (pad "56" smd rect (at 2.525 19.05) (size 3.15 1) (layers "F.Cu" "F.Paste" "F.Mask") (tstamp 82b04946-76c6-40f4-8765-a7e4bc38fff3))
  (pad "57" smd rect (at -2.525 21.59) (size 3.15 1) (layers "F.Cu" "F.Paste" "F.Mask") (tstamp 7b6d6469-5cb2-4885-b61a-ddbb0565f8b1))
  (pad "58" smd rect (at 2.525 21.59) (size 3.15 1) (layers "F.Cu" "F.Paste" "F.Mask") (tstamp 1b0359ee-019f-4bf5-a611-dd55ecee5eb6))
  (pad "59" smd rect (at -2.525 24.13) (size 3.15 1) (layers "F.Cu" "F.Paste" "F.Mask") (tstamp 575c7165-50e4-4eac-aa99-285d3796bac9))
  (pad "60" smd rect (at 2.525 24.13) (size 3.15 1) (layers "F.Cu" "F.Paste" "F.Mask") (tstamp cc0e6e2e-b84c-40f4-839a-79afcd0d4602))
  (pad "61" smd rect (at -2.525 26.67) (size 3.15 1) (layers "F.Cu" "F.Paste" "F.Mask") (tstamp 51ec46ca-b44c-477c-b64a-aaebff6dbcd4))
  (pad "62" smd rect (at 2.525 26.67) (size 3.15 1) (layers "F.Cu" "F.Paste" "F.Mask") (tstamp 8c2a7f81-2e58-4502-a04e-00ce3e899245))
  (pad "63" smd rect (at -2.525 29.21) (size 3.15 1) (layers "F.Cu" "F.Paste" "F.Mask") (tstamp e52eb4e7-320d-4f5e-9629-2a5aaee29d01))
  (pad "64" smd rect (at 2.525 29.21) (size 3.15 1) (layers "F.Cu" "F.Paste" "F.Mask") (tstamp 184238ec-5013-44f4-aa89-ce20238a1247))
  (pad "65" smd rect (at -2.525 31.75) (size 3.15 1) (layers "F.Cu" "F.Paste" "F.Mask") (tstamp 62abfb9e-0393-4791-a1e5-7d53e40b90d9))
  (pad "66" smd rect (at 2.525 31.75) (size 3.15 1) (layers "F.Cu" "F.Paste" "F.Mask") (tstamp 4cc2da8a-97f1-439b-9879-06691aff2f48))
  (pad "67" smd rect (at -2.525 34.29) (size 3.15 1) (layers "F.Cu" "F.Paste" "F.Mask") (tstamp 5c06e367-c23a-4bab-8c76-61233a33fe4c))
  (pad "68" smd rect (at 2.525 34.29) (size 3.15 1) (layers "F.Cu" "F.Paste" "F.Mask") (tstamp 38f297a2-2275-40b5-bfb2-09f787e5cc95))
  (pad "69" smd rect (at -2.525 36.83) (size 3.15 1) (layers "F.Cu" "F.Paste" "F.Mask") (tstamp 610ae033-2a84-4a2e-b8b7-54bcab1b7deb))
  (pad "70" smd rect (at 2.525 36.83) (size 3.15 1) (layers "F.Cu" "F.Paste" "F.Mask") (tstamp bb55de5b-75c1-4900-a48c-d236dd345997))
  (pad "71" smd rect (at -2.525 39.37) (size 3.15 1) (layers "F.Cu" "F.Paste" "F.Mask") (tstamp 349d8482-f9e1-4ebf-9af6-255eced7d5e8))
  (pad "72" smd rect (at 2.525 39.37) (size 3.15 1) (layers "F.Cu" "F.Paste" "F.Mask") (tstamp dd3798f2-6037-4996-a14e-4034632734b4))
  (pad "73" smd rect (at -2.525 41.91) (size 3.15 1) (layers "F.Cu" "F.Paste" "F.Mask") (tstamp 00e16a2b-5385-4281-9a92-60c210d9d7e0))
  (pad "74" smd rect (at 2.525 41.91) (size 3.15 1) (layers "F.Cu" "F.Paste" "F.Mask") (tstamp 0d174751-9830-4e15-99fe-25ec4db6ca54))
  (pad "75" smd rect (at -2.525 44.45) (size 3.15 1) (layers "F.Cu" "F.Paste" "F.Mask") (tstamp 921ef79c-6463-4265-9dc1-61d77487b996))
  (pad "76" smd rect (at 2.525 44.45) (size 3.15 1) (layers "F.Cu" "F.Paste" "F.Mask") (tstamp 1fb7a5d3-3194-43b6-b7db-c430895070e5))
  (pad "77" smd rect (at -2.525 46.99) (size 3.15 1) (layers "F.Cu" "F.Paste" "F.Mask") (tstamp 885f73ef-d964-45a8-8ad4-d463b3b398c3))
  (pad "78" smd rect (at 2.525 46.99) (size 3.15 1) (layers "F.Cu" "F.Paste" "F.Mask") (tstamp f42431ce-7e5a-457f-94a9-f3980813cf69))
  (pad "79" smd rect (at -2.525 49.53) (size 3.15 1) (layers "F.Cu" "F.Paste" "F.Mask") (tstamp 889965d8-8e77-4c11-b66b-854bee2efd9e))
  (pad "80" smd rect (at 2.525 49.53) (size 3.15 1) (layers "F.Cu" "F.Paste" "F.Mask") (tstamp 20bf333b-9b13-475f-b069-570fb88ca9fc))
  (model "${KICADLIB}/model/connector/PinHeader_2x40_P2.54mm_Vertical_SMD.step"
    (offset (xyz 0 0 0))
    (scale (xyz 1 1 1))
    (rotate (xyz 0 0 0))
  )
)
