(footprint "PinSocket_2x20_P2.54mm_Vertical" (version 20221018) (generator pcbnew)
  (layer "F.Cu")
  (descr "Through hole straight socket strip, 2x20, 2.54mm pitch, double cols (from Kicad 4.0.7), script generated")
  (tags "Through hole socket strip THT 2x20 2.54mm double row")
  (attr through_hole)
  (fp_text reference "REF**" (at -1.27 -2.77) (layer "F.SilkS")
      (effects (font (size 1 1) (thickness 0.15)))
    (tstamp 3911191a-02c9-4b1a-83d5-68a1a2fdd0d8)
  )
  (fp_text value "PinSocket_2x20_P2.54mm_Vertical" (at -1.27 51.03) (layer "F.Fab") hide
      (effects (font (size 1 1) (thickness 0.15)))
    (tstamp 3c0e797c-63ae-46ed-96c7-2a100797c547)
  )
  (fp_text user "^" (at 2.4 0 90 unlocked) (layer "F.SilkS")
      (effects (font (size 1 1) (thickness 0.15)))
    (tstamp 727be40d-35bd-4ea6-ae71-7a7d37fc4876)
  )
  (fp_text user "${REFERENCE}" (at -1.27 24.13 90) (layer "F.Fab")
      (effects (font (size 1 1) (thickness 0.15)))
    (tstamp 9fc0b938-fe05-4db6-ad64-d3d85da22157)
  )
  (fp_line (start -3.87 -1.33) (end -3.87 49.59)
    (stroke (width 0.12) (type solid)) (layer "F.SilkS") (tstamp eb6ae313-72d3-460a-a1cb-060a873cb5d1))
  (fp_line (start -3.87 -1.33) (end -1.27 -1.33)
    (stroke (width 0.12) (type solid)) (layer "F.SilkS") (tstamp c02ce353-3b01-41ec-a0f6-f4d0173696fc))
  (fp_line (start -3.87 49.59) (end 1.33 49.59)
    (stroke (width 0.12) (type solid)) (layer "F.SilkS") (tstamp 1e54d7a7-472c-4399-81ea-3c8f73bf6904))
  (fp_line (start -1.27 -1.33) (end -1.27 1.27)
    (stroke (width 0.12) (type solid)) (layer "F.SilkS") (tstamp e5bada22-f145-48af-a7b0-09741859a625))
  (fp_line (start -1.27 1.27) (end 1.33 1.27)
    (stroke (width 0.12) (type solid)) (layer "F.SilkS") (tstamp 40f8e0ed-f499-4ea6-887e-51494e293927))
  (fp_line (start 0 -1.33) (end 1.33 -1.33)
    (stroke (width 0.12) (type solid)) (layer "F.SilkS") (tstamp 51fda3dc-d770-46a3-83ef-a6ce1d0e7221))
  (fp_line (start 1.33 -1.33) (end 1.33 0)
    (stroke (width 0.12) (type solid)) (layer "F.SilkS") (tstamp 50e189da-d8c3-4fa7-ab5c-8db6cc213acd))
  (fp_line (start 1.33 1.27) (end 1.33 49.59)
    (stroke (width 0.12) (type solid)) (layer "F.SilkS") (tstamp c4305c30-deb7-4f16-91a2-4e634e725ac8))
  (fp_line (start -4.34 -1.8) (end 1.76 -1.8)
    (stroke (width 0.05) (type solid)) (layer "F.CrtYd") (tstamp 0f4f8402-c280-4b1d-abb7-dffad3cff33b))
  (fp_line (start -4.34 50) (end -4.34 -1.8)
    (stroke (width 0.05) (type solid)) (layer "F.CrtYd") (tstamp 752e5a7b-288e-4abd-b1b7-c62887acb726))
  (fp_line (start 1.76 -1.8) (end 1.76 50)
    (stroke (width 0.05) (type solid)) (layer "F.CrtYd") (tstamp 09c4d367-928c-4ede-b32d-9640c68a270c))
  (fp_line (start 1.76 50) (end -4.34 50)
    (stroke (width 0.05) (type solid)) (layer "F.CrtYd") (tstamp 250aa92f-b736-475e-8cb3-416ff293042e))
  (fp_line (start -3.81 -1.27) (end 0.27 -1.27)
    (stroke (width 0.1) (type solid)) (layer "F.Fab") (tstamp 951f2af9-e76c-4524-9d3c-6c785bc0b29d))
  (fp_line (start -3.81 49.53) (end -3.81 -1.27)
    (stroke (width 0.1) (type solid)) (layer "F.Fab") (tstamp c07ae07f-8ba2-44a7-88d3-36afaf79186b))
  (fp_line (start 0.27 -1.27) (end 1.27 -0.27)
    (stroke (width 0.1) (type solid)) (layer "F.Fab") (tstamp 4c25018f-9640-42fa-99c0-b46ac31f7670))
  (fp_line (start 1.27 -0.27) (end 1.27 49.53)
    (stroke (width 0.1) (type solid)) (layer "F.Fab") (tstamp 3b411c1c-66f0-490f-b126-44d30f51ffab))
  (fp_line (start 1.27 49.53) (end -3.81 49.53)
    (stroke (width 0.1) (type solid)) (layer "F.Fab") (tstamp 48086c9c-f1dd-41db-9392-ea44f8144c1a))
  (pad "1" thru_hole rect (at 0 0) (size 1.7 1.7) (drill 1) (layers "*.Cu" "*.Mask") (remove_unused_layers) (keep_end_layers) (tstamp 8333b2c9-7f77-4c98-a523-bdfd9eee409c))
  (pad "2" thru_hole oval (at -2.54 0) (size 1.7 1.7) (drill 1) (layers "*.Cu" "*.Mask") (remove_unused_layers) (keep_end_layers) (tstamp dd90ad5d-21c7-4d7a-8421-3aa6e38a1dd7))
  (pad "3" thru_hole oval (at 0 2.54) (size 1.7 1.7) (drill 1) (layers "*.Cu" "*.Mask") (remove_unused_layers) (keep_end_layers) (tstamp 2d950e7c-590c-45b0-9dcf-bb5660966510))
  (pad "4" thru_hole oval (at -2.54 2.54) (size 1.7 1.7) (drill 1) (layers "*.Cu" "*.Mask") (remove_unused_layers) (keep_end_layers) (tstamp c293f51a-af51-4e2d-97e5-2b25f3d26e2b))
  (pad "5" thru_hole oval (at 0 5.08) (size 1.7 1.7) (drill 1) (layers "*.Cu" "*.Mask") (remove_unused_layers) (keep_end_layers) (tstamp 9bb8f406-2757-4a45-9a9f-d64ab505ee1c))
  (pad "6" thru_hole oval (at -2.54 5.08) (size 1.7 1.7) (drill 1) (layers "*.Cu" "*.Mask") (remove_unused_layers) (keep_end_layers) (tstamp 58cb20ff-49ad-45b8-8e58-2bad0610604a))
  (pad "7" thru_hole oval (at 0 7.62) (size 1.7 1.7) (drill 1) (layers "*.Cu" "*.Mask") (remove_unused_layers) (keep_end_layers) (tstamp b1912f46-fc30-4803-be87-35fd70682cda))
  (pad "8" thru_hole oval (at -2.54 7.62) (size 1.7 1.7) (drill 1) (layers "*.Cu" "*.Mask") (remove_unused_layers) (keep_end_layers) (tstamp b7316a90-153a-45e9-a103-abf0fb546a19))
  (pad "9" thru_hole oval (at 0 10.16) (size 1.7 1.7) (drill 1) (layers "*.Cu" "*.Mask") (remove_unused_layers) (keep_end_layers) (tstamp d25751d7-d6c7-49ba-a746-65ec961dac06))
  (pad "10" thru_hole oval (at -2.54 10.16) (size 1.7 1.7) (drill 1) (layers "*.Cu" "*.Mask") (remove_unused_layers) (keep_end_layers) (tstamp f240325c-c310-4237-9a3d-59b0d64b2ec2))
  (pad "11" thru_hole oval (at 0 12.7) (size 1.7 1.7) (drill 1) (layers "*.Cu" "*.Mask") (remove_unused_layers) (keep_end_layers) (tstamp f81ce0ba-e05f-4fff-a30e-c1a6250f3e63))
  (pad "12" thru_hole oval (at -2.54 12.7) (size 1.7 1.7) (drill 1) (layers "*.Cu" "*.Mask") (remove_unused_layers) (keep_end_layers) (tstamp f7d98095-efe4-48da-ac87-cfd847de2bbc))
  (pad "13" thru_hole oval (at 0 15.24) (size 1.7 1.7) (drill 1) (layers "*.Cu" "*.Mask") (remove_unused_layers) (keep_end_layers) (tstamp a7dbc8dd-51db-4db2-b025-f3cc63c23ef1))
  (pad "14" thru_hole oval (at -2.54 15.24) (size 1.7 1.7) (drill 1) (layers "*.Cu" "*.Mask") (remove_unused_layers) (keep_end_layers) (tstamp bd60d504-b547-448c-9a2f-cc84db747b66))
  (pad "15" thru_hole oval (at 0 17.78) (size 1.7 1.7) (drill 1) (layers "*.Cu" "*.Mask") (remove_unused_layers) (keep_end_layers) (tstamp cdf9287e-5d3f-4bdb-8560-702d0f0ceda7))
  (pad "16" thru_hole oval (at -2.54 17.78) (size 1.7 1.7) (drill 1) (layers "*.Cu" "*.Mask") (remove_unused_layers) (keep_end_layers) (tstamp f756bfc1-cc74-4295-8f13-b46d80b454ee))
  (pad "17" thru_hole oval (at 0 20.32) (size 1.7 1.7) (drill 1) (layers "*.Cu" "*.Mask") (remove_unused_layers) (keep_end_layers) (tstamp c10ad04b-9f1b-4c38-9617-889a1b8b53ac))
  (pad "18" thru_hole oval (at -2.54 20.32) (size 1.7 1.7) (drill 1) (layers "*.Cu" "*.Mask") (remove_unused_layers) (keep_end_layers) (tstamp 3c772303-d73f-4125-8701-f43750737bdc))
  (pad "19" thru_hole oval (at 0 22.86) (size 1.7 1.7) (drill 1) (layers "*.Cu" "*.Mask") (remove_unused_layers) (keep_end_layers) (tstamp 5126296d-dc05-4e45-bfb4-e1946c603ea0))
  (pad "20" thru_hole oval (at -2.54 22.86) (size 1.7 1.7) (drill 1) (layers "*.Cu" "*.Mask") (remove_unused_layers) (keep_end_layers) (tstamp 115d394b-cc3e-4d05-ac35-5256d76515d4))
  (pad "21" thru_hole oval (at 0 25.4) (size 1.7 1.7) (drill 1) (layers "*.Cu" "*.Mask") (remove_unused_layers) (keep_end_layers) (tstamp bd3d4c94-2212-4120-9613-23bff8e49a99))
  (pad "22" thru_hole oval (at -2.54 25.4) (size 1.7 1.7) (drill 1) (layers "*.Cu" "*.Mask") (remove_unused_layers) (keep_end_layers) (tstamp 461519dd-7b71-4d4d-84d3-ac7f0f5b3b81))
  (pad "23" thru_hole oval (at 0 27.94) (size 1.7 1.7) (drill 1) (layers "*.Cu" "*.Mask") (remove_unused_layers) (keep_end_layers) (tstamp b24b8342-9513-4325-a9bb-2e3a9dca8194))
  (pad "24" thru_hole oval (at -2.54 27.94) (size 1.7 1.7) (drill 1) (layers "*.Cu" "*.Mask") (remove_unused_layers) (keep_end_layers) (tstamp 82385e89-e920-412c-9454-52bc6b6f2b10))
  (pad "25" thru_hole oval (at 0 30.48) (size 1.7 1.7) (drill 1) (layers "*.Cu" "*.Mask") (remove_unused_layers) (keep_end_layers) (tstamp 75288c8e-ca90-498f-b498-0399915c04b4))
  (pad "26" thru_hole oval (at -2.54 30.48) (size 1.7 1.7) (drill 1) (layers "*.Cu" "*.Mask") (remove_unused_layers) (keep_end_layers) (tstamp 244e03a3-6ec5-45a7-a234-4c53b02a6ac9))
  (pad "27" thru_hole oval (at 0 33.02) (size 1.7 1.7) (drill 1) (layers "*.Cu" "*.Mask") (remove_unused_layers) (keep_end_layers) (tstamp 8b5e378a-175f-48be-99a0-19a9a3055669))
  (pad "28" thru_hole oval (at -2.54 33.02) (size 1.7 1.7) (drill 1) (layers "*.Cu" "*.Mask") (remove_unused_layers) (keep_end_layers) (tstamp 7ab550eb-13ab-4e23-8a94-d7a82e8ced47))
  (pad "29" thru_hole oval (at 0 35.56) (size 1.7 1.7) (drill 1) (layers "*.Cu" "*.Mask") (remove_unused_layers) (keep_end_layers) (tstamp eab86076-b301-4a3d-a028-11c7f5c66f78))
  (pad "30" thru_hole oval (at -2.54 35.56) (size 1.7 1.7) (drill 1) (layers "*.Cu" "*.Mask") (remove_unused_layers) (keep_end_layers) (tstamp e11189ed-c496-45ed-a643-e609ebb4a580))
  (pad "31" thru_hole oval (at 0 38.1) (size 1.7 1.7) (drill 1) (layers "*.Cu" "*.Mask") (remove_unused_layers) (keep_end_layers) (tstamp 78092ee5-3c8b-4043-ba5b-49fec7489c6a))
  (pad "32" thru_hole oval (at -2.54 38.1) (size 1.7 1.7) (drill 1) (layers "*.Cu" "*.Mask") (remove_unused_layers) (keep_end_layers) (tstamp 6df49fc6-4db4-4157-a86a-f4c471133f40))
  (pad "33" thru_hole oval (at 0 40.64) (size 1.7 1.7) (drill 1) (layers "*.Cu" "*.Mask") (remove_unused_layers) (keep_end_layers) (tstamp b4500dc8-d2c5-4b4d-aa2e-44edaa26a220))
  (pad "34" thru_hole oval (at -2.54 40.64) (size 1.7 1.7) (drill 1) (layers "*.Cu" "*.Mask") (remove_unused_layers) (keep_end_layers) (tstamp a36f6073-dcc4-40db-b5df-f6eb27bf6b83))
  (pad "35" thru_hole oval (at 0 43.18) (size 1.7 1.7) (drill 1) (layers "*.Cu" "*.Mask") (remove_unused_layers) (keep_end_layers) (tstamp e3d3a8b0-3d8e-4557-84ee-c68372520eac))
  (pad "36" thru_hole oval (at -2.54 43.18) (size 1.7 1.7) (drill 1) (layers "*.Cu" "*.Mask") (remove_unused_layers) (keep_end_layers) (tstamp c83a91bf-05f2-450c-9502-3725ad31da27))
  (pad "37" thru_hole oval (at 0 45.72) (size 1.7 1.7) (drill 1) (layers "*.Cu" "*.Mask") (remove_unused_layers) (keep_end_layers) (tstamp 13909e5d-cdad-4705-ab66-7ec6152050c2))
  (pad "38" thru_hole oval (at -2.54 45.72) (size 1.7 1.7) (drill 1) (layers "*.Cu" "*.Mask") (remove_unused_layers) (keep_end_layers) (tstamp 06050ea8-53d2-442e-954e-5c095245a941))
  (pad "39" thru_hole oval (at 0 48.26) (size 1.7 1.7) (drill 1) (layers "*.Cu" "*.Mask") (remove_unused_layers) (keep_end_layers) (tstamp b7aaa082-f625-49b2-9cca-a7471a810a9e))
  (pad "40" thru_hole oval (at -2.54 48.26) (size 1.7 1.7) (drill 1) (layers "*.Cu" "*.Mask") (remove_unused_layers) (keep_end_layers) (tstamp 8f51e5e7-ddee-454d-b198-863ad9731a1b))
  (model "${KICADLIB}/model/connector/PinSocket_2x20_P2.54mm_Vertical.step"
    (offset (xyz 0 0 0))
    (scale (xyz 1 1 1))
    (rotate (xyz 0 0 0))
  )
)
