(footprint "DFN400X400X80-9" (version 20221018) (generator pcbnew)
  (layer "F.Cu")
  (descr "8-Lead Plastic Dual Flat, No Lead Package (MD) - 4x4x0.9 mm Body [DFN] (see Microchip Packaging Specification 00000049BS.pdf)")
  (tags "DFN 0.8")
  (attr smd)
  (fp_text reference "REF**" (at 0 -2.7) (layer "F.SilkS")
      (effects (font (size 1 1) (thickness 0.15)))
    (tstamp df237926-8f32-4304-bfc6-6e6e0080489c)
  )
  (fp_text value "DFN400X400X80-9" (at 0 3.075) (layer "F.Fab") hide
      (effects (font (size 1 1) (thickness 0.15)))
    (tstamp 40ccb683-6adf-4efc-bae2-f6b1d0908b5e)
  )
  (fp_text user "^" (at -3.1 -1.2 270 unlocked) (layer "F.SilkS")
      (effects (font (size 1 1) (thickness 0.15)))
    (tstamp 66b647af-ff8c-44b6-8b2d-0854cea1a44d)
  )
  (fp_text user "${REFERENCE}" (at 0 0) (layer "F.Fab")
      (effects (font (size 0.75 0.75) (thickness 0.1)))
    (tstamp cfcd03cb-c60d-4455-8576-06ea45a96737)
  )
  (fp_line (start -2 -2) (end -2 -1.5)
    (stroke (width 0.1) (type solid)) (layer "F.SilkS") (tstamp d345cc58-8987-4d90-a376-a140a826bb42))
  (fp_line (start -2 -2) (end 2 -2)
    (stroke (width 0.1) (type solid)) (layer "F.SilkS") (tstamp 061693bb-8676-4d25-aec8-fe5ec284ea03))
  (fp_line (start -2 2) (end -2 1.5)
    (stroke (width 0.1) (type solid)) (layer "F.SilkS") (tstamp 2a9ae6c7-f5ec-4e3b-a4c4-e0259cfb48de))
  (fp_line (start -2 2) (end 2 2)
    (stroke (width 0.1) (type solid)) (layer "F.SilkS") (tstamp a231e9ea-5c41-4f61-a32d-ad01803e4c6e))
  (fp_line (start 2 -2) (end 2 -1.5)
    (stroke (width 0.1) (type solid)) (layer "F.SilkS") (tstamp cb4e41b6-1080-4fa2-9997-c72346824fd3))
  (fp_line (start 2 2) (end 2 1.5)
    (stroke (width 0.1) (type solid)) (layer "F.SilkS") (tstamp 77f12f10-8193-4057-84f9-75aa3e155ec7))
  (fp_line (start -2.5 -2.1) (end -2.5 2.1)
    (stroke (width 0.05) (type solid)) (layer "F.CrtYd") (tstamp eeab077e-b3dd-4ec4-9867-766aedee3bdc))
  (fp_line (start -2.5 -2.1) (end 2.5 -2.1)
    (stroke (width 0.05) (type solid)) (layer "F.CrtYd") (tstamp 06c0ed32-8da8-4568-aae8-d52ddae6391e))
  (fp_line (start -2.5 2.1) (end 2.5 2.1)
    (stroke (width 0.05) (type solid)) (layer "F.CrtYd") (tstamp 74f66480-d3b2-4658-9ef3-25ef8b781891))
  (fp_line (start 2.5 -2.1) (end 2.5 2.1)
    (stroke (width 0.05) (type solid)) (layer "F.CrtYd") (tstamp d8431f89-4a69-4e22-a1a0-2da492653920))
  (fp_line (start -2 -1) (end -1 -2)
    (stroke (width 0.15) (type solid)) (layer "F.Fab") (tstamp 9fbfbde8-9e04-4357-b1ce-4ab531434cbd))
  (fp_line (start -2 2) (end -2 -1)
    (stroke (width 0.15) (type solid)) (layer "F.Fab") (tstamp 95552511-9ad4-4aca-ba7d-65d0eec06469))
  (fp_line (start -1 -2) (end 2 -2)
    (stroke (width 0.15) (type solid)) (layer "F.Fab") (tstamp b8920cc4-b04e-4d07-837e-3972051ccb78))
  (fp_line (start 2 -2) (end 2 2)
    (stroke (width 0.15) (type solid)) (layer "F.Fab") (tstamp d73464d3-2c94-47c5-910c-8eae32309b1a))
  (fp_line (start 2 2) (end -2 2)
    (stroke (width 0.15) (type solid)) (layer "F.Fab") (tstamp 001f112c-1b25-4c42-baa4-4613e37614b0))
  (pad "" smd roundrect (at -0.7 -0.9) (size 1 1.3) (layers "F.Paste") (roundrect_rratio 0.05) (tstamp 2f8943f9-3720-458b-a68d-ebe866d90e1f))
  (pad "" smd roundrect (at -0.7 0.9) (size 1 1.3) (layers "F.Paste") (roundrect_rratio 0.05) (tstamp 0802c109-cea3-41e1-af73-bbbec52aee86))
  (pad "" smd roundrect (at 0.7 -0.9) (size 1 1.3) (layers "F.Paste") (roundrect_rratio 0.05) (tstamp d33ce30d-69fa-42f4-bb00-7712a1dc4c4f))
  (pad "" smd roundrect (at 0.7 0.9) (size 1 1.3) (layers "F.Paste") (roundrect_rratio 0.05) (tstamp 87996016-12b0-4ee4-967c-37d7c62207af))
  (pad "1" smd roundrect (at -2 -1.2) (size 0.8 0.35) (layers "F.Cu" "F.Paste" "F.Mask") (roundrect_rratio 0.1428571429) (tstamp a410a961-c2c5-49ba-91d5-4747b3d7498c))
  (pad "2" smd roundrect (at -2 -0.4) (size 0.8 0.35) (layers "F.Cu" "F.Paste" "F.Mask") (roundrect_rratio 0.1428571429) (tstamp 26912fdc-43ed-4bd7-b86d-f2d74caf47a5))
  (pad "3" smd roundrect (at -2 0.4) (size 0.8 0.35) (layers "F.Cu" "F.Paste" "F.Mask") (roundrect_rratio 0.1428571429) (tstamp ebfa681d-46b0-4acf-93ce-ad90e15bd342))
  (pad "4" smd roundrect (at -2 1.2) (size 0.8 0.35) (layers "F.Cu" "F.Paste" "F.Mask") (roundrect_rratio 0.1428571429) (tstamp cb3dfdbf-2c24-40ae-9df2-caa54d67c486))
  (pad "5" smd roundrect (at 2 1.2) (size 0.8 0.35) (layers "F.Cu" "F.Paste" "F.Mask") (roundrect_rratio 0.1428571429) (tstamp 978365f9-4947-4c17-97ee-dfa7d4934c1a))
  (pad "6" smd roundrect (at 2 0.4) (size 0.8 0.35) (layers "F.Cu" "F.Paste" "F.Mask") (roundrect_rratio 0.1428571429) (tstamp ba80fc88-9fe0-48bd-8707-998471628377))
  (pad "7" smd roundrect (at 2 -0.4) (size 0.8 0.35) (layers "F.Cu" "F.Paste" "F.Mask") (roundrect_rratio 0.1428571429) (tstamp 97020f03-b381-45e5-8188-cbe20796a331))
  (pad "8" smd roundrect (at 2 -1.2) (size 0.8 0.35) (layers "F.Cu" "F.Paste" "F.Mask") (roundrect_rratio 0.1428571429) (tstamp ed68444b-3b24-48a4-81c8-1ec870d82521))
  (pad "9" smd roundrect (at 0 0) (size 2.4 3.1) (layers "F.Cu" "F.Mask") (roundrect_rratio 0.02083333333) (tstamp 409030ce-0beb-4c37-bc37-9f547bb3474a))
  (model "${KICADLIB}/model/DFN/DFN400X400X80-9.step"
    (offset (xyz 0 0 0))
    (scale (xyz 1 1 1))
    (rotate (xyz 0 0 0))
  )
)
