(footprint "PXC_1755736" (version 20211014) (generator pcbnew) (layer "F.Cu")
  (tedit 61849179)
  (attr through_hole)
  (fp_text reference "REF**" (at 0 -4.75 unlocked) (layer "F.SilkS")
    (effects (font (size 1 1) (thickness 0.15)))
    (tstamp 64d02d57-8a47-419f-a488-90f7470fe9bd)
  )
  (fp_text value "PXC_1755736" (at 0 1 unlocked) (layer "F.Fab") hide
    (effects (font (size 1 1) (thickness 0.15)))
    (tstamp bf2f7f66-d5eb-4e01-a61b-fc3c7cf6ea3c)
  )
  (fp_text user "^" (at -2.55 -2 180 unlocked) (layer "B.SilkS")
    (effects (font (size 1 1) (thickness 0.15)) (justify mirror))
    (tstamp 51539a94-7ea6-4fc4-9a41-b9b7ae5a6f7c)
  )
  (fp_text user "^" (at -2.5 -4.75 180 unlocked) (layer "F.SilkS")
    (effects (font (size 1 1) (thickness 0.15)))
    (tstamp 1deadd40-d6bb-43fc-a8c4-2770ea780a89)
  )
  (fp_text user "${REFERENCE}" (at 0 0 unlocked) (layer "F.Fab")
    (effects (font (size 1 1) (thickness 0.15)))
    (tstamp 43bb7283-dc53-42f7-bda1-b193f3ae82bb)
  )
  (fp_line (start 6.05 4.8) (end -6.05 4.8) (layer "F.SilkS") (width 0.1) (tstamp 173043bd-0475-4f6e-a584-d37ef4708a82))
  (fp_line (start 6.05 -3.8) (end 6.05 4.8) (layer "F.SilkS") (width 0.1) (tstamp 34dd7684-ac3b-4560-bfa5-876fa15c60b9))
  (fp_line (start -6.05 4.8) (end -6.05 -3.8) (layer "F.SilkS") (width 0.1) (tstamp 566a5b5a-5b71-4806-adc7-a89db43c5cb9))
  (fp_line (start -6.05 -3.8) (end 6.05 -3.8) (layer "F.SilkS") (width 0.1) (tstamp d8227cce-fada-4438-83b4-919561b3c5cc))
  (fp_rect (start -6.5 -4.25) (end 6.5 5.25) (layer "F.CrtYd") (width 0.05) (fill none) (tstamp cc3cd176-3633-466d-b853-8bd5d38c9d34))
  (fp_line (start 6.05 4.8) (end -6.05 4.8) (layer "F.Fab") (width 0.1) (tstamp 4e8c9ee5-eb1e-4ed5-a8c4-3707e040332e))
  (fp_line (start -6.05 -2.8) (end -5.05 -3.8) (layer "F.Fab") (width 0.1) (tstamp 6a6494a4-293b-4be0-95a6-dcefa3c1d57e))
  (fp_line (start -6.05 4.8) (end -6.05 -2.8) (layer "F.Fab") (width 0.1) (tstamp 939fcc4c-bb4a-4b0f-ae2a-aa9a45464b3b))
  (fp_line (start -5.05 -3.8) (end 6.05 -3.8) (layer "F.Fab") (width 0.1) (tstamp c3e1d1c4-a351-42a3-aa05-37856b0307e6))
  (fp_line (start 6.05 -3.8) (end 6.05 4.8) (layer "F.Fab") (width 0.1) (tstamp fbdb7dab-f8d7-4499-9243-21c57ff92adc))
  (pad "1" thru_hole circle (at -2.54 0) (size 2.4 2.4) (drill 1.4) (layers *.Cu *.Mask) (tstamp 7c92a391-5cdd-4ee8-b77b-3368d10cda7b))
  (pad "2" thru_hole circle (at 2.54 0) (size 2.4 2.4) (drill 1.4) (layers *.Cu *.Mask) (tstamp 0d10d3cf-9187-49ea-bff4-8905b7fbc0f5))
  (model "${KICADLIB}/model/connector/pxc_1755736.stp"
    (offset (xyz 6.08 3.8 0))
    (scale (xyz 1 1 1))
    (rotate (xyz -90 0 -90))
  )
  (model "${KICADLIB}/model/connector/pxc_1757019.stp"
    (offset (xyz 5.12 3.5 22))
    (scale (xyz 1 1 1))
    (rotate (xyz 90 0 180))
  )
  (model "${KICADLIB}/model/connector/pxc_1792249.stp" hide
    (offset (xyz -5.08 -3 3.8))
    (scale (xyz 1 1 1))
    (rotate (xyz 0 0 0))
  )
  (model "${KICADLIB}/model/connector/pxc_1808816.stp" hide
    (offset (xyz 5.08 3.5 28.85))
    (scale (xyz 1 1 1))
    (rotate (xyz 90 0 -180))
  )
)
