{
  "version": 2,
  "scene": {
    "materials": [
      {
        "name": "Garment-Material",
        "type": "StandardMaterial",
        "specularColor": [
          0,
          0,
          0
        ],
        "diffuseColor": [
          0,
          0,
          0
        ],
        "emissiveColor": [
          1,
          1,
          1
        ],
        "backFaceCulling": false,
        "diffuseTexture": {
          "uri": "diffuse.jpg"
        },
        "opacityTexture": {
          "uri": "opacity.jpg",
          "getAlphaFromRGB": true
        }
      }
    ]
  }
}