{
  "version": 2,
  "scene": {
    "defaultEnvironment": {
      "createGround": true,
      "createSkybox": true,
      "mainColor": [
        0.9,
        0.9,
        0.9
      ]
    },
    "nodes": [
      {
        "name": "Garment",
        "type": "Mesh",
        "uri": "mesh.drc",
        "mustDepthSortFacets": true,
        "material": "Garment-Material",
        "scaling": [
          -1,
          1,
          1
        ],
        "pluginExtension": ".drc"
      },
      {
        "name": "Orbit",
        "type": "ArcRotateCamera",
        "target": "Garment",
        "useFramingBehavior": true,
        "useAutoRotationBehavior": true,
        "autoRotationBehavior": {
          "idleRotationSpeed": 0.25
        },
        "minZ": 0.1,
        "maxZ": 1000,
        "upperVerticalAngleLimit": 45,
        "lowerVerticalAngleLimit": 45,
        "upperRadiusLimit": 50,
        "lowerRadiusLimit": 10,
        "horizontalAngle": 90
      }
    ]
  }
}