{
  "pbmConfigurations" : [
     {
        "pbmId" : "DAZ_Genesis8Male_default",
        "exclusiveMorphGroups" : [
           {
             "groupId": "chest_width",
             "candidateMorphs" : [
                 {
                    "morphID" : "SCLChestWidth",
                    "morphWeight" : 1.0
                 }
              ]
           },
           {
              "groupId": "chest_depth",
              "candidateMorphs" : [
                 {
                    "morphID" : "SCLChestDepth",
                    "morphWeight" : 1.0
                 }
              ]
           },
           {
              "groupId": "shoulder_width",
              "candidateMorphs" : [
                    {
                       "morphID" : "SCLShldrsWidth",
                       "morphWeight" : 1.0
                    }
                 ]
              },
           {
           "groupId": "waist_width",
           "candidateMorphs" : [
                 {
                    "morphID" : "PBMWaistWidth",
                    "morphWeight" : 1.0
                 }
              ]
           },
           {
              "groupId": "waist_depth",
              "candidateMorphs" : [
                 {
                    "morphID" : "PBMStomachDepth",
                    "morphWeight" : 1.0
                 }
              ]
           },
           {
              "groupId": "hip_width",
              "candidateMorphs" : [
                 {
                    "morphID" : "PBMHipSize",
                    "morphWeight" : 1.0
                 }
              ]
           },
           {
              "groupId": "hip_depth",
              "candidateMorphs" : [
                 {
                    "morphID" : "PBMThighsSize",
                    "morphWeight" : 1.0
                 }
              ]
           },
           {
             "groupId": "body_size",
             "candidateMorphs" : [
                 {
                    "morphID" : "FBMHeavy",
                    "morphWeight" : 1.0
                 },
                 {
                    "morphID" : "FBMThin",
                    "morphWeight" : 1.0
                 }
              ]
           }
        ],
        "measurements" : [
           {
              "identifier" : "shoulder_length",
              "type" : "polygon",
              "vertices" : [ 842, 2886, 4007, 10166, 9072, 7028 ]
           },
           {
              "identifier" : "chest_circumference",
              "type" : "circumference_plane",
              "vertices" : [ 10432, 13986, 4278 ]
           },
           {
              "identifier" : "waist_circumference",
              "type" : "circumference_plane",
              "vertices" : [ 10492, 4345, 4341 ]
           },
           {
              "identifier" : "hip_circumference",
              "type" : "circumference_plane",
              "vertices" : [ 9245, 3069, 3976 ]
           }
        ]
     },
     {
        "pbmId" : "DAZ_Genesis8Female_default",
        "exclusiveMorphGroups" : [
           {
             "groupId": "chest_width",
             "candidateMorphs" : [
                 {
                    "morphID" : "SCLChestWidth",
                    "morphWeight" : 1.0
                 }
              ]
           },
           {
              "groupId": "chest_depth",
              "candidateMorphs" : [
                 {
                    "morphID" : "SCLChestDepth",
                    "morphWeight" : 1.0
                 }
              ]
           },
           {
              "groupId": "shoulder_width",
              "candidateMorphs" : [
                    {
                       "morphID" : "SCLShldrsWidth",
                       "morphWeight" : 1.0
                    }
                 ]
              },
           {
           "groupId": "waist_width",
           "candidateMorphs" : [
                 {
                    "morphID" : "PBMWaistWidth",
                    "morphWeight" : 1.0
                 }
              ]
           },
           {
              "groupId": "waist_depth",
              "candidateMorphs" : [
                 {
                    "morphID" : "PBMStomachDepth",
                    "morphWeight" : 1.0
                 }
              ]
           },
           {
              "groupId": "hip_width",
              "candidateMorphs" : [
                 {
                    "morphID" : "PBMHipSize",
                    "morphWeight" : 1.0
                 }
              ]
           },
           {
              "groupId": "hip_depth",
              "candidateMorphs" : [
                 {
                    "morphID" : "PBMThighsSize",
                    "morphWeight" : 1.0
                 }
              ]
           },
           {
             "groupId": "body_size",
             "candidateMorphs" : [
                 {
                    "morphID" : "FBMHeavy",
                    "morphWeight" : 1.0
                 },
                 {
                    "morphID" : "FBMThin",
                    "morphWeight" : 1.0
                 }
              ]
           }
        ],
        "measurements" : [
           {
              "identifier" : "shoulder_length",
              "type" : "polygon",
              "vertices" : [ 7404, 9589, 10719, 4236, 3079, 894 ]
           },
           {
              "identifier" : "chest_circumference",
              "type" : "circumference_plane",
              "vertices" : [ 10938, 84, 4458 ]
           },
           {
              "identifier" : "waist_circumference",
              "type" : "circumference_plane",
              "vertices" : [ 11098, 4625, 4626 ]
           },
           {
              "identifier" : "hip_circumference",
              "type" : "circumference_plane",
              "vertices" : [ 8235, 1725, 3551 ]
           }
        ]
     }
  ]
}