SPARK {
  ID              4                             
  Name            "GRAVEL"                      

  CollideWorld    true                          
  CollideObject   true                          
  CollideCam      true                          
  HasTrail        false                         
  FieldAffect     true                         
  Spins           false                        
  Grows           false                       
  Additive        false                     
  Horizontal      false                      

  Size            6.00000 6.00000            
  UV              0.517921 0.751165           
  UVSize          0.039766 0.039766           
  TexturePage     48                          
  Color           241 237 225                  

  Mass            0.100000                      
  Resistance      0.060000                      
  Friction        0.700000                      
  Restitution     0.200000                      

  LifeTime        1.500000                      
  LifeTimeVar     0.500000                     

  SpinRate        0.000000                     
  SpinRateVar     25.000000                   

  SizeVar         0.000000                    
  GrowRate        0.000000                     
  GrowRateVar     0.000000                     

  TrailType       -1                           
}

SPARK {
  ID              5                             
  Name            "HAY"                        

  CollideWorld    true                          
  CollideObject   true                          
  CollideCam      false                         
  HasTrail        false                        
  FieldAffect     true                          
  Spins           true                          
  Grows           false                         
  Additive        false                        
  Horizontal      false                       

  Size            12.000000 12.000000            
  UV              0.575278 0.673396             
  UVSize          0.079532 0.079532            
  TexturePage     48                            
  Color           173 176 177                   

  Mass            0.100000                     
  Resistance      0.020000                      
  Friction        1.000000                      
  Restitution     0.500000                      

  LifeTime        1.000000                      
  LifeTimeVar     0.300000                      

  SpinRate        0.000000                      
  SpinRateVar     15.000000                     

  SizeVar         0.000000                      
  GrowRate        0.000000                      
  GrowRateVar     0.000000                     

  TrailType       -1                           
}

SPARK {
  ID              6                             
  Name            "GRASS"                       

  CollideWorld    true                          
  CollideObject   true                          
  CollideCam      false                         
  HasTrail        false                         
  FieldAffect     true                          
  Spins           true                          
  Grows           false                        
  Additive        false                         
  Horizontal      false                         

  Size            8.000000 8.000000             
  UV              0.506299 0.684851             
  UVSize          0.05605 0.05605             
  TexturePage     48                            
  Color           255 255 255                   

  Mass            0.100000                      
  Resistance      0.020000                      
  Friction        1.000000                      
  Restitution     0.500000                      

  LifeTime        1.000000                      
  LifeTimeVar     0.300000                      

  SpinRate        0.000000                      
  SpinRateVar     15.000000                    

  SizeVar         0.000000                      
  GrowRate        0.000000                      
  GrowRateVar     0.000000                     

  TrailType       -1                            
}


SPARK {
  ID              2                             
  Name            "Bubbles"                        

  CollideWorld    false                        
  CollideObject   true                       
  CollideCam      false                         
  HasTrail        false                         
  FieldAffect     true                          
  Spins           false                        
  Grows           false                         
  Additive        false                        
  Horizontal      false                        

  Size            10.000000 10.000000         
  UV              0.575278 0.752498            
  UVSize          0.118 0.118             
  TexturePage     48                            
  Color           255 255 255                   


  Mass            0.030000                      
  Resistance      0.090000                      
  Friction        0.001000                     
  Restitution     0.000000                     


  LifeTime        24.000000                      
  LifeTimeVar     0.300000                      

  SpinRate        0.000000                     
  SpinRateVar     0.000000                      

  SizeVar         10.900000                      
  GrowRate        50.000000                     
  GrowRateVar     20.000000                   

  TrailType       -1                           
}

SPARK {
  ID              3                             
  Name            "POPCORN"                   

  CollideWorld    true  
  CollideObject   true  
  CollideCam      true       
  HasTrail        false                
  FieldAffect     true                   
  Spins           true                       
  Grows           false                   
  Additive        false                  
  Horizontal      false                     

  Size            3.800000 3.800000         
  UV              0.517921 0.751165           
  UVSize          0.039766 0.039766           
  TexturePage     48                          
  Color           252 255 189             

  Mass            0.300000                 
  Resistance      0.010000                  
  Friction        0.700000                   
  Restitution     0.800000                   

  LifeTime        10.000000                  
  LifeTimeVar     0.000000                   

  SpinRate        1.000000                   
  SpinRateVar     10.000000                  

  SizeVar         2.000000                     
  GrowRate        0.000000                  
  GrowRateVar     0.000000               

  TrailType       -1                     
}