PICKUPS {
  SpawnCount      24 3                           ; Initial and per-player count
  EnvColor        255 255 128                   ; Color of shininess (RGB)
  LightColor      128 96 0                      ; Color of light (RGB)
}