{

	MATERIAL {
	  ID              0
	  Name            "TARMAC WET"
	  Skid            true
	  Spark           false
	  Corrugated      false
	  Moves           false
	  Dusty           true
	  Roughness       0.8
	  Grip            0.5
	  Hardness        1
	  SkidSound       6
	  ScrapeSound     5
	  DustType        2
	}

	DUST {
	  ID              2
	  Name            "TARMAC WATERDROPS"
	  SparkType       29
	  ParticleChance  9
	  ParticleRandom  0
	  SmokeType       30
	  SmokeChance     9
	  SmokeRandom     0.1
	}
	
	SPARK {
	  ID              29
	  Name            "WATERDROPS"
	  CollideWorld    false
	  CollideObject   false
	  CollideCam      false
	  HasTrail        false
	  FieldAffect     false
	  Spins           true
	  Grows           true
	  Additive        true
	  Horizontal      false
	  Size            15 15
	  UV              0 0.5
	  UVSize          0.25 0.25
	  TexturePage     47
	  Color           150 150 150
	  Mass            0.05
	  Resistance      0.002
	  Friction        0
	  Restitution     0
	  LifeTime        0.2
	  LifeTimeVar     0
	  SpinRate        80
	  SpinRateVar     10
	  SizeVar         10
	  GrowRate        0
	  GrowRateVar     36
	}

	SPARK {
	  ID              30
	  Name            "DUST"
	  CollideWorld    true
	  CollideObject   true
	  CollideCam      false
	  HasTrail        false
	  FieldAffect     false
	  Spins           true
	  Grows           true
	  Additive        true
	  Horizontal      false
	  Size            20 20
	  UV              0 0
	  UVSize          0.25 0.25
	  TexturePage     47
	  Color           10 10 10
	  Mass            0.03
	  Resistance      0.002
	  Friction        0
	  Restitution     0
	  LifeTime        0.5
	  LifeTimeVar     0.1
	  SpinRate        0
	  SpinRateVar     6
	  SizeVar         2
	  GrowRate        0
	  GrowRateVar     36
	}
}