{

;============================================================
;============================================================
; DRJ-61
;============================================================
;============================================================
Name 	"DRJ-61"


;====================
; Model Filenames
;====================

MODEL 0 	"cars\phim_drj-61\body.prm"
MODEL 1 	"cars\phim_drj-61\wheel-fl.prm"
MODEL 2 	"cars\phim_drj-61\wheel-fr.prm"
MODEL 3 	"cars\phim_drj-61\wheel-bl.prm"
MODEL 4 	"cars\phim_drj-61\wheel-br.prm"
MODEL 5 	"cars\phim_drj-61\axle.prm"
MODEL 6 	"NONE"
MODEL 7 	"NONE"
MODEL 8 	"NONE"
MODEL 9 	"NONE"
MODEL 10 	"NONE"
MODEL 11 	"NONE"
MODEL 12 	"NONE"
MODEL 13 	"NONE"
MODEL 14 	"NONE"
MODEL 15 	"NONE"
MODEL 16 	"NONE"
MODEL 17 	"cars\misc\Aerial.m"
MODEL 18 	"cars\misc\AerialT.m"
TPAGE 	"cars\phim_drj-61\car.bmp"
COLL 	"cars\phim_drj-61\hull.hul"
;)TCARBOX "cars\phim_drj-61\box.bmp"
;)TSHADOW "cars\phim_drj-61\shadow.bmp"
;)SHADOWTABLE -102.7011 102.7011 105.8447 -105.8447 -6.8692
EnvRGB 	200 200 200


;====================
; Stuff mainly for frontend display and car selectability
;====================

BestTime 	TRUE
Selectable 	TRUE
;)CPUSelectable TRUE
;)Statistics TRUE
Class 	1
Obtain 	0
Rating 	2
TopEnd 	3028.182617
Acc 	6.199949
Weight 	2.000000
Handling 	50.000000
Trans 	0
MaxRevs 	0.500000


;====================
; Handling related stuff
;====================

SteerRate 	3.000000
SteerMod 	0.400000
EngineRate 	4.500000
TopSpeed 	34.500000
DownForceMod 	2.000000
CoM 	0.000000 -7.000000 -10.000000
Weapon 	0.000000 -32.000000 64.000000


;====================
; Car Body details
;====================

BODY { 	; Start Body
ModelNum 	0
Offset 	0, 0, 0
Mass 	2.000000
Inertia 	1900.000000 0.000000 0.000000
			0.000000 2600.000000 0.000000
			0.000000 0.000000 1000.000000
Gravity 	2200
Hardness 	0.000000
Resistance 	0.001000
AngRes 	0.001000
ResMod 	25.000000
Grip 	0.150000
StaticFriction 	0.800000
KineticFriction 	0.400000
} 	; End Body


;====================
; Car Wheel details
;====================

WHEEL 0 { 	; Start Wheel
ModelNum 	1
Offset1 	-24.000000 4.000000 47.000000
Offset2 	0.000000 0.000000 0.000000
IsPresent 	TRUE
IsPowered 	TRUE
IsTurnable 	TRUE
SteerRatio 	-0.50000
EngineRatio 	20000.000000
Radius 	16.000000
Mass 	0.200000
Gravity 	2100.000000
MaxPos 	6.000000
SkidWidth 	10.000000
ToeIn 	0.000000
AxleFriction 	0.020000
Grip 	0.014000
StaticFriction 	1.500000
KineticFriction 	1.500000
} 	; End Wheel

WHEEL 1 { 	; Start Wheel
ModelNum 	2
Offset1 	24.000000 4.000000 47.000000
Offset2 	0.000000 0.000000 0.000000
IsPresent 	TRUE
IsPowered 	TRUE
IsTurnable 	TRUE
SteerRatio 	-0.50000
EngineRatio 	20000.000000
Radius 	16.000000
Mass 	0.200000
Gravity 	2100.000000
MaxPos 	6.000000
SkidWidth 	10.000000
ToeIn 	0.000000
AxleFriction 	0.020000
Grip 	0.014000
StaticFriction 	1.500000
KineticFriction 	1.500000
} ; End Wheel

WHEEL 2 { 	; Start Wheel
ModelNum 	3
Offset1 	-24.000000 4.000000 -50.000000
Offset2 	0.000000 0.000000 0.000000
IsPresent 	TRUE
IsPowered 	TRUE
IsTurnable 	FALSE
SteerRatio 	0.000000
EngineRatio 	22000.000000
Radius 	16.000000
Mass 	0.200000
Gravity 	2200.000000
MaxPos 	8.000000
SkidWidth 	10.000000
ToeIn 	0.000000
AxleFriction 	0.050000
Grip 	0.014000
StaticFriction 	1.500000
KineticFriction 	1.500000
} 	; End Wheel

WHEEL 3 { 	; Start Wheel
ModelNum 	4
Offset1 	24.000000 4.000000 -50.000000
Offset2 	0.000000 0.000000 0.000000
IsPresent 	TRUE
IsPowered 	TRUE
IsTurnable 	FALSE
SteerRatio 	0.000000
EngineRatio 	22000.000000
Radius 	16.000000
Mass 0.200000
Gravity 	2200.000000
MaxPos 	8.000000
SkidWidth 	10.000000
ToeIn 	0.000000
AxleFriction 0.050000
Grip 	0.014000
StaticFriction 	1.500000
KineticFriction 	1.500000
} 	; End Wheel


;====================
; Car Spring details
;====================

SPRING 0 { 	; Start Spring
ModelNum 	-1
Offset 	0.000000 0.000000 0.000000
Length 	0.000000
Stiffness 	400.00000
Damping 	9.000000
Restitution 	-0.950000
} 	; End Spring

SPRING 1 { 	; Start Spring
ModelNum 	-1
Offset 	0.000000 0.000000 0.000000
Length 	0.000000
Stiffness 	400.000000
Damping 	9.000000
Restitution 	-0.950000
} 	; End Spring

SPRING 2 { 	; Start Spring
ModelNum 	-1
Offset 	0.000000 0.000000 0.000000
Length 	0.000000
Stiffness 	400.000000
Damping 	9.000000
Restitution 	-0.950000
} 	; End Spring

SPRING 3 { 	; Start Spring
ModelNum 	-1
Offset 	0.000000 0.000000 0.000000
Length 	0.000000
Stiffness 	400.000000
Damping 	9.000000
Restitution 	-0.950000
} 	; End Spring


;====================
; Car Pin details
;====================

PIN 0 { 	; Start Pin
ModelNum 	-1
Offset 	0.000000 0.000000 0.000000
Length 	0.000000
} 	; End Pin

PIN 1 { 	; Start Pin
ModelNum 	-1
Offset 	0.000000 0.000000 0.000000
Length 	0.000000
} 	; End Pin

PIN 2 { 	; Start Pin
ModelNum 	-1
Offset 	0.000000 0.000000 0.000000
Length 	0.000000
} 	; End Pin

PIN 3 { 	; Start Pin
ModelNum 	-1
Offset 	0.000000 0.000000 0.000000
Length 	0.000000
} 	; End Pin


;====================
; Car axle details
;====================

AXLE 0 { 	; Start Axle
ModelNum 	5
Offset 	10.000000 2.000000 50.000000
Length 	25.000000
} 	; End axle

AXLE 1 { 	; Start Axle
ModelNum 	5
Offset 	-10.000000 2.000000 50.000000
Length 	25.000000
} 	; End axle

AXLE 2 { 	; Start Axle
ModelNum 	5
Offset 	10.000000 2.000000 -50.000000
Length 	25.000000
} 	; End axle

AXLE 3 { 	; Start Axle
ModelNum 	5
Offset 	-10.000000 2.000000 -50.000000
Length 	25.000000
} 	; End axle


;====================
; Car spinner details
;====================

SPINNER { 	; Start spinner
ModelNum 	-1
Offset 	0.000000 0.000000 0.000000
Axis 	0.000000 1.000000 0.000000
AngVel 	0.000000
} 	; End Spinner


;====================
; Car Aerial details
;==================== 

AERIAL { 	; Start Aerial
SecModelNum 	17
TopModelNum 	18
Offset 	-24.500000 -27.500000 42.000000
Direction 	0.000000 -1.000000 0.000000
Length 	19.000000
Stiffness 	2000.000000
Damping 	5.500000
} 	; End Aerial


;====================
; Car AI details
;====================

AI { 	;Start AI
UnderThresh 	93.820000
UnderRange 	3835.356934
UnderFront 	197.100006
UnderRear 	556.727966
UnderMax 	0.510582
OverThresh 	462.209991
OverRange 	1182.744873
OverMax 	1.000000
OverAccThresh 	37.340000
OverAccRange 	625.908142
PickupBias 	13106
BlockBias 	22936
OvertakeBias 	19660
Suspension 	16383
Aggression 	0
} 	; End AI

}

RIP David R. Jones, 1961-2017
