{

;============================================================
;============================================================
; AMCO TC
;============================================================
;============================================================
Name      	"AMCO TC"


;====================
; Model Filenames
;====================

MODEL 	0 	"cars\amcotc\body.prm"
MODEL 	1 	"cars\amcotc\wheell.prm"
MODEL 	2 	"cars\amcotc\wheelr.prm"
MODEL 	3 	"NONE"
MODEL 	4 	"NONE"
MODEL 	5 	"cars\amcotc\axle.prm"
MODEL 	6 	"NONE"
MODEL 	7 	"NONE"
MODEL 	8 	"NONE"
MODEL 	9 	"NONE"
MODEL 	10 	"NONE"
MODEL 	11 	"NONE"
MODEL 	12 	"NONE"
MODEL 	13 	"NONE"
MODEL 	14 	"NONE"
MODEL 	15 	"NONE"
MODEL 	16 	"NONE"
MODEL 	17 	"cars\misc\Aerial.m"
MODEL 	18 	"cars\misc\AerialT.m"
TPAGE 	"cars\amcotc\car.bmp"
TSHADOW 	"cars\amcotc\shadow.bmp"
;)SHADOWTABLE 	-84.3068 84.3068 90.2865 -70.2865 -38.9363
;)TCARBOX "cars\amcotc\carbox.bmp"
;)SFXENGINE "cars/amcotc/motor.wav"
COLL 	"cars\amcotc\hull.hul"
EnvRGB 	100 100 100

;====================
; Stuff mainly for frontend display and car selectability
;====================

BestTime   	TRUE
Selectable 	TRUE
Class      	1 			; Engine type (0=Elec, 1=Glow, 2=Other)
Obtain     	0 			; Obtain method
Rating     	1 			; Skill level (rookie, amateur, ...)
TopEnd     	2831.167480 			; Actual top speed (mph) for frontend bars
Acc        	6.147198 			; Acceleration rating (empirical)
Weight     	3.700000 			; Scaled weight (for frontend bars)
Handling   	50.000000 			; Handling ability (empirical and totally subjective)
Trans      	0 			; Transmission type (calculate in game anyway...)
MaxRevs    	0.500000 			; Max Revs (for rev counter)
;) Statistics   TRUE

;====================
; Handling related stuff
;====================

SteerRate  	3.000000 			; Rate at which steer angle approaches value from input
SteerMod   	0.400000 			;
EngineRate 	2.500000 			; Rate at which Engine voltage approaches set value
TopSpeed   	33.400000 			; Car's theoretical top speed (not including friction...)
DownForceMod	10.000000 			; Down force modifier when car on floor
CoM        	0.000000 -25.000000 7.500000 		; Centre of mass relative to model centre
Weapon     	0.000000 -20.000000 64.000000 		; Weapon genration offset

;====================
; Car Body details
;====================

BODY {		; Start Body
ModelNum   	0 			; Model Number in above list
Offset     	0, -2, 0 		; Calculated in game
Mass       	3.700000
Inertia    	5500.000000 0.000000 0.000000
           	0.000000 6500.000000 0.000000
           	0.000000 0.000000 5500.000000
Gravity		2000 			; No longer used
Hardness   	0.100000
Resistance 	0.001500 			; Linear air esistance
AngRes     	0.001000 			; Angular air resistance
ResMod     	25.000000 			; Ang air resistnce scale when in air
Grip       	0.050000 			; Converts downforce to friction value
StaticFriction 0.800000
KineticFriction 0.600000
}     		; End Body

;====================
; Car Wheel details
;====================

WHEEL 0 { 	; Start Wheel
ModelNum 	1
Offset1  	-32.000000 26.000000 45.750000
Offset2  	0.000000 0.000000 0.000000
IsPresent   	TRUE
IsPowered   	TRUE
IsTurnable  	TRUE
SteerRatio  	-0.200000
EngineRatio 	10000.000000
Radius      	13.000000
Mass        	0.250000
Gravity     	2200.000000
MaxPos      	10.000000
SkidWidth   	14.500000
ToeIn       	0.000000
AxleFriction    	0.035000
Grip            	0.020000
StaticFriction  	1.750000
KineticFriction 	1.650000
}          	; End Wheel

WHEEL 1 { 	; Start Wheel
ModelNum 	2
Offset1  	32.000000 26.000000 45.750000
Offset2  	0.000000 0.000000 0.000000
IsPresent   	TRUE
IsPowered   	TRUE
IsTurnable  	TRUE
SteerRatio  	-0.200000
EngineRatio 	10000.000000
Radius      	13.000000
Mass        	0.250000
Gravity     	2200.000000
MaxPos      	10.000000
SkidWidth   	14.500000
ToeIn       	0.000000
AxleFriction    	0.035000
Grip            	0.020000
StaticFriction  	1.750000
KineticFriction 	1.650000
}          	; End Wheel

WHEEL 2 { 	; Start Wheel
ModelNum 	1
Offset1  	-32.000000 26.400000 -33.500000
Offset2  	0.000000 0.000000 0.000000
IsPresent   	TRUE
IsPowered   	TRUE
IsTurnable  	FALSE
SteerRatio  	1.000000
EngineRatio 	50000.000000
Radius      	13.000000
Mass        	0.300000
Gravity     	2200.000000
MaxPos      	10.000000
SkidWidth   	14.500000
ToeIn       	0.000000
AxleFriction    	0.050000
Grip            	0.030000
StaticFriction  	1.850000
KineticFriction 	1.750000
}          	; End Wheel

WHEEL 3 { 	; Start Wheel
ModelNum 	2
Offset1  	32.000000 26.400000 -33.500000
Offset2  	0.000000 0.000000 0.000000
IsPresent   	TRUE
IsPowered   	TRUE
IsTurnable  	FALSE
SteerRatio  	1.000000
EngineRatio 	50000.000000
Radius      	13.000000
Mass        	0.300000
Gravity     	2200.000000
MaxPos      	10.000000
SkidWidth   	14.500000
ToeIn       	0.000000
AxleFriction    	0.050000
Grip            	0.030000
StaticFriction  	1.850000
KineticFriction 	1.750000
}          	; End Wheel


;====================
; Car Spring details
;====================

SPRING 0 { 	; Start Spring
ModelNum    	-1
Offset      	0.000000 0.000000 0.000000
Length      	0.000000
Stiffness   	550.000000
Damping     	15.000000
Restitution 	-0.950000
}           	; End Spring

SPRING 1 { 	; Start Spring
ModelNum    	-1
Offset      	0.000000 0.000000 0.000000
Length      	0.000000
Stiffness   	550.000000
Damping     	15.000000
Restitution 	-0.950000
}           	; End Spring

SPRING 2 { 	; Start Spring
ModelNum    	-1
Offset      	0.000000 0.000000 0.000000
Length      	0.000000
Stiffness   	550.000000
Damping     	15.000000
Restitution 	-0.950000
}           	; End Spring

SPRING 3 { 	; Start Spring
ModelNum    	-1
Offset      	0.000000 0.000000 0.000000
Length      	0.000000
Stiffness   	550.000000
Damping     	15.000000
Restitution 	-0.950000
}           	; End Spring


;====================
; Car Pin details
;====================

PIN 0 {    	; Start Pin
ModelNum    	-1
Offset      	0.000000 0.000000 0.000000
Length      	0.000000
}           	; End Pin

PIN 1 {    	; Start Pin
ModelNum    	-1
Offset      	0.000000 0.000000 0.000000
Length      	0.000000
}           	; End Pin

PIN 2 {    	; Start Pin
ModelNum    	-1
Offset      	0.000000 0.000000 0.000000
Length      	0.000000
}           	; End Pin

PIN 3 {    	; Start Pin
ModelNum    	-1
Offset      	0.000000 0.000000 0.000000
Length      	0.000000
}           	; End Pin


;====================
; Car axle details
;====================

AXLE 0 {   	; Start Axle
ModelNum    	5
Offset      	-10.000000 26.000000 45.750000
Length      	12.000000
}           	; End axle

AXLE 1 {   	; Start Axle
ModelNum    	5
Offset      	10.000000 26.000000 45.750000
Length      	12.000000
}           	; End axle

AXLE 2 {   	; Start Axle
ModelNum    	5
Offset      	-10.000000 26.000000 -33.500000
Length      	12.000000
}           	; End axle

AXLE 3 {   	; Start Axle
ModelNum    	5
Offset      	10.000000 26.000000 -33.500000
Length      	12.000000
}           	; End axle


;====================
; Car spinner details
;====================

SPINNER {   	; Start spinner
ModelNum    	-1
Offset      	0.000000 0.000000 0.000000
Axis        	0.000000 1.000000 0.000000
AngVel      	0.000000
}           	; End Spinner


;====================
; Car Aerial details
;====================

AERIAL {    	; Start Aerial
SecModelNum 	17
TopModelNum 	18
Offset      	-25.000000 8.500000 -10.000000
Direction   	0.000000 -1.000000 0.000000
Length      	30.000000
Stiffness   	2000.000000
Damping     	5.500000
}           	; End Aerial


;====================
; Car AI details
;====================

AI {        	 ;Start AI
UnderThresh 	530.960083
UnderRange  	1390.939941
UnderFront	 	2228.502197
UnderRear   	532.879944
UnderMax    	0.395497
OverThresh  	2521.723389
OverRange   	1399.063965
OverMax     	0.488563
OverAccThresh  	83.449997
OverAccRange   	2113.864502
PickupBias     	3276
BlockBias      	3276
OvertakeBias   	16383
Suspension     	0
Aggression     	0
}           	; End AI

}

H34VYW316HTR4C3R