{

;============================================================
;============================================================
; Karen
;============================================================
;============================================================
Name      	"Karen"


;====================
; Model Filenames
;====================

MODEL 	0 	"cars\phim_jgkaren\body.prm"
MODEL 	1 	"cars\phim_jgkaren\wheel-l.prm"
MODEL 	2 	"cars\phim_jgkaren\wheel-r.prm"
MODEL 	3 	"NONE"
MODEL 	4 	"NONE"
MODEL 	5 	"NONE"
MODEL 	6 	"NONE"
MODEL 	7 	"NONE"
MODEL 	8 	"NONE"
MODEL 	9 	"NONE"
MODEL 	10 	"NONE"
MODEL 	11 	"NONE"
MODEL 	12 	"NONE"
MODEL 	13 	"NONE"
MODEL 	14 	"NONE"
MODEL 	15 	"NONE"
MODEL 	16 	"NONE"
MODEL 	17 	"cars\misc\Aerial.m"
MODEL 	18 	"cars\misc\AerialT.m"
TPAGE 	"cars\phim_jgkaren\car.bmp"
COLL 	"cars\phim_jgkaren\hull.hul"
;)TCARBOX "cars\phim_jgkaren\box.bmp"
;)TSHADOW "cars\phim_jgkaren\shadow.bmp"
;)SHADOWTABLE -87.2 87.1 92 -86 -7.1
EnvRGB 	200 200 200

;====================
; Frontend
;====================

BestTime   	TRUE
Selectable 	TRUE
;)Statistics 	TRUE
Class      	0
Obtain     	0
Rating     	4
TopEnd     	3613.315918
Acc        	6.307042
Weight     	1.800000
Handling   	50.000000
Trans      	0
MaxRevs    	0.500000

;====================
; Handling
;====================

SteerRate  	4.000000
SteerMod   	0.000000
EngineRate 	4.500000
TopSpeed   	43.450000
DownForceMod	2.000000
CoM        	0.000000 0.000000 -5.000000
Weapon     	0.000000 -32.000000 64.000000

;====================
; Body
;====================

BODY {		; Start Body
ModelNum   	0
Offset     	0, 0, 0
Mass       	1.800000
Inertia    	1800.000000 0.000000 0.000000
           	0.000000 2190.000000 0.000000
           	0.000000 0.0000000 700.000000
Gravity		2200
Hardness   	0.000000
Resistance 	0.001000
AngRes     	0.001000
ResMod     	25.000000
Grip       	0.010000
StaticFriction  0.800000
KineticFriction 0.400000
}     		; End Body

;====================
; Wheels
;====================

WHEEL 0 { 	; Start Wheel
ModelNum 	1
Offset1  	-26.060000 -1.950000 33.320000
Offset2  	0.000000 0.000000 0.000000
IsPresent   	TRUE
IsPowered   	TRUE
IsTurnable  	TRUE
SteerRatio  	-0.400000
EngineRatio 	14300.000000
Radius      	10.000000
Mass        	0.150000
Gravity     	2200.000000
MaxPos      	3.000000
SkidWidth   	13.000000
ToeIn       	0.000000
AxleFriction    0.020000
Grip            0.015000
StaticFriction  1.600000
KineticFriction 2.000000
}          	; End Wheel

WHEEL 1 { 	; Start Wheel
ModelNum 	1
Offset1  	26.060000 -1.950000 33.320000
Offset2  	0.000000 0.000000 0.000000
IsPresent   	TRUE
IsPowered   	TRUE
IsTurnable  	TRUE
SteerRatio  	-0.400000
EngineRatio 	14300.000000
Radius      	10.000000
Mass        	0.150000
Gravity     	2200.000000
MaxPos      	3.000000
SkidWidth   	13.000000
ToeIn       	0.000000
AxleFriction    0.020000
Grip            0.015000
StaticFriction  1.600000
KineticFriction 2.000000
}          	; End Wheel

WHEEL 2 { 	; Start Wheel
ModelNum 	2
Offset1  	-26.060000 -1.950000 -35.880000
Offset2  	0.000000 0.000000 0.000000
IsPresent   	TRUE
IsPowered   	TRUE
IsTurnable  	FALSE
SteerRatio  	0.000000
EngineRatio 	14300.000000
Radius      	10.000000
Mass        	0.150000
Gravity     	2200.000000
MaxPos      	3.000000
SkidWidth   	14.000000
ToeIn       	0.000000
AxleFriction    0.020000
Grip            0.015000
StaticFriction  1.600000
KineticFriction 1.900000
}          	; End Wheel

WHEEL 3 { 	; Start Wheel
ModelNum 	2
Offset1  	26.060000 -1.950000 -35.880000
Offset2  	0.000000 0.000000 0.000000
IsPresent   	TRUE
IsPowered   	TRUE
IsTurnable  	FALSE
SteerRatio  	0.000000
EngineRatio 	14300.000000
Radius      	10.000000
Mass        	0.150000
Gravity     	2200.000000
MaxPos      	3.000000
SkidWidth   	14.000000
ToeIn       	0.000000
AxleFriction    0.020000
Grip            0.015000
StaticFriction  1.600000
KineticFriction 1.900000
}          	; End Wheel


;====================
; Car Spring details
;====================

SPRING 0 { 	; Start Spring
ModelNum    	-1
Offset      	0.000000 0.000000 0.000000
Length      	0.000000
Stiffness   	600.000000
Damping     	15.000000
Restitution 	-0.800000
}           	; End Spring

SPRING 1 { 	; Start Spring
ModelNum    	-1
Offset      	0.000000 0.000000 0.000000
Length      	0.000000
Stiffness   	600.000000
Damping     	15.000000
Restitution 	-0.800000
}           	; End Spring

SPRING 2 { 	; Start Spring
ModelNum    	-1
Offset      	0.000000 0.000000 0.000000
Length      	0.000000
Stiffness   	600.000000
Damping     	15.000000
Restitution 	-0.800000
}           	; End Spring

SPRING 3 { 	; Start Spring
ModelNum    	-1
Offset      	0.000000 0.000000 0.000000
Length      	0.000000
Stiffness   	600.000000
Damping     	15.000000
Restitution 	-0.800000
}           	; End Spring


;====================
; Car Pin details
;====================

PIN 0 {    	; Start Pin
ModelNum    	-1
Offset      	0.000000 0.000000 0.000000
Length      	0.000000
}           	; End Pin

PIN 1 {    	; Start Pin
ModelNum    	-1
Offset      	0.000000 0.000000 0.000000
Length      	0.000000
}           	; End Pin

PIN 2 {    	; Start Pin
ModelNum    	-1
Offset      	0.000000 0.000000 0.000000
Length      	0.000000
}           	; End Pin

PIN 3 {    	; Start Pin
ModelNum    	-1
Offset      	0.000000 0.000000 0.000000
Length      	0.000000
}           	; End Pin


;====================
; Car axle details
;====================

AXLE 0 {   	; Start Axle
ModelNum    	-1
Offset      	0.000000 0.000000 0.000000
Length      	0.000000
}           	; End axle

AXLE 1 {   	; Start Axle
ModelNum    	-1
Offset      	0.000000 0.000000 0.000000
Length      	0.000000
}           	; End axle

AXLE 2 {   	; Start Axle
ModelNum    	-1
Offset      	0.000000 0.000000 0.000000
Length      	0.000000
}           	; End axle

AXLE 3 {   	; Start Axle
ModelNum    	-1
Offset      	0.000000 0.000000 0.000000
Length      	0.000000
}           	; End axle


;====================
; Car spinner details
;====================

SPINNER {   	; Start spinner
ModelNum    	-1
Offset      	0.000000 0.000000 0.000000
Axis        	0.000000 1.000000 0.000000
AngVel      	0.000000
}           	; End Spinner


;====================
; Car Aerial details
;====================

AERIAL {    	; Start Aerial
SecModelNum 	17
TopModelNum 	18
Offset      	22.000000 -40.000000 18.000000
Direction   	0.000000 -1.000000 0.000000
Length      	20.000000
Stiffness   	2000.000000
Damping     	5.500000
}           	; End Aerial


;====================
; Car AI details
;====================

AI {        	 ;Start AI
UnderThresh 	449.829102
UnderRange  	1
UnderFront	 	0
UnderRear   	0
UnderMax    	-2.0
OverThresh  	449.829102
OverRange   	1
OverMax     	2.0
OverAccThresh  	5000
OverAccRange   	0
PickupBias     	3276
BlockBias      	6553
OvertakeBias   	22936
Suspension     	0
Aggression     	0
}           	; End AI

}

AAAD7B07
