{

;============================================================
;============================================================
; Twyster - By Norfair and MightyCucumber
;============================================================
;============================================================
Name       	"Twyster"


;====================
; Stuff mainly for frontend display and car selectability
;====================

BestTime   	true
Selectable 	true
;)CPUSelectable	true
;)Statistics 	true
Class      	0 			; Engine type (0=Elec, 1=Glow, 2=Other)
Obtain     	0 			; Obtain method
Rating     	2 			; Skill level (rookie, amateur, ...)
TopEnd     	3089.879883 		; Actual top speed (mph) for frontend bars
Acc        	6.828206 		; Acceleration rating (empirical)
Weight     	2.000000 		; Scaled weight (for frontend bars)
Trans      	2 			; Transmission type (0=4WD, 1=FWD, 2=RWD)
MaxRevs    	0.500000 		; Max Revs (for rev counter, deprecated...)

;====================
; Model Filenames
;====================

MODEL 	0 	"cars/twyster/body.prm"
MODEL 	1 	"cars/twyster/wheel-l.prm"
MODEL 	2 	"cars/twyster/wheel-r.prm"
MODEL 	3 	"cars/twyster/axle-f.prm"
MODEL 	4 	"cars/twyster/axle-b.prm"
MODEL 	5 	"cars/twyster/spring.prm"
MODEL 	6 	"NONE"
MODEL 	7 	"NONE"
MODEL 	8 	"NONE"
MODEL 	9 	"NONE"
MODEL 	10 	"NONE"
MODEL 	11 	"NONE"
MODEL 	12 	"NONE"
MODEL 	13 	"NONE"
MODEL 	14 	"NONE"
MODEL 	15 	"NONE"
MODEL 	16 	"NONE"
MODEL 	17 	"cars/misc/Aerial.m"
MODEL 	18 	"cars/misc/AerialT.m"
COLL 		"cars/twyster/hull.hul"
TPAGE 		"cars/twyster/car.bmp"
;)TCARBOX 	"cars/twyster/carbox.bmp" 			; Carbox texture
;)TSHADOW 	"cars/twyster/shadow.bmp" 			; Shadow texture
;)SHADOWINDEX 	-1 							; Use a default shadow (0 to 27 or -1)
;)SHADOWTABLE 	-71.300003 71.300003 82.300003 -69.099998 -5.900000 	; Left, right, front, back, height (relative to model center)
;)SFXENGINE 	"cars/twyster/moto.wav"
;)SFXSERVO 	"NONE"
;)SFXHONK 	"NONE"
EnvRGB 		125 235 245

;====================
; Handling related stuff
;====================

SteerRate  	3.000000 			; Rate at which steer angle approaches value from input
SteerMod   	0.800000 			;
EngineRate 	5.000000 			; Rate at which Engine voltage approaches set value
TopSpeed   	34.000000 			; Car's theoretical top speed (not including friction...)
DownForceMod	5.000000 			; Down force modifier when car on floor
CoM        	0.000000 -2.000000 -4.000000 	; Centre of mass relative to model centre
Weapon     	0.000000 -32.000000 64.000000 	; Weapon generation offset
;)Flippable	false 		; Rotor car effect
;)Flying   	false 		; Flying like the UFO car
;)ClothFx  	false 		; Mystery car cloth effect

;====================
; Camera details
;====================

;)CAMATTACHED {	; Start Camera
;)HoodOffset   	0.000000 0.000000 0.000000 	; Offset from model center
;)HoodLook     	0.050000 			; Look angle (-0.25 to 0.25, 0.0 - straight ahead)
;)RearOffset   	0.000000 0.000000 0.000000
;)RearLook     	0.050000
;)FixedOffset  	true 				; Is offset fixed or moving
;)FixedLook    	true 				; Is look fixed or moving
;)UseDefault   	true 				; Use default offsets (computed in game)
;)}            	; End Camera

;====================
; Car Body details
;====================

BODY {		; Start Body
ModelNum   	0 			; Model Number in above list
Offset     	0.000000 0.000000 0.000000
Mass       	2.000000
Inertia    	1800.000000 0.000000 0.000000
           	0.000000 2800.000000 0.000000
           	0.000000 0.000000 1800.000000
Gravity    	2200 			; No longer used
Hardness   	0.000000
Resistance 	0.001000 		; Linear air resistance
AngRes     	0.001100 		; Angular air resistance
ResMod     	18.000000 		; AngRes scale when in air
Grip       	0.020000 		; Converts downforce to friction value
StaticFriction 	0.800000
KineticFriction 0.400000
}     		; End Body

;====================
; Car Wheel details
;====================

WHEEL 0 { 	; Start Wheel
ModelNum 	1
Offset1  	-29.000000 -2.000000 38.820000
Offset2  	-9.500000 0.000000 0.000000
IsPresent   	true
IsPowered   	false
IsTurnable  	true
SteerRatio  	-0.400000
EngineRatio 	43000.000000
Radius      	15.900000
Mass        	0.150000
Gravity     	3000.000000
MaxPos      	18.000000
SkidWidth   	18.000000
ToeIn       	0.000000
;)Camber    	0.000000
AxleFriction    0.020000
Grip            0.020000
StaticFriction  2.100000
KineticFriction 2.000000
}          	; End Wheel

WHEEL 1 { 	; Start Wheel
ModelNum 	2
Offset1  	29.000000 -2.000000 38.820000
Offset2  	9.500000 0.000000 0.000000
IsPresent   	true
IsPowered   	false
IsTurnable  	true
SteerRatio  	-0.400000
EngineRatio 	43000.000000
Radius      	15.900000
Mass        	0.150000
Gravity     	3000.000000
MaxPos      	18.000000
SkidWidth   	18.000000
ToeIn       	0.000000
;)Camber    	0.000000
AxleFriction    0.020000
Grip            0.020000
StaticFriction  2.100000
KineticFriction 2.000000
}          	; End Wheel

WHEEL 2 { 	; Start Wheel
ModelNum 	1
Offset1  	-29.000000 -2.000000 -27.980000
Offset2  	-9.500000 0.000000 0.000000
IsPresent   	true
IsPowered   	true
IsTurnable  	true
SteerRatio  	0.400000
EngineRatio 	38000.000000
Radius      	15.900000
Mass        	0.150000
Gravity     	3000.000000
MaxPos      	20.000000
SkidWidth   	18.000000
ToeIn       	0.000000
;)Camber    	0.000000
AxleFriction    0.050000
Grip            0.030000
StaticFriction  2.300000
KineticFriction 2.300000
}          	; End Wheel

WHEEL 3 { 	; Start Wheel
ModelNum 	2
Offset1  	29.000000 -2.000000 -27.980000
Offset2  	9.500000 0.000000 0.000000
IsPresent   	true
IsPowered   	true
IsTurnable  	true
SteerRatio  	0.400000
EngineRatio 	38000.000000
Radius      	15.900000
Mass        	0.150000
Gravity     	3000.000000
MaxPos      	20.000000
SkidWidth   	18.000000
ToeIn       	0.000000
;)Camber    	0.000000
AxleFriction    0.050000
Grip            0.030000
StaticFriction  2.300000
KineticFriction 2.300000
}          	; End Wheel


;====================
; Car Spring details
;====================

SPRING 0 { 	; Start Spring
ModelNum    	5
Offset      	-23.969999 -16.500000 38.820000
Length      	12.200000
Stiffness   	300.000000
Damping     	12.000000
Restitution 	-0.750000
}           	; End Spring

SPRING 1 { 	; Start Spring
ModelNum    	5
Offset      	23.980000 -16.500000 38.820000
Length      	12.200000
Stiffness   	300.000000
Damping     	12.000000
Restitution 	-0.750000
}           	; End Spring

SPRING 2 { 	; Start Spring
ModelNum    	-1
Offset      	0.000000 0.000000 0.000000
Length      	0.000000
Stiffness   	300.000000
Damping     	12.000000
Restitution 	-0.750000
}           	; End Spring

SPRING 3 { 	; Start Spring
ModelNum    	-1
Offset      	0.000000 0.000000 0.000000
Length      	0.000000
Stiffness   	300.000000
Damping     	12.000000
Restitution 	-0.750000
}           	; End Spring


;====================
; Car Pin details
;====================

PIN 0 {    	; Start Pin
ModelNum    	-1
Offset      	0.000000 0.000000 0.000000
Length      	0.000000
}           	; End Pin

PIN 1 {    	; Start Pin
ModelNum    	-1
Offset      	0.000000 0.000000 0.000000
Length      	0.000000
}           	; End Pin

PIN 2 {    	; Start Pin
ModelNum    	-1
Offset      	0.000000 0.000000 0.000000
Length      	0.000000
}           	; End Pin

PIN 3 {    	; Start Pin
ModelNum    	-1
Offset      	0.000000 0.000000 0.000000
Length      	0.000000
}           	; End Pin


;====================
; Car axle details
;====================

AXLE 0 {   	; Start Axle
ModelNum    	3
Offset      	-15.200000 -6.000000 38.820000
Length      	14.000000
}           	; End axle

AXLE 1 {   	; Start Axle
ModelNum    	3
Offset      	15.200000 -6.000000 38.820000
Length      	14.000000
}           	; End axle

AXLE 2 {   	; Start Axle
ModelNum    	4
Offset      	-10.060000 -7.000000 -16.000000
Length      	30.000000
}           	; End axle

AXLE 3 {   	; Start Axle
ModelNum    	4
Offset      	10.060000 -7.000000 -16.000000
Length      	30.000000
}           	; End axle


;====================
; Car spinner details
;====================

SPINNER {   	; Start spinner
ModelNum    	-1
Offset      	0.000000 0.000000 0.000000
Axis        	0.000000 1.000000 0.000000
AngVel      	0.000000
;)Type      	1 				; 1: Default rot, 2: Turn with steer, 4: Translate with speed, 6: 2 and 4
;)Trans     	0.000000 3.000000 6.000000 	; Translation max
;)TransVel  	0.001000 			; Velocity factor
}           	; End Spinner


;====================
; Car Aerial details
;====================

AERIAL {    	; Start Aerial
SecModelNum 	17
TopModelNum 	18
Offset      	-13.500000 -14.200001 26.500000
Direction   	0.000000 -1.000000 -0.250000
Length      	30.000000
Stiffness   	2000.000000
Damping     	5.500000
}           	; End Aerial


;====================
; Car AI details
;====================

AI {        	; Start AI
UnderThresh 	701.696838
UnderRange  	1500.000000
UnderFront  	809.173462
UnderRear   	335.000000
UnderMax    	0.698500
OverThresh  	100.000000
OverRange   	899.260010
OverMax     	1.000000
OverAccThresh  	549.966431
OverAccRange   	400.000000
PickupBias     	3276
BlockBias      	3276
OvertakeBias   	16383
Suspension     	0
Aggression     	0
}           	; End AI

}

