{

;============================================================
;============================================================
; Quinx
;============================================================
;============================================================
Name      	"Quinx"


;====================
; Model Filenames
;====================

MODEL 	0 	"cars\kuinkusu\body.prm"
MODEL 	1 	"cars\kuinkusu\wheel-l.prm"
MODEL 	2 	"cars\kuinkusu\wheel-r.prm"
MODEL 	3 	"NONE"
MODEL 	4 	"NONE"
MODEL 	5 	"NONE"
MODEL 	6 	"NONE"
MODEL 	7 	"NONE"
MODEL 	8 	"NONE"
MODEL 	9 	"NONE"
MODEL 	10 	"NONE"
MODEL 	11 	"NONE"
MODEL 	12 	"NONE"
MODEL 	13 	"NONE"
MODEL 	14 	"NONE"
MODEL 	15 	"NONE"
MODEL 	16 	"NONE"
MODEL 	17 	"cars\misc\Aerial.m"
MODEL 	18 	"cars\misc\AerialT.m"
TPAGE 	"cars\kuinkusu\car.bmp"
;)TCARBOX  	"cars/kuinkusu/carbox.bmp" 			
;)TSHADOW 	"cars/kuinkusu/shadow.bmp"
;)SHADOWINDEX 	-1 			
;)SHADOWTABLE -52.3 52.3 82.5 -78.4 -12.7
COLL 	"cars\kuinkusu\hull.hul"
EnvRGB 	200 200 200

;====================
; Stuff mainly for frontend display and car selectability
;====================

;)CPUSelectable	true
;)Statistics 	true
BestTime   	TRUE
Selectable 	TRUE
Class      	1 			
Obtain     	0 			
Rating     	4 			
TopEnd     	3588.701660 			
Acc        	5.607957 			
Weight     	2.000000 			
Handling   	50.000000 			
Trans      	0 			
MaxRevs    	0.500000 			

;====================
; Handling related stuff
;====================

SteerRate  	3.000000 			
SteerMod   	0.400000 			
EngineRate 	4.500000 
TopSpeed   	40.000000 			
DownForceMod	2.000000
CoM        	0.000000 6.000000 -7.000000 		
Weapon     	0.000000 -32.000000 64.000000 		

;====================
; Car Body details
;====================

BODY {		; Start Body
ModelNum   	0 			
Offset     	0, 0, 0 		
Mass       	2.000000
Inertia    	1400.000000 0.000000 0.000000
           	0.000000 2100.000000 0.000000
           	0.000000 0.000000 800.000000
Gravity		2200 			
Hardness   	0.000000
Resistance 	0.001000 			
AngRes     	0.001000 			
ResMod     	25.000000 			
Grip       	0.010000 			
StaticFriction 0.800000
KineticFriction 0.400000
}     		; End Body

;====================
; Car Wheel details
;====================

WHEEL 0 { 	; Start Wheel
ModelNum 	1
Offset1  	-27.000000 -6.750000 36.500000
Offset2  	-2.000000 0.000000 0.000000
IsPresent   	TRUE
IsPowered   	TRUE
IsTurnable  	TRUE
SteerRatio  	-0.500000
EngineRatio 	20000.000000
Radius      	10.000000
Mass        	0.150000
Gravity     	2200.000000
MaxPos      	3.000000
SkidWidth   	10.000000
ToeIn       	0.000000
AxleFriction    	0.020000
Grip            	0.016000
StaticFriction  	2.020000
KineticFriction 	1.950000
}          	; End Wheel


WHEEL 1 { 	; Start Wheel
ModelNum 	2
Offset1  	27.000000 -6.750000 36.500000
Offset2  	2.000000 0.000000 0.000000
IsPresent   	TRUE
IsPowered   	TRUE
IsTurnable  	TRUE
SteerRatio  	-0.500000
EngineRatio 	20000.000000
Radius      	10.000000
Mass        	0.150000
Gravity     	2200.000000
MaxPos      	3.000000
SkidWidth   	10.000000
ToeIn       	0.000000
AxleFriction    	0.020000
Grip            	0.016000
StaticFriction  	2.020000
KineticFriction 	1.950000
}          	; End Wheel


WHEEL 2 { 	; Start Wheel
ModelNum 	1
Offset1  	-27.000000 -6.750000 -33.500000
Offset2  	-2.000000 0.000000 0.000000
IsPresent   	TRUE
IsPowered   	TRUE
IsTurnable  	FALSE
SteerRatio  	0.100000
EngineRatio 	20000.000000
Radius      	10.000000
Mass        	0.150000
Gravity     	2200.000000
MaxPos      	3.000000
SkidWidth   	10.000000
ToeIn       	0.000000
AxleFriction    	0.050000
Grip            	0.016000
StaticFriction  	2.020000
KineticFriction 	1.950000
}          	; End Wheel

WHEEL 3 { 	; Start Wheel
ModelNum 	2
Offset1  	27.000000 -6.750000 -33.500000
Offset2  	2.000000 0.000000 0.000000
IsPresent   	TRUE
IsPowered   	TRUE
IsTurnable  	FALSE
SteerRatio  	0.100000
EngineRatio 	20000.000000
Radius      	10.000000
Mass        	0.150000
Gravity     	2200.000000
MaxPos      	3.000000
SkidWidth   	10.000000
ToeIn       	0.000000
AxleFriction    	0.050000
Grip            	0.016000
StaticFriction  	2.020000
KineticFriction 	1.950000
}          	; End Wheel


;====================
; Car Spring details
;====================

SPRING 0 { 	; Start Spring
ModelNum    	-1
Offset      	0.000000 0.000000 0.000000
Length      	0.000000
Stiffness   	1000.000000
Damping     	15.000000
Restitution 	-0.750000
}           	; End Spring

SPRING 1 { 	; Start Spring
ModelNum    	-1
Offset      	0.000000 0.000000 0.000000
Length      	0.000000
Stiffness   	1000.000000
Damping     	15.000000
Restitution 	-0.750000
}           	; End Spring

SPRING 2 { 	; Start Spring
ModelNum    	-1
Offset      	0.000000 0.000000 0.000000
Length      	0.000000
Stiffness   	1000.000000
Damping     	15.000000
Restitution 	-0.750000
}           	; End Spring

SPRING 3 { 	; Start Spring
ModelNum    	-1
Offset      	0.000000 0.000000 0.000000
Length      	0.000000
Stiffness   	1000.000000
Damping     	15.000000
Restitution 	-0.750000
}           	; End Spring


;====================
; Car Pin details
;====================

PIN 0 {    	; Start Pin
ModelNum    	-1
Offset      	0.000000 0.000000 0.000000
Length      	0.000000
}           	; End Pin

PIN 1 {    	; Start Pin
ModelNum    	-1
Offset      	0.000000 0.000000 0.000000
Length      	0.000000
}           	; End Pin

PIN 2 {    	; Start Pin
ModelNum    	-1
Offset      	0.000000 0.000000 0.000000
Length      	0.000000
}           	; End Pin

PIN 3 {    	; Start Pin
ModelNum    	-1
Offset      	0.000000 0.000000 0.000000
Length      	0.000000
}           	; End Pin


;====================
; Car axle details
;====================

AXLE 0 {   	; Start Axle
ModelNum    	-1
Offset      	0.000000 0.000000 0.000000
Length      	0.000000
}           	; End axle

AXLE 1 {   	; Start Axle
ModelNum    	-1
Offset      	0.000000 0.000000 0.000000
Length      	0.000000
}           	; End axle

AXLE 2 {   	; Start Axle
ModelNum    	-1
Offset      	0.000000 0.000000 0.000000
Length      	0.000000
}           	; End axle

AXLE 3 {   	; Start Axle
ModelNum    	-1
Offset      	0.000000 0.000000 0.000000
Length      	0.000000
}           	; End axle


;====================
; Car spinner details
;====================

SPINNER {   	; Start spinner
ModelNum    	-1
Offset      	0.000000 0.000000 0.000000
Axis        	0.000000 1.000000 0.000000
AngVel      	0.000000
}           	; End Spinner


;====================
; Car Aerial details
;====================

AERIAL {    	; Start Aerial
SecModelNum 	17
TopModelNum 	18
Offset      	-17.000000 -22.000000 -45.000000
Direction   	0.000000 -1.000000 0.000000
Length      	17.000000
Stiffness   	2000.000000
Damping     	5.500000
}           	; End Aerial


;====================
; Car AI details
;====================

AI {        	 ;Start AI
UnderThresh 	530.960083
UnderRange  	1390.939941
UnderFront	 	2228.502197
UnderRear   	532.879944
UnderMax    	0.395497
OverThresh  	2521.723389
OverRange   	1399.063965
OverMax     	0.488563
OverAccThresh  	83.449997
OverAccRange   	2113.864502
PickupBias     	3276
BlockBias      	3276
OvertakeBias   	16383
Suspension     	0
Aggression     	0
}           	; End AI

}

