{

;============================================================
;============================================================
; mach - By Norfair
;============================================================
;============================================================
Name       	"Mach"


;====================
; Stuff mainly for frontend display and car selectability
;====================

BestTime   	true
Selectable 	true
;)CPUSelectable	true
;)Statistics 	true
Class      	1 			; Engine type (0=Elec, 1=Glow, 2=Other)
Obtain     	1 			; Obtain method
Rating     	4 			; Skill level (rookie, amateur, ...)
TopEnd     	3450.614990 		; Actual top speed (mph) for frontend bars
Acc        	4.024300 		; Acceleration rating (empirical)
Weight     	2.5 		; Scaled weight (for frontend bars)
Trans      	0			; Transmission type (0=4WD, 1=FWD, 2=RWD)
MaxRevs    	0.500000 		; Max Revs (for rev counter, deprecated...)

;====================
; Model Filenames
;====================

MODEL 	0 	"cars/nrf_mach/body.prm"
MODEL 	1 	"cars/nrf_mach/wheel-l.prm"
MODEL 	2 	"cars/nrf_mach/wheel-r.prm"
MODEL 	3 	"NONE"
MODEL 	4 	"NONE"
MODEL 	5 	"NONE"
MODEL 	6 	"NONE"
MODEL 	7 	"NONE"
MODEL 	8 	"NONE"
MODEL 	9 	"NONE"
MODEL 	10 	"NONE"
MODEL 	11 	"NONE"
MODEL 	12 	"NONE"
MODEL 	13 	"NONE"
MODEL 	14 	"NONE"
MODEL 	15 	"NONE"
MODEL 	16 	"NONE"
MODEL 	17 	"cars/misc/Aerial.m"
MODEL 	18 	"cars/misc/AerialT.m"
COLL 		"cars/nrf_mach/hull.hul"
TPAGE 		"cars/nrf_mach/car.bmp"
;)TCARBOX 	"cars/nrf_mach/carbox.bmp" 			; Carbox texture
;)TSHADOW 	"cars/nrf_mach/shadow.bmp" 			; Shadow texture
;)SHADOWINDEX 	-1 							; Use a default shadow (0 to 27 or -1)
;)SHADOWTABLE -45.9 45.9 85.0 -73.0 -9.4 	; Left, right, front, back, height (relative to model center)
;)SFXENGINE 	"NONE"
;)SFXSERVO 	"NONE"
;)SFXHONK 	"NONE"
EnvRGB 		200 200 200

;====================
; Handling related stuff
;====================

SteerRate  	2.500000 			; Rate at which steer angle approaches value from input
SteerMod   	0.400000 			;
EngineRate 	4.500000 			; Rate at which Engine voltage approaches set value
TopSpeed   	37.260000 			; Car's theoretical top speed (not including friction...)
DownForceMod	1.000000 			; Down force modifier when car on floor
CoM        	0.000000 4.000000 3.500000 	; Centre of mass relative to model centre
Weapon     	0.000000 -32.000000 64.000000 	; Weapon generation offset
;)Flippable	false 		; Rotor car effect
;)Flying   	false 		; Flying like the UFO car
;)ClothFx  	false 		; Mystery car cloth effect

;====================
; Camera details
;====================

;)CAMATTACHED {	; Start Camera
;)HoodOffset   	0.000000 0.000000 0.000000 	; Offset from model center
;)HoodLook     	0.050000 			; Look angle (-0.25 to 0.25, 0.0 - straight ahead)
;)RearOffset   	0.000000 0.000000 0.000000
;)RearLook     	0.050000
;)FixedOffset  	true 				; Is offset fixed or moving
;)FixedLook    	true 				; Is look fixed or moving
;)UseDefault   	true 				; Use default offsets (computed in game)
;)}            	; End Camera

;====================
; Car Body details
;====================

BODY {		; Start Body
ModelNum   	0 			; Model Number in above list
Offset     	0.000000 0.000000 0.000000
Mass       	2.50000
Inertia    	1200.000000 0.000000 0.000000
           	0.000000 2200.000000 0.000000
           	0.000000 0.000000 800.000000
Gravity    	2200 			; No longer used
Hardness   	0.00000
Resistance 	0.001000 		; Linear air resistance
AngRes     	0.00200 		; Angular air resistance
ResMod     	25.000000 		; AngRes scale when in air
Grip       	0.01000 		; Converts downforce to friction value
StaticFriction 	0.800000
KineticFriction 0.400000
}     		; End Body

;====================
; Car Wheel details
;====================

WHEEL 0 { 	; Start Wheel
ModelNum 	1
Offset1  	-25.59 -6 37.69
Offset2  	0.000000 0.000000 0.000000
IsPresent   	true
IsPowered   	true
IsTurnable  	true
SteerRatio  	-0.40000
EngineRatio 	40000
Radius      	10.4000
Mass        	0.150000
Gravity     	2200.000000
MaxPos      	3.000000
SkidWidth   	11.00000
ToeIn       	0.000000
;)Camber    	0.000000
AxleFriction    0.020000
Grip            0.0125
StaticFriction  1.8
KineticFriction 1.8
}          	; End Wheel

WHEEL 1 { 	; Start Wheel
ModelNum 	2
Offset1  	25.59 -6 37.69
Offset2  	0.000000 0.000000 0.000000
IsPresent   	true
IsPowered   	true
IsTurnable  	true
SteerRatio  	-0.40000
EngineRatio 	40000
Radius      	10.4000
Mass        	0.150000
Gravity     	2200.000000
MaxPos      	3.000000
SkidWidth   	11.00000
ToeIn       	0.000000
;)Camber    	0.000000
AxleFriction    0.020000
Grip            0.0125
StaticFriction  1.8
KineticFriction 1.8
}          	; End Wheel

WHEEL 2 { 	; Start Wheel
ModelNum 	1
Offset1  	-25.59 -6 -29.98
Offset2  	0.000000 0.000000 0.000000
IsPresent   	true
IsPowered   	true
IsTurnable  	false
SteerRatio  	0.100000
EngineRatio 	40000
Radius      	10.4000
Mass        	0.150000
Gravity     	2200.000000
MaxPos      	3.000000
SkidWidth   	11.00000
ToeIn       	0.000000
;)Camber    	0.000000
AxleFriction    0.050000
Grip            0.012
StaticFriction  1.78
KineticFriction 1.74
}          	; End Wheel

WHEEL 3 { 	; Start Wheel
ModelNum 	2
Offset1  	25.59 -6 -29.98
Offset2  	0.000000 0.000000 0.000000
IsPresent   	true
IsPowered   	true
IsTurnable  	false
SteerRatio  	0.100000
EngineRatio 	40000
Radius      	10.4000
Mass        	0.150000
Gravity     	2200.000000
MaxPos      	3.000000
SkidWidth   	11.00000
ToeIn       	0.000000
;)Camber    	0.000000
AxleFriction    0.050000
Grip            0.012
StaticFriction  1.78
KineticFriction 1.74
}          	; End Wheel


;====================
; Car Spring details
;====================

SPRING 0 { 	; Start Spring
ModelNum    	-1
Offset      	0.000000 0.000000 0.000000
Length      	0.000000
Stiffness   	1000.000000
Damping     	12.000000
Restitution 	-0.80000
}           	; End Spring

SPRING 1 { 	; Start Spring
ModelNum    	-1
Offset      	0.000000 0.000000 0.000000
Length      	0.000000
Stiffness   	1000.000000
Damping     	12.000000
Restitution 	-0.80000
}           	; End Spring

SPRING 2 { 	; Start Spring
ModelNum    	-1
Offset      	0.000000 0.000000 0.000000
Length      	0.000000
Stiffness   	1000.000000
Damping     	12.000000
Restitution 	-0.80000
}           	; End Spring

SPRING 3 { 	; Start Spring
ModelNum    	-1
Offset      	0.000000 0.000000 0.000000
Length      	0.000000
Stiffness   	1000.000000
Damping     	12.000000
Restitution 	-0.80000
}           	; End Spring


;====================
; Car Pin details
;====================

PIN 0 {    	; Start Pin
ModelNum    	-1
Offset      	0.000000 0.000000 0.000000
Length      	0.000000
}           	; End Pin

PIN 1 {    	; Start Pin
ModelNum    	-1
Offset      	0.000000 0.000000 0.000000
Length      	0.000000
}           	; End Pin

PIN 2 {    	; Start Pin
ModelNum    	-1
Offset      	0.000000 0.000000 0.000000
Length      	0.000000
}           	; End Pin

PIN 3 {    	; Start Pin
ModelNum    	-1
Offset      	0.000000 0.000000 0.000000
Length      	0.000000
}           	; End Pin


;====================
; Car axle details
;====================

AXLE 0 {   	; Start Axle
ModelNum    	-1
Offset      	0.000000 0.000000 0.000000
Length      	0.000000
}           	; End axle

AXLE 1 {   	; Start Axle
ModelNum    	-1
Offset      	0.000000 0.000000 0.000000
Length      	0.000000
}           	; End axle

AXLE 2 {   	; Start Axle
ModelNum    	-1
Offset      	0.000000 0.000000 0.000000
Length      	0.000000
}           	; End axle

AXLE 3 {   	; Start Axle
ModelNum    	-1
Offset      	0.000000 0.000000 0.000000
Length      	0.000000
}           	; End axle


;====================
; Car spinner details
;====================

SPINNER {   	; Start spinner
ModelNum    	-1
Offset      	0.000000 0.000000 0.000000
Axis        	0.000000 1.000000 0.000000
AngVel      	0.000000
;)Type      	1 				; 1: Default rot, 2: Turn with steer, 4: Translate with speed, 6: 2 and 4
;)Trans     	0.000000 3.000000 6.000000 	; Translation max
;)TransVel  	0.001000 			; Velocity factor
}           	; End Spinner


;====================
; Car Aerial details
;====================

AERIAL {    	; Start Aerial
SecModelNum 	17
TopModelNum 	18
Offset      	21.4 -21.45 -35.39
Direction   	0.000000 -1.000000 -0.400000
Length      	20.000000
Stiffness   	3000.000000
Damping     	15.500000
}           	; End Aerial


;====================
; Car AI details
;====================

AI {        	; Start AI
UnderThresh 	1043.510742
UnderRange  	2702.099854
UnderFront  	2036.469604
UnderRear   	335.000000
UnderMax    	0.638043
OverThresh  	531.036438
OverRange   	1827.135498
OverMax     	0.640206
OverAccThresh  	613.148560
OverAccRange   	1021.179871
PickupBias     	3276
BlockBias      	3276
OvertakeBias   	16383
Suspension     	0
Aggression     	0
}           	; End AI

}

