{

;============================================================
;============================================================
; Hoshino
;============================================================
;============================================================
Name		"Hoshino"


;====================
; Models
;====================

MODEL 	0 	"cars\hoshino\body.prm"
MODEL 	1 	"cars\hoshino\wheel-l.prm"
MODEL 	2 	"cars\hoshino\wheel-r.prm"
MODEL 	3 	"cars\hoshino\wheel-l.prm"
MODEL 	4 	"cars\hoshino\wheel-r.prm"
MODEL 	5 	"NONE"
MODEL 	6 	"NONE"
MODEL 	7 	"NONE"
MODEL 	8 	"NONE"
MODEL 	9 	"NONE"
MODEL 	10 	"NONE"
MODEL 	11 	"NONE"
MODEL 	12 	"NONE"
MODEL 	13 	"NONE"
MODEL 	14 	"NONE"
MODEL 	15 	"NONE"
MODEL 	16 	"NONE"
MODEL 	17 	"cars\misc\aerial.m"
MODEL 	18 	"cars\misc\aerialt.m"
TPAGE 		"cars\hoshino\car.bmp"
TCARBOX 	"cars\hoshino\carbox.bmp"
TSHADOW		"cars\hoshino\shadow.bmp"
;)SHADOWTABLE -40.9 40.9 76.4 -79.3 7.7
COLL 		"cars\hoshino\hull.hul"
EnvRGB 	200 200 200

;====================
; Frontend
;====================

BestTime   	TRUE
Selectable 	TRUE
Statistics	TRUE
Class      	1
Obtain		0
Rating     	5
TopEnd     	4191.9707036
Acc        	6.483216
Weight     	2.000000
Handling   	50.000000
Trans      	2
MaxRevs    	0.500000

;====================
; Handling
;====================

SteerRate  	3.66
SteerMod   	0.000000
EngineRate 	4.500000
TopSpeed   	45.000000
DownForceMod	2.000000
CoM        	0.000000 -11.000000 3.000000
Weapon     	0.000000 -32.000000 64.000000

;====================
; Body
;====================

BODY {		; Start Body
ModelNum   	0
Offset     	0, 0, 0
Mass       	2.000000
Inertia    	1600.000000 0.000000 0.000000
           	0.000000 2800.000000 0.000000
           	0.000000 0.000000 1200.000000
Gravity		2200
Hardness   	0.000000
Resistance 	0.001000
AngRes     	0.001000
ResMod     	25.000000
Grip       	0.010000
StaticFriction 	0.800000
KineticFriction 0.400000
}     		; End Body

;====================
; Wheels
;====================

WHEEL 0 { 	; Start Wheel
ModelNum 	1
Offset1  	-22.000000 9.100000 37.000000
Offset2  	0.000000 0.000000 0.000000
IsPresent   	TRUE
IsPowered   	FALSE
IsTurnable  	TRUE
SteerRatio  	-0.22
EngineRatio 	0.000000
Radius      	10.000000
Mass        	0.150000
Gravity     	2200.000000
MaxPos      	3.000000
SkidWidth   	10.000000
ToeIn       	0.000000
AxleFriction    	0.020000
Grip            	0.022
StaticFriction  	2.11
KineticFriction 	2.01
}          	; End Wheel

WHEEL 1 { 	; Start Wheel
ModelNum 	2
Offset1  	22.000000 9.100000 37.000000
Offset2  	0.000000 0.000000 0.000000
IsPresent   	TRUE
IsPowered   	FALSE
IsTurnable  	TRUE
SteerRatio  	-0.22
EngineRatio 	0.000000
Radius      	10.000000
Mass        	0.150000
Gravity     	2200.000000
MaxPos      	3.000000
SkidWidth   	10.000000
ToeIn       	0.000000
AxleFriction    	0.020000
Grip            	0.022
StaticFriction  	2.11
KineticFriction 	2.01
}          	; End Wheel

WHEEL 2 { 	; Start Wheel
ModelNum 	3
Offset1  	-22.000000 9.100000 -34.000000
Offset2  	0.000000 0.000000 0.000000
IsPresent   	TRUE
IsPowered   	TRUE
IsTurnable  	FALSE
SteerRatio  	0.000000
EngineRatio 	37000.000000
Radius      	10.000000
Mass        	0.150000
Gravity     	2200.000000
MaxPos      	3.000000
SkidWidth   	10.000000
ToeIn       	0.000000
AxleFriction    	0.050000
Grip            	0.026
StaticFriction  	2.15
KineticFriction 	2.07
}          	; End Wheel

WHEEL 3 { 	; Start Wheel
ModelNum 	4
Offset1  	22.000000 9.100000 -34.000000
Offset2  	0.000000 0.000000 0.000000
IsPresent   	TRUE
IsPowered   	TRUE
IsTurnable  	FALSE
SteerRatio  	0.000000
EngineRatio 	37000.000000
Radius      	10.000000
Mass        	0.150000
Gravity     	2200.000000
MaxPos      	3.000000
SkidWidth   	10.000000
ToeIn       	0.000000
AxleFriction    	0.050000
Grip            	0.026
StaticFriction  	2.15
KineticFriction 	2.07
}          	; End Wheel


;====================
; Springs
;====================

SPRING 0 { 	; Start Spring
ModelNum    	-1
Offset      	0.000000 0.000000 0.000000
Length      	0.000000
Stiffness   	1000.000000
Damping     	15.000000
Restitution 	-0.900000
}           	; End Spring

SPRING 1 { 	; Start Spring
ModelNum    	-1
Offset      	0.000000 0.000000 0.000000
Length      	0.000000
Stiffness   	1000.000000
Damping     	15.000000
Restitution 	-0.900000
}           	; End Spring

SPRING 2 { 	; Start Spring
ModelNum    	-1
Offset      	0.000000 0.000000 0.000000
Length      	0.000000
Stiffness   	1000.000000
Damping     	14.000000
Restitution 	-0.880000
}           	; End Spring

SPRING 3 { 	; Start Spring
ModelNum    	-1
Offset      	0.000000 0.000000 0.000000
Length      	0.000000
Stiffness   	1000.000000
Damping     	14.000000
Restitution 	-0.880000
}           	; End Spring


;====================
; Pins
;====================

PIN 0 {    	; Start Pin
ModelNum    	-1
Offset      	0.000000 0.000000 0.000000
Length      	0.000000
}           	; End Pin

PIN 1 {    	; Start Pin
ModelNum    	-1
Offset      	0.000000 0.000000 0.000000
Length      	0.000000
}           	; End Pin

PIN 2 {    	; Start Pin
ModelNum    	-1
Offset      	0.000000 0.000000 0.000000
Length      	0.000000
}           	; End Pin

PIN 3 {    	; Start Pin
ModelNum    	-1
Offset      	0.000000 0.000000 0.000000
Length      	0.000000
}           	; End Pin


;====================
; Axles
;====================

AXLE 0 {   	; Start Axle
ModelNum    	-1
Offset      	0.000000 0.000000 0.000000
Length      	0.000000
}           	; End axle

AXLE 1 {   	; Start Axle
ModelNum    	-1
Offset      	0.000000 0.000000 0.000000
Length      	0.000000
}           	; End axle

AXLE 2 {   	; Start Axle
ModelNum    	-1
Offset      	0.000000 0.000000 0.000000
Length      	0.000000
}           	; End axle

AXLE 3 {   	; Start Axle
ModelNum    	-1
Offset      	0.000000 0.000000 0.000000
Length      	0.000000
}           	; End axle


;====================
; Spinner
;====================

SPINNER {   	; Start spinner
ModelNum    	-1
Offset      	0.000000 0.000000 0.000000
Axis        	0.000000 0.000000 0.000000
AngVel      	0.000000
}           	; End Spinner


;====================
; Aerial
;====================

AERIAL {    	; Start Aerial
SecModelNum 	17
TopModelNum 	18
Offset      	20.000000 -3.000000 30.000000 
Direction   	0.000000 -1.000000 0.000000
Length      	17.000000
Stiffness   	2000.000000
Damping     	5.500000
}           	; End Aerial


;====================
; AI
;====================

AI {        	 ;Start AI
UnderThresh 	530.960083
UnderRange  	1390.939941
UnderFront	2228.502197
UnderRear   	532.879944
UnderMax    	0.395497
OverThresh  	2521.723389
OverRange   	1399.063965
OverMax     	0.488563
OverAccThresh  	83.449997
OverAccRange   	2113.864502
PickupBias     	3276
BlockBias      	3276
OvertakeBias   	16383
Suspension     	0
Aggression     	0
}           	; End AI

}