=====================================================================
=====================================================================
=====================================================================
=====================================================================
Details:

Name:                             Sakura
Author:                             Kipy
Category:                        Remodel
Class:                          Advanced    
Engine type:                        Glow
Trans:                               4WD
Top Speed:           35,4 mph / 57,0 kph
Folder's name:    .../ReVolt/cars/sakura/

=====================================================================
=====================================================================
=====================================================================

Tools:

Blender 2.76 + jig's plugin
Paint.NET
prm2hul

=====================================================================
=====================================================================
Credits:

Copyright belongs to Kipy.
You can repaint/modify, but ALWAYS mention the author of this car.
Special thanks to Mladen and URV.

=====================================================================
=====================================================================
							2018.03.12.
=====================================================================
=====================================================================