{

;============================================================
;============================================================
; Nyx
;============================================================
;============================================================
Name       	"DXGP Nyx"


;====================
; Stuff mainly for frontend display and car selectability
;====================

BestTime   	true
Selectable 	true
;)CPUSelectable	false
;)Statistics 	false
Class      	0 			; Engine type (0=Elec, 1=Glow, 2=Other)
Obtain     	0 			; Obtain method
Rating     	-200 			; Skill level (rookie, amateur, ...)
TopEnd     	3681.925537 			; Actual top speed (mph) for frontend bars
Acc        	4.698242 			; Acceleration rating (empirical)
Weight     	2.850000 			; Scaled weight (for frontend bars)
Trans      	2 			; Transmission type (0=4WD, 1=FWD, 2=RWD)
MaxRevs    	0.500000 			; Max Revs (for rev counter, deprecated...)
;)TCARBOX  	"cars/drift_nyx/carbox.bmp" 		; Carbox texture

;====================
; Model Filenames
;====================

MODEL 	0 	"cars/drift_nyx/body.prm"
MODEL 	1 	"cars/drift_nyx/wheelfl.prm"
MODEL 	2 	"cars/drift_nyx/wheelfr.prm"
MODEL 	3 	"cars/drift_nyx/wheelbl.prm"
MODEL 	4 	"cars/drift_nyx/wheelbr.prm"
MODEL 	5 	"NONE"
MODEL 	6 	"NONE"
MODEL 	7 	"NONE"
MODEL 	8 	"NONE"
MODEL 	9 	"NONE"
MODEL 	10 	"NONE"
MODEL 	11 	"NONE"
MODEL 	12 	"NONE"
MODEL 	13 	"NONE"
MODEL 	14 	"NONE"
MODEL 	15 	"NONE"
MODEL 	16 	"NONE"
MODEL 	17 	"cars/misc/Aerial.m"
MODEL 	18 	"cars/misc/AerialT.m"
COLL 	"cars/drift_nyx/hull.hul"
TPAGE 	"cars/drift_nyx/car.bmp"
;)TSHADOW 	"cars/drift_nyx/shadow.bmp"
;)SHADOWINDEX 	-1
;)SHADOWTABLE 	-48.700001 48.700001 84.099998 -84.900002 16.700001 	; Left, right, front, back, height (relative to model center)
EnvRGB 	100 100 100

;====================
; Handling related stuff
;====================

SteerRate  	3.250000 			; Rate at which steer angle approaches value from input
SteerMod   	0.400000 			;
EngineRate 	4.500000 			; Rate at which Engine voltage approaches set value
TopSpeed   	36.000000 			; Car's theoretical top speed (not including friction...)
DownForceMod	2.000000 			; Down force modifier when car on floor
CoM        	0.000000 -20.000000 -9.000000 		; Centre of mass relative to model centre
Weapon     	0.000000 -45.000000 70.000000 		; Weapon generation offset
;)Flippable	false 			; Rotor car effect
;)Flying   	false 			; Flying like the UFO car
;)ClothFx  	false 			; Mystery car cloth effect

;====================
; Car Body details
;====================

BODY {		; Start Body
ModelNum   	0 			; Model Number in above list
Offset     	0.000000 0.000000 0.000000
Mass       	2.000000
Inertia    	2600.000000 0.000000 0.000000
           	0.000000 3010.000000 0.000000
           	0.000000 0.000000 750.000000
Gravity    	2200 			; No longer used
Hardness   	0.000000
Resistance 	0.001000 			; Linear air resistance
AngRes     	0.005000 			; Angular air resistance
ResMod     	5.000000 			; AngRes scale when in air
Grip       	0.010000 			; Converts downforce to friction value
StaticFriction 0.800000
KineticFriction 0.400000
}     		; End Body

;====================
; Car Wheel details
;====================

WHEEL 0 { 	; Start Wheel
ModelNum 	1
Offset1  	-23.000000 9.500000 40.799999
Offset2  	-2.000000 0.000000 0.000000
IsPresent   	true
IsPowered   	false
IsTurnable  	true
SteerRatio  	-0.600000
EngineRatio 	0.000000
Radius      	10.000000
Mass        	0.150000
Gravity     	4400.000000
MaxPos      	7.000000
SkidWidth   	8.500000
ToeIn       	0.000000
;)Camber    	-6.000000
AxleFriction    	0.020000
Grip            	0.002000
StaticFriction  	1.030000
KineticFriction 	1.020000
}          	; End Wheel

WHEEL 1 { 	; Start Wheel
ModelNum 	2
Offset1  	23.000000 9.500000 40.799999
Offset2  	2.000000 0.000000 0.000000
IsPresent   	true
IsPowered   	false
IsTurnable  	true
SteerRatio  	-0.600000
EngineRatio 	0.000000
Radius      	10.000000
Mass        	0.150000
Gravity     	4400.000000
MaxPos      	7.000000
SkidWidth   	8.500000
ToeIn       	0.000000
;)Camber    	-6.000000
AxleFriction    	0.020000
Grip            	0.002000
StaticFriction  	1.030000
KineticFriction 	1.020000
}          	; End Wheel

WHEEL 2 { 	; Start Wheel
ModelNum 	3
Offset1  	-25.500000 11.000000 -43.200001
Offset2  	-2.000000 0.000000 0.000000
IsPresent   	true
IsPowered   	true
IsTurnable  	false
SteerRatio  	0.000000
EngineRatio 	55000.000000
Radius      	10.000000
Mass        	0.150000
Gravity     	4400.000000
MaxPos      	7.000000
SkidWidth   	8.500000
ToeIn       	0.000000
;)Camber    	-3.000000
AxleFriction    	0.020000
Grip            	0.002050
StaticFriction  	1.545000
KineticFriction 	1.540000
}          	; End Wheel

WHEEL 3 { 	; Start Wheel
ModelNum 	4
Offset1  	25.500000 11.000000 -43.200001
Offset2  	2.000000 0.000000 0.000000
IsPresent   	true
IsPowered   	true
IsTurnable  	false
SteerRatio  	0.000000
EngineRatio 	55000.000000
Radius      	10.000000
Mass        	0.150000
Gravity     	4400.000000
MaxPos      	7.000000
SkidWidth   	8.500000
ToeIn       	0.000000
;)Camber    	-3.000000
AxleFriction    	0.020000
Grip            	0.002050
StaticFriction  	1.545000
KineticFriction 	1.540000
}          	; End Wheel


;====================
; Car Spring details
;====================

SPRING 0 { 	; Start Spring
ModelNum    	-1
Offset      	0.000000 0.000000 0.000000
Length      	0.000000
Stiffness   	1000.000000
Damping     	10.000000
Restitution 	-0.750000
}           	; End Spring

SPRING 1 { 	; Start Spring
ModelNum    	-1
Offset      	0.000000 0.000000 0.000000
Length      	0.000000
Stiffness   	1000.000000
Damping     	10.000000
Restitution 	-0.750000
}           	; End Spring

SPRING 2 { 	; Start Spring
ModelNum    	-1
Offset      	0.000000 0.000000 0.000000
Length      	0.000000
Stiffness   	400.000000
Damping     	10.000000
Restitution 	-0.750000
}           	; End Spring

SPRING 3 { 	; Start Spring
ModelNum    	-1
Offset      	0.000000 0.000000 0.000000
Length      	0.000000
Stiffness   	400.000000
Damping     	10.000000
Restitution 	-0.750000
}           	; End Spring


;====================
; Car Pin details
;====================

PIN 0 {    	; Start Pin
ModelNum    	-1
Offset      	0.000000 0.000000 0.000000
Length      	0.000000
}           	; End Pin

PIN 1 {    	; Start Pin
ModelNum    	-1
Offset      	0.000000 0.000000 0.000000
Length      	0.000000
}           	; End Pin

PIN 2 {    	; Start Pin
ModelNum    	-1
Offset      	0.000000 0.000000 0.000000
Length      	0.000000
}           	; End Pin

PIN 3 {    	; Start Pin
ModelNum    	-1
Offset      	0.000000 0.000000 0.000000
Length      	0.000000
}           	; End Pin


;====================
; Car axle details
;====================

AXLE 0 {   	; Start Axle
ModelNum    	-1
Offset      	0.000000 0.000000 0.000000
Length      	0.000000
}           	; End axle

AXLE 1 {   	; Start Axle
ModelNum    	-1
Offset      	0.000000 0.000000 0.000000
Length      	0.000000
}           	; End axle

AXLE 2 {   	; Start Axle
ModelNum    	-1
Offset      	0.000000 0.000000 0.000000
Length      	0.000000
}           	; End axle

AXLE 3 {   	; Start Axle
ModelNum    	-1
Offset      	0.000000 0.000000 0.000000
Length      	0.000000
}           	; End axle


;====================
; Car spinner details
;====================

SPINNER {   	; Start spinner
ModelNum    	-1
Offset      	0.000000 0.000000 0.000000
Axis        	0.000000 0.000000 0.000000
AngVel      	0.000000
;)Type      	1 			; 1: Default rot, 2: Turn with steer, 4: Translate with speed, 6: 2 and 4
;)Trans     	0.000000 3.000000 6.000000 		; Translation max
;)TransVel  	0.001000 			; Velocity factor
}           	; End Spinner


;====================
; Car Aerial details
;====================

AERIAL {    	; Start Aerial
SecModelNum 	17
TopModelNum 	18
Offset      	-20.000000 -15.000000 -17.500000
Direction   	0.000000 -1.000000 0.000000
Length      	17.000000
Stiffness   	2000.000000
Damping     	5.500000
}           	; End Aerial


;====================
; Car AI details
;====================

AI {        	 ;Start AI
UnderThresh 	150.000000
UnderRange  	3098.658691
UnderFront  	2248.433105
UnderRear   	1541.193848
UnderMax    	0.320000
OverThresh  	1713.217529
OverRange   	1831.650024
OverMax     	0.900000
OverAccThresh  	89.169998
OverAccRange   	400.000000
PickupBias     	3276
BlockBias      	3276
OvertakeBias   	16383
Suspension     	0
Aggression     	0
}           	; End AI

}

